lucene-dev mailing list archives

Site index · List index
Message view « Date » · « Thread »
Top « Date » · « Thread »
From Policeman Jenkins Server <jenk...@thetaphi.de>
Subject [JENKINS] Lucene-Solr-7.x-MacOSX (64bit/jdk1.8.0) - Build # 860 - Unstable!
Date Sun, 30 Sep 2018 16:40:28 GMT
Build: https://jenkins.thetaphi.de/job/Lucene-Solr-7.x-MacOSX/860/
Java: 64bit/jdk1.8.0 -XX:-UseCompressedOops -XX:+UseG1GC

1 tests failed.
FAILED:  org.apache.solr.client.solrj.io.stream.MathExpressionTest.testGammaDistribution

Error Message:


Stack Trace:
java.lang.AssertionError
	at __randomizedtesting.SeedInfo.seed([88E923EF1A26DEF4:B5930841395E74E3]:0)
	at org.junit.Assert.fail(Assert.java:92)
	at org.junit.Assert.assertTrue(Assert.java:43)
	at org.junit.Assert.assertTrue(Assert.java:54)
	at org.apache.solr.client.solrj.io.stream.MathExpressionTest.testGammaDistribution(MathExpressionTest.java:3961)
	at sun.reflect.NativeMethodAccessorImpl.invoke0(Native Method)
	at sun.reflect.NativeMethodAccessorImpl.invoke(NativeMethodAccessorImpl.java:62)
	at sun.reflect.DelegatingMethodAccessorImpl.invoke(DelegatingMethodAccessorImpl.java:43)
	at java.lang.reflect.Method.invoke(Method.java:498)
	at com.carrotsearch.randomizedtesting.RandomizedRunner.invoke(RandomizedRunner.java:1742)
	at com.carrotsearch.randomizedtesting.RandomizedRunner$8.evaluate(RandomizedRunner.java:935)
	at com.carrotsearch.randomizedtesting.RandomizedRunner$9.evaluate(RandomizedRunner.java:971)
	at com.carrotsearch.randomizedtesting.RandomizedRunner$10.evaluate(RandomizedRunner.java:985)
	at com.carrotsearch.randomizedtesting.rules.SystemPropertiesRestoreRule$1.evaluate(SystemPropertiesRestoreRule.java:57)
	at org.apache.lucene.util.TestRuleSetupTeardownChained$1.evaluate(TestRuleSetupTeardownChained.java:49)
	at org.apache.lucene.util.AbstractBeforeAfterRule$1.evaluate(AbstractBeforeAfterRule.java:45)
	at org.apache.lucene.util.TestRuleThreadAndTestName$1.evaluate(TestRuleThreadAndTestName.java:48)
	at org.apache.lucene.util.TestRuleIgnoreAfterMaxFailures$1.evaluate(TestRuleIgnoreAfterMaxFailures.java:64)
	at org.apache.lucene.util.TestRuleMarkFailure$1.evaluate(TestRuleMarkFailure.java:47)
	at com.carrotsearch.randomizedtesting.rules.StatementAdapter.evaluate(StatementAdapter.java:36)
	at com.carrotsearch.randomizedtesting.ThreadLeakControl$StatementRunner.run(ThreadLeakControl.java:368)
	at com.carrotsearch.randomizedtesting.ThreadLeakControl.forkTimeoutingTask(ThreadLeakControl.java:817)
	at com.carrotsearch.randomizedtesting.ThreadLeakControl$3.evaluate(ThreadLeakControl.java:468)
	at com.carrotsearch.randomizedtesting.RandomizedRunner.runSingleTest(RandomizedRunner.java:944)
	at com.carrotsearch.randomizedtesting.RandomizedRunner$5.evaluate(RandomizedRunner.java:830)
	at com.carrotsearch.randomizedtesting.RandomizedRunner$6.evaluate(RandomizedRunner.java:880)
	at com.carrotsearch.randomizedtesting.RandomizedRunner$7.evaluate(RandomizedRunner.java:891)
	at com.carrotsearch.randomizedtesting.rules.StatementAdapter.evaluate(StatementAdapter.java:36)
	at com.carrotsearch.randomizedtesting.rules.SystemPropertiesRestoreRule$1.evaluate(SystemPropertiesRestoreRule.java:57)
	at org.apache.lucene.util.AbstractBeforeAfterRule$1.evaluate(AbstractBeforeAfterRule.java:45)
	at com.carrotsearch.randomizedtesting.rules.StatementAdapter.evaluate(StatementAdapter.java:36)
	at org.apache.lucene.util.TestRuleStoreClassName$1.evaluate(TestRuleStoreClassName.java:41)
	at com.carrotsearch.randomizedtesting.rules.NoShadowingOrOverridesOnMethodsRule$1.evaluate(NoShadowingOrOverridesOnMethodsRule.java:40)
	at com.carrotsearch.randomizedtesting.rules.NoShadowingOrOverridesOnMethodsRule$1.evaluate(NoShadowingOrOverridesOnMethodsRule.java:40)
	at com.carrotsearch.randomizedtesting.rules.StatementAdapter.evaluate(StatementAdapter.java:36)
	at com.carrotsearch.randomizedtesting.rules.StatementAdapter.evaluate(StatementAdapter.java:36)
	at com.carrotsearch.randomizedtesting.rules.StatementAdapter.evaluate(StatementAdapter.java:36)
	at org.apache.lucene.util.TestRuleAssertionsRequired$1.evaluate(TestRuleAssertionsRequired.java:53)
	at org.apache.lucene.util.TestRuleMarkFailure$1.evaluate(TestRuleMarkFailure.java:47)
	at org.apache.lucene.util.TestRuleIgnoreAfterMaxFailures$1.evaluate(TestRuleIgnoreAfterMaxFailures.java:64)
	at org.apache.lucene.util.TestRuleIgnoreTestSuites$1.evaluate(TestRuleIgnoreTestSuites.java:54)
	at com.carrotsearch.randomizedtesting.rules.StatementAdapter.evaluate(StatementAdapter.java:36)
	at com.carrotsearch.randomizedtesting.ThreadLeakControl$StatementRunner.run(ThreadLeakControl.java:368)
	at java.lang.Thread.run(Thread.java:748)




Build Log:
[...truncated 16110 lines...]
   [junit4] Suite: org.apache.solr.client.solrj.io.stream.MathExpressionTest
   [junit4]   2> Creating dataDir: /Users/jenkins/workspace/Lucene-Solr-7.x-MacOSX/solr/build/solr-solrj/test/J0/temp/solr.client.solrj.io.stream.MathExpressionTest_88E923EF1A26DEF4-001/init-core-data-001
   [junit4]   1> 16:11:09.596 [Thread-322] ERROR org.apache.zookeeper.server.ZooKeeperServer - ZKShutdownHandler is not registered, so ZooKeeper server won't take any action on ERROR or SHUTDOWN server state changes
   [junit4]   1> 16:11:09.732 [jetty-launcher-602-thread-3] ERROR org.apache.solr.util.StartupLoggingUtils - Missing Java Option solr.log.dir. Logging may be missing or incomplete.
   [junit4]   1> 16:11:09.732 [jetty-launcher-602-thread-4] ERROR org.apache.solr.util.StartupLoggingUtils - Missing Java Option solr.log.dir. Logging may be missing or incomplete.
   [junit4]   1> 16:11:09.733 [jetty-launcher-602-thread-2] ERROR org.apache.solr.util.StartupLoggingUtils - Missing Java Option solr.log.dir. Logging may be missing or incomplete.
   [junit4]   1> 16:11:09.735 [jetty-launcher-602-thread-1] ERROR org.apache.solr.util.StartupLoggingUtils - Missing Java Option solr.log.dir. Logging may be missing or incomplete.
   [junit4]   1> [[43.906797030808235, 77.69455762489834], [44.906797030808235, 78.69455762489834], [45.906797030808235, 79.69455762489834], [46.906797030808235, 80.69455762489834], [47.906797030808235, 81.69455762489834]]
   [junit4] IGNOR/A 0.00s J0 | MathExpressionTest.testDistributions
   [junit4]    > Assumption #1: 'badapple' test group is disabled (@BadApple(bugUrl=https://issues.apache.org/jira/browse/SOLR-12028))
   [junit4]   2> NOTE: reproduce with: ant test  -Dtestcase=MathExpressionTest -Dtests.method=testGammaDistribution -Dtests.seed=88E923EF1A26DEF4 -Dtests.slow=true -Dtests.locale=fr-FR -Dtests.timezone=GMT -Dtests.asserts=true -Dtests.file.encoding=US-ASCII
   [junit4] FAILURE 0.61s J0 | MathExpressionTest.testGammaDistribution <<<
   [junit4]    > Throwable #1: java.lang.AssertionError
   [junit4]    > 	at __randomizedtesting.SeedInfo.seed([88E923EF1A26DEF4:B5930841395E74E3]:0)
   [junit4]    > 	at org.apache.solr.client.solrj.io.stream.MathExpressionTest.testGammaDistribution(MathExpressionTest.java:3961)
   [junit4]    > 	at java.lang.Thread.run(Thread.java:748)
   [junit4] IGNOR/A 0.00s J0 | MathExpressionTest.testMultiVariateNormalDistribution
   [junit4]    > Assumption #1: 'badapple' test group is disabled (@BadApple(bugUrl=https://issues.apache.org/jira/browse/SOLR-12028))
   [junit4]   1> 16:11:28.994 [SUITE-MathExpressionTest-seed#[88E923EF1A26DEF4]-worker] ERROR org.apache.zookeeper.server.ZooKeeperServer - ZKShutdownHandler is not registered, so ZooKeeper server won't take any action on ERROR or SHUTDOWN server state changes
   [junit4]   2> NOTE: leaving temporary files on disk at: /Users/jenkins/workspace/Lucene-Solr-7.x-MacOSX/solr/build/solr-solrj/test/J0/temp/solr.client.solrj.io.stream.MathExpressionTest_88E923EF1A26DEF4-001
   [junit4]   2> NOTE: test params are: codec=Asserting(Lucene70): {test_t=TestBloomFilteredLucenePostings(BloomFilteringPostingsFormat(Lucene50(blocksize=128))), col_s=FST50, multiDefault=Lucene50(blocksize=128), id=TestBloomFilteredLucenePostings(BloomFilteringPostingsFormat(Lucene50(blocksize=128))), text=PostingsFormat(name=LuceneVarGapFixedInterval)}, docValues:{multiDefault=DocValuesFormat(name=Direct), price_f=DocValuesFormat(name=Direct), intDefault=DocValuesFormat(name=Asserting), test_dt=DocValuesFormat(name=Lucene70), price_i=DocValuesFormat(name=Lucene70), col_s=DocValuesFormat(name=Asserting), loc_p_1_d1=DocValuesFormat(name=Lucene70), order_i=DocValuesFormat(name=Direct), _version_=DocValuesFormat(name=Asserting), loc_p_0_d1=DocValuesFormat(name=Asserting), id=DocValuesFormat(name=Lucene70), miles_i=DocValuesFormat(name=Asserting), timestamp=DocValuesFormat(name=Direct)}, maxPointsInLeafNode=1967, maxMBSortInHeap=6.809991050799898, sim=RandomSimilarity(queryNorm=true): {}, locale=fr-FR, timezone=GMT
   [junit4]   2> NOTE: Mac OS X 10.11.6 x86_64/Oracle Corporation 1.8.0_172 (64-bit)/cpus=3,threads=1,free=206213144,total=475004928
   [junit4]   2> NOTE: All tests run in this JVM: [ArcTangentEvaluatorTest, EqualToEvaluatorTest, CubedRootEvaluatorTest, DocumentAnalysisResponseTest, AndEvaluatorTest, TestUpdateRequestCodec, GraphExpressionTest, TestSolrProperties, RawValueEvaluatorTest, TestToleratedUpdateError, ConcurrentUpdateSolrClientTest, AbsoluteValueEvaluatorTest, ShardParamsTest, GetByIdTest, FieldAnalysisResponseTest, TestSolrJErrorHandling, TestV2Request, UsingSolrJRefGuideExamplesTest, StreamExpressionParserTest, GreaterThanEqualToEvaluatorTest, SelectWithEvaluatorsTest, TestXMLEscaping, HttpSolrClientSSLAuthConPoolTest, ModuloEvaluatorTest, TestJavaBinCodec, LargeVolumeEmbeddedTest, JdbcDriverTest, SquareRootEvaluatorTest, CloudSolrClientMultiConstructorTest, FieldValueEvaluatorTest, SolrExampleStreamingTest, TestFastWriter, TestCloudCollectionsListeners, ContentStreamTest, JettyWebappTest, TestBatchUpdate, OperationsTest, HttpSolrClientBuilderTest, ArcCosineEvaluatorTest, SolrExampleXMLTest, SolrExceptionTest, SolrQueryTest, SolrSchemalessExampleTest, TestPolicy, TestPolicy2, MergeIndexesEmbeddedTest, SolrExampleEmbeddedTest, SolrExampleJettyTest, SolrExampleStreamingBinaryTest, CloudSolrClientBuilderTest, CloudSolrClientCacheTest, CloudSolrClientTest, MathExpressionTest]
   [junit4] Completed [98/156 (1!)] on J0 in 21.25s, 102 tests, 1 failure, 2 skipped <<< FAILURES!

[...truncated 47913 lines...]
[asciidoctor:convert] asciidoctor: ERROR: about-this-guide.adoc: line 1: invalid part, must have at least one section (e.g., chapter, appendix, etc.)
[asciidoctor:convert] asciidoctor: ERROR: solr-glossary.adoc: line 1: invalid part, must have at least one section (e.g., chapter, appendix, etc.)
     [java] Processed 2430 links (1982 relative) to 3170 anchors in 245 files
     [echo] Validated Links & Anchors via: /Users/jenkins/workspace/Lucene-Solr-7.x-MacOSX/solr/build/solr-ref-guide/bare-bones-html/

-documentation-lint:
    [jtidy] Checking for broken html (such as invalid tags)...
   [delete] Deleting directory /Users/jenkins/workspace/Lucene-Solr-7.x-MacOSX/lucene/build/jtidy_tmp
     [echo] Checking for broken links...
     [exec] 
     [exec] Crawl/parse...
     [exec] 
     [exec] Verify...
     [echo] Checking for malformed docs...

jar-checksums:

resolve:

ivy-availability-check:
[loadresource] Do not set property disallowed.ivy.jars.list as its length is 0.

-ivy-fail-disallowed-ivy-version:

ivy-fail:

ivy-configure:
[ivy:configure] :: loading settings :: file = /Users/jenkins/workspace/Lucene-Solr-7.x-MacOSX/lucene/top-level-ivy-settings.xml

resolve:

ivy-availability-check:
[loadresource] Do not set property disallowed.ivy.jars.list as its length is 0.

-ivy-fail-disallowed-ivy-version:

ivy-fail:

ivy-configure:
[ivy:configure] :: loading settings :: file = /Users/jenkins/workspace/Lucene-Solr-7.x-MacOSX/lucene/top-level-ivy-settings.xml

resolve:

resolve:

ivy-availability-check:
[loadresource] Do not set property disallowed.ivy.jars.list as its length is 0.

-ivy-fail-disallowed-ivy-version:

ivy-fail:

ivy-configure:
[ivy:configure] :: loading settings :: file = /Users/jenkins/workspace/Lucene-Solr-7.x-MacOSX/lucene/top-level-ivy-settings.xml

resolve:

ivy-availability-check:
[loadresource] Do not set property disallowed.ivy.jars.list as its length is 0.

-ivy-fail-disallowed-ivy-version:

ivy-fail:

ivy-configure:
[ivy:configure] :: loading settings :: file = /Users/jenkins/workspace/Lucene-Solr-7.x-MacOSX/lucene/top-level-ivy-settings.xml

resolve:

ivy-availability-check:
[loadresource] Do not set property disallowed.ivy.jars.list as its length is 0.

-ivy-fail-disallowed-ivy-version:

ivy-fail:

ivy-configure:
[ivy:configure] :: loading settings :: file = /Users/jenkins/workspace/Lucene-Solr-7.x-MacOSX/lucene/top-level-ivy-settings.xml

resolve:

ivy-availability-check:
[loadresource] Do not set property disallowed.ivy.jars.list as its length is 0.

-ivy-fail-disallowed-ivy-version:

ivy-fail:

ivy-configure:
[ivy:configure] :: loading settings :: file = /Users/jenkins/workspace/Lucene-Solr-7.x-MacOSX/lucene/top-level-ivy-settings.xml

resolve:

ivy-availability-check:
[loadresource] Do not set property disallowed.ivy.jars.list as its length is 0.

-ivy-fail-disallowed-ivy-version:

ivy-fail:

ivy-configure:
[ivy:configure] :: loading settings :: file = /Users/jenkins/workspace/Lucene-Solr-7.x-MacOSX/lucene/top-level-ivy-settings.xml

resolve:

ivy-availability-check:
[loadresource] Do not set property disallowed.ivy.jars.list as its length is 0.

-ivy-fail-disallowed-ivy-version:

ivy-fail:

ivy-configure:
[ivy:configure] :: loading settings :: file = /Users/jenkins/workspace/Lucene-Solr-7.x-MacOSX/lucene/top-level-ivy-settings.xml

resolve:

ivy-availability-check:
[loadresource] Do not set property disallowed.ivy.jars.list as its length is 0.

-ivy-fail-disallowed-ivy-version:

ivy-fail:

ivy-configure:
[ivy:configure] :: loading settings :: file = /Users/jenkins/workspace/Lucene-Solr-7.x-MacOSX/lucene/top-level-ivy-settings.xml

resolve:

ivy-availability-check:
[loadresource] Do not set property disallowed.ivy.jars.list as its length is 0.

-ivy-fail-disallowed-ivy-version:

ivy-fail:

ivy-configure:
[ivy:configure] :: loading settings :: file = /Users/jenkins/workspace/Lucene-Solr-7.x-MacOSX/lucene/top-level-ivy-settings.xml

resolve:

ivy-availability-check:
[loadresource] Do not set property disallowed.ivy.jars.list as its length is 0.

-ivy-fail-disallowed-ivy-version:

ivy-fail:

ivy-configure:
[ivy:configure] :: loading settings :: file = /Users/jenkins/workspace/Lucene-Solr-7.x-MacOSX/lucene/top-level-ivy-settings.xml

resolve:

ivy-availability-check:
[loadresource] Do not set property disallowed.ivy.jars.list as its length is 0.

-ivy-fail-disallowed-ivy-version:

ivy-fail:

ivy-configure:
[ivy:configure] :: loading settings :: file = /Users/jenkins/workspace/Lucene-Solr-7.x-MacOSX/lucene/top-level-ivy-settings.xml

resolve:

ivy-availability-check:
[loadresource] Do not set property disallowed.ivy.jars.list as its length is 0.

-ivy-fail-disallowed-ivy-version:

ivy-fail:

ivy-configure:
[ivy:configure] :: loading settings :: file = /Users/jenkins/workspace/Lucene-Solr-7.x-MacOSX/lucene/top-level-ivy-settings.xml

resolve:

ivy-availability-check:
[loadresource] Do not set property disallowed.ivy.jars.list as its length is 0.

-ivy-fail-disallowed-ivy-version:

ivy-fail:

ivy-configure:
[ivy:configure] :: loading settings :: file = /Users/jenkins/workspace/Lucene-Solr-7.x-MacOSX/lucene/top-level-ivy-settings.xml

resolve:

ivy-availability-check:
[loadresource] Do not set property disallowed.ivy.jars.list as its length is 0.

-ivy-fail-disallowed-ivy-version:

ivy-fail:

ivy-configure:
[ivy:configure] :: loading settings :: file = /Users/jenkins/workspace/Lucene-Solr-7.x-MacOSX/lucene/top-level-ivy-settings.xml

resolve:

ivy-availability-check:
[loadresource] Do not set property disallowed.ivy.jars.list as its length is 0.

-ivy-fail-disallowed-ivy-version:

ivy-fail:

ivy-configure:
[ivy:configure] :: loading settings :: file = /Users/jenkins/workspace/Lucene-Solr-7.x-MacOSX/lucene/top-level-ivy-settings.xml

resolve:

ivy-availability-check:
[loadresource] Do not set property disallowed.ivy.jars.list as its length is 0.

-ivy-fail-disallowed-ivy-version:

ivy-fail:

ivy-configure:
[ivy:configure] :: loading settings :: file = /Users/jenkins/workspace/Lucene-Solr-7.x-MacOSX/lucene/top-level-ivy-settings.xml

resolve:

ivy-availability-check:
[loadresource] Do not set property disallowed.ivy.jars.list as its length is 0.

-ivy-fail-disallowed-ivy-version:

ivy-fail:

ivy-configure:
[ivy:configure] :: loading settings :: file = /Users/jenkins/workspace/Lucene-Solr-7.x-MacOSX/lucene/top-level-ivy-settings.xml

resolve:

ivy-availability-check:
[loadresource] Do not set property disallowed.ivy.jars.list as its length is 0.

-ivy-fail-disallowed-ivy-version:

ivy-fail:

ivy-configure:
[ivy:configure] :: loading settings :: file = /Users/jenkins/workspace/Lucene-Solr-7.x-MacOSX/lucene/top-level-ivy-settings.xml

resolve:

ivy-availability-check:
[loadresource] Do not set property disallowed.ivy.jars.list as its length is 0.

-ivy-fail-disallowed-ivy-version:

ivy-fail:

ivy-configure:
[ivy:configure] :: loading settings :: file = /Users/jenkins/workspace/Lucene-Solr-7.x-MacOSX/lucene/top-level-ivy-settings.xml

resolve:

ivy-availability-check:
[loadresource] Do not set property disallowed.ivy.jars.list as its length is 0.

-ivy-fail-disallowed-ivy-version:

ivy-fail:

ivy-configure:
[ivy:configure] :: loading settings :: file = /Users/jenkins/workspace/Lucene-Solr-7.x-MacOSX/lucene/top-level-ivy-settings.xml

resolve:

ivy-availability-check:
[loadresource] Do not set property disallowed.ivy.jars.list as its length is 0.

-ivy-fail-disallowed-ivy-version:

ivy-fail:

ivy-configure:
[ivy:configure] :: loading settings :: file = /Users/jenkins/workspace/Lucene-Solr-7.x-MacOSX/lucene/top-level-ivy-settings.xml

resolve:

ivy-availability-check:
[loadresource] Do not set property disallowed.ivy.jars.list as its length is 0.

-ivy-fail-disallowed-ivy-version:

ivy-fail:

ivy-configure:
[ivy:configure] :: loading settings :: file = /Users/jenkins/workspace/Lucene-Solr-7.x-MacOSX/lucene/top-level-ivy-settings.xml

resolve:

ivy-availability-check:
[loadresource] Do not set property disallowed.ivy.jars.list as its length is 0.

-ivy-fail-disallowed-ivy-version:

ivy-fail:

ivy-configure:
[ivy:configure] :: loading settings :: file = /Users/jenkins/workspace/Lucene-Solr-7.x-MacOSX/lucene/top-level-ivy-settings.xml

resolve:

ivy-availability-check:
[loadresource] Do not set property disallowed.ivy.jars.list as its length is 0.

-ivy-fail-disallowed-ivy-version:

ivy-fail:

ivy-configure:
[ivy:configure] :: loading settings :: file = /Users/jenkins/workspace/Lucene-Solr-7.x-MacOSX/lucene/top-level-ivy-settings.xml

resolve:

ivy-availability-check:
[loadresource] Do not set property disallowed.ivy.jars.list as its length is 0.

-ivy-fail-disallowed-ivy-version:

ivy-fail:

ivy-configure:
[ivy:configure] :: loading settings :: file = /Users/jenkins/workspace/Lucene-Solr-7.x-MacOSX/lucene/top-level-ivy-settings.xml

common.resolve:

resolve:

ivy-availability-check:
[loadresource] Do not set property disallowed.ivy.jars.list as its length is 0.

-ivy-fail-disallowed-ivy-version:

ivy-fail:

ivy-configure:
[ivy:configure] :: loading settings :: file = /Users/jenkins/workspace/Lucene-Solr-7.x-MacOSX/lucene/top-level-ivy-settings.xml

resolve:

ivy-availability-check:
[loadresource] Do not set property disallowed.ivy.jars.list as its length is 0.

-ivy-fail-disallowed-ivy-version:

ivy-fail:

ivy-configure:
[ivy:configure] :: loading settings :: file = /Users/jenkins/workspace/Lucene-Solr-7.x-MacOSX/lucene/top-level-ivy-settings.xml

resolve:

ivy-availability-check:
[loadresource] Do not set property disallowed.ivy.jars.list as its length is 0.

-ivy-fail-disallowed-ivy-version:

ivy-fail:

ivy-configure:
[ivy:configure] :: loading settings :: file = /Users/jenkins/workspace/Lucene-Solr-7.x-MacOSX/lucene/top-level-ivy-settings.xml

resolve:

ivy-availability-check:
[loadresource] Do not set property disallowed.ivy.jars.list as its length is 0.

-ivy-fail-disallowed-ivy-version:

ivy-fail:

ivy-configure:
[ivy:configure] :: loading settings :: file = /Users/jenkins/workspace/Lucene-Solr-7.x-MacOSX/lucene/top-level-ivy-settings.xml

resolve:

ivy-availability-check:
[loadresource] Do not set property disallowed.ivy.jars.list as its length is 0.

-ivy-fail-disallowed-ivy-version:

ivy-fail:

ivy-configure:
[ivy:configure] :: loading settings :: file = /Users/jenkins/workspace/Lucene-Solr-7.x-MacOSX/lucene/top-level-ivy-settings.xml

resolve:

jar-checksums:
    [mkdir] Created dir: /Users/jenkins/workspace/Lucene-Solr-7.x-MacOSX/lucene/null109080367
     [copy] Copying 35 files to /Users/jenkins/workspace/Lucene-Solr-7.x-MacOSX/lucene/null109080367
   [delete] Deleting directory /Users/jenkins/workspace/Lucene-Solr-7.x-MacOSX/lucene/null109080367

resolve-example:

ivy-availability-check:
[loadresource] Do not set property disallowed.ivy.jars.list as its length is 0.

-ivy-fail-disallowed-ivy-version:

ivy-fail:

ivy-configure:
[ivy:configure] :: loading settings :: file = /Users/jenkins/workspace/Lucene-Solr-7.x-MacOSX/lucene/top-level-ivy-settings.xml

resolve:

resolve-server:

ivy-availability-check:
[loadresource] Do not set property disallowed.ivy.jars.list as its length is 0.

-ivy-fail-disallowed-ivy-version:

ivy-fail:

ivy-fail:

ivy-configure:
[ivy:configure] :: loading settings :: file = /Users/jenkins/workspace/Lucene-Solr-7.x-MacOSX/lucene/top-level-ivy-settings.xml

resolve:

resolve:

ivy-availability-check:
[loadresource] Do not set property disallowed.ivy.jars.list as its length is 0.

-ivy-fail-disallowed-ivy-version:

ivy-fail:

ivy-fail:

ivy-configure:
[ivy:configure] :: loading settings :: file = /Users/jenkins/workspace/Lucene-Solr-7.x-MacOSX/lucene/top-level-ivy-settings.xml

resolve:

ivy-availability-check:
[loadresource] Do not set property disallowed.ivy.jars.list as its length is 0.

-ivy-fail-disallowed-ivy-version:

ivy-fail:

ivy-fail:

ivy-configure:
[ivy:configure] :: loading settings :: file = /Users/jenkins/workspace/Lucene-Solr-7.x-MacOSX/lucene/top-level-ivy-settings.xml

resolve:

ivy-availability-check:
[loadresource] Do not set property disallowed.ivy.jars.list as its length is 0.

-ivy-fail-disallowed-ivy-version:

ivy-fail:

ivy-configure:
[ivy:configure] :: loading settings :: file = /Users/jenkins/workspace/Lucene-Solr-7.x-MacOSX/lucene/top-level-ivy-settings.xml

resolve:

ivy-availability-check:
[loadresource] Do not set property disallowed.ivy.jars.list as its length is 0.

-ivy-fail-disallowed-ivy-version:

ivy-fail:

ivy-fail:

ivy-configure:
[ivy:configure] :: loading settings :: file = /Users/jenkins/workspace/Lucene-Solr-7.x-MacOSX/lucene/top-level-ivy-settings.xml

resolve:

ivy-availability-check:
[loadresource] Do not set property disallowed.ivy.jars.list as its length is 0.

-ivy-fail-disallowed-ivy-version:

ivy-fail:

ivy-configure:
[ivy:configure] :: loading settings :: file = /Users/jenkins/workspace/Lucene-Solr-7.x-MacOSX/lucene/top-level-ivy-settings.xml

resolve:

ivy-availability-check:
[loadresource] Do not set property disallowed.ivy.jars.list as its length is 0.

-ivy-fail-disallowed-ivy-version:

ivy-fail:

ivy-fail:

ivy-configure:
[ivy:configure] :: loading settings :: file = /Users/jenkins/workspace/Lucene-Solr-7.x-MacOSX/lucene/top-level-ivy-settings.xml

resolve:

ivy-availability-check:
[loadresource] Do not set property disallowed.ivy.jars.list as its length is 0.

-ivy-fail-disallowed-ivy-version:

ivy-fail:

ivy-fail:

ivy-configure:
[ivy:configure] :: loading settings :: file = /Users/jenkins/workspace/Lucene-Solr-7.x-MacOSX/lucene/top-level-ivy-settings.xml

resolve:

ivy-availability-check:
[loadresource] Do not set property disallowed.ivy.jars.list as its length is 0.

-ivy-fail-disallowed-ivy-version:

ivy-fail:

ivy-fail:

ivy-configure:
[ivy:configure] :: loading settings :: file = /Users/jenkins/workspace/Lucene-Solr-7.x-MacOSX/lucene/top-level-ivy-settings.xml

resolve:

ivy-availability-check:
[loadresource] Do not set property disallowed.ivy.jars.list as its length is 0.

-ivy-fail-disallowed-ivy-version:

ivy-fail:

ivy-fail:

ivy-configure:
[ivy:configure] :: loading settings :: file = /Users/jenkins/workspace/Lucene-Solr-7.x-MacOSX/lucene/top-level-ivy-settings.xml

resolve:

ivy-availability-check:
[loadresource] Do not set property disallowed.ivy.jars.list as its length is 0.

-ivy-fail-disallowed-ivy-version:

ivy-fail:

ivy-fail:

ivy-configure:
[ivy:configure] :: loading settings :: file = /Users/jenkins/workspace/Lucene-Solr-7.x-MacOSX/lucene/top-level-ivy-settings.xml

resolve:

ivy-availability-check:
[loadresource] Do not set property disallowed.ivy.jars.list as its length is 0.

-ivy-fail-disallowed-ivy-version:

ivy-fail:

ivy-fail:

ivy-configure:
[ivy:configure] :: loading settings :: file = /Users/jenkins/workspace/Lucene-Solr-7.x-MacOSX/lucene/top-level-ivy-settings.xml

resolve:

ivy-availability-check:
[loadresource] Do not set property disallowed.ivy.jars.list as its length is 0.

-ivy-fail-disallowed-ivy-version:

ivy-fail:

ivy-fail:

ivy-configure:
[ivy:configure] :: loading settings :: file = /Users/jenkins/workspace/Lucene-Solr-7.x-MacOSX/lucene/top-level-ivy-settings.xml

resolve:

ivy-availability-check:
[loadresource] Do not set property disallowed.ivy.jars.list as its length is 0.

-ivy-fail-disallowed-ivy-version:

ivy-fail:

ivy-fail:

ivy-configure:
[ivy:configure] :: loading settings :: file = /Users/jenkins/workspace/Lucene-Solr-7.x-MacOSX/lucene/top-level-ivy-settings.xml

resolve:

ivy-availability-check:
[loadresource] Do not set property disallowed.ivy.jars.list as its length is 0.

-ivy-fail-disallowed-ivy-version:

ivy-fail:

ivy-fail:

ivy-configure:
[ivy:configure] :: loading settings :: file = /Users/jenkins/workspace/Lucene-Solr-7.x-MacOSX/lucene/top-level-ivy-settings.xml

resolve:

ivy-availability-check:
[loadresource] Do not set property disallowed.ivy.jars.list as its length is 0.

-ivy-fail-disallowed-ivy-version:

ivy-fail:

ivy-fail:

ivy-configure:
[ivy:configure] :: loading settings :: file = /Users/jenkins/workspace/Lucene-Solr-7.x-MacOSX/lucene/top-level-ivy-settings.xml

resolve:

jar-checksums:
    [mkdir] Created dir: /Users/jenkins/workspace/Lucene-Solr-7.x-MacOSX/solr/null715537404
     [copy] Copying 239 files to /Users/jenkins/workspace/Lucene-Solr-7.x-MacOSX/solr/null715537404
   [delete] Deleting directory /Users/jenkins/workspace/Lucene-Solr-7.x-MacOSX/solr/null715537404

check-working-copy:
[ivy:cachepath] :: resolving dependencies :: org.eclipse.jgit#org.eclipse.jgit-caller;working
[ivy:cachepath] 	confs: [default]
[ivy:cachepath] 	found org.eclipse.jgit#org.eclipse.jgit;4.6.0.201612231935-r in public
[ivy:cachepath] 	found com.jcraft#jsch;0.1.53 in public
[ivy:cachepath] 	found com.googlecode.javaewah#JavaEWAH;1.1.6 in public
[ivy:cachepath] 	found org.apache.httpcomponents#httpclient;4.3.6 in public
[ivy:cachepath] 	found org.apache.httpcomponents#httpcore;4.3.3 in public
[ivy:cachepath] 	found commons-logging#commons-logging;1.1.3 in public
[ivy:cachepath] 	found commons-codec#commons-codec;1.6 in public
[ivy:cachepath] 	found org.slf4j#slf4j-api;1.7.2 in public
[ivy:cachepath] :: resolution report :: resolve 38ms :: artifacts dl 4ms
	---------------------------------------------------------------------
	|                  |            modules            ||   artifacts   |
	|       conf       | number| search|dwnlded|evicted|| number|dwnlded|
	---------------------------------------------------------------------
	|      default     |   8   |   0   |   0   |   0   ||   8   |   0   |
	---------------------------------------------------------------------
[wc-checker] Initializing working copy...
[wc-checker] SLF4J: Failed to load class "org.slf4j.impl.StaticLoggerBinder".
[wc-checker] SLF4J: Defaulting to no-operation (NOP) logger implementation
[wc-checker] SLF4J: See http://www.slf4j.org/codes.html#StaticLoggerBinder for further details.
[wc-checker] Checking working copy status...

-jenkins-base:

BUILD SUCCESSFUL
Total time: 119 minutes 20 seconds
Setting ANT_1_8_2_HOME=/Users/jenkins/tools/hudson.tasks.Ant_AntInstallation/ANT_1.8.2
[Lucene-Solr-7.x-MacOSX] $ /bin/sh -xe /var/folders/qg/h2dfw5s161s51l2bn79mrb7r0000gn/T/jenkins573485785486470304.sh
+ mv lucene/build lucene/build.orig
+ mv solr/build solr/build.orig
+ export ANT_HOME=/Users/jenkins/tools/hudson.tasks.Ant_AntInstallation/ANT_1.8.2
+ ANT_HOME=/Users/jenkins/tools/hudson.tasks.Ant_AntInstallation/ANT_1.8.2
+ export PATH=/Users/jenkins/tools/hudson.tasks.Ant_AntInstallation/ANT_1.8.2/bin:/Users/jenkins/tools/java/64bit/jdk1.8.0/bin:/usr/bin:/bin:/usr/sbin:/sbin:/usr/local/bin
+ PATH=/Users/jenkins/tools/hudson.tasks.Ant_AntInstallation/ANT_1.8.2/bin:/Users/jenkins/tools/java/64bit/jdk1.8.0/bin:/usr/bin:/bin:/usr/sbin:/sbin:/usr/local/bin
+ python3 -u dev-tools/scripts/reproduceJenkinsFailures.py --no-git https://jenkins.thetaphi.de/job/Lucene-Solr-7.x-MacOSX/860/consoleText
[repro] Jenkins log URL: https://jenkins.thetaphi.de/job/Lucene-Solr-7.x-MacOSX/860/consoleText

[repro] Revision: 216f10026b86627750e133fe24ce6a750c470695

[repro] Ant options: "-Dargs=-XX:-UseCompressedOops -XX:+UseG1GC"
[repro] Repro line:  ant test  -Dtestcase=MathExpressionTest -Dtests.method=testGammaDistribution -Dtests.seed=88E923EF1A26DEF4 -Dtests.slow=true -Dtests.locale=fr-FR -Dtests.timezone=GMT -Dtests.asserts=true -Dtests.file.encoding=US-ASCII

[repro] ant clean
Buildfile: /Users/jenkins/workspace/Lucene-Solr-7.x-MacOSX/build.xml

clean:

clean:

clean:

BUILD SUCCESSFUL
Total time: 0 seconds
[repro] Test suites by module:
[repro]    solr/solrj
[repro]       MathExpressionTest
[repro] ant compile-test
Buildfile: /Users/jenkins/workspace/Lucene-Solr-7.x-MacOSX/solr/solrj/build.xml

compile-solr-test-framework:

ivy-availability-check:
[loadresource] Do not set property disallowed.ivy.jars.list as its length is 0.

-ivy-fail-disallowed-ivy-version:

ivy-fail:

ivy-configure:
[ivy:configure] :: Apache Ivy 2.4.0 - 20141213170938 :: http://ant.apache.org/ivy/ ::
[ivy:configure] :: loading settings :: file = /Users/jenkins/workspace/Lucene-Solr-7.x-MacOSX/lucene/top-level-ivy-settings.xml

resolve:

-clover.disable:

-clover.load:

-clover.classpath:

-clover.setup:

clover:

compile-solr-core:

compile-solrj:

ivy-availability-check:
[loadresource] Do not set property disallowed.ivy.jars.list as its length is 0.

-ivy-fail-disallowed-ivy-version:

ivy-fail:

ivy-configure:
[ivy:configure] :: loading settings :: file = /Users/jenkins/workspace/Lucene-Solr-7.x-MacOSX/lucene/top-level-ivy-settings.xml

resolve-groovy:
[ivy:cachepath] :: resolving dependencies :: org.codehaus.groovy#groovy-all-caller;working
[ivy:cachepath] 	confs: [default]
[ivy:cachepath] 	found org.codehaus.groovy#groovy-all;2.4.15 in public
[ivy:cachepath] :: resolution report :: resolve 21ms :: artifacts dl 1ms
	---------------------------------------------------------------------
	|                  |            modules            ||   artifacts   |
	|       conf       | number| search|dwnlded|evicted|| number|dwnlded|
	---------------------------------------------------------------------
	|      default     |   1   |   0   |   0   |   0   ||   1   |   0   |
	---------------------------------------------------------------------

check-lucene-core-uptodate:

jar-lucene-core:

-mrjar-classes-uptodate:

ivy-availability-check:
[loadresource] Do not set property disallowed.ivy.jars.list as its length is 0.

-ivy-fail-disallowed-ivy-version:

ivy-fail:

ivy-configure:
[ivy:configure] :: loading settings :: file = /Users/jenkins/workspace/Lucene-Solr-7.x-MacOSX/lucene/top-level-ivy-settings.xml

resolve-groovy:

-check-git-state:

-git-cleanroot:

-copy-git-state:
     [copy] Copying 1 file to /Users/jenkins/workspace/Lucene-Solr-7.x-MacOSX/lucene/build

git-autoclean:

resolve:

init:

-clover.disable:

-clover.load:

-clover.classpath:

-clover.setup:

clover:

compile-core:
    [mkdir] Created dir: /Users/jenkins/workspace/Lucene-Solr-7.x-MacOSX/lucene/build/core/classes/java
    [javac] Compiling 857 source files to /Users/jenkins/workspace/Lucene-Solr-7.x-MacOSX/lucene/build/core/classes/java
    [javac] Note: Some input files use or override a deprecated API.
    [javac] Note: Recompile with -Xlint:deprecation for details.
    [javac] Creating empty /Users/jenkins/workspace/Lucene-Solr-7.x-MacOSX/lucene/build/core/classes/java/org/apache/lucene/util/graph/package-info.class
    [javac] Creating empty /Users/jenkins/workspace/Lucene-Solr-7.x-MacOSX/lucene/build/core/classes/java/org/apache/lucene/document/package-info.class
    [javac] Creating empty /Users/jenkins/workspace/Lucene-Solr-7.x-MacOSX/lucene/build/core/classes/java/org/apache/lucene/package-info.class
    [javac] Creating empty /Users/jenkins/workspace/Lucene-Solr-7.x-MacOSX/lucene/build/core/classes/java/org/apache/lucene/util/bkd/package-info.class
    [javac] Creating empty /Users/jenkins/workspace/Lucene-Solr-7.x-MacOSX/lucene/build/core/classes/java/org/apache/lucene/codecs/compressing/package-info.class
    [javac] Creating empty /Users/jenkins/workspace/Lucene-Solr-7.x-MacOSX/lucene/build/core/classes/java/org/apache/lucene/codecs/lucene60/package-info.class
    [javac] Creating empty /Users/jenkins/workspace/Lucene-Solr-7.x-MacOSX/lucene/build/core/classes/java/org/apache/lucene/codecs/package-info.class
    [javac] Creating empty /Users/jenkins/workspace/Lucene-Solr-7.x-MacOSX/lucene/build/core/classes/java/org/apache/lucene/util/package-info.class
    [javac] Creating empty /Users/jenkins/workspace/Lucene-Solr-7.x-MacOSX/lucene/build/core/classes/java/org/apache/lucene/index/package-info.class
    [javac] Creating empty /Users/jenkins/workspace/Lucene-Solr-7.x-MacOSX/lucene/build/core/classes/java/org/apache/lucene/util/fst/package-info.class
    [javac] Creating empty /Users/jenkins/workspace/Lucene-Solr-7.x-MacOSX/lucene/build/core/classes/java/org/apache/lucene/analysis/tokenattributes/package-info.class
    [javac] Creating empty /Users/jenkins/workspace/Lucene-Solr-7.x-MacOSX/lucene/build/core/classes/java/org/apache/lucene/search/package-info.class
    [javac] Creating empty /Users/jenkins/workspace/Lucene-Solr-7.x-MacOSX/lucene/build/core/classes/java/org/apache/lucene/codecs/lucene62/package-info.class
    [javac] Creating empty /Users/jenkins/workspace/Lucene-Solr-7.x-MacOSX/lucene/build/core/classes/java/org/apache/lucene/util/packed/package-info.class
    [javac] Creating empty /Users/jenkins/workspace/Lucene-Solr-7.x-MacOSX/lucene/build/core/classes/java/org/apache/lucene/util/mutable/package-info.class
    [javac] Creating empty /Users/jenkins/workspace/Lucene-Solr-7.x-MacOSX/lucene/build/core/classes/java/org/apache/lucene/codecs/lucene70/package-info.class
    [javac] Creating empty /Users/jenkins/workspace/Lucene-Solr-7.x-MacOSX/lucene/build/core/classes/java/org/apache/lucene/codecs/perfield/package-info.class
    [javac] Creating empty /Users/jenkins/workspace/Lucene-Solr-7.x-MacOSX/lucene/build/core/classes/java/org/apache/lucene/analysis/package-info.class
    [javac] Creating empty /Users/jenkins/workspace/Lucene-Solr-7.x-MacOSX/lucene/build/core/classes/java/org/apache/lucene/analysis/standard/package-info.class
    [javac] Creating empty /Users/jenkins/workspace/Lucene-Solr-7.x-MacOSX/lucene/build/core/classes/java/org/apache/lucene/store/package-info.class
    [javac] Creating empty /Users/jenkins/workspace/Lucene-Solr-7.x-MacOSX/lucene/build/core/classes/java/org/apache/lucene/codecs/blocktree/package-info.class
    [javac] Creating empty /Users/jenkins/workspace/Lucene-Solr-7.x-MacOSX/lucene/build/core/classes/java/org/apache/lucene/search/spans/package-info.class
    [javac] Creating empty /Users/jenkins/workspace/Lucene-Solr-7.x-MacOSX/lucene/build/core/classes/java/org/apache/lucene/search/similarities/package-info.class
    [javac] Creating empty /Users/jenkins/workspace/Lucene-Solr-7.x-MacOSX/lucene/build/core/classes/java/org/apache/lucene/util/automaton/package-info.class
    [javac] Creating empty /Users/jenkins/workspace/Lucene-Solr-7.x-MacOSX/lucene/build/core/classes/java/org/apache/lucene/codecs/lucene50/package-info.class
    [javac] Creating empty /Users/jenkins/workspace/Lucene-Solr-7.x-MacOSX/lucene/build/core/classes/java/org/apache/lucene/geo/package-info.class
     [copy] Copying 3 files to /Users/jenkins/workspace/Lucene-Solr-7.x-MacOSX/lucene/build/core/classes/java

patch-mrjar-classes:
[patch-cls] Remapped: org/apache/lucene/analysis/tokenattributes/CharTermAttributeImpl
[patch-cls] Remapped: org/apache/lucene/codecs/compressing/LZ4
[patch-cls] Remapped: org/apache/lucene/document/BinaryPoint$2
[patch-cls] Remapped: org/apache/lucene/document/DoubleRange
[patch-cls] Remapped: org/apache/lucene/document/FloatRange
[patch-cls] Remapped: org/apache/lucene/document/IntRange
[patch-cls] Remapped: org/apache/lucene/document/LatLonPointDistanceQuery$1$2
[patch-cls] Remapped: org/apache/lucene/document/LatLonPointDistanceQuery$1$3
[patch-cls] Remapped: org/apache/lucene/document/LatLonPointInPolygonQuery$1$1
[patch-cls] Remapped: org/apache/lucene/document/LongRange
[patch-cls] Remapped: org/apache/lucene/document/RangeFieldQuery$QueryType$1
[patch-cls] Remapped: org/apache/lucene/document/RangeFieldQuery$QueryType$2
[patch-cls] Remapped: org/apache/lucene/document/RangeFieldQuery$QueryType$3
[patch-cls] Remapped: org/apache/lucene/index/BitsSlice
[patch-cls] Remapped: org/apache/lucene/index/CheckIndex$VerifyPointsVisitor
[patch-cls] Remapped: org/apache/lucene/index/CodecReader
[patch-cls] Remapped: org/apache/lucene/index/MergeReaderWrapper
[patch-cls] Remapped: org/apache/lucene/index/PointValues
[patch-cls] Remapped: org/apache/lucene/search/BooleanScorer$TailPriorityQueue
[patch-cls] Remapped: org/apache/lucene/search/PointInSetQuery$SinglePointVisitor
[patch-cls] Remapped: org/apache/lucene/search/PointRangeQuery$1$1
[patch-cls] Remapped: org/apache/lucene/search/PointRangeQuery$1$2
[patch-cls] Remapped: org/apache/lucene/search/PointRangeQuery$1
[patch-cls] Remapped: org/apache/lucene/util/BytesRef
[patch-cls] Remapped: org/apache/lucene/util/BytesRefArray
[patch-cls] Remapped: org/apache/lucene/util/CharsRef$UTF16SortedAsUTF8Comparator
[patch-cls] Remapped: org/apache/lucene/util/CharsRef
[patch-cls] Remapped: org/apache/lucene/util/IntsRef
[patch-cls] Remapped: org/apache/lucene/util/LongsRef
[patch-cls] Remapped: org/apache/lucene/util/StringHelper
[patch-cls] Remapped: org/apache/lucene/util/automaton/Automaton$Builder
[patch-cls] Remapped: org/apache/lucene/util/automaton/Automaton
[patch-cls] Remapped: org/apache/lucene/util/bkd/BKDReader
[patch-cls] Remapped: org/apache/lucene/util/bkd/BKDWriter$BKDMergeQueue
[patch-cls] Remapped: org/apache/lucene/util/bkd/BKDWriter
[patch-cls] Remapped: org/apache/lucene/util/bkd/MutablePointsReaderUtils$1$1
[patch-cls] Remapped: org/apache/lucene/util/bkd/MutablePointsReaderUtils$2
[patch-cls] Remapped: org/apache/lucene/util/bkd/MutablePointsReaderUtils$3$1
[patch-cls] Remapped 38 class files for Java 9 to: /Users/jenkins/workspace/Lucene-Solr-7.x-MacOSX/lucene/build/core/classes/java9
    [touch] Creating /Users/jenkins/workspace/Lucene-Solr-7.x-MacOSX/lucene/build/core/patch-mrjar.stamp

-mrjar-check:

-mrjar-core:
     [exec] Result: 1
      [jar] Building jar: /Users/jenkins/workspace/Lucene-Solr-7.x-MacOSX/lucene/build/core/lucene-core-7.6.0-SNAPSHOT.jar

-jar-core:

jar-core:

check-backward-codecs-uptodate:

jar-backward-codecs:

-mrjar-classes-uptodate:

ivy-availability-check:
[loadresource] Do not set property disallowed.ivy.jars.list as its length is 0.

-ivy-fail-disallowed-ivy-version:

ivy-fail:

ivy-configure:
[ivy:configure] :: loading settings :: file = /Users/jenkins/workspace/Lucene-Solr-7.x-MacOSX/lucene/top-level-ivy-settings.xml

resolve-groovy:

-check-git-state:

-git-cleanroot:

-copy-git-state:

git-autoclean:

resolve:

common.init:

compile-lucene-core:

-check-git-state:

-git-cleanroot:

-copy-git-state:

git-autoclean:

ivy-availability-check:
[loadresource] Do not set property disallowed.ivy.jars.list as its length is 0.

-ivy-fail-disallowed-ivy-version:

ivy-fail:

ivy-configure:
[ivy:configure] :: loading settings :: file = /Users/jenkins/workspace/Lucene-Solr-7.x-MacOSX/lucene/top-level-ivy-settings.xml

resolve:

init:

-clover.disable:

-clover.load:

-clover.classpath:

-clover.setup:

clover:

compile-core:

init:

-clover.disable:

-clover.load:

-clover.classpath:

-clover.setup:

clover:

compile-core:
    [mkdir] Created dir: /Users/jenkins/workspace/Lucene-Solr-7.x-MacOSX/lucene/build/backward-codecs/classes/java
    [javac] Compiling 13 source files to /Users/jenkins/workspace/Lucene-Solr-7.x-MacOSX/lucene/build/backward-codecs/classes/java
    [javac] Note: Some input files use or override a deprecated API.
    [javac] Note: Recompile with -Xlint:deprecation for details.
    [javac] Creating empty /Users/jenkins/workspace/Lucene-Solr-7.x-MacOSX/lucene/build/backward-codecs/classes/java/org/apache/lucene/codecs/lucene54/package-info.class
    [javac] Creating empty /Users/jenkins/workspace/Lucene-Solr-7.x-MacOSX/lucene/build/backward-codecs/classes/java/org/apache/lucene/codecs/lucene53/package-info.class
     [copy] Copying 3 files to /Users/jenkins/workspace/Lucene-Solr-7.x-MacOSX/lucene/build/backward-codecs/classes/java

patch-mrjar-classes:
[patch-cls] Remapped 0 class files for Java 9 to: /Users/jenkins/workspace/Lucene-Solr-7.x-MacOSX/lucene/build/backward-codecs/classes/java9
    [touch] Creating /Users/jenkins/workspace/Lucene-Solr-7.x-MacOSX/lucene/build/backward-codecs/patch-mrjar.stamp

-mrjar-check:

-mrjar-core:

-jar-core:
     [exec] Result: 1
      [jar] Building jar: /Users/jenkins/workspace/Lucene-Solr-7.x-MacOSX/lucene/build/backward-codecs/lucene-backward-codecs-7.6.0-SNAPSHOT.jar

jar-core:

check-analyzers-phonetic-uptodate:

jar-analyzers-phonetic:

-mrjar-classes-uptodate:

ivy-availability-check:
[loadresource] Do not set property disallowed.ivy.jars.list as its length is 0.

-ivy-fail-disallowed-ivy-version:

ivy-fail:

ivy-configure:
[ivy:configure] :: loading settings :: file = /Users/jenkins/workspace/Lucene-Solr-7.x-MacOSX/lucene/top-level-ivy-settings.xml

resolve-groovy:

check-analyzers-common-uptodate:

jar-analyzers-common:

-mrjar-classes-uptodate:

ivy-availability-check:
[loadresource] Do not set property disallowed.ivy.jars.list as its length is 0.

-ivy-fail-disallowed-ivy-version:

ivy-fail:

ivy-configure:
[ivy:configure] :: loading settings :: file = /Users/jenkins/workspace/Lucene-Solr-7.x-MacOSX/lucene/top-level-ivy-settings.xml

resolve-groovy:

-check-git-state:

-git-cleanroot:

-copy-git-state:

git-autoclean:

resolve:

common.init:

compile-lucene-core:

-check-git-state:

-git-cleanroot:

-copy-git-state:

git-autoclean:

ivy-availability-check:
[loadresource] Do not set property disallowed.ivy.jars.list as its length is 0.

-ivy-fail-disallowed-ivy-version:

ivy-fail:

ivy-configure:
[ivy:configure] :: loading settings :: file = /Users/jenkins/workspace/Lucene-Solr-7.x-MacOSX/lucene/top-level-ivy-settings.xml

resolve:

init:

-clover.disable:

-clover.load:

-clover.classpath:

-clover.setup:

clover:

compile-core:

init:

-clover.disable:

-clover.load:

-clover.classpath:

-clover.setup:

clover:

compile-core:
    [mkdir] Created dir: /Users/jenkins/workspace/Lucene-Solr-7.x-MacOSX/lucene/build/analysis/common/classes/java
    [javac] Compiling 475 source files to /Users/jenkins/workspace/Lucene-Solr-7.x-MacOSX/lucene/build/analysis/common/classes/java
    [javac] Note: Some input files use or override a deprecated API.
    [javac] Note: Recompile with -Xlint:deprecation for details.
    [javac] Creating empty /Users/jenkins/workspace/Lucene-Solr-7.x-MacOSX/lucene/build/analysis/common/classes/java/org/apache/lucene/analysis/hunspell/package-info.class
    [javac] Creating empty /Users/jenkins/workspace/Lucene-Solr-7.x-MacOSX/lucene/build/analysis/common/classes/java/org/apache/lucene/analysis/minhash/package-info.class
    [javac] Creating empty /Users/jenkins/workspace/Lucene-Solr-7.x-MacOSX/lucene/build/analysis/common/classes/java/org/apache/lucene/analysis/ga/package-info.class
    [javac] Creating empty /Users/jenkins/workspace/Lucene-Solr-7.x-MacOSX/lucene/build/analysis/common/classes/java/org/apache/lucene/analysis/ca/package-info.class
    [javac] Creating empty /Users/jenkins/workspace/Lucene-Solr-7.x-MacOSX/lucene/build/analysis/common/classes/java/org/apache/lucene/analysis/custom/package-info.class
    [javac] Creating empty /Users/jenkins/workspace/Lucene-Solr-7.x-MacOSX/lucene/build/analysis/common/classes/java/org/apache/lucene/analysis/sr/package-info.class
    [javac] Creating empty /Users/jenkins/workspace/Lucene-Solr-7.x-MacOSX/lucene/build/analysis/common/classes/java/org/apache/lucene/collation/package-info.class
    [javac] Creating empty /Users/jenkins/workspace/Lucene-Solr-7.x-MacOSX/lucene/build/analysis/common/classes/java/org/apache/lucene/analysis/sv/package-info.class
    [javac] Creating empty /Users/jenkins/workspace/Lucene-Solr-7.x-MacOSX/lucene/build/analysis/common/classes/java/org/apache/lucene/analysis/bg/package-info.class
    [javac] Creating empty /Users/jenkins/workspace/Lucene-Solr-7.x-MacOSX/lucene/build/analysis/common/classes/java/org/apache/lucene/analysis/payloads/package-info.class
    [javac] Creating empty /Users/jenkins/workspace/Lucene-Solr-7.x-MacOSX/lucene/build/analysis/common/classes/java/org/apache/lucene/analysis/ngram/package-info.class
    [javac] Creating empty /Users/jenkins/workspace/Lucene-Solr-7.x-MacOSX/lucene/build/analysis/common/classes/java/org/apache/lucene/analysis/core/package-info.class
    [javac] Creating empty /Users/jenkins/workspace/Lucene-Solr-7.x-MacOSX/lucene/build/analysis/common/classes/java/org/apache/lucene/analysis/bn/package-info.class
    [javac] Creating empty /Users/jenkins/workspace/Lucene-Solr-7.x-MacOSX/lucene/build/analysis/common/classes/java/org/apache/lucene/analysis/fr/package-info.class
    [javac] Creating empty /Users/jenkins/workspace/Lucene-Solr-7.x-MacOSX/lucene/build/analysis/common/classes/java/org/tartarus/snowball/ext/package-info.class
    [javac] Creating empty /Users/jenkins/workspace/Lucene-Solr-7.x-MacOSX/lucene/build/analysis/common/classes/java/org/apache/lucene/analysis/br/package-info.class
    [javac] Creating empty /Users/jenkins/workspace/Lucene-Solr-7.x-MacOSX/lucene/build/analysis/common/classes/java/org/apache/lucene/analysis/miscellaneous/package-info.class
    [javac] Creating empty /Users/jenkins/workspace/Lucene-Solr-7.x-MacOSX/lucene/build/analysis/common/classes/java/org/apache/lucene/analysis/sinks/package-info.class
    [javac] Creating empty /Users/jenkins/workspace/Lucene-Solr-7.x-MacOSX/lucene/build/analysis/common/classes/java/org/apache/lucene/analysis/cjk/package-info.class
    [javac] Creating empty /Users/jenkins/workspace/Lucene-Solr-7.x-MacOSX/lucene/build/analysis/common/classes/java/org/apache/lucene/analysis/synonym/package-info.class
    [javac] Creating empty /Users/jenkins/workspace/Lucene-Solr-7.x-MacOSX/lucene/build/analysis/common/classes/java/org/apache/lucene/analysis/wikipedia/package-info.class
    [javac] Creating empty /Users/jenkins/workspace/Lucene-Solr-7.x-MacOSX/lucene/build/analysis/common/classes/java/org/apache/lucene/analysis/fa/package-info.class
    [javac] Creating empty /Users/jenkins/workspace/Lucene-Solr-7.x-MacOSX/lucene/build/analysis/common/classes/java/org/apache/lucene/analysis/reverse/package-info.class
    [javac] Creating empty /Users/jenkins/workspace/Lucene-Solr-7.x-MacOSX/lucene/build/analysis/common/classes/java/org/apache/lucene/analysis/nl/package-info.class
    [javac] Creating empty /Users/jenkins/workspace/Lucene-Solr-7.x-MacOSX/lucene/build/analysis/common/classes/java/org/apache/lucene/analysis/ro/package-info.class
    [javac] Creating empty /Users/jenkins/workspace/Lucene-Solr-7.x-MacOSX/lucene/build/analysis/common/classes/java/org/apache/lucene/analysis/fi/package-info.class
    [javac] Creating empty /Users/jenkins/workspace/Lucene-Solr-7.x-MacOSX/lucene/build/analysis/common/classes/java/org/apache/lucene/analysis/ru/package-info.class
    [javac] Creating empty /Users/jenkins/workspace/Lucene-Solr-7.x-MacOSX/lucene/build/analysis/common/classes/java/org/apache/lucene/analysis/no/package-info.class
    [javac] Creating empty /Users/jenkins/workspace/Lucene-Solr-7.x-MacOSX/lucene/build/analysis/common/classes/java/org/apache/lucene/analysis/el/package-info.class
    [javac] Creating empty /Users/jenkins/workspace/Lucene-Solr-7.x-MacOSX/lucene/build/analysis/common/classes/java/org/apache/lucene/analysis/ckb/package-info.class
    [javac] Creating empty /Users/jenkins/workspace/Lucene-Solr-7.x-MacOSX/lucene/build/analysis/common/classes/java/org/tartarus/snowball/package-info.class
    [javac] Creating empty /Users/jenkins/workspace/Lucene-Solr-7.x-MacOSX/lucene/build/analysis/common/classes/java/org/apache/lucene/analysis/in/package-info.class
    [javac] Creating empty /Users/jenkins/workspace/Lucene-Solr-7.x-MacOSX/lucene/build/analysis/common/classes/java/org/apache/lucene/analysis/util/package-info.class
    [javac] Creating empty /Users/jenkins/workspace/Lucene-Solr-7.x-MacOSX/lucene/build/analysis/common/classes/java/org/apache/lucene/analysis/it/package-info.class
    [javac] Creating empty /Users/jenkins/workspace/Lucene-Solr-7.x-MacOSX/lucene/build/analysis/common/classes/java/org/apache/lucene/analysis/snowball/package-info.class
    [javac] Creating empty /Users/jenkins/workspace/Lucene-Solr-7.x-MacOSX/lucene/build/analysis/common/classes/java/org/apache/lucene/analysis/en/package-info.class
    [javac] Creating empty /Users/jenkins/workspace/Lucene-Solr-7.x-MacOSX/lucene/build/analysis/common/classes/java/org/apache/lucene/analysis/es/package-info.class
    [javac] Creating empty /Users/jenkins/workspace/Lucene-Solr-7.x-MacOSX/lucene/build/analysis/common/classes/java/org/apache/lucene/analysis/shingle/package-info.class
    [javac] Creating empty /Users/jenkins/workspace/Lucene-Solr-7.x-MacOSX/lucene/build/analysis/common/classes/java/org/apache/lucene/analysis/eu/package-info.class
    [javac] Creating empty /Users/jenkins/workspace/Lucene-Solr-7.x-MacOSX/lucene/build/analysis/common/classes/java/org/apache/lucene/analysis/ar/package-info.class
    [javac] Creating empty /Users/jenkins/workspace/Lucene-Solr-7.x-MacOSX/lucene/build/analysis/common/classes/java/org/apache/lucene/analysis/query/package-info.class
    [javac] Creating empty /Users/jenkins/workspace/Lucene-Solr-7.x-MacOSX/lucene/build/analysis/common/classes/java/org/apache/lucene/analysis/id/package-info.class
    [javac] Creating empty /Users/jenkins/workspace/Lucene-Solr-7.x-MacOSX/lucene/build/analysis/common/classes/java/org/apache/lucene/analysis/compound/hyphenation/package-info.class
    [javac] Creating empty /Users/jenkins/workspace/Lucene-Solr-7.x-MacOSX/lucene/build/analysis/common/classes/java/org/apache/lucene/analysis/charfilter/package-info.class
    [javac] Creating empty /Users/jenkins/workspace/Lucene-Solr-7.x-MacOSX/lucene/build/analysis/common/classes/java/org/apache/lucene/analysis/pt/package-info.class
    [javac] Creating empty /Users/jenkins/workspace/Lucene-Solr-7.x-MacOSX/lucene/build/analysis/common/classes/java/org/apache/lucene/analysis/lv/package-info.class
    [javac] Creating empty /Users/jenkins/workspace/Lucene-Solr-7.x-MacOSX/lucene/build/analysis/common/classes/java/org/apache/lucene/analysis/lt/package-info.class
    [javac] Creating empty /Users/jenkins/workspace/Lucene-Solr-7.x-MacOSX/lucene/build/analysis/common/classes/java/org/apache/lucene/analysis/hu/package-info.class
    [javac] Creating empty /Users/jenkins/workspace/Lucene-Solr-7.x-MacOSX/lucene/build/analysis/common/classes/java/org/apache/lucene/analysis/hy/package-info.class
    [javac] Creating empty /Users/jenkins/workspace/Lucene-Solr-7.x-MacOSX/lucene/build/analysis/common/classes/java/org/apache/lucene/analysis/pattern/package-info.class
    [javac] Creating empty /Users/jenkins/workspace/Lucene-Solr-7.x-MacOSX/lucene/build/analysis/common/classes/java/org/apache/lucene/analysis/cz/package-info.class
    [javac] Creating empty /Users/jenkins/workspace/Lucene-Solr-7.x-MacOSX/lucene/build/analysis/common/classes/java/org/apache/lucene/analysis/th/package-info.class
    [javac] Creating empty /Users/jenkins/workspace/Lucene-Solr-7.x-MacOSX/lucene/build/analysis/common/classes/java/org/apache/lucene/analysis/path/package-info.class
    [javac] Creating empty /Users/jenkins/workspace/Lucene-Solr-7.x-MacOSX/lucene/build/analysis/common/classes/java/org/apache/lucene/analysis/tr/package-info.class
    [javac] Creating empty /Users/jenkins/workspace/Lucene-Solr-7.x-MacOSX/lucene/build/analysis/common/classes/java/org/apache/lucene/analysis/da/package-info.class
    [javac] Creating empty /Users/jenkins/workspace/Lucene-Solr-7.x-MacOSX/lucene/build/analysis/common/classes/java/org/apache/lucene/analysis/de/package-info.class
    [javac] Creating empty /Users/jenkins/workspace/Lucene-Solr-7.x-MacOSX/lucene/build/analysis/common/classes/java/org/apache/lucene/analysis/hi/package-info.class
    [javac] Creating empty /Users/jenkins/workspace/Lucene-Solr-7.x-MacOSX/lucene/build/analysis/common/classes/java/org/apache/lucene/collation/tokenattributes/package-info.class
    [javac] Creating empty /Users/jenkins/workspace/Lucene-Solr-7.x-MacOSX/lucene/build/analysis/common/classes/java/org/apache/lucene/analysis/gl/package-info.class
    [javac] Creating empty /Users/jenkins/workspace/Lucene-Solr-7.x-MacOSX/lucene/build/analysis/common/classes/java/org/apache/lucene/analysis/commongrams/package-info.class
    [javac] Creating empty /Users/jenkins/workspace/Lucene-Solr-7.x-MacOSX/lucene/build/analysis/common/classes/java/org/apache/lucene/analysis/compound/package-info.class
     [copy] Copying 40 files to /Users/jenkins/workspace/Lucene-Solr-7.x-MacOSX/lucene/build/analysis/common/classes/java

patch-mrjar-classes:
[patch-cls] Remapped 0 class files for Java 9 to: /Users/jenkins/workspace/Lucene-Solr-7.x-MacOSX/lucene/build/analysis/common/classes/java9
    [touch] Creating /Users/jenkins/workspace/Lucene-Solr-7.x-MacOSX/lucene/build/analysis/common/patch-mrjar.stamp

-mrjar-check:

-mrjar-core:

-jar-core:
     [exec] Result: 1
      [jar] Building jar: /Users/jenkins/workspace/Lucene-Solr-7.x-MacOSX/lucene/build/analysis/common/lucene-analyzers-common-7.6.0-SNAPSHOT.jar

jar-core:

-check-git-state:

-git-cleanroot:

-copy-git-state:

git-autoclean:

resolve:

common.init:

compile-lucene-core:

-check-git-state:

-git-cleanroot:

-copy-git-state:

git-autoclean:

ivy-availability-check:
[loadresource] Do not set property disallowed.ivy.jars.list as its length is 0.

-ivy-fail-disallowed-ivy-version:

ivy-fail:

ivy-configure:
[ivy:configure] :: loading settings :: file = /Users/jenkins/workspace/Lucene-Solr-7.x-MacOSX/lucene/top-level-ivy-settings.xml

resolve:

init:

-clover.disable:

-clover.load:

-clover.classpath:

-clover.setup:

clover:

compile-core:

init:

-clover.disable:

-clover.load:

-clover.classpath:

-clover.setup:

clover:

common.compile-core:
    [mkdir] Created dir: /Users/jenkins/workspace/Lucene-Solr-7.x-MacOSX/lucene/build/analysis/phonetic/classes/java
    [javac] Compiling 9 source files to /Users/jenkins/workspace/Lucene-Solr-7.x-MacOSX/lucene/build/analysis/phonetic/classes/java
    [javac] Creating empty /Users/jenkins/workspace/Lucene-Solr-7.x-MacOSX/lucene/build/analysis/phonetic/classes/java/org/apache/lucene/analysis/phonetic/package-info.class
     [copy] Copying 1 file to /Users/jenkins/workspace/Lucene-Solr-7.x-MacOSX/lucene/build/analysis/phonetic/classes/java

compile-core:

patch-mrjar-classes:
[patch-cls] Remapped 0 class files for Java 9 to: /Users/jenkins/workspace/Lucene-Solr-7.x-MacOSX/lucene/build/analysis/phonetic/classes/java9
    [touch] Creating /Users/jenkins/workspace/Lucene-Solr-7.x-MacOSX/lucene/build/analysis/phonetic/patch-mrjar.stamp

-mrjar-check:

-mrjar-core:

-jar-core:
     [exec] Result: 1
      [jar] Building jar: /Users/jenkins/workspace/Lucene-Solr-7.x-MacOSX/lucene/build/analysis/phonetic/lucene-analyzers-phonetic-7.6.0-SNAPSHOT.jar

jar-core:

check-analyzers-kuromoji-uptodate:

jar-analyzers-kuromoji:

-mrjar-classes-uptodate:

ivy-availability-check:
[loadresource] Do not set property disallowed.ivy.jars.list as its length is 0.

-ivy-fail-disallowed-ivy-version:

ivy-fail:

ivy-configure:
[ivy:configure] :: loading settings :: file = /Users/jenkins/workspace/Lucene-Solr-7.x-MacOSX/lucene/top-level-ivy-settings.xml

resolve-groovy:

check-analyzers-common-uptodate:

jar-analyzers-common:

-check-git-state:

-git-cleanroot:

-copy-git-state:

git-autoclean:

resolve:

common.init:

compile-lucene-core:

-check-git-state:

-git-cleanroot:

-copy-git-state:

git-autoclean:

ivy-availability-check:
[loadresource] Do not set property disallowed.ivy.jars.list as its length is 0.

-ivy-fail-disallowed-ivy-version:

ivy-fail:

ivy-configure:
[ivy:configure] :: loading settings :: file = /Users/jenkins/workspace/Lucene-Solr-7.x-MacOSX/lucene/top-level-ivy-settings.xml

resolve:

init:

-clover.disable:

-clover.load:

-clover.classpath:

-clover.setup:

clover:

compile-core:

init:

-clover.disable:

-clover.load:

-clover.classpath:

-clover.setup:

clover:

common.compile-core:
    [mkdir] Created dir: /Users/jenkins/workspace/Lucene-Solr-7.x-MacOSX/lucene/build/analysis/kuromoji/classes/java
    [javac] Compiling 39 source files to /Users/jenkins/workspace/Lucene-Solr-7.x-MacOSX/lucene/build/analysis/kuromoji/classes/java
    [javac] Creating empty /Users/jenkins/workspace/Lucene-Solr-7.x-MacOSX/lucene/build/analysis/kuromoji/classes/java/org/apache/lucene/analysis/ja/dict/package-info.class
    [javac] Creating empty /Users/jenkins/workspace/Lucene-Solr-7.x-MacOSX/lucene/build/analysis/kuromoji/classes/java/org/apache/lucene/analysis/ja/package-info.class
    [javac] Creating empty /Users/jenkins/workspace/Lucene-Solr-7.x-MacOSX/lucene/build/analysis/kuromoji/classes/java/org/apache/lucene/analysis/ja/util/package-info.class
    [javac] Creating empty /Users/jenkins/workspace/Lucene-Solr-7.x-MacOSX/lucene/build/analysis/kuromoji/classes/java/org/apache/lucene/analysis/ja/tokenattributes/package-info.class
     [copy] Copying 14 files to /Users/jenkins/workspace/Lucene-Solr-7.x-MacOSX/lucene/build/analysis/kuromoji/classes/java

compile-core:

patch-mrjar-classes:
[patch-cls] Remapped 0 class files for Java 9 to: /Users/jenkins/workspace/Lucene-Solr-7.x-MacOSX/lucene/build/analysis/kuromoji/classes/java9
    [touch] Creating /Users/jenkins/workspace/Lucene-Solr-7.x-MacOSX/lucene/build/analysis/kuromoji/patch-mrjar.stamp

-mrjar-check:

-mrjar-core:

-jar-core:
     [exec] Result: 1
      [jar] Building jar: /Users/jenkins/workspace/Lucene-Solr-7.x-MacOSX/lucene/build/analysis/kuromoji/lucene-analyzers-kuromoji-7.6.0-SNAPSHOT.jar

jar-core:

check-analyzers-nori-uptodate:

jar-analyzers-nori:

-mrjar-classes-uptodate:

ivy-availability-check:
[loadresource] Do not set property disallowed.ivy.jars.list as its length is 0.

-ivy-fail-disallowed-ivy-version:

ivy-fail:

ivy-configure:
[ivy:configure] :: loading settings :: file = /Users/jenkins/workspace/Lucene-Solr-7.x-MacOSX/lucene/top-level-ivy-settings.xml

resolve-groovy:

check-analyzers-common-uptodate:

jar-analyzers-common:

-check-git-state:

-git-cleanroot:

-copy-git-state:

git-autoclean:

resolve:

common.init:

compile-lucene-core:

-check-git-state:

-git-cleanroot:

-copy-git-state:

git-autoclean:

ivy-availability-check:
[loadresource] Do not set property disallowed.ivy.jars.list as its length is 0.

-ivy-fail-disallowed-ivy-version:

ivy-fail:

ivy-configure:
[ivy:configure] :: loading settings :: file = /Users/jenkins/workspace/Lucene-Solr-7.x-MacOSX/lucene/top-level-ivy-settings.xml

resolve:

init:

-clover.disable:

-clover.load:

-clover.classpath:

-clover.setup:

clover:

compile-core:

init:

-clover.disable:

-clover.load:

-clover.classpath:

-clover.setup:

clover:

common.compile-core:
    [mkdir] Created dir: /Users/jenkins/workspace/Lucene-Solr-7.x-MacOSX/lucene/build/analysis/nori/classes/java
    [javac] Compiling 29 source files to /Users/jenkins/workspace/Lucene-Solr-7.x-MacOSX/lucene/build/analysis/nori/classes/java
    [javac] Creating empty /Users/jenkins/workspace/Lucene-Solr-7.x-MacOSX/lucene/build/analysis/nori/classes/java/org/apache/lucene/analysis/ko/package-info.class
    [javac] Creating empty /Users/jenkins/workspace/Lucene-Solr-7.x-MacOSX/lucene/build/analysis/nori/classes/java/org/apache/lucene/analysis/ko/tokenattributes/package-info.class
    [javac] Creating empty /Users/jenkins/workspace/Lucene-Solr-7.x-MacOSX/lucene/build/analysis/nori/classes/java/org/apache/lucene/analysis/ko/util/package-info.class
    [javac] Creating empty /Users/jenkins/workspace/Lucene-Solr-7.x-MacOSX/lucene/build/analysis/nori/classes/java/org/apache/lucene/analysis/ko/dict/package-info.class
     [copy] Copying 11 files to /Users/jenkins/workspace/Lucene-Solr-7.x-MacOSX/lucene/build/analysis/nori/classes/java

compile-core:

patch-mrjar-classes:
[patch-cls] Remapped 0 class files for Java 9 to: /Users/jenkins/workspace/Lucene-Solr-7.x-MacOSX/lucene/build/analysis/nori/classes/java9
    [touch] Creating /Users/jenkins/workspace/Lucene-Solr-7.x-MacOSX/lucene/build/analysis/nori/patch-mrjar.stamp

-mrjar-check:

-mrjar-core:

-jar-core:
     [exec] Result: 1
      [jar] Building jar: /Users/jenkins/workspace/Lucene-Solr-7.x-MacOSX/lucene/build/analysis/nori/lucene-analyzers-nori-7.6.0-SNAPSHOT.jar

jar-core:

check-codecs-uptodate:

jar-codecs:

-mrjar-classes-uptodate:

ivy-availability-check:
[loadresource] Do not set property disallowed.ivy.jars.list as its length is 0.

-ivy-fail-disallowed-ivy-version:

ivy-fail:

ivy-configure:
[ivy:configure] :: loading settings :: file = /Users/jenkins/workspace/Lucene-Solr-7.x-MacOSX/lucene/top-level-ivy-settings.xml

resolve-groovy:

-check-git-state:

-git-cleanroot:

-copy-git-state:

git-autoclean:

resolve:

common.init:

compile-lucene-core:

-check-git-state:

-git-cleanroot:

-copy-git-state:

git-autoclean:

ivy-availability-check:
[loadresource] Do not set property disallowed.ivy.jars.list as its length is 0.

-ivy-fail-disallowed-ivy-version:

ivy-fail:

ivy-configure:
[ivy:configure] :: loading settings :: file = /Users/jenkins/workspace/Lucene-Solr-7.x-MacOSX/lucene/top-level-ivy-settings.xml

resolve:

init:

-clover.disable:

-clover.load:

-clover.classpath:

-clover.setup:

clover:

compile-core:

init:

-clover.disable:

-clover.load:

-clover.classpath:

-clover.setup:

clover:

compile-core:
    [mkdir] Created dir: /Users/jenkins/workspace/Lucene-Solr-7.x-MacOSX/lucene/build/codecs/classes/java
    [javac] Compiling 67 source files to /Users/jenkins/workspace/Lucene-Solr-7.x-MacOSX/lucene/build/codecs/classes/java
    [javac] Note: Some input files use or override a deprecated API.
    [javac] Note: Recompile with -Xlint:deprecation for details.
    [javac] Creating empty /Users/jenkins/workspace/Lucene-Solr-7.x-MacOSX/lucene/build/codecs/classes/java/org/apache/lucene/codecs/bloom/package-info.class
    [javac] Creating empty /Users/jenkins/workspace/Lucene-Solr-7.x-MacOSX/lucene/build/codecs/classes/java/org/apache/lucene/codecs/memory/package-info.class
    [javac] Creating empty /Users/jenkins/workspace/Lucene-Solr-7.x-MacOSX/lucene/build/codecs/classes/java/org/apache/lucene/codecs/simpletext/package-info.class
    [javac] Creating empty /Users/jenkins/workspace/Lucene-Solr-7.x-MacOSX/lucene/build/codecs/classes/java/org/apache/lucene/codecs/blockterms/package-info.class
    [javac] Creating empty /Users/jenkins/workspace/Lucene-Solr-7.x-MacOSX/lucene/build/codecs/classes/java/org/apache/lucene/codecs/blocktreeords/package-info.class
     [copy] Copying 3 files to /Users/jenkins/workspace/Lucene-Solr-7.x-MacOSX/lucene/build/codecs/classes/java

patch-mrjar-classes:
[patch-cls] Remapped: org/apache/lucene/codecs/simpletext/SimpleTextBKDWriter$BKDMergeQueue
[patch-cls] Remapped: org/apache/lucene/codecs/simpletext/SimpleTextBKDWriter
[patch-cls] Remapped: org/apache/lucene/codecs/simpletext/SimpleTextStoredFieldsReader
[patch-cls] Remapped 3 class files for Java 9 to: /Users/jenkins/workspace/Lucene-Solr-7.x-MacOSX/lucene/build/codecs/classes/java9
    [touch] Creating /Users/jenkins/workspace/Lucene-Solr-7.x-MacOSX/lucene/build/codecs/patch-mrjar.stamp

-mrjar-check:

-mrjar-core:
     [exec] Result: 1
      [jar] Building jar: /Users/jenkins/workspace/Lucene-Solr-7.x-MacOSX/lucene/build/codecs/lucene-codecs-7.6.0-SNAPSHOT.jar

-jar-core:

jar-core:

check-expressions-uptodate:

jar-expressions:

-mrjar-classes-uptodate:

ivy-availability-check:
[loadresource] Do not set property disallowed.ivy.jars.list as its length is 0.

-ivy-fail-disallowed-ivy-version:

ivy-fail:

ivy-configure:
[ivy:configure] :: loading settings :: file = /Users/jenkins/workspace/Lucene-Solr-7.x-MacOSX/lucene/top-level-ivy-settings.xml

resolve-groovy:

-check-git-state:

-git-cleanroot:

-copy-git-state:

git-autoclean:

resolve:

common.init:

compile-lucene-core:

-check-git-state:

-git-cleanroot:

-copy-git-state:

git-autoclean:

ivy-availability-check:
[loadresource] Do not set property disallowed.ivy.jars.list as its length is 0.

-ivy-fail-disallowed-ivy-version:

ivy-fail:

ivy-configure:
[ivy:configure] :: loading settings :: file = /Users/jenkins/workspace/Lucene-Solr-7.x-MacOSX/lucene/top-level-ivy-settings.xml

resolve:

init:

-clover.disable:

-clover.load:

-clover.classpath:

-clover.setup:

clover:

compile-core:

init:

-clover.disable:

-clover.load:

-clover.classpath:

-clover.setup:

clover:

compile-core:
    [mkdir] Created dir: /Users/jenkins/workspace/Lucene-Solr-7.x-MacOSX/lucene/build/expressions/classes/java
    [javac] Compiling 17 source files to /Users/jenkins/workspace/Lucene-Solr-7.x-MacOSX/lucene/build/expressions/classes/java
    [javac] Creating empty /Users/jenkins/workspace/Lucene-Solr-7.x-MacOSX/lucene/build/expressions/classes/java/org/apache/lucene/expressions/js/package-info.class
    [javac] Creating empty /Users/jenkins/workspace/Lucene-Solr-7.x-MacOSX/lucene/build/expressions/classes/java/org/apache/lucene/expressions/package-info.class
     [copy] Copying 1 file to /Users/jenkins/workspace/Lucene-Solr-7.x-MacOSX/lucene/build/expressions/classes/java

patch-mrjar-classes:
[patch-cls] Remapped 0 class files for Java 9 to: /Users/jenkins/workspace/Lucene-Solr-7.x-MacOSX/lucene/build/expressions/classes/java9
    [touch] Creating /Users/jenkins/workspace/Lucene-Solr-7.x-MacOSX/lucene/build/expressions/patch-mrjar.stamp

-mrjar-check:

-mrjar-core:

-jar-core:
     [exec] Result: 1
      [jar] Building jar: /Users/jenkins/workspace/Lucene-Solr-7.x-MacOSX/lucene/build/expressions/lucene-expressions-7.6.0-SNAPSHOT.jar

jar-core:

check-suggest-uptodate:

jar-suggest:

-mrjar-classes-uptodate:

ivy-availability-check:
[loadresource] Do not set property disallowed.ivy.jars.list as its length is 0.

-ivy-fail-disallowed-ivy-version:

ivy-fail:

ivy-configure:
[ivy:configure] :: loading settings :: file = /Users/jenkins/workspace/Lucene-Solr-7.x-MacOSX/lucene/top-level-ivy-settings.xml

resolve-groovy:

check-expressions-uptodate:

jar-expressions:

check-analyzers-common-uptodate:

jar-analyzers-common:

-check-git-state:

-git-cleanroot:

-copy-git-state:

git-autoclean:

resolve:

common.init:

compile-lucene-core:

-check-git-state:

-git-cleanroot:

-copy-git-state:

git-autoclean:

ivy-availability-check:
[loadresource] Do not set property disallowed.ivy.jars.list as its length is 0.

-ivy-fail-disallowed-ivy-version:

ivy-fail:

ivy-configure:
[ivy:configure] :: loading settings :: file = /Users/jenkins/workspace/Lucene-Solr-7.x-MacOSX/lucene/top-level-ivy-settings.xml

resolve:

init:

-clover.disable:

-clover.load:

-clover.classpath:

-clover.setup:

clover:

compile-core:

init:

-clover.disable:

-clover.load:

-clover.classpath:

-clover.setup:

clover:

common.compile-core:
    [mkdir] Created dir: /Users/jenkins/workspace/Lucene-Solr-7.x-MacOSX/lucene/build/suggest/classes/java
    [javac] Compiling 78 source files to /Users/jenkins/workspace/Lucene-Solr-7.x-MacOSX/lucene/build/suggest/classes/java
    [javac] /Users/jenkins/workspace/Lucene-Solr-7.x-MacOSX/lucene/suggest/src/java/org/apache/lucene/search/spell/LuceneLevenshteinDistance.java:39: warning: [overrides] Class LuceneLevenshteinDistance overrides equals, but neither it nor any superclass overrides hashCode method
    [javac] public final class LuceneLevenshteinDistance implements StringDistance {
    [javac]              ^
    [javac] Note: /Users/jenkins/workspace/Lucene-Solr-7.x-MacOSX/lucene/suggest/src/java/org/apache/lucene/search/suggest/jaspell/JaspellLookup.java uses or overrides a deprecated API.
    [javac] Note: Recompile with -Xlint:deprecation for details.
    [javac] 1 warning
    [javac] Creating empty /Users/jenkins/workspace/Lucene-Solr-7.x-MacOSX/lucene/build/suggest/classes/java/org/apache/lucene/search/suggest/package-info.class
    [javac] Creating empty /Users/jenkins/workspace/Lucene-Solr-7.x-MacOSX/lucene/build/suggest/classes/java/org/apache/lucene/search/suggest/document/package-info.class
    [javac] Creating empty /Users/jenkins/workspace/Lucene-Solr-7.x-MacOSX/lucene/build/suggest/classes/java/org/apache/lucene/search/spell/package-info.class
    [javac] Creating empty /Users/jenkins/workspace/Lucene-Solr-7.x-MacOSX/lucene/build/suggest/classes/java/org/apache/lucene/search/suggest/jaspell/package-info.class
    [javac] Creating empty /Users/jenkins/workspace/Lucene-Solr-7.x-MacOSX/lucene/build/suggest/classes/java/org/apache/lucene/search/suggest/tst/package-info.class
    [javac] Creating empty /Users/jenkins/workspace/Lucene-Solr-7.x-MacOSX/lucene/build/suggest/classes/java/org/apache/lucene/search/suggest/analyzing/package-info.class
    [javac] Creating empty /Users/jenkins/workspace/Lucene-Solr-7.x-MacOSX/lucene/build/suggest/classes/java/org/apache/lucene/search/suggest/fst/package-info.class
     [copy] Copying 2 files to /Users/jenkins/workspace/Lucene-Solr-7.x-MacOSX/lucene/build/suggest/classes/java

compile-core:

patch-mrjar-classes:
[patch-cls] Remapped 0 class files for Java 9 to: /Users/jenkins/workspace/Lucene-Solr-7.x-MacOSX/lucene/build/suggest/classes/java9
    [touch] Creating /Users/jenkins/workspace/Lucene-Solr-7.x-MacOSX/lucene/build/suggest/patch-mrjar.stamp

-mrjar-check:

-mrjar-core:

-jar-core:
     [exec] Result: 1
      [jar] Building jar: /Users/jenkins/workspace/Lucene-Solr-7.x-MacOSX/lucene/build/suggest/lucene-suggest-7.6.0-SNAPSHOT.jar

jar-core:

check-highlighter-uptodate:

jar-highlighter:

-mrjar-classes-uptodate:

ivy-availability-check:
[loadresource] Do not set property disallowed.ivy.jars.list as its length is 0.

-ivy-fail-disallowed-ivy-version:

ivy-fail:

ivy-configure:
[ivy:configure] :: loading settings :: file = /Users/jenkins/workspace/Lucene-Solr-7.x-MacOSX/lucene/top-level-ivy-settings.xml

resolve-groovy:

check-memory-uptodate:

jar-memory:

-mrjar-classes-uptodate:

ivy-availability-check:
[loadresource] Do not set property disallowed.ivy.jars.list as its length is 0.

-ivy-fail-disallowed-ivy-version:

ivy-fail:

ivy-configure:
[ivy:configure] :: loading settings :: file = /Users/jenkins/workspace/Lucene-Solr-7.x-MacOSX/lucene/top-level-ivy-settings.xml

resolve-groovy:

check-queryparser-uptodate:

jar-queryparser:

-mrjar-classes-uptodate:

ivy-availability-check:
[loadresource] Do not set property disallowed.ivy.jars.list as its length is 0.

-ivy-fail-disallowed-ivy-version:

ivy-fail:

ivy-configure:
[ivy:configure] :: loading settings :: file = /Users/jenkins/workspace/Lucene-Solr-7.x-MacOSX/lucene/top-level-ivy-settings.xml

resolve-groovy:

check-queries-uptodate:

jar-queries:

-mrjar-classes-uptodate:

ivy-availability-check:
[loadresource] Do not set property disallowed.ivy.jars.list as its length is 0.

-ivy-fail-disallowed-ivy-version:

ivy-fail:

ivy-configure:
[ivy:configure] :: loading settings :: file = /Users/jenkins/workspace/Lucene-Solr-7.x-MacOSX/lucene/top-level-ivy-settings.xml

resolve-groovy:

check-expressions-uptodate:

jar-expressions:

-check-git-state:

-git-cleanroot:

-copy-git-state:

git-autoclean:

resolve:

common.init:

compile-lucene-core:

-check-git-state:

-git-cleanroot:

-copy-git-state:

git-autoclean:

ivy-availability-check:
[loadresource] Do not set property disallowed.ivy.jars.list as its length is 0.

-ivy-fail-disallowed-ivy-version:

ivy-fail:

ivy-configure:
[ivy:configure] :: loading settings :: file = /Users/jenkins/workspace/Lucene-Solr-7.x-MacOSX/lucene/top-level-ivy-settings.xml

resolve:

init:

-clover.disable:

-clover.load:

-clover.classpath:

-clover.setup:

clover:

compile-core:

init:

-clover.disable:

-clover.load:

-clover.classpath:

-clover.setup:

clover:

common.compile-core:
    [mkdir] Created dir: /Users/jenkins/workspace/Lucene-Solr-7.x-MacOSX/lucene/build/queries/classes/java
    [javac] Compiling 86 source files to /Users/jenkins/workspace/Lucene-Solr-7.x-MacOSX/lucene/build/queries/classes/java
    [javac] /Users/jenkins/workspace/Lucene-Solr-7.x-MacOSX/lucene/queries/src/java/org/apache/lucene/queries/function/FunctionQuery.java:59: warning: [rawtypes] found raw type: Map
    [javac]     protected final Map context;
    [javac]                     ^
    [javac]   missing type arguments for generic class Map<K,V>
    [javac]   where K,V are type-variables:
    [javac]     K extends Object declared in interface Map
    [javac]     V extends Object declared in interface Map
    [javac] /Users/jenkins/workspace/Lucene-Solr-7.x-MacOSX/lucene/queries/src/java/org/apache/lucene/queries/function/ValueSource.java:54: warning: [rawtypes] found raw type: Map
    [javac]   public abstract FunctionValues getValues(Map context, LeafReaderContext readerContext) throws IOException;
    [javac]                                            ^
    [javac]   missing type arguments for generic class Map<K,V>
    [javac]   where K,V are type-variables:
    [javac]     K extends Object declared in interface Map
    [javac]     V extends Object declared in interface Map
    [javac] /Users/jenkins/workspace/Lucene-Solr-7.x-MacOSX/lucene/queries/src/java/org/apache/lucene/queries/function/ValueSource.java:78: warning: [rawtypes] found raw type: Map
    [javac]   public void createWeight(Map context, IndexSearcher searcher) throws IOException {
    [javac]                            ^
    [javac]   missing type arguments for generic class Map<K,V>
    [javac]   where K,V are type-variables:
    [javac]     K extends Object declared in interface Map
    [javac]     V extends Object declared in interface Map
    [javac] /Users/jenkins/workspace/Lucene-Solr-7.x-MacOSX/lucene/queries/src/java/org/apache/lucene/queries/function/ValueSource.java:84: warning: [rawtypes] found raw type: Map
    [javac]   public static Map newContext(IndexSearcher searcher) {
    [javac]                 ^
    [javac]   missing type arguments for generic class Map<K,V>
    [javac]   where K,V are type-variables:
    [javac]     K extends Object declared in interface Map
    [javac]     V extends Object declared in interface Map
    [javac] /Users/jenkins/workspace/Lucene-Solr-7.x-MacOSX/lucene/queries/src/java/org/apache/lucene/queries/function/ValueSource.java:85: warning: [rawtypes] found raw type: Map
    [javac]     Map context = new IdentityHashMap();
    [javac]     ^
    [javac]   missing type arguments for generic class Map<K,V>
    [javac]   where K,V are type-variables:
    [javac]     K extends Object declared in interface Map
    [javac]     V extends Object declared in interface Map
    [javac] /Users/jenkins/workspace/Lucene-Solr-7.x-MacOSX/lucene/queries/src/java/org/apache/lucene/queries/function/ValueSource.java:85: warning: [rawtypes] found raw type: IdentityHashMap
    [javac]     Map context = new IdentityHashMap();
    [javac]                       ^
    [javac]   missing type arguments for generic class IdentityHashMap<K,V>
    [javac]   where K,V are type-variables:
    [javac]     K extends Object declared in class IdentityHashMap
    [javac]     V extends Object declared in class IdentityHashMap
    [javac] /Users/jenkins/workspace/Lucene-Solr-7.x-MacOSX/lucene/queries/src/java/org/apache/lucene/queries/function/ValueSource.java:86: warning: [unchecked] unchecked call to put(K,V) as a member of the raw type Map
    [javac]     context.put("searcher", searcher);
    [javac]                ^
    [javac]   where K,V are type-variables:
    [javac]     K extends Object declared in interface Map
    [javac]     V extends Object declared in interface Map
    [javac] /Users/jenkins/workspace/Lucene-Solr-7.x-MacOSX/lucene/queries/src/java/org/apache/lucene/queries/function/ValueSource.java:132: warning: [rawtypes] found raw type: Map
    [javac]       Map context = new IdentityHashMap<>();
    [javac]       ^
    [javac]   missing type arguments for generic class Map<K,V>
    [javac]   where K,V are type-variables:
    [javac]     K extends Object declared in interface Map
    [javac]     V extends Object declared in interface Map
    [javac] /Users/jenkins/workspace/Lucene-Solr-7.x-MacOSX/lucene/queries/src/java/org/apache/lucene/queries/function/ValueSource.java:134: warning: [unchecked] unchecked call to put(K,V) as a member of the raw type Map
    [javac]       context.put("scorer", scorer);
    [javac]                  ^
    [javac]   where K,V are type-variables:
    [javac]     K extends Object declared in interface Map
    [javac]     V extends Object declared in interface Map
    [javac] /Users/jenkins/workspace/Lucene-Solr-7.x-MacOSX/lucene/queries/src/java/org/apache/lucene/queries/function/ValueSource.java:208: warning: [rawtypes] found raw type: Map
    [javac]       Map context = new HashMap<>();
    [javac]       ^
    [javac]   missing type arguments for generic class Map<K,V>
    [javac]   where K,V are type-variables:
    [javac]     K extends Object declared in interface Map
    [javac]     V extends Object declared in interface Map
    [javac] /Users/jenkins/workspace/Lucene-Solr-7.x-MacOSX/lucene/queries/src/java/org/apache/lucene/queries/function/ValueSource.java:210: warning: [unchecked] unchecked call to put(K,V) as a member of the raw type Map
    [javac]       context.put("scorer", scorer);
    [javac]                  ^
    [javac]   where K,V are type-variables:
    [javac]     K extends Object declared in interface Map
    [javac]     V extends Object declared in interface Map
    [javac] /Users/jenkins/workspace/Lucene-Solr-7.x-MacOSX/lucene/queries/src/java/org/apache/lucene/queries/function/ValueSource.java:211: warning: [unchecked] unchecked call to put(K,V) as a member of the raw type Map
    [javac]       context.put("searcher", searcher);
    [javac]                  ^
    [javac]   where K,V are type-variables:
    [javac]     K extends Object declared in interface Map
    [javac]     V extends Object declared in interface Map
    [javac] /Users/jenkins/workspace/Lucene-Solr-7.x-MacOSX/lucene/queries/src/java/org/apache/lucene/queries/function/ValueSource.java:245: warning: [rawtypes] found raw type: Map
    [javac]       Map context = new HashMap<>();
    [javac]       ^
    [javac]   missing type arguments for generic class Map<K,V>
    [javac]   where K,V are type-variables:
    [javac]     K extends Object declared in interface Map
    [javac]     V extends Object declared in interface Map
    [javac] /Users/jenkins/workspace/Lucene-Solr-7.x-MacOSX/lucene/queries/src/java/org/apache/lucene/queries/function/ValueSource.java:248: warning: [unchecked] unchecked call to put(K,V) as a member of the raw type Map
    [javac]       context.put("scorer", scorer);
    [javac]                  ^
    [javac]   where K,V are type-variables:
    [javac]     K extends Object declared in interface Map
    [javac]     V extends Object declared in interface Map
    [javac] /Users/jenkins/workspace/Lucene-Solr-7.x-MacOSX/lucene/queries/src/java/org/apache/lucene/queries/function/ValueSource.java:249: warning: [unchecked] unchecked call to put(K,V) as a member of the raw type Map
    [javac]       context.put("searcher", searcher);
    [javac]                  ^
    [javac]   where K,V are type-variables:
    [javac]     K extends Object declared in interface Map
    [javac]     V extends Object declared in interface Map
    [javac] /Users/jenkins/workspace/Lucene-Solr-7.x-MacOSX/lucene/queries/src/java/org/apache/lucene/queries/function/ValueSource.java:293: warning: [rawtypes] found raw type: Map
    [javac]     public FunctionValues getValues(Map context, LeafReaderContext readerContext) throws IOException {
    [javac]                                     ^
    [javac]   missing type arguments for generic class Map<K,V>
    [javac]   where K,V are type-variables:
    [javac]     K extends Object declared in interface Map
    [javac]     V extends Object declared in interface Map
    [javac] /Users/jenkins/workspace/Lucene-Solr-7.x-MacOSX/lucene/queries/src/java/org/apache/lucene/queries/function/ValueSource.java:375: warning: [rawtypes] found raw type: Map
    [javac]       Map context = newContext(searcher);
    [javac]       ^
    [javac]   missing type arguments for generic class Map<K,V>
    [javac]   where K,V are type-variables:
    [javac]     K extends Object declared in interface Map
    [javac]     V extends Object declared in interface Map
    [javac] /Users/jenkins/workspace/Lucene-Solr-7.x-MacOSX/lucene/queries/src/java/org/apache/lucene/queries/function/ValueSource.java:382: warning: [rawtypes] found raw type: Map
    [javac]     private final Map context;
    [javac]                   ^
    [javac]   missing type arguments for generic class Map<K,V>
    [javac]   where K,V are type-variables:
    [javac]     K extends Object declared in interface Map
    [javac]     V extends Object declared in interface Map
    [javac] /Users/jenkins/workspace/Lucene-Solr-7.x-MacOSX/lucene/queries/src/java/org/apache/lucene/queries/function/ValueSource.java:384: warning: [rawtypes] found raw type: Map
    [javac]     public ValueSourceComparatorSource(Map context) {
    [javac]                                        ^
    [javac]   missing type arguments for generic class Map<K,V>
    [javac]   where K,V are type-variables:
    [javac]     K extends Object declared in interface Map
    [javac]     V extends Object declared in interface Map
    [javac] /Users/jenkins/workspace/Lucene-Solr-7.x-MacOSX/lucene/queries/src/java/org/apache/lucene/queries/function/ValueSource.java:404: warning: [rawtypes] found raw type: Map
    [javac]     private final Map fcontext;
    [javac]                   ^
    [javac]   missing type arguments for generic class Map<K,V>
    [javac]   where K,V are type-variables:
    [javac]     K extends Object declared in interface Map
    [javac]     V extends Object declared in interface Map
    [javac] /Users/jenkins/workspace/Lucene-Solr-7.x-MacOSX/lucene/queries/src/java/org/apache/lucene/queries/function/ValueSource.java:407: warning: [rawtypes] found raw type: Map
    [javac]     ValueSourceComparator(Map fcontext, int numHits) {
    [javac]                           ^
    [javac]   missing type arguments for generic class Map<K,V>
    [javac]   where K,V are type-variables:
    [javac]     K extends Object declared in interface Map
    [javac]     V extends Object declared in interface Map
    [javac] /Users/jenkins/workspace/Lucene-Solr-7.x-MacOSX/lucene/queries/src/java/org/apache/lucene/queries/function/BoostedQuery.java:70: warning: [rawtypes] found raw type: Map
    [javac]     Map fcontext;
    [javac]     ^
    [javac]   missing type arguments for generic class Map<K,V>
    [javac]   where K,V are type-variables:
    [javac]     K extends Object declared in interface Map
    [javac]     V extends Object declared in interface Map
    [javac] /Users/jenkins/workspace/Lucene-Solr-7.x-MacOSX/lucene/queries/src/java/org/apache/lucene/queries/function/valuesource/BytesRefFieldSource.java:44: warning: [rawtypes] found raw type: Map
    [javac]   public FunctionValues getValues(Map context, LeafReaderContext readerContext) throws IOException {
    [javac]                                   ^
    [javac]   missing type arguments for generic class Map<K,V>
    [javac]   where K,V are type-variables:
    [javac]     K extends Object declared in interface Map
    [javac]     V extends Object declared in interface Map
    [javac] /Users/jenkins/workspace/Lucene-Solr-7.x-MacOSX/lucene/queries/src/java/org/apache/lucene/queries/function/valuesource/ComparisonBoolFunction.java:53: warning: [rawtypes] found raw type: Map
    [javac]   public FunctionValues getValues(Map context, LeafReaderContext readerContext) throws IOException {
    [javac]                                   ^
    [javac]   missing type arguments for generic class Map<K,V>
    [javac]   where K,V are type-variables:
    [javac]     K extends Object declared in interface Map
    [javac]     V extends Object declared in interface Map
    [javac] /Users/jenkins/workspace/Lucene-Solr-7.x-MacOSX/lucene/queries/src/java/org/apache/lucene/queries/function/valuesource/ComparisonBoolFunction.java:100: warning: [rawtypes] found raw type: Map
    [javac]   public void createWeight(Map context, IndexSearcher searcher) throws IOException {
    [javac]                            ^
    [javac]   missing type arguments for generic class Map<K,V>
    [javac]   where K,V are type-variables:
    [javac]     K extends Object declared in interface Map
    [javac]     V extends Object declared in interface Map
    [javac] /Users/jenkins/workspace/Lucene-Solr-7.x-MacOSX/lucene/queries/src/java/org/apache/lucene/queries/function/valuesource/ConstValueSource.java:44: warning: [rawtypes] found raw type: Map
    [javac]   public FunctionValues getValues(Map context, LeafReaderContext readerContext) throws IOException {
    [javac]                                   ^
    [javac]   missing type arguments for generic class Map<K,V>
    [javac]   where K,V are type-variables:
    [javac]     K extends Object declared in interface Map
    [javac]     V extends Object declared in interface Map
    [javac] /Users/jenkins/workspace/Lucene-Solr-7.x-MacOSX/lucene/queries/src/java/org/apache/lucene/queries/function/valuesource/MultiFunction.java:115: warning: [rawtypes] found raw type: Map
    [javac]   public static FunctionValues[] valsArr(List<ValueSource> sources, Map fcontext, LeafReaderContext readerContext) throws IOException {
    [javac]                                                                     ^
    [javac]   missing type arguments for generic class Map<K,V>
    [javac]   where K,V are type-variables:
    [javac]     K extends Object declared in interface Map
    [javac]     V extends Object declared in interface Map
    [javac] /Users/jenkins/workspace/Lucene-Solr-7.x-MacOSX/lucene/queries/src/java/org/apache/lucene/queries/function/valuesource/MultiFunction.java:160: warning: [rawtypes] found raw type: Map
    [javac]   public void createWeight(Map context, IndexSearcher searcher) throws IOException {
    [javac]                            ^
    [javac]   missing type arguments for generic class Map<K,V>
    [javac]   where K,V are type-variables:
    [javac]     K extends Object declared in interface Map
    [javac]     V extends Object declared in interface Map
    [javac] /Users/jenkins/workspace/Lucene-Solr-7.x-MacOSX/lucene/queries/src/java/org/apache/lucene/queries/function/valuesource/DefFunction.java:45: warning: [rawtypes] found raw type: Map
    [javac]   public FunctionValues getValues(Map fcontext, LeafReaderContext readerContext) throws IOException {
    [javac]                                   ^
    [javac]   missing type arguments for generic class Map<K,V>
    [javac]   where K,V are type-variables:
    [javac]     K extends Object declared in interface Map
    [javac]     V extends Object declared in interface Map
    [javac] /Users/jenkins/workspace/Lucene-Solr-7.x-MacOSX/lucene/queries/src/java/org/apache/lucene/queries/function/valuesource/DualFloatFunction.java:54: warning: [rawtypes] found raw type: Map
    [javac]   public FunctionValues getValues(Map context, LeafReaderContext readerContext) throws IOException {
    [javac]                                   ^
    [javac]   missing type arguments for generic class Map<K,V>
    [javac]   where K,V are type-variables:
    [javac]     K extends Object declared in interface Map
    [javac]     V extends Object declared in interface Map
    [javac] /Users/jenkins/workspace/Lucene-Solr-7.x-MacOSX/lucene/queries/src/java/org/apache/lucene/queries/function/valuesource/DualFloatFunction.java:78: warning: [rawtypes] found raw type: Map
    [javac]   public void createWeight(Map context, IndexSearcher searcher) throws IOException {
    [javac]                            ^
    [javac]   missing type arguments for generic class Map<K,V>
    [javac]   where K,V are type-variables:
    [javac]     K extends Object declared in interface Map
    [javac]     V extends Object declared in interface Map
    [javac] /Users/jenkins/workspace/Lucene-Solr-7.x-MacOSX/lucene/queries/src/java/org/apache/lucene/queries/function/valuesource/DocFreqValueSource.java:148: warning: [rawtypes] found raw type: Map
    [javac]   public FunctionValues getValues(Map context, LeafReaderContext readerContext) throws IOException {
    [javac]                                   ^
    [javac]   missing type arguments for generic class Map<K,V>
    [javac]   where 

[...truncated too long message...]

xpressionTest.testCumulativeProbability
   [junit4] OK      0.05s J1 | MathExpressionTest.testMovingAverage
   [junit4] OK      0.09s J1 | MathExpressionTest.testLength
   [junit4] OK      0.06s J1 | MathExpressionTest.testValueAt
   [junit4] OK      0.48s J1 | MathExpressionTest.testBetaDistribution
   [junit4] OK      0.12s J1 | MathExpressionTest.testMemsetSize
   [junit4] OK      0.05s J1 | MathExpressionTest.testPrecision
   [junit4] OK      0.07s J1 | MathExpressionTest.testEbeDivide
   [junit4] OK      0.06s J1 | MathExpressionTest.testSetAndGetValue
   [junit4] OK      0.05s J1 | MathExpressionTest.testEbeSubtract
   [junit4] OK      0.05s J1 | MathExpressionTest.testKnn
   [junit4] OK      0.05s J1 | MathExpressionTest.testLerp
   [junit4] OK      0.06s J1 | MathExpressionTest.testMonteCarlo
   [junit4] OK      0.07s J1 | MathExpressionTest.testDescribe
   [junit4] OK      0.06s J1 | MathExpressionTest.testArray
   [junit4] OK      0.05s J1 | MathExpressionTest.testOlsRegress
   [junit4] OK      0.06s J1 | MathExpressionTest.testPolyfit
   [junit4] OK      0.09s J1 | MathExpressionTest.testCopyOf
   [junit4] OK      0.07s J1 | MathExpressionTest.testMannWhitney
   [junit4] OK      0.09s J1 | MathExpressionTest.testMarkovChain
   [junit4] OK      0.04s J1 | MathExpressionTest.testFreqTable
   [junit4] OK      0.05s J1 | MathExpressionTest.testEbeAdd
   [junit4] OK      0.05s J1 | MathExpressionTest.testOutliers
   [junit4] OK      0.09s J1 | MathExpressionTest.testCopyOfRange
   [junit4] OK      0.05s J1 | MathExpressionTest.testCosineSimilarity
   [junit4] OK      0.05s J1 | MathExpressionTest.testTimeDifferencingDefaultLag
   [junit4] OK      0.11s J1 | MathExpressionTest.testCovariance
   [junit4] OK      0.07s J1 | MathExpressionTest.testKnnRegress
   [junit4] OK      0.06s J1 | MathExpressionTest.testMatrixMult
   [junit4] OK      0.08s J1 | MathExpressionTest.testReverse
   [junit4] OK      0.06s J1 | MathExpressionTest.testAnova
   [junit4] OK      0.09s J1 | MathExpressionTest.testGeometricDistribution
   [junit4] OK      0.05s J1 | MathExpressionTest.testDotProduct
   [junit4] OK      0.05s J1 | MathExpressionTest.testMatrixMath
   [junit4] OK      0.05s J1 | MathExpressionTest.testBinomialCoefficient
   [junit4] OK      0.05s J1 | MathExpressionTest.testCorrMatrix
   [junit4] OK      0.06s J1 | MathExpressionTest.testMeanDifference
   [junit4] OK      0.10s J1 | MathExpressionTest.testConvolution
   [junit4] OK      0.08s J1 | MathExpressionTest.testRankTransform
   [junit4] OK      0.06s J1 | MathExpressionTest.testFuzzyKmeans
   [junit4] OK      0.07s J1 | MathExpressionTest.testHist
   [junit4] OK      0.05s J1 | MathExpressionTest.testMemset
   [junit4] OK      0.29s J1 | MathExpressionTest.testGammaDistribution
   [junit4] OK      0.06s J1 | MathExpressionTest.testSumDifference
   [junit4] OK      0.05s J1 | MathExpressionTest.testIntegrate
   [junit4] OK      0.09s J1 | MathExpressionTest.testCorrelationStream
   [junit4] OK      0.08s J1 | MathExpressionTest.testPercentile
   [junit4] OK      0.05s J1 | MathExpressionTest.testBicubicSpline
   [junit4] OK      0.08s J1 | MathExpressionTest.testMultiVariateNormalDistribution
   [junit4] OK      0.04s J1 | MathExpressionTest.testProbabilityRange
   [junit4] OK      0.10s J1 | MathExpressionTest.testBinomialDistribution
   [junit4] OK      0.05s J1 | MathExpressionTest.testOnes
   [junit4] OK      0.08s J1 | MathExpressionTest.testTermVectors
   [junit4] OK      0.06s J1 | MathExpressionTest.testTimeDifferencingDefinedLag
   [junit4] OK      0.05s J1 | MathExpressionTest.testExponentialMovingAverage
   [junit4] OK      0.07s J1 | MathExpressionTest.testNorms
   [junit4] OK      0.05s J1 | MathExpressionTest.testMinMaxScale
   [junit4] Completed [5/5] on J1 in 15.89s, 102 tests
   [junit4] 
   [junit4] JVM J0:     1.21 ..    67.59 =    66.38s
   [junit4] JVM J1:     1.21 ..    83.49 =    82.28s
   [junit4] Execution time total: 1 minute 23 seconds
   [junit4] Tests summary: 5 suites, 510 tests
   [junit4] Could not remove temporary path: /Users/jenkins/workspace/Lucene-Solr-7.x-MacOSX/solr/build/solr-solrj/test/J1 (java.nio.file.DirectoryNotEmptyException: Remaining files: [/Users/jenkins/workspace/Lucene-Solr-7.x-MacOSX/solr/build/solr-solrj/test/J1/temp])
   [junit4] Could not remove temporary path: /Users/jenkins/workspace/Lucene-Solr-7.x-MacOSX/solr/build/solr-solrj/test/J0 (java.nio.file.DirectoryNotEmptyException: Remaining files: [/Users/jenkins/workspace/Lucene-Solr-7.x-MacOSX/solr/build/solr-solrj/test/J0/temp])
     [echo] 5 slowest tests:
[junit4:tophints]  47.86s | org.apache.solr.client.solrj.io.stream.StreamDecoratorTest
[junit4:tophints]  43.85s | org.apache.solr.client.solrj.impl.CloudSolrClientTest
[junit4:tophints]  41.19s | org.apache.solr.client.solrj.io.graph.GraphExpressionTest
[junit4:tophints]  37.57s | org.apache.solr.client.solrj.io.graph.GraphTest
[junit4:tophints]  27.49s | org.apache.solr.client.solrj.io.stream.MathExpressionTest

-check-totals:

test-nocompile:

BUILD SUCCESSFUL
Total time: 1 minute 26 seconds
[repro] Failures:
[repro]   0/5 failed: org.apache.solr.client.solrj.io.stream.MathExpressionTest
[repro] Exiting with code 0
+ mv lucene/build lucene/build.repro
+ mv solr/build solr/build.repro
+ mv lucene/build.orig lucene/build
+ mv solr/build.orig solr/build
Archiving artifacts
Setting ANT_1_8_2_HOME=/Users/jenkins/tools/hudson.tasks.Ant_AntInstallation/ANT_1.8.2
java.lang.InterruptedException: no matches found within 10000
	at hudson.FilePath$ValidateAntFileMask.hasMatch(FilePath.java:2845)
	at hudson.FilePath$ValidateAntFileMask.invoke(FilePath.java:2724)
	at hudson.FilePath$ValidateAntFileMask.invoke(FilePath.java:2705)
	at hudson.FilePath$FileCallableWrapper.call(FilePath.java:3084)
Also:   hudson.remoting.Channel$CallSiteStackTrace: Remote call to MacOSX VBOX
		at hudson.remoting.Channel.attachCallSiteStackTrace(Channel.java:1741)
		at hudson.remoting.UserRequest$ExceptionResponse.retrieve(UserRequest.java:357)
		at hudson.remoting.Channel.call(Channel.java:955)
		at hudson.FilePath.act(FilePath.java:1070)
		at hudson.FilePath.act(FilePath.java:1059)
		at hudson.FilePath.validateAntFileMask(FilePath.java:2703)
		at hudson.tasks.ArtifactArchiver.perform(ArtifactArchiver.java:243)
		at hudson.tasks.BuildStepCompatibilityLayer.perform(BuildStepCompatibilityLayer.java:81)
		at hudson.tasks.BuildStepMonitor$1.perform(BuildStepMonitor.java:20)
		at hudson.model.AbstractBuild$AbstractBuildExecution.perform(AbstractBuild.java:744)
		at hudson.model.AbstractBuild$AbstractBuildExecution.performAllBuildSteps(AbstractBuild.java:690)
		at hudson.model.Build$BuildExecution.post2(Build.java:186)
		at hudson.model.AbstractBuild$AbstractBuildExecution.post(AbstractBuild.java:635)
		at hudson.model.Run.execute(Run.java:1831)
		at hudson.model.FreeStyleBuild.run(FreeStyleBuild.java:43)
		at hudson.model.ResourceController.execute(ResourceController.java:97)
		at hudson.model.Executor.run(Executor.java:429)
Caused: hudson.FilePath$TunneledInterruptedException
	at hudson.FilePath$FileCallableWrapper.call(FilePath.java:3086)
	at hudson.remoting.UserRequest.perform(UserRequest.java:212)
	at hudson.remoting.UserRequest.perform(UserRequest.java:54)
	at hudson.remoting.Request$2.run(Request.java:369)
	at hudson.remoting.InterceptingExecutorService$1.call(InterceptingExecutorService.java:72)
	at java.util.concurrent.FutureTask.run(FutureTask.java:266)
	at java.util.concurrent.ThreadPoolExecutor.runWorker(ThreadPoolExecutor.java:1149)
	at java.util.concurrent.ThreadPoolExecutor$Worker.run(ThreadPoolExecutor.java:624)
	at java.lang.Thread.run(Thread.java:748)
Caused: java.lang.InterruptedException: java.lang.InterruptedException: no matches found within 10000
	at hudson.FilePath.act(FilePath.java:1072)
	at hudson.FilePath.act(FilePath.java:1059)
	at hudson.FilePath.validateAntFileMask(FilePath.java:2703)
	at hudson.tasks.ArtifactArchiver.perform(ArtifactArchiver.java:243)
	at hudson.tasks.BuildStepCompatibilityLayer.perform(BuildStepCompatibilityLayer.java:81)
	at hudson.tasks.BuildStepMonitor$1.perform(BuildStepMonitor.java:20)
	at hudson.model.AbstractBuild$AbstractBuildExecution.perform(AbstractBuild.java:744)
	at hudson.model.AbstractBuild$AbstractBuildExecution.performAllBuildSteps(AbstractBuild.java:690)
	at hudson.model.Build$BuildExecution.post2(Build.java:186)
	at hudson.model.AbstractBuild$AbstractBuildExecution.post(AbstractBuild.java:635)
	at hudson.model.Run.execute(Run.java:1831)
	at hudson.model.FreeStyleBuild.run(FreeStyleBuild.java:43)
	at hudson.model.ResourceController.execute(ResourceController.java:97)
	at hudson.model.Executor.run(Executor.java:429)
No artifacts found that match the file pattern "**/*.events,heapdumps/**,**/*_pid*.log". Configuration error?
[WARNINGS] Parsing warnings in console log with parser Java Compiler (javac)
Setting ANT_1_8_2_HOME=/Users/jenkins/tools/hudson.tasks.Ant_AntInstallation/ANT_1.8.2
Setting ANT_1_8_2_HOME=/Users/jenkins/tools/hudson.tasks.Ant_AntInstallation/ANT_1.8.2
<Git Blamer> Using GitBlamer to create author and commit information for all warnings.
<Git Blamer> GIT_COMMIT=216f10026b86627750e133fe24ce6a750c470695, workspace=/Users/jenkins/workspace/Lucene-Solr-7.x-MacOSX
[WARNINGS] Computing warning deltas based on reference build #859
Recording test results
Setting ANT_1_8_2_HOME=/Users/jenkins/tools/hudson.tasks.Ant_AntInstallation/ANT_1.8.2
Build step 'Publish JUnit test result report' changed build result to UNSTABLE
Email was triggered for: Unstable (Test Failures)
Sending email for trigger: Unstable (Test Failures)
Setting ANT_1_8_2_HOME=/Users/jenkins/tools/hudson.tasks.Ant_AntInstallation/ANT_1.8.2
Setting ANT_1_8_2_HOME=/Users/jenkins/tools/hudson.tasks.Ant_AntInstallation/ANT_1.8.2
Setting ANT_1_8_2_HOME=/Users/jenkins/tools/hudson.tasks.Ant_AntInstallation/ANT_1.8.2
Setting ANT_1_8_2_HOME=/Users/jenkins/tools/hudson.tasks.Ant_AntInstallation/ANT_1.8.2

Mime
View raw message