lucene-dev mailing list archives

Site index · List index
Message view « Date » · « Thread »
Top « Date » · « Thread »
From Apache Jenkins Server <jenk...@builds.apache.org>
Subject [JENKINS] Lucene-Solr-Tests-7.x - Build # 846 - Unstable
Date Tue, 04 Sep 2018 07:09:55 GMT
Build: https://builds.apache.org/job/Lucene-Solr-Tests-7.x/846/

2 tests failed.
FAILED:  junit.framework.TestSuite.org.apache.solr.prometheus.collector.SolrCollectorTest

Error Message:
Error from server at https://127.0.0.1:34344/solr: KeeperErrorCode = Session expired for /configs/collection1_config

Stack Trace:
org.apache.solr.client.solrj.impl.HttpSolrClient$RemoteSolrException: Error from server at https://127.0.0.1:34344/solr: KeeperErrorCode = Session expired for /configs/collection1_config
	at __randomizedtesting.SeedInfo.seed([A4C31B48C95D8BA9]:0)
	at org.apache.solr.client.solrj.impl.HttpSolrClient.executeMethod(HttpSolrClient.java:643)
	at org.apache.solr.client.solrj.impl.HttpSolrClient.request(HttpSolrClient.java:255)
	at org.apache.solr.client.solrj.impl.HttpSolrClient.request(HttpSolrClient.java:244)
	at org.apache.solr.client.solrj.impl.LBHttpSolrClient.doRequest(LBHttpSolrClient.java:483)
	at org.apache.solr.client.solrj.impl.LBHttpSolrClient.request(LBHttpSolrClient.java:413)
	at org.apache.solr.client.solrj.impl.CloudSolrClient.sendRequest(CloudSolrClient.java:1109)
	at org.apache.solr.client.solrj.impl.CloudSolrClient.requestWithRetryOnStaleState(CloudSolrClient.java:886)
	at org.apache.solr.client.solrj.impl.CloudSolrClient.request(CloudSolrClient.java:819)
	at org.apache.solr.client.solrj.SolrRequest.process(SolrRequest.java:194)
	at org.apache.solr.client.solrj.SolrRequest.process(SolrRequest.java:211)
	at org.apache.solr.prometheus.exporter.SolrExporterTestBase.setupCluster(SolrExporterTestBase.java:48)
	at sun.reflect.NativeMethodAccessorImpl.invoke0(Native Method)
	at sun.reflect.NativeMethodAccessorImpl.invoke(NativeMethodAccessorImpl.java:62)
	at sun.reflect.DelegatingMethodAccessorImpl.invoke(DelegatingMethodAccessorImpl.java:43)
	at java.lang.reflect.Method.invoke(Method.java:498)
	at com.carrotsearch.randomizedtesting.RandomizedRunner.invoke(RandomizedRunner.java:1737)
	at com.carrotsearch.randomizedtesting.RandomizedRunner$6.evaluate(RandomizedRunner.java:874)
	at com.carrotsearch.randomizedtesting.RandomizedRunner$7.evaluate(RandomizedRunner.java:890)
	at com.carrotsearch.randomizedtesting.rules.StatementAdapter.evaluate(StatementAdapter.java:36)
	at com.carrotsearch.randomizedtesting.rules.SystemPropertiesRestoreRule$1.evaluate(SystemPropertiesRestoreRule.java:57)
	at org.apache.lucene.util.AbstractBeforeAfterRule$1.evaluate(AbstractBeforeAfterRule.java:45)
	at com.carrotsearch.randomizedtesting.rules.StatementAdapter.evaluate(StatementAdapter.java:36)
	at org.apache.lucene.util.TestRuleStoreClassName$1.evaluate(TestRuleStoreClassName.java:41)
	at com.carrotsearch.randomizedtesting.rules.NoShadowingOrOverridesOnMethodsRule$1.evaluate(NoShadowingOrOverridesOnMethodsRule.java:40)
	at com.carrotsearch.randomizedtesting.rules.NoShadowingOrOverridesOnMethodsRule$1.evaluate(NoShadowingOrOverridesOnMethodsRule.java:40)
	at com.carrotsearch.randomizedtesting.rules.StatementAdapter.evaluate(StatementAdapter.java:36)
	at com.carrotsearch.randomizedtesting.rules.StatementAdapter.evaluate(StatementAdapter.java:36)
	at com.carrotsearch.randomizedtesting.rules.StatementAdapter.evaluate(StatementAdapter.java:36)
	at org.apache.lucene.util.TestRuleAssertionsRequired$1.evaluate(TestRuleAssertionsRequired.java:53)
	at org.apache.lucene.util.TestRuleMarkFailure$1.evaluate(TestRuleMarkFailure.java:47)
	at org.apache.lucene.util.TestRuleIgnoreAfterMaxFailures$1.evaluate(TestRuleIgnoreAfterMaxFailures.java:64)
	at org.apache.lucene.util.TestRuleIgnoreTestSuites$1.evaluate(TestRuleIgnoreTestSuites.java:54)
	at com.carrotsearch.randomizedtesting.rules.StatementAdapter.evaluate(StatementAdapter.java:36)
	at com.carrotsearch.randomizedtesting.ThreadLeakControl$StatementRunner.run(ThreadLeakControl.java:368)
	at java.lang.Thread.run(Thread.java:748)


FAILED:  org.apache.solr.cloud.autoscaling.sim.TestSimComputePlanAction.testNodeLost

Error Message:
Timed out waiting for replicas of new collection to be active Live Nodes: [127.0.0.1:10001_solr, 127.0.0.1:10000_solr] Last available state: DocCollection(testNodeLost//clusterstate.json/4)={   "replicationFactor":"1",   "pullReplicas":"0",   "router":{"name":"compositeId"},   "maxShardsPerNode":"1",   "autoAddReplicas":"false",   "nrtReplicas":"2",   "tlogReplicas":"0",   "autoCreated":"true",   "shards":{"shard1":{       "replicas":{         "core_node1":{           "core":"testNodeLost_shard1_replica_n1",           "SEARCHER.searcher.maxDoc":0,           "SEARCHER.searcher.deletedDocs":0,           "INDEX.sizeInBytes":10240,           "node_name":"127.0.0.1:10001_solr",           "state":"active",           "type":"NRT",           "INDEX.sizeInGB":9.5367431640625E-6,           "SEARCHER.searcher.numDocs":0},         "core_node2":{           "core":"testNodeLost_shard1_replica_n2",           "SEARCHER.searcher.maxDoc":0,           "SEARCHER.searcher.deletedDocs":0,           "INDEX.sizeInBytes":10240,           "node_name":"127.0.0.1:10000_solr",           "state":"active",           "type":"NRT",           "INDEX.sizeInGB":9.5367431640625E-6,           "SEARCHER.searcher.numDocs":0}},       "range":"80000000-7fffffff",       "state":"active"}}}

Stack Trace:
java.lang.AssertionError: Timed out waiting for replicas of new collection to be active
Live Nodes: [127.0.0.1:10001_solr, 127.0.0.1:10000_solr]
Last available state: DocCollection(testNodeLost//clusterstate.json/4)={
  "replicationFactor":"1",
  "pullReplicas":"0",
  "router":{"name":"compositeId"},
  "maxShardsPerNode":"1",
  "autoAddReplicas":"false",
  "nrtReplicas":"2",
  "tlogReplicas":"0",
  "autoCreated":"true",
  "shards":{"shard1":{
      "replicas":{
        "core_node1":{
          "core":"testNodeLost_shard1_replica_n1",
          "SEARCHER.searcher.maxDoc":0,
          "SEARCHER.searcher.deletedDocs":0,
          "INDEX.sizeInBytes":10240,
          "node_name":"127.0.0.1:10001_solr",
          "state":"active",
          "type":"NRT",
          "INDEX.sizeInGB":9.5367431640625E-6,
          "SEARCHER.searcher.numDocs":0},
        "core_node2":{
          "core":"testNodeLost_shard1_replica_n2",
          "SEARCHER.searcher.maxDoc":0,
          "SEARCHER.searcher.deletedDocs":0,
          "INDEX.sizeInBytes":10240,
          "node_name":"127.0.0.1:10000_solr",
          "state":"active",
          "type":"NRT",
          "INDEX.sizeInGB":9.5367431640625E-6,
          "SEARCHER.searcher.numDocs":0}},
      "range":"80000000-7fffffff",
      "state":"active"}}}
	at __randomizedtesting.SeedInfo.seed([544EF372C32DE5AA:EB5B3D8C40C7802C]:0)
	at org.apache.solr.cloud.CloudTestUtils.waitForState(CloudTestUtils.java:70)
	at org.apache.solr.cloud.autoscaling.sim.TestSimComputePlanAction.testNodeLost(TestSimComputePlanAction.java:148)
	at sun.reflect.NativeMethodAccessorImpl.invoke0(Native Method)
	at sun.reflect.NativeMethodAccessorImpl.invoke(NativeMethodAccessorImpl.java:62)
	at sun.reflect.DelegatingMethodAccessorImpl.invoke(DelegatingMethodAccessorImpl.java:43)
	at java.lang.reflect.Method.invoke(Method.java:498)
	at com.carrotsearch.randomizedtesting.RandomizedRunner.invoke(RandomizedRunner.java:1737)
	at com.carrotsearch.randomizedtesting.RandomizedRunner$8.evaluate(RandomizedRunner.java:934)
	at com.carrotsearch.randomizedtesting.RandomizedRunner$9.evaluate(RandomizedRunner.java:970)
	at com.carrotsearch.randomizedtesting.RandomizedRunner$10.evaluate(RandomizedRunner.java:984)
	at com.carrotsearch.randomizedtesting.rules.SystemPropertiesRestoreRule$1.evaluate(SystemPropertiesRestoreRule.java:57)
	at org.apache.lucene.util.TestRuleSetupTeardownChained$1.evaluate(TestRuleSetupTeardownChained.java:49)
	at org.apache.lucene.util.AbstractBeforeAfterRule$1.evaluate(AbstractBeforeAfterRule.java:45)
	at org.apache.lucene.util.TestRuleThreadAndTestName$1.evaluate(TestRuleThreadAndTestName.java:48)
	at org.apache.lucene.util.TestRuleIgnoreAfterMaxFailures$1.evaluate(TestRuleIgnoreAfterMaxFailures.java:64)
	at org.apache.lucene.util.TestRuleMarkFailure$1.evaluate(TestRuleMarkFailure.java:47)
	at com.carrotsearch.randomizedtesting.rules.StatementAdapter.evaluate(StatementAdapter.java:36)
	at com.carrotsearch.randomizedtesting.ThreadLeakControl$StatementRunner.run(ThreadLeakControl.java:368)
	at com.carrotsearch.randomizedtesting.ThreadLeakControl.forkTimeoutingTask(ThreadLeakControl.java:817)
	at com.carrotsearch.randomizedtesting.ThreadLeakControl$3.evaluate(ThreadLeakControl.java:468)
	at com.carrotsearch.randomizedtesting.RandomizedRunner.runSingleTest(RandomizedRunner.java:943)
	at com.carrotsearch.randomizedtesting.RandomizedRunner$5.evaluate(RandomizedRunner.java:829)
	at com.carrotsearch.randomizedtesting.RandomizedRunner$6.evaluate(RandomizedRunner.java:879)
	at com.carrotsearch.randomizedtesting.RandomizedRunner$7.evaluate(RandomizedRunner.java:890)
	at com.carrotsearch.randomizedtesting.rules.StatementAdapter.evaluate(StatementAdapter.java:36)
	at com.carrotsearch.randomizedtesting.rules.SystemPropertiesRestoreRule$1.evaluate(SystemPropertiesRestoreRule.java:57)
	at org.apache.lucene.util.AbstractBeforeAfterRule$1.evaluate(AbstractBeforeAfterRule.java:45)
	at com.carrotsearch.randomizedtesting.rules.StatementAdapter.evaluate(StatementAdapter.java:36)
	at org.apache.lucene.util.TestRuleStoreClassName$1.evaluate(TestRuleStoreClassName.java:41)
	at com.carrotsearch.randomizedtesting.rules.NoShadowingOrOverridesOnMethodsRule$1.evaluate(NoShadowingOrOverridesOnMethodsRule.java:40)
	at com.carrotsearch.randomizedtesting.rules.NoShadowingOrOverridesOnMethodsRule$1.evaluate(NoShadowingOrOverridesOnMethodsRule.java:40)
	at com.carrotsearch.randomizedtesting.rules.StatementAdapter.evaluate(StatementAdapter.java:36)
	at com.carrotsearch.randomizedtesting.rules.StatementAdapter.evaluate(StatementAdapter.java:36)
	at com.carrotsearch.randomizedtesting.rules.StatementAdapter.evaluate(StatementAdapter.java:36)
	at org.apache.lucene.util.TestRuleAssertionsRequired$1.evaluate(TestRuleAssertionsRequired.java:53)
	at org.apache.lucene.util.TestRuleMarkFailure$1.evaluate(TestRuleMarkFailure.java:47)
	at org.apache.lucene.util.TestRuleIgnoreAfterMaxFailures$1.evaluate(TestRuleIgnoreAfterMaxFailures.java:64)
	at org.apache.lucene.util.TestRuleIgnoreTestSuites$1.evaluate(TestRuleIgnoreTestSuites.java:54)
	at com.carrotsearch.randomizedtesting.rules.StatementAdapter.evaluate(StatementAdapter.java:36)
	at com.carrotsearch.randomizedtesting.ThreadLeakControl$StatementRunner.run(ThreadLeakControl.java:368)
	at java.lang.Thread.run(Thread.java:748)
Caused by: java.util.concurrent.TimeoutException: last state: DocCollection(testNodeLost//clusterstate.json/4)={
  "replicationFactor":"1",
  "pullReplicas":"0",
  "router":{"name":"compositeId"},
  "maxShardsPerNode":"1",
  "autoAddReplicas":"false",
  "nrtReplicas":"2",
  "tlogReplicas":"0",
  "autoCreated":"true",
  "shards":{"shard1":{
      "replicas":{
        "core_node1":{
          "core":"testNodeLost_shard1_replica_n1",
          "SEARCHER.searcher.maxDoc":0,
          "SEARCHER.searcher.deletedDocs":0,
          "INDEX.sizeInBytes":10240,
          "node_name":"127.0.0.1:10001_solr",
          "state":"active",
          "type":"NRT",
          "INDEX.sizeInGB":9.5367431640625E-6,
          "SEARCHER.searcher.numDocs":0},
        "core_node2":{
          "core":"testNodeLost_shard1_replica_n2",
          "SEARCHER.searcher.maxDoc":0,
          "SEARCHER.searcher.deletedDocs":0,
          "INDEX.sizeInBytes":10240,
          "node_name":"127.0.0.1:10000_solr",
          "state":"active",
          "type":"NRT",
          "INDEX.sizeInGB":9.5367431640625E-6,
          "SEARCHER.searcher.numDocs":0}},
      "range":"80000000-7fffffff",
      "state":"active"}}}
	at org.apache.solr.cloud.CloudTestUtils.waitForState(CloudTestUtils.java:112)
	at org.apache.solr.cloud.CloudTestUtils.waitForState(CloudTestUtils.java:64)
	... 40 more




Build Log:
[...truncated 12448 lines...]
   [junit4] Suite: org.apache.solr.cloud.autoscaling.sim.TestSimComputePlanAction
   [junit4]   2> Creating dataDir: /home/jenkins/jenkins-slave/workspace/Lucene-Solr-Tests-7.x/solr/build/solr-core/test/J1/temp/solr.cloud.autoscaling.sim.TestSimComputePlanAction_544EF372C32DE5AA-001/init-core-data-001
   [junit4]   2> 183126 WARN  (SUITE-TestSimComputePlanAction-seed#[544EF372C32DE5AA]-worker) [    ] o.a.s.SolrTestCaseJ4 startTrackingSearchers: numOpens=348 numCloses=348
   [junit4]   2> 183126 INFO  (SUITE-TestSimComputePlanAction-seed#[544EF372C32DE5AA]-worker) [    ] o.a.s.SolrTestCaseJ4 Using PointFields (NUMERIC_POINTS_SYSPROP=true) w/NUMERIC_DOCVALUES_SYSPROP=true
   [junit4]   2> 183128 INFO  (SUITE-TestSimComputePlanAction-seed#[544EF372C32DE5AA]-worker) [    ] o.a.s.SolrTestCaseJ4 Randomized ssl (true) and clientAuth (false) via: @org.apache.solr.util.RandomizeSSL(reason=, ssl=NaN, value=NaN, clientAuth=NaN)
   [junit4]   2> 183128 INFO  (SUITE-TestSimComputePlanAction-seed#[544EF372C32DE5AA]-worker) [    ] o.a.s.SolrTestCaseJ4 SecureRandom sanity checks: test.solr.allowed.securerandom=null & java.security.egd=file:/dev/./urandom
   [junit4]   2> 183399 DEBUG (SUITE-TestSimComputePlanAction-seed#[544EF372C32DE5AA]-worker) [    ] o.a.s.c.a.s.SimClusterStateProvider --- new Overseer leader: 127.0.0.1:10000_solr
   [junit4]   2> 183413 DEBUG (Simulated OverseerAutoScalingTriggerThread) [    ] o.a.s.c.a.OverseerTriggerThread Adding .auto_add_replicas and .scheduled_maintenance triggers
   [junit4]   2> 183414 DEBUG (Simulated OverseerAutoScalingTriggerThread) [    ] o.a.s.c.a.OverseerTriggerThread Refreshing /autoscaling.json with znode version 0
   [junit4]   2> 183415 DEBUG (Simulated OverseerAutoScalingTriggerThread) [    ] o.a.s.c.a.OverseerTriggerThread Current znodeVersion 0, lastZnodeVersion -1
   [junit4]   2> 183436 DEBUG (Simulated OverseerAutoScalingTriggerThread) [    ] o.a.s.c.a.OverseerTriggerThread Processed trigger updates upto znodeVersion 0
   [junit4]   2> 183472 INFO  (SUITE-TestSimComputePlanAction-seed#[544EF372C32DE5AA]-worker) [    ] o.a.s.h.a.MetricsHistoryHandler No .system collection, keeping metrics history in memory.
   [junit4]   2> 183486 DEBUG (Simulated OverseerAutoScalingTriggerThread) [    ] o.a.s.c.a.NodeLostTrigger NodeLostTrigger .auto_add_replicas - Initial livenodes: [127.0.0.1:10000_solr]
   [junit4]   2> 183487 DEBUG (Simulated OverseerAutoScalingTriggerThread) [    ] o.a.s.c.a.OverseerTriggerThread -- clean old nodeAdded markers
   [junit4]   2> 183487 DEBUG (Simulated OverseerAutoScalingTriggerThread) [    ] o.a.s.c.a.OverseerTriggerThread Current znodeVersion 0, lastZnodeVersion 0
   [junit4]   2> 183487 DEBUG (ScheduledTrigger-157-thread-2) [    ] o.a.s.c.a.NodeLostTrigger Running NodeLostTrigger: .auto_add_replicas with currently live nodes: 1
   [junit4]   2> 183543 DEBUG (ScheduledTrigger-157-thread-1) [    ] o.a.s.c.a.NodeLostTrigger Running NodeLostTrigger: .auto_add_replicas with currently live nodes: 1
   [junit4]   2> 183579 DEBUG (ScheduledTrigger-157-thread-1) [    ] o.a.s.c.a.NodeLostTrigger Running NodeLostTrigger: .auto_add_replicas with currently live nodes: 1
   [junit4]   2> 183582 INFO  (TEST-TestSimComputePlanAction.testNodeLost-seed#[544EF372C32DE5AA]) [    ] o.a.s.SolrTestCaseJ4 ###Starting testNodeLost
   [junit4]   2> 183582 DEBUG (TEST-TestSimComputePlanAction.testNodeLost-seed#[544EF372C32DE5AA]) [    ] o.a.s.c.a.OverseerTriggerThread Refreshing /autoscaling.json with znode version 1
   [junit4]   2> 183582 DEBUG (Simulated OverseerAutoScalingTriggerThread) [    ] o.a.s.c.a.OverseerTriggerThread Processed trigger updates upto znodeVersion 1
   [junit4]   2> 183583 DEBUG (Simulated OverseerAutoScalingTriggerThread) [    ] o.a.s.c.a.OverseerTriggerThread -- clean old nodeLost markers
   [junit4]   2> 183583 DEBUG (Simulated OverseerAutoScalingTriggerThread) [    ] o.a.s.c.a.OverseerTriggerThread -- clean old nodeAdded markers
   [junit4]   2> 183583 DEBUG (Simulated OverseerAutoScalingTriggerThread) [    ] o.a.s.c.a.OverseerTriggerThread Current znodeVersion 1, lastZnodeVersion 1
   [junit4]   2> 183612 INFO  (TEST-TestSimComputePlanAction.testNodeLost-seed#[544EF372C32DE5AA]) [    ] o.a.s.c.a.s.SimCloudManager === Restarting OverseerTriggerThread and clearing object cache...
   [junit4]   2> 183612 WARN  (Simulated OverseerAutoScalingTriggerThread) [    ] o.a.s.c.a.OverseerTriggerThread Interrupted
   [junit4]   2> java.lang.InterruptedException: null
   [junit4]   2> 	at java.util.concurrent.locks.AbstractQueuedSynchronizer$ConditionObject.reportInterruptAfterWait(AbstractQueuedSynchronizer.java:2014) ~[?:1.8.0_172]
   [junit4]   2> 	at java.util.concurrent.locks.AbstractQueuedSynchronizer$ConditionObject.await(AbstractQueuedSynchronizer.java:2048) ~[?:1.8.0_172]
   [junit4]   2> 	at org.apache.solr.cloud.autoscaling.OverseerTriggerThread.run(OverseerTriggerThread.java:189) ~[java/:?]
   [junit4]   2> 	at java.lang.Thread.run(Thread.java:748) [?:1.8.0_172]
   [junit4]   2> 183635 DEBUG (TEST-TestSimComputePlanAction.testNodeLost-seed#[544EF372C32DE5AA]) [    ] o.a.s.c.a.ScheduledTriggers Shutting down scheduled thread pool executor now
   [junit4]   2> 183635 DEBUG (TEST-TestSimComputePlanAction.testNodeLost-seed#[544EF372C32DE5AA]) [    ] o.a.s.c.a.ScheduledTriggers Shutting down action executor now
   [junit4]   2> 183635 DEBUG (TEST-TestSimComputePlanAction.testNodeLost-seed#[544EF372C32DE5AA]) [    ] o.a.s.c.a.ScheduledTriggers Awaiting termination for action executor
   [junit4]   2> 183635 DEBUG (TEST-TestSimComputePlanAction.testNodeLost-seed#[544EF372C32DE5AA]) [    ] o.a.s.c.a.ScheduledTriggers Awaiting termination for scheduled thread pool executor
   [junit4]   2> 183635 DEBUG (TEST-TestSimComputePlanAction.testNodeLost-seed#[544EF372C32DE5AA]) [    ] o.a.s.c.a.ScheduledTriggers ScheduledTriggers closed completely
   [junit4]   2> 183635 DEBUG (TEST-TestSimComputePlanAction.testNodeLost-seed#[544EF372C32DE5AA]) [    ] o.a.s.c.a.OverseerTriggerThread OverseerTriggerThread has been closed explicitly
   [junit4]   2> 183669 DEBUG (Simulated OverseerAutoScalingTriggerThread) [    ] o.a.s.c.a.OverseerTriggerThread Adding .auto_add_replicas and .scheduled_maintenance triggers
   [junit4]   2> 183669 DEBUG (Simulated OverseerAutoScalingTriggerThread) [    ] o.a.s.c.a.OverseerTriggerThread Refreshing /autoscaling.json with znode version 2
   [junit4]   2> 183670 DEBUG (Simulated OverseerAutoScalingTriggerThread) [    ] o.a.s.c.a.OverseerTriggerThread Current znodeVersion 2, lastZnodeVersion -1
   [junit4]   2> 183670 DEBUG (Simulated OverseerAutoScalingTriggerThread) [    ] o.a.s.c.a.OverseerTriggerThread Processed trigger updates upto znodeVersion 2
   [junit4]   2> 183724 DEBUG (Simulated OverseerAutoScalingTriggerThread) [    ] o.a.s.c.a.NodeLostTrigger NodeLostTrigger .auto_add_replicas - Initial livenodes: [127.0.0.1:10000_solr]
   [junit4]   2> 183762 DEBUG (ScheduledTrigger-162-thread-1) [    ] o.a.s.c.a.NodeLostTrigger Running NodeLostTrigger: .auto_add_replicas with currently live nodes: 1
   [junit4]   2> 183762 DEBUG (Simulated OverseerAutoScalingTriggerThread) [    ] o.a.s.c.a.OverseerTriggerThread -- clean old nodeAdded markers
   [junit4]   2> 183762 DEBUG (Simulated OverseerAutoScalingTriggerThread) [    ] o.a.s.c.a.OverseerTriggerThread Current znodeVersion 2, lastZnodeVersion 2
   [junit4]   2> 183782 DEBUG (ScheduledTrigger-162-thread-1) [    ] o.a.s.c.a.NodeLostTrigger Running NodeLostTrigger: .auto_add_replicas with currently live nodes: 1
   [junit4]   2> 183893 DEBUG (ScheduledTrigger-162-thread-2) [    ] o.a.s.c.a.NodeLostTrigger Running NodeLostTrigger: .auto_add_replicas with currently live nodes: 1
   [junit4]   2> 183921 DEBUG (ScheduledTrigger-162-thread-1) [    ] o.a.s.c.a.NodeLostTrigger Running NodeLostTrigger: .auto_add_replicas with currently live nodes: 1
   [junit4]   2> 183941 DEBUG (ScheduledTrigger-162-thread-1) [    ] o.a.s.c.a.NodeLostTrigger Running NodeLostTrigger: .auto_add_replicas with currently live nodes: 1
   [junit4]   2> 183998 DEBUG (ScheduledTrigger-162-thread-2) [    ] o.a.s.c.a.NodeLostTrigger Running NodeLostTrigger: .auto_add_replicas with currently live nodes: 1
   [junit4]   2> 184018 DEBUG (ScheduledTrigger-162-thread-2) [    ] o.a.s.c.a.NodeLostTrigger Running NodeLostTrigger: .auto_add_replicas with currently live nodes: 1
   [junit4]   2> 184055 DEBUG (ScheduledTrigger-162-thread-2) [    ] o.a.s.c.a.NodeLostTrigger Running NodeLostTrigger: .auto_add_replicas with currently live nodes: 1
   [junit4]   2> 184091 DEBUG (ScheduledTrigger-162-thread-2) [    ] o.a.s.c.a.NodeLostTrigger Running NodeLostTrigger: .auto_add_replicas with currently live nodes: 1
   [junit4]   2> 184128 DEBUG (ScheduledTrigger-162-thread-2) [    ] o.a.s.c.a.NodeLostTrigger Running NodeLostTrigger: .auto_add_replicas with currently live nodes: 1
   [junit4]   2> 184164 DEBUG (ScheduledTrigger-162-thread-2) [    ] o.a.s.c.a.NodeLostTrigger Running NodeLostTrigger: .auto_add_replicas with currently live nodes: 1
   [junit4]   2> 184201 DEBUG (ScheduledTrigger-162-thread-2) [    ] o.a.s.c.a.NodeLostTrigger Running NodeLostTrigger: .auto_add_replicas with currently live nodes: 1
   [junit4]   2> 184237 DEBUG (ScheduledTrigger-162-thread-2) [    ] o.a.s.c.a.NodeLostTrigger Running NodeLostTrigger: .auto_add_replicas with currently live nodes: 1
   [junit4]   2> 184274 DEBUG (ScheduledTrigger-162-thread-2) [    ] o.a.s.c.a.NodeLostTrigger Running NodeLostTrigger: .auto_add_replicas with currently live nodes: 1
   [junit4]   2> 184290 DEBUG (simCloudManagerPool-161-thread-1) [    ] o.a.s.c.a.AutoScalingHandler Verified autoscaling configuration
   [junit4]   2> 184291 DEBUG (simCloudManagerPool-161-thread-1) [    ] o.a.s.c.a.OverseerTriggerThread Refreshing /autoscaling.json with znode version 3
   [junit4]   2> 184306 DEBUG (ScheduledTrigger-162-thread-2) [    ] o.a.s.c.a.NodeLostTrigger Running NodeLostTrigger: .auto_add_replicas with currently live nodes: 1
   [junit4]   2> 184327 DEBUG (ScheduledTrigger-162-thread-2) [    ] o.a.s.c.a.NodeLostTrigger Running NodeLostTrigger: .auto_add_replicas with currently live nodes: 1
   [junit4]   2> 184343 DEBUG (Simulated OverseerAutoScalingTriggerThread) [    ] o.a.s.c.a.OverseerTriggerThread Processed trigger updates upto znodeVersion 3
   [junit4]   2> 184344 DEBUG (Simulated OverseerAutoScalingTriggerThread) [    ] o.a.s.c.a.OverseerTriggerThread -- clean old nodeAdded markers
   [junit4]   2> 184344 DEBUG (Simulated OverseerAutoScalingTriggerThread) [    ] o.a.s.c.a.OverseerTriggerThread Current znodeVersion 3, lastZnodeVersion 3
   [junit4]   2> 184362 DEBUG (simCloudManagerPool-161-thread-2) [    ] o.a.s.c.a.AutoScalingHandler Verified autoscaling configuration
   [junit4]   2> 184396 DEBUG (simCloudManagerPool-161-thread-2) [    ] o.a.s.c.a.OverseerTriggerThread Refreshing /autoscaling.json with znode version 4
   [junit4]   2> 184398 DEBUG (Simulated OverseerAutoScalingTriggerThread) [    ] o.a.s.c.a.OverseerTriggerThread Processed trigger updates upto znodeVersion 4
   [junit4]   2> 184398 DEBUG (Simulated OverseerAutoScalingTriggerThread) [    ] o.a.s.c.a.OverseerTriggerThread -- clean old nodeAdded markers
   [junit4]   2> 184398 DEBUG (Simulated OverseerAutoScalingTriggerThread) [    ] o.a.s.c.a.OverseerTriggerThread Current znodeVersion 4, lastZnodeVersion 4
   [junit4]   2> 184400 DEBUG (ScheduledTrigger-162-thread-4) [    ] o.a.s.c.a.NodeLostTrigger Running NodeLostTrigger: .auto_add_replicas with currently live nodes: 1
   [junit4]   2> 184445 DEBUG (ScheduledTrigger-162-thread-2) [    ] o.a.s.c.a.NodeLostTrigger Running NodeLostTrigger: .auto_add_replicas with currently live nodes: 1
   [junit4]   2> 184481 DEBUG (ScheduledTrigger-162-thread-2) [    ] o.a.s.c.a.NodeLostTrigger Running NodeLostTrigger: .auto_add_replicas with currently live nodes: 1
   [junit4]   2> 184502 DEBUG (ScheduledTrigger-162-thread-2) [    ] o.a.s.c.a.NodeLostTrigger Running NodeLostTrigger: .auto_add_replicas with currently live nodes: 1
   [junit4]   2> 184538 DEBUG (ScheduledTrigger-162-thread-2) [    ] o.a.s.c.a.NodeLostTrigger Running NodeLostTrigger: .auto_add_replicas with currently live nodes: 2
   [junit4]   2> 184591 DEBUG (ScheduledTrigger-162-thread-2) [    ] o.a.s.c.a.NodeLostTrigger Running NodeLostTrigger: .auto_add_replicas with currently live nodes: 2
   [junit4]   2> 184611 DEBUG (ScheduledTrigger-162-thread-2) [    ] o.a.s.c.a.NodeLostTrigger Running NodeLostTrigger: .auto_add_replicas with currently live nodes: 2
   [junit4]   2> 184648 DEBUG (ScheduledTrigger-162-thread-2) [    ] o.a.s.c.a.NodeLostTrigger Running NodeLostTrigger: .auto_add_replicas with currently live nodes: 2
   [junit4]   2> 184677 DEBUG (ScheduledTrigger-162-thread-1) [    ] o.a.s.c.a.NodeLostTrigger Running NodeLostTrigger: .auto_add_replicas with currently live nodes: 2
   [junit4]   2> 184701 DEBUG (ScheduledTrigger-162-thread-2) [    ] o.a.s.c.a.NodeLostTrigger Running NodeLostTrigger: .auto_add_replicas with currently live nodes: 2
   [junit4]   2> 184721 DEBUG (ScheduledTrigger-162-thread-2) [    ] o.a.s.c.a.NodeLostTrigger Running NodeLostTrigger: .auto_add_replicas with currently live nodes: 2
   [junit4]   2> 184758 DEBUG (ScheduledTrigger-162-thread-2) [    ] o.a.s.c.a.NodeLostTrigger Running NodeLostTrigger: .auto_add_replicas with currently live nodes: 2
   [junit4]   2> 184776 DEBUG (simCloudManagerPool-161-thread-3) [    ] o.a.s.c.a.AutoScalingHandler Verified autoscaling configuration
   [junit4]   2> 184794 DEBUG (ScheduledTrigger-162-thread-4) [    ] o.a.s.c.a.NodeLostTrigger Running NodeLostTrigger: .auto_add_replicas with currently live nodes: 2
   [junit4]   2> 184795 DEBUG (simCloudManagerPool-161-thread-3) [    ] o.a.s.c.a.OverseerTriggerThread Refreshing /autoscaling.json with znode version 5
   [junit4]   2> 184797 DEBUG (simCloudManagerPool-161-thread-4) [    ] o.a.s.c.o.ClusterStateMutator building a new cName: testNodeLost
   [junit4]   2> 184798 DEBUG (Simulated OverseerAutoScalingTriggerThread) [    ] o.a.s.c.a.OverseerTriggerThread Processed trigger updates upto znodeVersion 5
   [junit4]   2> 184799 DEBUG (Simulated OverseerAutoScalingTriggerThread) [    ] o.a.s.c.a.NodeLostTrigger NodeLostTrigger node_lost_trigger - Initial livenodes: [127.0.0.1:10001_solr, 127.0.0.1:10000_solr]
   [junit4]   2> 184799 DEBUG (Simulated OverseerAutoScalingTriggerThread) [    ] o.a.s.c.a.OverseerTriggerThread -- clean old nodeAdded markers
   [junit4]   2> 184799 DEBUG (Simulated OverseerAutoScalingTriggerThread) [    ] o.a.s.c.a.OverseerTriggerThread Current znodeVersion 5, lastZnodeVersion 5
   [junit4]   2> 184799 DEBUG (ScheduledTrigger-162-thread-1) [    ] o.a.s.c.a.NodeLostTrigger Running NodeLostTrigger: node_lost_trigger with currently live nodes: 2
   [junit4]   2> 184819 DEBUG (ScheduledTrigger-162-thread-1) [    ] o.a.s.c.a.NodeLostTrigger Running NodeLostTrigger: .auto_add_replicas with currently live nodes: 2
   [junit4]   2> 184819 DEBUG (ScheduledTrigger-162-thread-1) [    ] o.a.s.c.a.NodeLostTrigger Running NodeLostTrigger: node_lost_trigger with currently live nodes: 2
   [junit4]   2> 184849 DEBUG (simCloudManagerPool-161-thread-4) [    ] o.a.s.c.s.c.a.PolicyHelper Creating a new session
   [junit4]   2> 184855 DEBUG (ScheduledTrigger-162-thread-1) [    ] o.a.s.c.a.NodeLostTrigger Running NodeLostTrigger: .auto_add_replicas with currently live nodes: 2
   [junit4]   2> 184855 DEBUG (ScheduledTrigger-162-thread-1) [    ] o.a.s.c.a.NodeLostTrigger Running NodeLostTrigger: node_lost_trigger with currently live nodes: 2
   [junit4]   2> 184864 DEBUG (simCloudManagerPool-161-thread-4) [    ] o.a.s.c.s.c.a.PolicyHelper New session created 
   [junit4]   2> 184892 DEBUG (ScheduledTrigger-162-thread-1) [    ] o.a.s.c.a.NodeLostTrigger Running NodeLostTrigger: .auto_add_replicas with currently live nodes: 2
   [junit4]   2> 184892 DEBUG (ScheduledTrigger-162-thread-1) [    ] o.a.s.c.a.NodeLostTrigger Running NodeLostTrigger: node_lost_trigger with currently live nodes: 2
   [junit4]   2> 184929 DEBUG (ScheduledTrigger-162-thread-1) [    ] o.a.s.c.a.NodeLostTrigger Running NodeLostTrigger: .auto_add_replicas with currently live nodes: 2
   [junit4]   2> 184929 DEBUG (ScheduledTrigger-162-thread-1) [    ] o.a.s.c.a.NodeLostTrigger Running NodeLostTrigger: node_lost_trigger with currently live nodes: 2
   [junit4]   2> 184970 INFO  (simCloudManagerPool-161-thread-4) [    ] o.a.s.c.s.c.a.PolicyHelper returnSession, curr-time 18374572784 sessionWrapper.createTime 18374567457961442, this.sessionWrapper.createTime 18374567457961442 
   [junit4]   2> 184971 DEBUG (simCloudManagerPool-161-thread-4) [    ] o.a.s.c.s.c.a.PolicyHelper session set to NULL
   [junit4]   2> 184972 DEBUG (ScheduledTrigger-162-thread-1) [    ] o.a.s.c.a.NodeLostTrigger Running NodeLostTrigger: .auto_add_replicas with currently live nodes: 2
   [junit4]   2> 184972 DEBUG (ScheduledTrigger-162-thread-1) [    ] o.a.s.c.a.NodeLostTrigger Running NodeLostTrigger: node_lost_trigger with currently live nodes: 2
   [junit4]   2> 185010 DEBUG (ScheduledTrigger-162-thread-1) [    ] o.a.s.c.a.NodeLostTrigger Running NodeLostTrigger: .auto_add_replicas with currently live nodes: 2
   [junit4]   2> 185010 DEBUG (ScheduledTrigger-162-thread-1) [    ] o.a.s.c.a.NodeLostTrigger Running NodeLostTrigger: node_lost_trigger with currently live nodes: 2
   [junit4]   2> 185046 DEBUG (ScheduledTrigger-162-thread-1) [    ] o.a.s.c.a.NodeLostTrigger Running NodeLostTrigger: .auto_add_replicas with currently live nodes: 2
   [junit4]   2> 185047 DEBUG (ScheduledTrigger-162-thread-1) [    ] o.a.s.c.a.NodeLostTrigger Running NodeLostTrigger: node_lost_trigger with currently live nodes: 2
   [junit4]   2> 185047 DEBUG (simCloudManagerPool-161-thread-5) [    ] o.a.s.c.a.s.SimClusterStateProvider -- submit leader election for testNodeLost / shard1
   [junit4]   2> 185048 DEBUG (simCloudManagerPool-161-thread-7) [    ] o.a.s.c.a.s.SimClusterStateProvider Running leader election for testNodeLost / shard1
   [junit4]   2> 185063 DEBUG (simCloudManagerPool-161-thread-7) [    ] o.a.s.c.a.s.SimClusterStateProvider -- elected new leader for testNodeLost / shard1: core_node1
   [junit4]   2> 185064 DEBUG (simCloudManagerPool-161-thread-6) [    ] o.a.s.c.a.s.SimClusterStateProvider -- submit leader election for testNodeLost / shard1
   [junit4]   2> 185065 DEBUG (simCloudManagerPool-161-thread-8) [    ] o.a.s.c.a.s.SimClusterStateProvider Running leader election for testNodeLost / shard1
   [junit4]   2> 185083 DEBUG (ScheduledTrigger-162-thread-1) [    ] o.a.s.c.a.NodeLostTrigger Running NodeLostTrigger: .auto_add_replicas with currently live nodes: 2
   [junit4]   2> 185083 DEBUG (ScheduledTrigger-162-thread-1) [    ] o.a.s.c.a.NodeLostTrigger Running NodeLostTrigger: node_lost_trigger with currently live nodes: 2
   [junit4]   2> 186949 DEBUG (ScheduledTrigger-162-thread-1) [    ] o.a.s.c.a.NodeLostTrigger Running NodeLostTrigger: .auto_add_replicas with currently live nodes: 2
   [junit4]   2> 186949 DEBUG (ScheduledTrigger-162-thread-1) [    ] o.a.s.c.a.NodeLostTrigger Running NodeLostTrigger: node_lost_trigger with currently live nodes: 2
   [junit4]   2> 186969 DEBUG (simCloudManagerPool-161-thread-8) [    ] o.a.s.c.a.s.SimClusterStateProvider -- already has leader testNodeLost / shard1: shard1:{
   [junit4]   2>   "replicas":{
   [junit4]   2>     "core_node1":{
   [junit4]   2>       "core":"testNodeLost_shard1_replica_n1",
   [junit4]   2>       "SEARCHER.searcher.maxDoc":0,
   [junit4]   2>       "SEARCHER.searcher.deletedDocs":0,
   [junit4]   2>       "INDEX.sizeInBytes":10240,
   [junit4]   2>       "node_name":"127.0.0.1:10001_solr",
   [junit4]   2>       "state":"active",
   [junit4]   2>       "type":"NRT",
   [junit4]   2>       "INDEX.sizeInGB":9.5367431640625E-6,
   [junit4]   2>       "SEARCHER.searcher.numDocs":0},
   [junit4]   2>     "core_node2":{
   [junit4]   2>       "core":"testNodeLost_shard1_replica_n2",
   [junit4]   2>       "SEARCHER.searcher.maxDoc":0,
   [junit4]   2>       "SEARCHER.searcher.deletedDocs":0,
   [junit4]   2>       "INDEX.sizeInBytes":10240,
   [junit4]   2>       "node_name":"127.0.0.1:10000_solr",
   [junit4]   2>       "state":"active",
   [junit4]   2>       "type":"NRT",
   [junit4]   2>       "INDEX.sizeInGB":9.5367431640625E-6,
   [junit4]   2>       "SEARCHER.searcher.numDocs":0}},
   [junit4]   2>   "range":"80000000-7fffffff",
   [junit4]   2>   "state":"active"}
   [junit4]   2> 186987 DEBUG (ScheduledTrigger-162-thread-2) [    ] o.a.s.c.a.NodeLostTrigger Running NodeLostTrigger: .auto_add_replicas with currently live nodes: 2
   [junit4]   2> 187007 DEBUG (ScheduledTrigger-162-thread-1) [    ] o.a.s.c.a.NodeLostTrigger Running NodeLostTrigger: .auto_add_replicas with currently live nodes: 2
   [junit4]   2> 187009 DEBUG (ScheduledTrigger-162-thread-2) [    ] o.a.s.c.a.NodeLostTrigger Running NodeLostTrigger: node_lost_trigger with currently live nodes: 2
   [junit4]   2> 187035 DEBUG (ScheduledTrigger-162-thread-1) [    ] o.a.s.c.a.NodeLostTrigger Running NodeLostTrigger: .auto_add_replicas with currently live nodes: 2
   [junit4]   2> 187036 DEBUG (ScheduledTrigger-162-thread-1) [    ] o.a.s.c.a.NodeLostTrigger Running NodeLostTrigger: node_lost_trigger with currently live nodes: 2
   [junit4]   2> 187056 DEBUG (ScheduledTrigger-162-thread-1) [    ] o.a.s.c.a.NodeLostTrigger Running NodeLostTrigger: .auto_add_replicas with currently live nodes: 2
   [junit4]   2> 187056 DEBUG (ScheduledTrigger-162-thread-1) [    ] o.a.s.c.a.NodeLostTrigger Running NodeLostTrigger: node_lost_trigger with currently live nodes: 2
   [junit4]   2> 187088 DEBUG (ScheduledTrigger-162-thread-1) [    ] o.a.s.c.a.NodeLostTrigger Running NodeLostTrigger: .auto_add_replicas with currently live nodes: 2
   [junit4]   2> 187088 DEBUG (ScheduledTrigger-162-thread-1) [    ] o.a.s.c.a.NodeLostTrigger Running NodeLostTrigger: node_lost_trigger with currently live nodes: 2
   [junit4]   2> 187109 DEBUG (ScheduledTrigger-162-thread-1) [    ] o.a.s.c.a.NodeLostTrigger Running NodeLostTrigger: .auto_add_replicas with currently live nodes: 2
   [junit4]   2> 187109 DEBUG (ScheduledTrigger-162-thread-1) [    ] o.a.s.c.a.NodeLostTrigger Running NodeLostTrigger: node_lost_trigger with currently live nodes: 2
   [junit4]   2> 187145 DEBUG (ScheduledTrigger-162-thread-1) [    ] o.a.s.c.a.NodeLostTrigger Running NodeLostTrigger: .auto_add_replicas with currently live nodes: 2
   [junit4]   2> 187145 DEBUG (ScheduledTrigger-162-thread-1) [    ] o.a.s.c.a.NodeLostTrigger Running NodeLostTrigger: node_lost_trigger with currently live nodes: 2
   [junit4]   2> 187182 DEBUG (ScheduledTrigger-162-thread-1) [    ] o.a.s.c.a.NodeLostTrigger Running NodeLostTrigger: .auto_add_replicas with currently live nodes: 2
   [junit4]   2> 187182 DEBUG (ScheduledTrigger-162-thread-1) [    ] o.a.s.c.a.NodeLostTrigger Running NodeLostTrigger: node_lost_trigger with currently live nodes: 2
   [junit4]   2> 187219 DEBUG (ScheduledTrigger-162-thread-1) [    ] o.a.s.c.a.NodeLostTrigger Running NodeLostTrigger: .auto_add_replicas with currently live nodes: 2
   [junit4]   2> 187219 DEBUG (ScheduledTrigger-162-thread-1) [    ] o.a.s.c.a.NodeLostTrigger Running NodeLostTrigger: node_lost_trigger with currently live nodes: 2
   [junit4]   2> 187259 DEBUG (ScheduledTrigger-162-thread-1) [    ] o.a.s.c.a.NodeLostTrigger Running NodeLostTrigger: .auto_add_replicas with currently live nodes: 2
   [junit4]   2> 187259 DEBUG (ScheduledTrigger-162-thread-1) [    ] o.a.s.c.a.NodeLostTrigger Running NodeLostTrigger: node_lost_trigger with currently live nodes: 2
   [junit4]   2> 187284 DEBUG (ScheduledTrigger-162-thread-1) [    ] o.a.s.c.a.NodeLostTrigger Running NodeLostTrigger: .auto_add_replicas with currently live nodes: 2
   [junit4]   2> 187284 DEBUG (ScheduledTrigger-162-thread-1) [    ] o.a.s.c.a.NodeLostTrigger Running NodeLostTrigger: node_lost_trigger with currently live nodes: 2
   [junit4]   2> 187320 DEBUG (ScheduledTrigger-162-thread-1) [    ] o.a.s.c.a.NodeLostTrigger Running NodeLostTrigger: .auto_add_replicas with currently live nodes: 2
   [junit4]   2> 187320 DEBUG (ScheduledTrigger-162-thread-1) [    ] o.a.s.c.a.NodeLostTrigger Running NodeLostTrigger: node_lost_trigger with currently live nodes: 2
   [junit4]   2> 187353 DEBUG (ScheduledTrigger-162-thread-1) [    ] o.a.s.c.a.NodeLostTrigger Running NodeLostTrigger: .auto_add_replicas with currently live nodes: 2
   [junit4]   2> 187353 DEBUG (ScheduledTrigger-162-thread-1) [    ] o.a.s.c.a.NodeLostTrigger Running NodeLostTrigger: node_lost_trigger with currently live nodes: 2
   [junit4]   2> 187416 DEBUG (ScheduledTrigger-162-thread-1) [    ] o.a.s.c.a.NodeLostTrigger Running NodeLostTrigger: .auto_add_replicas with currently live nodes: 2
   [junit4]   2> 187416 DEBUG (ScheduledTrigger-162-thread-1) [    ] o.a.s.c.a.NodeLostTrigger Running NodeLostTrigger: node_lost_trigger with currently live nodes: 2
   [junit4]   2> 187451 DEBUG (ScheduledTrigger-162-thread-1) [    ] o.a.s.c.a.NodeLostTrigger Running NodeLostTrigger: .auto_add_replicas with currently live nodes: 2
   [junit4]   2> 187451 DEBUG (ScheduledTrigger-162-thread-1) [    ] o.a.s.c.a.NodeLostTrigger Running NodeLostTrigger: node_lost_trigger with currently live nodes: 2
   [junit4]   2> 187471 DEBUG (ScheduledTrigger-162-thread-1) [    ] o.a.s.c.a.NodeLostTrigger Running NodeLostTrigger: .auto_add_replicas with currently live nodes: 2
   [junit4]   2> 187471 DEBUG (ScheduledTrigger-162-thread-1) [    ] o.a.s.c.a.NodeLostTrigger Running NodeLostTrigger: node_lost_trigger with currently live nodes: 2
   [junit4]   2> 187503 DEBUG (ScheduledTrigger-162-thread-1) [    ] o.a.s.c.a.NodeLostTrigger Running NodeLostTrigger: .auto_add_replicas with currently live nodes: 2
   [junit4]   2> 187503 DEBUG (ScheduledTrigger-162-thread-1) [    ] o.a.s.c.a.NodeLostTrigger Running NodeLostTrigger: node_lost_trigger with currently live nodes: 2
   [junit4]   2> 187524 DEBUG (ScheduledTrigger-162-thread-1) [    ] o.a.s.c.a.NodeLostTrigger Running NodeLostTrigger: .auto_add_replicas with currently live nodes: 2
   [junit4]   2> 187524 DEBUG (ScheduledTrigger-162-thread-1) [    ] o.a.s.c.a.NodeLostTrigger Running NodeLostTrigger: node_lost_trigger with currently live nodes: 2
   [junit4]   2> 187544 DEBUG (ScheduledTrigger-162-thread-1) [    ] o.a.s.c.a.NodeLostTrigger Running NodeLostTrigger: .auto_add_replicas with currently live nodes: 2
   [junit4]   2> 187544 DEBUG (ScheduledTrigger-162-thread-1) [    ] o.a.s.c.a.NodeLostTrigger Running NodeLostTrigger: node_lost_trigger with currently live nodes: 2
   [junit4]   2> 187581 DEBUG (ScheduledTrigger-162-thread-1) [    ] o.a.s.c.a.NodeLostTrigger Running NodeLostTrigger: .auto_add_replicas with currently live nodes: 2
   [junit4]   2> 187581 DEBUG (ScheduledTrigger-162-thread-1) [    ] o.a.s.c.a.NodeLostTrigger Running NodeLostTrigger: node_lost_trigger with currently live nodes: 2
   [junit4]   2> 187618 DEBUG (ScheduledTrigger-162-thread-4) [    ] o.a.s.c.a.NodeLostTrigger Running NodeLostTrigger: .auto_add_replicas with currently live nodes: 2
   [junit4]   2> 187618 DEBUG (ScheduledTrigger-162-thread-4) [    ] o.a.s.c.a.NodeLostTrigger Running NodeLostTrigger: node_lost_trigger with currently live nodes: 2
   [junit4]   2> 187655 DEBUG (ScheduledTrigger-162-thread-4) [    ] o.a.s.c.a.NodeLostTrigger Running NodeLostTrigger: .auto_add_replicas with currently live nodes: 2
   [junit4]   2> 187657 DEBUG (ScheduledTrigger-162-thread-1) [    ] o.a.s.c.a.NodeLostTrigger Running NodeLostTrigger: node_lost_trigger with currently live nodes: 2
   [junit4]   2> 187686 DEBUG (ScheduledTrigger-162-thread-1) [    ] o.a.s.c.a.NodeLostTrigger Running NodeLostTrigger: node_lost_trigger with currently live nodes: 2
   [junit4]   2> 187687 DEBUG (ScheduledTrigger-162-thread-1) [    ] o.a.s.c.a.NodeLostTrigger Running NodeLostTrigger: .auto_add_replicas with currently live nodes: 2
   [junit4]   2> 187735 DEBUG (ScheduledTrigger-162-thread-1) [    ] o.a.s.c.a.NodeLostTrigger Running NodeLostTrigger: node_lost_trigger with currently live nodes: 2
   [junit4]   2> 187735 DEBUG (ScheduledTrigger-162-thread-1) [    ] o.a.s.c.a.NodeLostTrigger Running NodeLostTrigger: .auto_add_replicas with currently live nodes: 2
   [junit4]   2> 187764 DEBUG (ScheduledTrigger-162-thread-1) [    ] o.a.s.c.a.NodeLostTrigger Running NodeLostTrigger: node_lost_trigger with currently live nodes: 2
   [junit4]   2> 187764 DEBUG (ScheduledTrigger-162-thread-1) [    ] o.a.s.c.a.NodeLostTrigger Running NodeLostTrigger: .auto_add_replicas with currently live nodes: 2
   [junit4]   2> 187788 DEBUG (ScheduledTrigger-162-thread-1) [    ] o.a.s.c.a.NodeLostTrigger Running NodeLostTrigger: node_lost_trigger with currently live nodes: 2
   [junit4]   2> 187788 DEBUG (ScheduledTrigger-162-thread-1) [    ] o.a.s.c.a.NodeLostTrigger Running NodeLostTrigger: .auto_add_replicas with currently live nodes: 2
   [junit4]   2> 187808 DEBUG (ScheduledTrigger-162-thread-1) [    ] o.a.s.c.a.NodeLostTrigger Running NodeLostTrigger: node_lost_trigger with currently live nodes: 2
   [junit4]   2> 187808 DEBUG (ScheduledTrigger-162-thread-1) [    ] o.a.s.c.a.NodeLostTrigger Running NodeLostTrigger: .auto_add_replicas with currently live nodes: 2
   [junit4]   2> 187837 DEBUG (ScheduledTrigger-162-thread-1) [    ] o.a.s.c.a.NodeLostTrigger Running NodeLostTrigger: node_lost_trigger with currently live nodes: 2
   [junit4]   2> 187837 DEBUG (ScheduledTrigger-162-thread-1) [    ] o.a.s.c.a.NodeLostTrigger Running NodeLostTrigger: .auto_add_replicas with currently live nodes: 2
   [junit4]   2> 187873 DEBUG (ScheduledTrigger-162-thread-1) [    ] o.a.s.c.a.NodeLostTrigger Running NodeLostTrigger: node_lost_trigger with currently live nodes: 2
   [junit4]   2> 187874 DEBUG (ScheduledTrigger-162-thread-1) [    ] o.a.s.c.a.NodeLostTrigger Running NodeLostTrigger: .auto_add_replicas with currently live nodes: 2
   [junit4]   2> 187898 DEBUG (ScheduledTrigger-162-thread-1) [    ] o.a.s.c.a.NodeLostTrigger Running NodeLostTrigger: node_lost_trigger with currently live nodes: 2
   [junit4]   2> 187898 DEBUG (ScheduledTrigger-162-thread-3) [    ] o.a.s.c.a.NodeLostTrigger Running NodeLostTrigger: .auto_add_replicas with currently live nodes: 2
   [junit4]   2> 187918 DEBUG (ScheduledTrigger-162-thread-1) [    ] o.a.s.c.a.NodeLostTrigger Running NodeLostTrigger: node_lost_trigger with currently live nodes: 2
   [junit4]   2> 187918 DEBUG (ScheduledTrigger-162-thread-1) [    ] o.a.s.c.a.NodeLostTrigger Running NodeLostTrigger: .auto_add_replicas with currently live nodes: 2
   [junit4]   2> 187938 DEBUG (ScheduledTrigger-162-thread-1) [    ] o.a.s.c.a.NodeLostTrigger Running NodeLostTrigger: node_lost_trigger with currently live nodes: 2
   [junit4]   2> 187938 DEBUG (ScheduledTrigger-162-thread-1) [    ] o.a.s.c.a.NodeLostTrigger Running NodeLostTrigger: .auto_add_replicas with currently live nodes: 2
   [junit4]   2> 187959 DEBUG (ScheduledTrigger-162-thread-1) [    ] o.a.s.c.a.NodeLostTrigger Running NodeLostTrigger: node_lost_trigger with currently live nodes: 2
   [junit4]   2> 187959 DEBUG (ScheduledTrigger-162-thread-1) [    ] o.a.s.c.a.NodeLostTrigger Running NodeLostTrigger: .auto_add_replicas with currently live nodes: 2
   [junit4]   2> 187979 DEBUG (ScheduledTrigger-162-thread-1) [    ] o.a.s.c.a.NodeLostTrigger Running NodeLostTrigger: node_lost_trigger with currently live nodes: 2
   [junit4]   2> 187979 DEBUG (ScheduledTrigger-162-thread-3) [    ] o.a.s.c.a.NodeLostTrigger Running NodeLostTrigger: .auto_add_replicas with currently live nodes: 2
   [junit4]   2> 188008 DEBUG (ScheduledTrigger-162-thread-3) [    ] o.a.s.c.a.NodeLostTrigger Running NodeLostTrigger: node_lost_trigger with currently live nodes: 2
   [junit4]   2> 188008 DEBUG (ScheduledTrigger-162-thread-3) [    ] o.a.s.c.a.NodeLostTrigger Running NodeLostTrigger: .auto_add_replicas with currently live nodes: 2
   [junit4]   2> 188093 DEBUG (ScheduledTrigger-162-thread-2) [    ] o.a.s.c.a.NodeLostTrigger Running NodeLostTrigger: node_lost_trigger with currently live nodes: 2
   [junit4]   2> 188093 DEBUG (ScheduledTrigger-162-thread-2) [    ] o.a.s.c.a.NodeLostTrigger Running NodeLostTrigger: .auto_add_replicas with currently live nodes: 2
   [junit4]   2> 188117 DEBUG (ScheduledTrigger-162-thread-3) [    ] o.a.s.c.a.NodeLostTrigger Running NodeLostTrigger: node_lost_trigger with currently live nodes: 2
   [junit4]   2> 188118 DEBUG (ScheduledTrigger-162-thread-3) [    ] o.a.s.c.a.NodeLostTrigger Running NodeLostTrigger: .auto_add_replicas with currently live nodes: 2
   [junit4]   2> 188138 DEBUG (ScheduledTrigger-162-thread-3) [    ] o.a.s.c.a.NodeLostTrigger Running NodeLostTrigger: node_lost_trigger with currently live nodes: 2
   [junit4]   2> 188138 DEBUG (ScheduledTrigger-162-thread-3) [    ] o.a.s.c.a.NodeLostTrigger Running NodeLostTrigger: .auto_add_replicas with currently live nodes: 2
   [junit4]   2> 188158 DEBUG (ScheduledTrigger-162-thread-3) [    ] o.a.s.c.a.NodeLostTrigger Running NodeLostTrigger: node_lost_trigger with currently live nodes: 2
   [junit4]   2> 188158 DEBUG (ScheduledTrigger-162-thread-3) [    ] o.a.s.c.a.NodeLostTrigger Running NodeLostTrigger: .auto_add_replicas with currently live nodes: 2
   [junit4]   2> 188178 DEBUG (ScheduledTrigger-162-thread-3) [    ] o.a.s.c.a.NodeLostTrigger Running NodeLostTrigger: node_lost_trigger with currently live nodes: 2
   [junit4]   2> 188178 DEBUG (ScheduledTrigger-162-thread-3) [    ] o.a.s.c.a.NodeLostTrigger Running NodeLostTrigger: .auto_add_replicas with currently live nodes: 2
   [junit4]   2> 188198 DEBUG (ScheduledTrigger-162-thread-3) [    ] o.a.s.c.a.NodeLostTrigger Running NodeLostTrigger: node_lost_trigger with currently live nodes: 2
   [junit4]   2> 188198 DEBUG (ScheduledTrigger-162-thread-3) [    ] o.a.s.c.a.NodeLostTrigger Running NodeLostTrigger: .auto_add_replicas with currently live nodes: 2
   [junit4]   2> 188219 DEBUG (ScheduledTrigger-162-thread-3) [    ] o.a.s.c.a.NodeLostTrigger Running NodeLostTrigger: node_lost_trigger with currently live nodes: 2
   [junit4]   2> 188219 DEBUG (ScheduledTrigger-162-thread-3) [    ] o.a.s.c.a.NodeLostTrigger Running NodeLostTrigger: .auto_add_replicas with currently live nodes: 2
   [junit4]   2> 188244 DEBUG (ScheduledTrigger-162-thread-3) [    ] o.a.s.c.a.NodeLostTrigger Running NodeLostTrigger: node_lost_trigger with currently live nodes: 2
   [junit4]   2> 188244 DEBUG (ScheduledTrigger-162-thread-3) [    ] o.a.s.c.a.NodeLostTrigger Running NodeLostTrigger: .auto_add_replicas with currently live nodes: 2
   [junit4]   2> 188264 DEBUG (ScheduledTrigger-162-thread-3) [    ] o.a.s.c.a.NodeLostTrigger Running NodeLostTrigger: node_lost_trigger with currently live nodes: 2
   [junit4]   2> 188264 DEBUG (ScheduledTrigger-162-thread-3) [    ] o.a.s.c.a.NodeLostTrigger Running NodeLostTrigger: .auto_add_replicas with currently live nodes: 2
   [junit4]   2> 188301 DEBUG (ScheduledTrigger-162-thread-3) [    ] o.a.s.c.a.NodeLostTrigger Running NodeLostTrigger: node_lost_trigger with currently live nodes: 2
   [junit4]   2> 188301 DEBUG (ScheduledTrigger-162-thread-3) [    ] o.a.s.c.a.NodeLostTrigger Running NodeLostTrigger: .auto_add_replicas with currently live nodes: 2
   [junit4]   2> 188341 DEBUG (ScheduledTrigger-162-thread-3) [    ] o.a.s.c.a.NodeLostTrigger Running NodeLostTrigger: node_lost_trigger with currently live nodes: 2
   [junit4]   2> 188341 DEBUG (ScheduledTrigger-162-thread-3) [    ] o.a.s.c.a.NodeLostTrigger Running NodeLostTrigger: .auto_add_replicas with currently live nodes: 2
   [junit4]   2> 188362 DEBUG (ScheduledTrigger-162-thread-3) [    ] o.a.s.c.a.NodeLostTrigger Running NodeLostTrigger: node_lost_trigger with currently live nodes: 2
   [junit4]   2> 188362 DEBUG (ScheduledTrigger-162-thread-3) [    ] o.a.s.c.a.NodeLostTrigger Running NodeLostTrigger: .auto_add_replicas with currently live nodes: 2
   [junit4]   2> 188382 DEBUG (ScheduledTrigger-162-thread-3) [    ] o.a.s.c.a.NodeLostTrigger Running NodeLostTrigger: node_lost_trigger with currently live nodes: 2
   [junit4]   2> 188382 DEBUG (ScheduledTrigger-162-thread-3) [    ] o.a.s.c.a.NodeLostTrigger Running NodeLostTrigger: .auto_add_replicas with currently live nodes: 2
   [junit4]   2> 188414 DEBUG (ScheduledTrigger-162-thread-3) [    ] o.a.s.c.a.NodeLostTrigger Running NodeLostTrigger: node_lost_trigger with currently live nodes: 2
   [junit4]   2> 188414 DEBUG (ScheduledTrigger-162-thread-3) [    ] o.a.s.c.a.NodeLostTrigger Running NodeLostTrigger: .auto_add_replicas with currently live nodes: 2
   [junit4]   2> 188435 DEBUG (ScheduledTrigger-162-thread-3) [    ] o.a.s.c.a.NodeLostTrigger Running NodeLostTrigger: node_lost_trigger with currently live nodes: 2
   [junit4]   2> 188435 DEBUG (ScheduledTrigger-162-thread-3) [    ] o.a.s.c.a.NodeLostTrigger Running NodeLostTrigger: .auto_add_replicas with currently live nodes: 2
   [junit4]   2> 188467 DEBUG (ScheduledTrigger-162-thread-3) [    ] o.a.s.c.a.NodeLostTrigger Running NodeLostTrigger: node_lost_trigger with currently live nodes: 2
   [junit4]   2> 188467 DEBUG (ScheduledTrigger-162-thread-3) [    ] o.a.s.c.a.NodeLostTrigger Running NodeLostTrigger: .auto_add_replicas with currently live nodes: 2
   [junit4]   2> 188488 DEBUG (ScheduledTrigger-162-thread-3) [    ] o.a.s.c.a.NodeLostTrigger Running NodeLostTrigger: node_lost_trigger with currently live nodes: 2
   [junit4]   2> 188488 DEBUG (ScheduledTrigger-162-thread-1) [    ] o.a.s.c.a.NodeLostTrigger Running NodeLostTrigger: .auto_add_replicas with currently live nodes: 2
   [junit4]   2> 188516 DEBUG (ScheduledTrigger-162-thread-3) [    ] o.a.s.c.a.NodeLostTrigger Running NodeLostTrigger: node_lost_trigger with currently live nodes: 2
   [junit4]   2> 188516 DEBUG (ScheduledTrigger-162-thread-3) [    ] o.a.s.c.a.NodeLostTrigger Running NodeLostTrigger: .auto_add_replicas with currently live nodes: 2
   [junit4]   2> 188545 DEBUG (ScheduledTrigger-162-thread-2) [    ] o.a.s.c.a.NodeLostTrigger Running NodeLostTrigger: .auto_add_replicas with currently live nodes: 2
   [junit4]   2> 188545 DEBUG (ScheduledTrigger-162-thread-3) [    ] o.a.s.c.a.NodeLostTrigger Running NodeLostTrigger: node_lost_trigger with currently live nodes: 2
   [junit4]   2> 188565 DEBUG (ScheduledTrigger-162-thread-2) [    ] o.a.s.c.a.NodeLostTrigger Running NodeLostTrigger: .auto_add_replicas with currently live nodes: 2
   [junit4]   2> 188565 DEBUG (ScheduledTrigger-162-thread-2) [    ] o.a.s.c.a.NodeLostTrigger Running NodeLostTrigger: node_lost_trigger with currently live nodes: 2
   [junit4]   2> 188593 DEBUG (ScheduledTrigger-162-thread-2) [    ] o.a.s.c.a.NodeLostTrigger Running NodeLostTrigger: .auto_add_replicas with currently live nodes: 2
   [junit4]   2> 188593 DEBUG (ScheduledTrigger-162-thread-2) [    ] o.a.s.c.a.NodeLostTrigger Running NodeLostTrigger: node_lost_trigger with currently live nodes: 2
   [junit4]   2> 188614 DEBUG (ScheduledTrigger-162-thread-2) [    ] o.a.s.c.a.NodeLostTrigger Running NodeLostTrigger: .auto_add_replicas with currently live nodes: 2
   [junit4]   2> 188614 DEBUG (ScheduledTrigger-162-thread-2) [    ] o.a.s.c.a.NodeLostTrigger Running NodeLostTrigger: node_lost_trigger with currently live nodes: 2
   [junit4]   2> 188634 DEBUG (ScheduledTrigger-162-thread-2) [    ] o.a.s.c.a.NodeLostTrigger Running NodeLostTrigger: .auto_add_replicas with currently live nodes: 2
   [junit4]   2> 188634 DEBUG (ScheduledTrigger-162-thread-2) [    ] o.a.s.c.a.NodeLostTrigger Running NodeLostTrigger: node_lost_trigger with currently live nodes: 2
   [junit4]   2> 188654 DEBUG (ScheduledTrigger-162-thread-2) [    ] o.a.s.c.a.NodeLostTrigger Running NodeLostTrigger: .auto_add_replicas with currently live nodes: 2
   [junit4]   2> 188654 DEBUG (ScheduledTrigger-162-thread-2) [    ] o.a.s.c.a.NodeLostTrigger Running NodeLostTrigger: node_lost_trigger with currently live nodes: 2
   [junit4]   2> 188676 DEBUG (ScheduledTrigger-162-thread-2) [    ] o.a.s.c.a.NodeLostTrigger Running NodeLostTrigger: .auto_add_replicas with currently live nodes: 2
   [junit4]   2> 188676 DEBUG (ScheduledTrigger-162-thread-2) [    ] o.a.s.c.a.NodeLostTrigger Running NodeLostTrigger: node_lost_trigger with currently live nodes: 2
   [junit4]   2> 188703 DEBUG (ScheduledTrigger-162-thread-2) [    ] o.a.s.c.a.NodeLostTrigger Running NodeLostTrigger: .auto_add_replicas with currently live nodes: 2
   [junit4]   2> 188703 DEBUG (ScheduledTrigger-162-thread-2) [    ] o.a.s.c.a.NodeLostTrigger Running NodeLostTrigger: node_lost_trigger with currently live nodes: 2
   [junit4]   2> 188723 DEBUG (ScheduledTrigger-162-thread-2) [    ] o.a.s.c.a.NodeLostTrigger Running NodeLostTrigger: .auto_add_replicas with currently live nodes: 2
   [junit4]   2> 188723 DEBUG (ScheduledTrigger-162-thread-2) [    ] o.a.s.c.a.NodeLostTrigger Running NodeLostTrigger: node_lost_trigger with currently live nodes: 2
   [junit4]   2> 188744 DEBUG (ScheduledTrigger-162-thread-2) [    ] o.a.s.c.a.NodeLostTrigger Running NodeLostTrigger: .auto_add_replicas with currently live nodes: 2
   [junit4]   2> 188744 DEBUG (ScheduledTrigger-162-thread-2) [    ] o.a.s.c.a.NodeLostTrigger Running NodeLostTrigger: node_lost_trigger with currently live nodes: 2
   [junit4]   2> 188776 DEBUG (ScheduledTrigger-162-thread-2) [    ] o.a.s.c.a.NodeLostTrigger Running NodeLostTrigger: .auto_add_replicas with currently live nodes: 2
   [junit4]   2> 188776 DEBUG (ScheduledTrigger-162-thread-2) [    ] o.a.s.c.a.NodeLostTrigger Running NodeLostTrigger: node_lost_trigger with currently live nodes: 2
   [junit4]   2> 188777 INFO  (TEST-TestSimComputePlanAction.testNodeLost-seed#[544EF372C32DE5AA]) [    ] o.a.s.c.a.s.TestSimComputePlanAction -------------_ FINAL STATE --------------
   [junit4]   2> 188777 INFO  (TEST-TestSimComputePlanAction.testNodeLost-seed#[544EF372C32DE5AA]) [    ] o.a.s.c.a.s.TestSimComputePlanAction * Node values: {
   [junit4]   2>   "127.0.0.1:10001_solr":{
   [junit4]   2>     "sysprop.java.vendor":"Oracle Corporation",
   [junit4]   2>     "cores":1,
   [junit4]   2>     "host":"127.0.0.1",
   [junit4]   2>     "freedisk":1023,
   [junit4]   2>     "sysprop.java.version":"1.8.0_172",
   [junit4]   2>     "ip_1":"127",
   [junit4]   2>     "ip_3":"0",
   [junit4]   2>     "ip_2":"0",
   [junit4]   2>     "ip_4":"1",
   [junit4]   2>     "node":"127.0.0.1:10001_solr",
   [junit4]   2>     "metrics:solr.jvm:buffers.direct.Count":0,
   [junit4]   2>     "port":10001,
   [junit4]   2>     "heapUsage":123450000,
   [junit4]   2>     "sysLoadAvg":1.0,
   [junit4]   2>     "metrics:solr.node:ADMIN./admin/authorization.clientErrors:count":0},
   [junit4]   2>   "127.0.0.1:10000_solr":{
   [junit4]   2>     "sysprop.java.vendor":"Oracle Corporation",
   [junit4]   2>     "cores":1,
   [junit4]   2>     "host":"127.0.0.1",
   [junit4]   2>     "freedisk":999,
   [junit4]   2>     "sysprop.java.version":"1.8.0_172",
   [junit4]   2>     "ip_1":"127",
   [junit4]   2>     "ip_3":"0",
   [junit4]   2>     "ip_2":"0",
   [junit4]   2>     "ip_4":"1",
   [junit4]   2>     "node":"127.0.0.1:10000_solr",
   [junit4]   2>     "metrics:solr.jvm:buffers.direct.Count":0,
   [junit4]   2>     "port":10000,
   [junit4]   2>     "heapUsage":123450000,
   [junit4]   2>     "sysLoadAvg":1.0,
   [junit4]   2>     "metrics:solr.node:ADMIN./admin/authorization.clientErrors:count":0}}
   [junit4]   2> 188777 INFO  (TEST-TestSimComputePlanAction.testNodeLost-seed#[544EF372C32DE5AA]) [    ] o.a.s.c.a.s.TestSimComputePlanAction * Live nodes: [127.0.0.1:10001_solr, 127.0.0.1:10000_solr]
   [junit4]   2> 188779 INFO  (TEST-TestSimComputePlanAction.testNodeLost-seed#[544EF372C32DE5AA]) [    ] o.a.s.c.a.s.TestSimComputePlanAction * Collection testNodeLost state: DocCollection(testNodeLost//clusterstate.json/4)={
   [junit4]   2>   "replicationFactor":"1",
   [junit4]   2>   "pullReplicas":"0",
   [junit4]   2>   "router":{"name":"compositeId"},
   [junit4]   2>   "maxShardsPerNode":"1",
   [junit4]   2>   "autoAddReplicas":"false",
   [junit4]   2>   "nrtReplicas":"2",
   [junit4]   2>   "tlogReplicas":"0",
   [junit4]   2>   "autoCreated":"true",
   [junit4]   2>   "shards":{"shard1":{
   [junit4]   2>       "replicas":{
   [junit4]   2>         "core_node1":{
   [junit4]   2>           "core":"testNodeLost_shard1_replica_n1",
   [junit4]   2>           "SEARCHER.searcher.maxDoc":0,
   [junit4]   2>           "SEARCHER.searcher.deletedDocs":0,
   [junit4]   2>           "INDEX.sizeInBytes":10240,
   [junit4]   2>           "node_name":"127.0.0.1:10001_solr",
   [junit4]   2>           "state":"active",
   [junit4]   2>           "type":"NRT",
   [junit4]   2>           "INDEX.sizeInGB":9.5367431640625E-6,
   [junit4]   2>           "SEARCHER.searcher.numDocs":0},
   [junit4]   2>         "core_node2":{
   [junit4]   2>           "core":"testNodeLost_shard1_replica_n2",
   [junit4]   2>           "SEARCHER.searcher.maxDoc":0,
   [junit4]   2>           "SEARCHER.searcher.deletedDocs":0,
   [junit4]   2>           "INDEX.sizeInBytes":10240,
   [junit4]   2>           "node_name":"127.0.0.1:10000_solr",
   [junit4]   2>           "state":"active",
   [junit4]   2>           "type":"NRT",
   [junit4]   2>           "INDEX.sizeInGB":9.5367431640625E-6,
   [junit4]   2>           "SEARCHER.searcher.numDocs":0}},
   [junit4]   2>       "range":"80000000-7fffffff",
   [junit4]   2>       "state":"active"}}}
   [junit4]   2> 188779 INFO  (TEST-TestSimComputePlanAction.testNodeLost-seed#[544EF372C32DE5AA]) [    ] o.a.s.SolrTestCaseJ4 ###Ending testNodeLost
   [junit4]   2> 188795 INFO  (TEST-TestSimComputePlanAction.testNodeLost-seed#[544EF372C32DE5AA]) [    ] o.a.s.c.a.s.SimSolrCloudTestCase #######################################
   [junit4]   2> ############ CLUSTER STATE ############
   [junit4]   2> #######################################
   [junit4]   2> ## Live nodes:		2
   [junit4]   2> ## Empty nodes:	0
   [junit4]   2> ## Dead nodes:		0
   [junit4]   2> ## Collections:	[testNodeLost]
   [junit4]   2> ## Max replicas per node:	1
   [junit4]   2> ## Min replicas per node:	1
   [junit4]   2> ## Total replicas:		2
   [junit4]   2> ## * testNodeLost		2
   [junit4]   2> ##		- active           2
   [junit4]   2> ######### Solr op counts ##########
   [junit4]   2> ##		- CREATE             1
   [junit4]   2> ##		- autoscaling        3
   [junit4]   2> ######### Autoscaling event counts ###########
   [junit4]   2> 
   [junit4]   2> 188796 DEBUG (ScheduledTrigger-162-thread-2) [    ] o.a.s.c.a.NodeLostTrigger Running NodeLostTrigger: .auto_add_replicas with currently live nodes: 2
   [junit4]   2> 188813 DEBUG (ScheduledTrigger-162-thread-1) [    ] o.a.s.c.a.NodeLostTrigger Running NodeLostTrigger: node_lost_trigger with currently live nodes: 2
   [junit4]   2> 188927 DEBUG (ScheduledTrigger-162-thread-2) [    ] o.a.s.c.a.NodeLostTrigger Running NodeLostTrigger: node_lost_trigger with currently live nodes: 2
   [junit4]   2> NOTE: reproduce with: ant test  -Dtestcase=TestSimComputePlanAction -Dtests.method=testNodeLost -Dtests.seed=544EF372C32DE5AA -Dtests.multiplier=2 -Dtests.slow=true -Dtests.locale=he-IL -Dtests.timezone=Etc/GMT+12 -Dtests.asserts=true -Dtests.file.encoding=ISO-8859-1
   [junit4] FAILURE 5.46s J1 | TestSimComputePlanAction.testNodeLost <<<
   [junit4]    > Throwable #1: java.lang.AssertionError: Timed out waiting for replicas of new collection to be active
   [junit4]    > Live Nodes: [127.0.0.1:10001_solr, 127.0.0.1:10000_solr]
   [junit4]    > Last available state: DocCollection(testNodeLost//clusterstate.json/4)={
   [junit4]    >   "replicationFactor":"1",
   [junit4]    >   "pullReplicas":"0",
   [junit4]    >   "router":{"name":"compositeId"},
   [junit4]    >   "maxShardsPerNode":"1",
   [junit4]    >   "autoAddReplicas":"false",
   [junit4]    >   "nrtReplicas":"2",
   [junit4]    >   "tlogReplicas":"0",
   [junit4]    >   "autoCreated":"true",
   [junit4]    >   "shards":{"shard1":{
   [junit4]    >       "replicas":{
   [junit4]    >         "core_node1":{
   [junit4]    >           "core":"testNodeLost_shard1_replica_n1",
   [junit4]    >           "SEARCHER.searcher.maxDoc":0,
   [junit4]    >           "SEARCHER.searcher.deletedDocs":0,
   [junit4]    >           "INDEX.sizeInBytes":10240,
   [junit4]    >           "node_name":"127.0.0.1:10001_solr",
   [junit4]    >           "state":"active",
   [junit4]    >           "type":"NRT",
   [junit4]    >           "INDEX.sizeInGB":9.5367431640625E-6,
   [junit4]    >           "SEARCHER.searcher.numDocs":0},
   [junit4]    >         "core_node2":{
   [junit4]    >           "core":"testNodeLost_shard1_replica_n2",
   [junit4]    >           "SEARCHER.searcher.maxDoc":0,
   [junit4]    >           "SEARCHER.searcher.deletedDocs":0,
   [junit4]    >           "INDEX.sizeInBytes":10240,
   [junit4]    >           "node_name":"127.0.0.1:10000_solr",
   [junit4]    >           "state":"active",
   [junit4]    >           "type":"NRT",
   [junit4]    >           "INDEX.sizeInGB":9.5367431640625E-6,
   [junit4]    >           "SEARCHER.searcher.numDocs":0}},
   [junit4]    >       "range":"80000000-7fffffff",
   [junit4]    >       "state":"active"}}}
   [junit4]    > 	at __randomizedtesting.SeedInfo.seed([544EF372C32DE5AA:EB5B3D8C40C7802C]:0)
   [junit4]    > 	at org.apache.solr.cloud.CloudTestUtils.waitForState(CloudTestUtils.java:70)
   [junit4]    > 	at org.apache.solr.cloud.autoscaling.sim.TestSimComputePlanAction.testNodeLost(TestSimComputePlanAction.java:148)
   [junit4]    > 	at java.lang.Thread.run(Thread.java:748)
   [junit4]    > Caused by: java.util.concurrent.TimeoutException: last state: DocCollection(testNodeLost//clusterstate.json/4)={
   [junit4]    >   "replicationFactor":"1",
   [junit4]    >   "pullReplicas":"0",
   [junit4]    >   "router":{"name":"compositeId"},
   [junit4]    >   "maxShardsPerNode":"1",
   [junit4]    >   "autoAddReplicas":"false",
   [junit4]    >   "nrtReplicas":"2",
   [junit4]    >   "tlogReplicas":"0",
   [junit4]    >   "autoCreated":"true",
   [junit4]    >   "shards":{"shard1":{
   [junit4]    >       "replicas":{
   [junit4]    >         "core_node1":{
   [junit4]    >           "core":"testNodeLost_shard1_replica_n1",
   [junit4]    >           "SEARCHER.searcher.maxDoc":0,
   [junit4]    >           "SEARCHER.searcher.deletedDocs":0,
   [junit4]    >           "INDEX.sizeInBytes":10240,
   [junit4]    >           "node_name":"127.0.0.1:10001_solr",
   [junit4]    >           "state":"active",
   [junit4]    >           "type":"NRT",
   [junit4]    >           "INDEX.sizeInGB":9.5367431640625E-6,
   [junit4]    >           "SEARCHER.searcher.numDocs":0},
   [junit4]    >         "core_node2":{
   [junit4]    >           "core":"testNodeLost_shard1_replica_n2",
   [junit4]    >           "SEARCHER.searcher.maxDoc":0,
   [junit4]    >           "SEARCHER.searcher.deletedDocs":0,
   [junit4]    >           "INDEX.sizeInBytes":10240,
   [junit4]    >           "node_name":"127.0.0.1:10000_solr",
   [junit4]    >           "state":"active",
   [junit4]    >           "type":"NRT",
   [junit4]    >           "INDEX.sizeInGB":9.5367431640625E-6,
   [junit4]    >           "SEARCHER.searcher.numDocs":0}},
   [junit4]    >       "range":"80000000-7fffffff",
   [junit4]    >       "state":"active"}}}
   [junit4]    > 	at org.apache.solr.cloud.CloudTestUtils.waitForState(CloudTestUtils.java:112)
   [junit4]    > 	at org.apache.solr.cloud.CloudTestUtils.waitForState(CloudTestUtils.java:64)
   [junit4]    > 	... 40 more
   [junit4]   2> 188948 DEBUG (ScheduledTrigger-162-thread-1) [    ] o.a.s.c.a.NodeLostTrigger Running NodeLostTrigger: .auto_add_replicas with currently live nodes: 2
   [junit4]   2> 188948 DEBUG (ScheduledTrigger-162-thread-3) [    ] o.a.s.c.a.NodeLostTrigger Running NodeLostTrigger: node_lost_trigger with currently live nodes: 2
   [junit4]   2> 188950 INFO  (TEST-TestSimComputePlanAction.testNodeWithMultipleReplicasLost-seed#[544EF372C32DE5AA]) [    ] o.a.s.SolrTestCaseJ4 ###Starting testNodeWithMultipleReplicasLost
   [junit4]   2> 188950 DEBUG (TEST-TestSimComputePlanAction.testNodeWithMultipleReplicasLost-seed#[544EF372C32DE5AA]) [    ] o.a.s.c.a.OverseerTriggerThread Refreshing /autoscaling.json with znode version 6
   [junit4]   2> 188950 DEBUG (TEST-TestSimComputePlanAction.testNodeWithMultipleReplicasLost-seed#[544EF372C32DE5AA]) [    ] o.a.s.c.a.s.SimNodeStateProvider --removing value for 127.0.0.1:10001_solr
   [junit4]   2> 188951 INFO  (TEST-TestSimComputePlanAction.testNodeWithMultipleReplicasLost-seed#[544EF372C32DE5AA]) [    ] o.a.s.c.a.s.SimCloudManager === Restarting OverseerTriggerThread and clearing object cache...
   [junit4]   2> 188951 WARN  (Simulated OverseerAutoScalingTriggerThread) [    ] o.a.s.c.a.OverseerTriggerThread OverseerTriggerThread woken up but we are closed, exiting.
   [junit4]   2> 188959 DEBUG (TEST-TestSimComputePlanAction.testNodeWithMultipleReplicasLost-seed#[544EF372C32DE5AA]) [    ] o.a.s.c.a.ScheduledTriggers Shutting down scheduled thread pool executor now
   [junit4]   2> 188959 DEBUG (TEST-TestSimComputePlanAction.testNodeWithMultipleReplicasLost-seed#[544EF372C32DE5AA]) [    ] o.a.s.c.a.ScheduledTriggers Shutting down action executor now
   [junit4]   2> 188959 DEBUG (TEST-TestSimComputePlanAction.testNodeWithMultipleReplicasLost-seed#[544EF372C32DE5AA]) [    ] o.a.s.c.a.ScheduledTriggers Awaiting termination for action executor
   [junit4]   2> 188959 DEBUG (TEST-TestSimComputePlanAction.testNodeWithMultipleReplicasLost-seed#[544EF372C32DE5AA]) [    ] o.a.s.c.a.ScheduledTriggers Awaiting termination for scheduled thread pool executor
   [junit4]   2> 188960 DEBUG (TEST-TestSimComputePlanAction.testNodeWithMultipleReplicasLost-seed#[544EF372C32DE5AA]) [    ] o.a.s.c.a.ScheduledTriggers ScheduledTriggers closed completely
   [junit4]   2> 188960 DEBUG (TEST-TestSimComputePlanAction.testNodeWithMultipleReplicasLost-seed#[544EF372C32DE5AA]) [    ] o.a.s.c.a.OverseerTriggerThread OverseerTriggerThread has been closed explicitly
   [junit4]   2> 188984 DEBUG (Simulated OverseerAutoScalingTriggerThread) [    ] o.a.s.c.a.OverseerTriggerThread Adding .auto_add_replicas and .scheduled_maintenance triggers
   [junit4]   2> 188984 DEBUG (Simulated OverseerAutoScalingTriggerThread) [    ] o.a.s.c.a.OverseerTriggerThread Refreshing /autoscaling.json with znode version 7
   [junit4]   2> 188985 DEBUG (Simulated OverseerAutoScalingTriggerThread) [    ] o.a.s.c.a.OverseerTriggerThread Current znodeVersion 7, lastZnodeVersion -1
   [junit4]   2> 188985 DEBUG (Simulated OverseerAutoScalingTriggerThread) [    ] o.a.s.c.a.OverseerTriggerThread Processed trigger updates upto znodeVersion 7
   [junit4]   2> 189020 DEBUG (Simulated OverseerAutoScalingTriggerThread) [    ] o.a.s.c.a.NodeLostTrigger NodeLostTrigger .auto_add_replicas - Initial livenodes: [127.0.0.1:10000_solr]
   [junit4]   2> 189033 DEBUG (Simulated OverseerAutoScalingTriggerThread) [    ] o.a.s.c.a.OverseerTriggerThread -- clean old nodeAdded markers
   [junit4]   2> 189033 DEBUG (Simulated OverseerAutoScalingTriggerThread) [    ] o.a.s.c.a.OverseerTriggerThread Current znodeVersion 7, lastZnodeVersion 7
   [junit4]   2> 189033 DEBUG (ScheduledTrigger-165-thread-1) [    ] o.a.s.c.a.NodeLostTrigger Running NodeLostTrigger: .auto_add_replicas with currently live nodes: 1
   [junit4]   2> 189056 DEBUG (ScheduledTrigger-165-thread-1) [    ] o.a.s.c.a.NodeLostTrigger Running NodeLostTrigger: .auto_add_replicas with currently live nodes: 1
   [junit4]   2> 189139 DEBUG (ScheduledTrigger-165-thread-4) [    ] o.a.s.c.a.NodeLostTrigger Running NodeLostTrigger: .auto_add_replicas with currently live nodes: 1
   [junit4]   2> 189140 DEBUG (simCloudManagerPool-164-thread-1) [    ] o.a.s.c.a.AutoScalingHandler Verified autoscaling configuration
   [junit4]   2> 189140 DEBUG (simCloudManagerPool-164-thread-1) [    ] o.a.s.c.a.OverseerTriggerThread Refreshing /autoscaling.json with znode version 8
   [junit4]   2> 189143 DEBUG (Simulated OverseerAutoScalingTriggerThread) [    ] o.a.s.c.a.OverseerTriggerThread Processed trigger updates upto znodeVersion 8
   [junit4]   2> 189143 DEBUG (Simulated OverseerAutoScalingTriggerThread) [    ] o.a.s.c.a.OverseerTriggerThread -- clean old nodeAdded markers
   [junit4]   2> 189143 DEBUG (Simulated OverseerAutoScalingTriggerThread) [    ] o.a.s.c.a.OverseerTriggerThread Current znodeVersion 8, lastZnodeVersion 8
   [junit4]   2> 189164 DEBUG (simCloudManagerPool-164-thread-2) [    ] o.a.s.c.a.AutoScalingHandler Verified autoscaling configuration
   [junit4]   2> 189164 DEBUG (simCloudManagerPool-164-thread-2) [    ] o.a.s.c.a.OverseerTriggerThread Refreshing /autoscaling.json with znode version 9
   [junit4]   2> 189164 DEBUG (Simulated OverseerAutoScalingTriggerThread) [    ] o.a.s.c.a.OverseerTriggerThread Processed trigger updates upto znodeVersion 9
   [junit4]   2> 189165 DEBUG (Simulated OverseerAutoScalingTriggerThread) [    ] o.a.s.c.a.OverseerTriggerThread -- clean old nodeAdded markers
   [junit4]   2> 189165 DEBUG (Simulated OverseerAutoScalingTriggerThread) [    ] o.a.s.c.a.OverseerTriggerThread Current znodeVersion 9, lastZnodeVersion 9
   [junit4]   2> 189175 DEBUG (ScheduledTrigger-165-thread-2) [    ] o.a.s.c.a.NodeLostTrigger Running NodeLostTrigger: .auto_add_replicas with currently live nodes: 1
   [junit4]   2> 189227 DEBUG (ScheduledTrigger-165-thread-4) [    ] o.a.s.c.a.NodeLostTrigger Running NodeLostTrigger: .auto_add_replicas with currently live nodes: 1
   [junit4]   2> 189248 DEBUG (ScheduledTrigger-165-thread-2) [    ] o.a.s.c.a.NodeLostTrigger Running NodeLostTrigger: .auto_add_replicas with currently live nodes: 1
   [junit4]   2> 189280 DEBUG (ScheduledTrigger-165-thread-2) [    ] o.a.s.c.a.NodeLostTrigger Running NodeLostTrigger: .auto_add_replicas with currently live nodes: 1
   [junit4]   2> 189303 DEBUG (ScheduledTrigger-165-thread-2) [    ] o.a.s.c.a.NodeLostTrigger Running NodeLostTrigger: .auto_add_replicas with currently live nodes: 4
   [junit4]   2> 189329 DEBUG (ScheduledTrigger-165-thread-2) [    ] o.a.s.c.a.NodeLostTrigger Running NodeLostTrigger: .auto_add_replicas with currently live nodes: 4
   [junit4]   2> 189396 DEBUG (ScheduledTrigger-165-thread-4) [    ] o.a.s.c.a.NodeLostTrigger Running NodeLostTrigger: .auto_add_replicas with currently live nodes: 4
   [junit4]   2> 189399 DEBUG (simCloudManagerPool-164-thread-3) [    ] o.a.s.c.a.AutoScalingHandler Verified autoscaling configuration
   [junit4]   2> 189399 DEBUG (simCloudManagerPool-164-thread-3) [    ] o.a.s.c.a.OverseerTriggerThread Refreshing /autoscaling.json with znode version 10
   [junit4]   2> 189400 DEBUG (Simulated OverseerAutoScalingTriggerThread) [    ] o.a.s.c.a.OverseerTriggerThread Processed trigger updates upto znodeVersion 10
   [junit4]   2> 189401 DEBUG (Simulated OverseerAutoScalingTriggerThread) [    ] o.a.s.c.a.NodeLostTrigger NodeLostTrigger node_lost_trigger - Initial livenodes: [127.0.0.1:10004_solr, 127.0.0.1:10000_solr, 127.0.0.1:10002_solr, 127.0.0.1:10003_solr]
   [junit4]   2> 189401 DEBUG (Simulated OverseerAutoScalingTriggerThread) [    ] o.a.s.c.a.OverseerTriggerThread -- clean old nodeAdded markers
   [junit4]   2> 189401 DEBUG (Simulated OverseerAutoScalingTriggerThread) [    ] o.a.s.c.a.OverseerTriggerThread Current znodeVersion 10, lastZnodeVersion 10
   [junit4]   2> 189401 DEBUG (ScheduledTrigger-165-thread-3) [    ] o.a.s.c.a.NodeLostTrigger Running NodeLostTrigger: node_lost_trigger with currently live nodes: 4
   [junit4]   2> 189411 DEBUG (simCloudManagerPool-164-thread-4) [    ] o.a.s.c.o.ClusterStateMutator building a new cName: testNodeWithMultipleReplicasLost
   [junit4]   2> 189416 DEBUG (ScheduledTrigger-165-thread-3) [    ] o.a.s.c.a.NodeLostTrigger Running NodeLostTrigger: .auto_add_replicas with currently live nodes: 4
   [junit4]   2> 189422 DEBUG (simCloudManagerPool-164-thread-4) [    ] o.a.s.c.s.c.a.PolicyHelper Creating a new session
   [junit4]   2> 189422 DEBUG (simCloudManagerPool-164-thread-4) [    ] o.a.s.c.s.c.a.PolicyHelper New session created 
   [junit4]   2> 189435 DEBUG (ScheduledTrigger-165-thread-3) [    ] o.a.s.c.a.NodeLostTrigger Running NodeLostTrigger: node_lost_trigger with currently live nodes: 4
   [junit4]   2> 189437 DEBUG (ScheduledTrigger-165-thread-3) [    ] o.a.s.c.a.NodeLostTrigger Running NodeLostTrigger: .auto_add_replicas with currently live nodes: 4
   [junit4]   2> 189472 DEBUG (ScheduledTrigger-165-thread-4) [    ] o.a.s.c.a.NodeLostTrigger Running NodeLostTrigger: .auto_add_replicas with currently live nodes: 4
   [junit4]   2> 189472 DEBUG (ScheduledTrigger-165-thread-3) [    ] o.a.s.c.a.NodeLostTrigger Running NodeLostTrigger: node_lost_trigger with currently live nodes: 4
   [junit4]   2> 189480 INFO  (simCloudManagerPool-164-thread-4) [    ] o.a.s.c.s.c.a.PolicyHelper returnSession, curr-time 18374798283 sessionWrapper.createTime 18374795375767092, this.sessionWrapper.createTime 18374795375767092 
   [junit4]   2> 189480 DEBUG (simCloudManagerPool-164-thread-4) [    ] o.a.s.c.s.c.a.PolicyHelper session set to NULL
   [junit4]   2> 189517 DEBUG (simCloudManagerPool-164-thread-5) [    ] o.a.s.c.a.s.SimClusterStateProvider -- submit leader election for testNodeWithMultipleReplicasLost / shard1
   [junit4]   2> 189517 DEBUG (simCloudManagerPool-164-thread-10) [    ] o.a.s.c.a.s.SimClusterStateProvider Running leader election for testNodeWithMultipleReplicasLost / shard1
   [junit4]   2> 189590 DEBUG (simCloudManagerPool-164-thread-6) [    ] o.a.s.c.a.s.SimClusterStateProvider -- no replicas in testNodeWithMultipleReplicasLost / shard2
   [junit4]   2> 189590 DEBUG (simCloudManagerPool-164-thread-6) [    ] o.a.s.c.a.s.SimClusterStateProvider -- submit leader election for testNodeWithMultipleReplicasLost / shard1
   [junit4]   2> 189590 DEBUG (simCloudManagerPool-164-thread-10) [    ] o.a.s.c.a.s.SimClusterStateProvider -- elected new leader for testNodeWithMultipleReplicasLost / shard1: core_node1
   [junit4]   2> 189602 DEBUG (ScheduledTrigger-165-thread-4) [    ] o.a.s.c.a.NodeLostTrigger Running NodeLostTrigger: .auto_add_replicas with currently live nodes: 4
   [junit4]   2> 189603 DEBUG (ScheduledTrigger-165-thread-4) [    ] o.a.s.c.a.NodeLostTrigger Running NodeLostTrigger: node_lost_trigger with currently live nodes: 4
   [junit4]   2> 189612 DEBUG (simCloudManagerPool-164-thread-7) [    ] o.a.s.c.a.s.SimClusterStateProvider -- no replicas in testNodeWithMultipleReplicasLost / shard2
   [junit4]   2> 189612 DEBUG (simCloudManagerPool-164-thread-7) [    ] o.a.s.c.a.s.SimClusterStateProvider -- already has leader testNodeWithMultipleReplicasLost / shard1
   [junit4]   2> 189683 DEBUG (simCloudManagerPool-164-thread-12) [    ] o.a.s.c.a.s.SimClusterStateProvider Running leader election for testNodeWithMultipleReplicasLost / shard1
   [junit4]   2> 189692 DEBUG (simCloudManagerPool-164-thread-8) [    ] o.a.s.c.a.s.SimClusterStateProvider -- submit leader election for testNodeWithMultipleReplicasLost / shard2
   [junit4]   2> 189707 DEBUG (simCloudManagerPool-164-thread-8) [    ] o.a.s.c.a.s.SimClusterStateProvider -- already has leader testNodeWithMultipleReplicasLost / shard1
   [junit4]   2> 189707 DEBUG (simCloudManagerPool-164-thread-13) [    ] o.a.s.c.a.s.SimClusterStateProvider Running leader election for testNodeWithMultipleReplicasLost / shard2
   [junit4]   2> 189709 DEBUG (simCloudManagerPool-164-thread-13) [    ] o.a.s.c.a.s.SimClusterStateProvider -- elected new leader for testNodeWithMultipleReplicasLost / shard2: core_node4
   [junit4]   2> 189715 DEBUG (ScheduledTrigger-165-thread-2) [    ] o.a.s.c.a.NodeLostTrigger Running NodeLostTrigger: .auto_add_replicas with currently live nodes: 4
   [junit4]   2> 189715 DEBUG (ScheduledTrigger-165-thread-2) [    ] o.a.s.c.a.NodeLostTrigger Running NodeLostTrigger: node_lost_trigger with currently live nodes: 4
   [junit4]   2> 189707 DEBUG (simCloudManagerPool-164-thread-12) [    ] o.a.s.c.a.s.SimClusterStateProvider -- already has leader testNodeWithMultipleReplicasLost / shard1: shard1:{
   [junit4]   2>   "replicas":{
   [junit4]   2>     "core_node1":{
   [junit4]   2>       "core":"testNodeWithMultipleReplicasLost_shard1_replica_n1",
   [junit4]   2>       "SEARCHER.searcher.maxDoc":0,
   [junit4]   2>       "SEARCHER.searcher.deletedDocs":0,
   [junit4]   2>       "INDEX.sizeInBytes":10240,
   [junit4]   2>       "node_name":"127.0.0.1:10003_solr",
   [junit4]   2>       "state":"active",
   [junit4]   2>       "type":"NRT",
   [junit4]   2>       "INDEX.sizeInGB":9.5367431640625E-6,
   [junit4]   2>       "SEARCHER.searcher.numDocs":0},
   [junit4]   2>     "core_node2":{
   [junit4]   2>       "core":"testNodeWithMultipleReplicasLost_shard1_replica_n2",
   [junit4]   2>       "SEARCHER.searcher.maxDoc":0,
   [junit4]   2>       "SEARCHER.searcher.deletedDocs":0,
   [junit4]   2>       "INDEX.sizeInBytes":10240,
   [junit4]   2>       "node_name":"127.0.0.1:10002_solr",
   [junit4]   2>       "state":"active",
   [junit4]   2>       "type":"NRT",
   [junit4]   2>       "INDEX.sizeInGB":9.5367431640625E-6,
   [junit4]   2>       "SEARCHER.searcher.numDocs":0}},
   [junit4]   2>   "range":"80000000-ffffffff",
   [junit4]   2>   "state":"active"}
   [junit4]   2> 189724 DEBUG (simCloudManagerPool-164-thread-9) [    ] o.a.s.c.a.s.SimClusterStateProvider -- already has leader testNodeWithMultipleReplicasLost / shard2
   [junit4]   2> 189724 DEBUG (simCloudManagerPool-164-thread-9) [    ] o.a.s.c.a.s.SimClusterStateProvider -- already has leader testNodeWithMultipleReplicasLost / shard1
   [junit4]   2> 189781 DEBUG (ScheduledTrigger-165-thread-1) [    ] o.a.s.c.a.NodeLostTrigger Running NodeLostTrigger: .auto_add_replicas with currently live nodes: 4
   [junit4]   2> 189781 DEBUG (ScheduledTrigger-165-thread-1) [    ] o.a.s.c.a.NodeLostTrigger Running NodeLostTrigger: node_lost_trigger with currently live nodes: 4
   [junit4]   2> 189801 DEBUG (simCloudManagerPool-164-thread-11) [    ] o.a.s.c.a.s.SimClusterStateProvider -- already has leader testNodeWithMultipleReplicasLost / shard2
   [junit4]   2> 189801 DEBUG (simCloudManagerPool-164-thread-11) [    ] o.a.s.c.a.s.SimClusterStateProvider -- already has leader testNodeWithMultipleReplicasLost / shard1
   [junit4]   2> 189801 DEBUG (ScheduledTrigger-165-thread-4) [    ] o.a.s.c.a.NodeLostTrigger Running NodeLostTrigger: .auto_add_replicas with currently live nodes: 4
   [junit4]   2> 189801 DEBUG (ScheduledTrigger-165-thread-4) [    ] o.a.s.c.a.NodeLostTrigger Running NodeLostTrigger: node_lost_trigger with currently live nodes: 4
   [junit4]   2> 189802 DEBUG (TEST-TestSimComputePlanAction.testNodeWithMultipleReplicasLost-seed#[544EF372C32DE5AA]) [    ] o.a.s.c.a.s.TestSimComputePlanAction -- cluster state: znodeVersion: 14
   [junit4]   2> live nodes:[127.0.0.1:10004_solr, 127.0.0.1:10000_solr, 127.0.0.1:10002_solr, 127.0.0.1:10003_solr]
   [junit4]   2> collections:{testNodeWithMultipleReplicasLost=DocCollection(testNodeWithMultipleReplicasLost//clusterstate.json/13)={
   [junit4]   2>   "replicationFactor":"1",
   [junit4]   2>   "pullReplicas":"0",
   [junit4]   2>   "router":{"name":"compositeId"},
   [junit4]   2>   "maxShardsPerNode":"1",
   [junit4]   2>   "autoAddReplicas":"false",
   [junit4]   2>   "nrtReplicas":"3",
   [junit4]   2>   "tlogReplicas":"0",
   [junit4]   2>   "autoCreated":"true",
   [junit4]   2>   "shards":{
   [junit4]   2>     "shard2":{
   [junit4]   2>       "replicas":{
   [junit4]   2>         "core_node6":{
   [junit4]   2>           "core":"testNodeWithMultipleReplicasLost_shard2_replica_n6",
   [junit4]   2>           "SEARCHER.searcher.maxDoc":0,
   [junit4]   2>           "SEARCHER.searcher.deletedDocs":0,
   [junit4]   2>           "INDEX.sizeInBytes":10240,
   [junit4]   2>           "node_name":"127.0.0.1:10002_solr",
   [junit4]   2>           "state":"active",
   [junit4]   2>           "type":"NRT",
   [junit4]   2>           "INDEX.sizeInGB":9.5367431640625E-6,
   [junit4]   2>           "SEARCHER.searcher.numDocs":0},
   [junit4]   2>         "core_node4":{
   [junit4]   2>           "core":"testNodeWithMultipleReplicasLost_shard2_replica_n4",
   [junit4]   2>           "leader":"true",
   [junit4]   2>           "SEARCHER.searcher.maxDoc":0,
   [junit4]   2>           "SEARCHER.searcher.deletedDocs":0,
   [junit4]   2>           "INDEX.sizeInBytes":10240,
   [junit4]   2>           "node_name":"127.0.0.1:10000_solr",
   [junit4]   2>           "state":"active",
   [junit4]   2>           "type":"NRT",
   [junit4]   2>           "INDEX.sizeInGB":9.5367431640625E-6,
   [junit4]   2>           "SEARCHER.searcher.numDocs":0},
   [junit4]   2>         "core_node5":{
   [junit4]   2>           "core":"testNodeWithMultipleReplicasLost_shard2_replica_n5",
   [junit4]   2>           "SEARCHER.searcher.maxDoc":0,
   [junit4]   2>           "SEARCHER.searcher.deletedDocs":0,
   [junit4]   2>           "INDEX.sizeInBytes":10240,
   [junit4]   2>           "node_name":"127.0.0.1:10004_solr",
   [junit4]   2>           "state":"active",
   [junit4]   2>           "type":"NRT",
   [junit4]   2>           "INDEX.sizeInGB":9.5367431640625E-6,
   [junit4]   2>           "SEARCHER.searcher.numDocs":0}},
   [junit4]   2>       "range":"0-7fffffff",
   [junit4]   2>       "state":"active"},
   [junit4]   2>     "shard1":{
   [junit4]   2>       "replicas":{
   [junit4]   2>         "core_node1":{
   [junit4]   2>           "core":"testNodeWithMultipleReplicasLost_shard1_replica_n1",
   [junit4]   2>           "leader":"true",
   [junit4]   2>           "SEARCHER.searcher.maxDoc":0,
   [junit4]   2>           "SEARCHER.searcher.deletedDocs":0,
   [junit4]   2>           "INDEX.sizeInBytes":10240,
   [junit4]   2>           "node_name":"127.0.0.1:10003_solr",
   [junit4]   2>           "state":"active",
   [junit4]   2>           "type":"NRT",
   [junit4]   2>           "INDEX.sizeInGB":9.5367431640625E-6,
   [junit4]   2>           "SEARCHER.searcher.numDocs":0},
   [junit4]   2>         "core_node2":{
   [junit4]   2>           "core":"testNodeWithMultipleReplicasLost_shard1_replica_n2",
   [junit4]   2>           "SEARCHER.searcher.maxDoc":0,
   [junit4]   2>           "SEARCHER.searcher.deletedDocs":0,
   [junit4]   2>           "INDEX.sizeInBytes":10240,
   [junit4]   2>           "node_name":"127.0.0.1:10002_solr",
   [junit4]   2>           "state":"active",
   [junit4]   2>           "type":"NRT",
   [junit4]   2>           "INDEX.sizeInGB":9.5367431640625E-6,
   [junit4]   2>           "SEARCHER.searcher.numDocs":0},
   [junit4]   2>         "core_node3":{
   [junit4]   2>           "core":"testNodeWithMultipleReplicasLost_shard1_replica_n3",
   [junit4]   2>           "SEARCHER.searcher.maxDoc":0,
   [junit4]   2>           "SEARCHER.searcher.deletedDocs":0,
   [junit4]   2>           "INDEX.sizeInBytes":10240,
   [junit4]   2>           "node_name":"127.0.0.1:10004_solr",
   [junit4]   2>           "state":"active",
   [junit4]   2>           "type":"NRT",
   [junit4]   2>           "INDEX.sizeInGB":9.5367431640625E-6,
   [junit4]   2>           "SEARCHER.searcher.numDocs":0}},
   [junit4]   2>       "range":"80000000-ffffffff",
   [junit4]   2>       "state":"active"}}}}
   [junit4]   2> 189805 DEBUG (TEST-TestSimComputePlanAction.testNodeWithMultipleReplicasLost-seed#[544EF372C32DE5AA]) [    ] o.a.s.c.a.s.SimClusterStateProvider -- already has leader testNodeWithMultipleReplicasLost / shard2
   [junit4]   2> 189805 DEBUG (TEST-TestSimComputePlanAction.testNodeWithMultipleReplicasLost-seed#[544EF372C32DE5AA]) [    ] o.a.s.c.a.s.SimClusterStateProvider -- already has leader testNodeWithMultipleReplicasLost / shard1
   [junit4]   2> 189829 DEBUG (ScheduledTrigger-165-thread-4) [    ] o.a.s.c.a.NodeLostTrigger Running NodeLostTrigger: .auto_add_replicas with currently live nodes: 3
   [junit4]   2> 189829 DEBUG (ScheduledTrigger-165-thread-4) [    ] o.a.s.c.a.NodeLostTrigger Tracking lost node: 127.0.0.1:10004_solr
   [junit4]   2> 189829 DEBUG (ScheduledTrigger-165-thread-2) [    ] o.a.s.c.a.NodeLostTrigger Running NodeLostTrigger: node_lost_trigger with currently live nodes: 3
   [junit4]   2> 189829 DEBUG (ScheduledTrigger-165-thread-2) [    ] o.a.s.c.a.NodeLostTrigger Tracking lost node: 127.0.0.1:10004_solr
   [junit4]   2> 189849 DEBUG (ScheduledTrigger-165-thread-2) [    ] o.a.s.c.a.NodeLostTrigger Running NodeLostTrigger: .auto_add_replicas with currently live nodes: 3
   [junit4]   2> 189849 DEBUG (ScheduledTrigger-165-thread-4) [    ] o.a.s.c.a.NodeLostTrigger Running NodeLostTrigger: node_lost_trigger with currently live nodes: 3
   [junit4]   2> 189849 DEBUG (ScheduledTrigger-165-thread-4) [    ] o.a.s.c.a.NodeLostTrigger NodeLostTrigger firing registered processor for lost nodes: [127.0.0.1:10004_solr]
   [junit4]   2> 189852 DEBUG (ScheduledTrigger-165-thread-4) [    ] o.a.s.c.a.ScheduledTriggers ++++++++ Cooldown inactive - processing event: {
   [junit4]   2>   "id":"4147cc2c43a60aTeub5kh0dqk30u7atl0vdbwhm9",
   [junit4]   2>   "source":"node_lost_trigger",
   [junit4]   2>   "eventTime":18374815727724042,
   [junit4]   2>   "eventType":"NODELOST",
   [junit4]   2>   "properties":{
   [junit4]   2>     "eventTimes":[18374815727724042],
   [junit4]   2>     "nodeNames":["127.0.0.1:10004_solr"]}}
   [junit4]   2> 189878 DEBUG (ScheduledTrigger-165-thread-4) [    ] o.a.s.c.a.ScheduledTriggers Pausing all triggers: [.auto_add_replicas, .scheduled_maintenance, node_lost_trigger]
   [junit4]   2> 189880 DEBUG (simCloudManagerPool-164-thread-14) [    ] o.a.s.c.o.ClusterStateMutator building a new cName: .system
   [junit4]   2> 189891 DEBUG (simCloudManagerPool-164-thread-14) [    ] o.a.s.c.s.c.a.PolicyHelper Creating a new session
   [junit4]   2> 189892 DEBUG (simCloudManagerPool-164-thread-14) [    ] o.a.s.c.s.c.a.PolicyHelper New session created 
   [junit4]   2> 189893 INFO  (simCloudManagerPool-164-thread-14) [    ] o.a.s.c.s.c.a.PolicyHelper returnSession, curr-time 18374818919 sessionWrapper.createTime 18374818869804942, this.sessionWrapper.createTime 18374818869804942 
   [junit4]   2> 189893 DEBUG (simCloudManagerPool-164-thread-14) [    ] o.a.s.c.s.c.a.PolicyHelper session set to NULL
   [junit4]   2> 189904 DEBUG (simCloudManagerPool-164-thread-15) [    ] o.a.s.c.a.s.SimClusterStateProvider -- submit leader election for .system / shard1
   [junit4]   2> 189904 DEBUG (simCloudManagerPool-164-thread-16) [    ] o.a.s.c.a.s.SimClusterStateProvider Running leader election for .system / shard1
   [junit4]   2> 189935 DEBUG (simCloudManagerPool-164-thread-16) [    ] o.a.s.c.a.s.SimClusterStateProvider -- elected new leader for .system / shard1: core_node1
   [junit4]   2> 189962 DEBUG (AutoscalingActionExecutor-166-thread-1) [    ] o.a.s.c.a.ScheduledTriggers -- processing actions for {
   [junit4]   2>   "id":"4147cc2c43a60aTeub5kh0dqk30u7atl0vdbwhm9",
   [junit4]   2>   "source":"node_lost_trigger",
   [junit4]   2>   "eventTime":18374815727724042,
   [junit4]   2>   "eventType":"NODELOST",
   [junit4]   2>   "properties":{
   [junit4]   2>     "eventTimes":[18374815727724042],
   [junit4]   2>     "_enqueue_time_":18374818170576342,
   [junit4]   2>     "nodeNames":["127.0.0.1:10004_solr"]}}
   [junit4]   2> 189963 DEBUG (AutoscalingActionExecutor-166-thread-1) [    ] o.a.s.c.a.ComputePlanAction -- processing event: {
   [junit4]   2>   "id":"4147cc2c43a60aTeub5kh0dqk30u7atl0vdbwhm9",
   [junit4]   2>   "source":"node_lost_trigger",
   [junit4]   2>   "eventTime":18374815727724042,
   [junit4]   2>   "eventType":"NODELOST",
   [junit4]   2>   "properties":{
   [junit4]   2>     "eventTimes":[18374815727724042],
   [junit4]   2>     "_enqueue_time_":18374818170576342,
   [junit4]   2>     "nodeNames":["127.0.0.1:10004_solr"]}} with context properties: {BEFORE_ACTION=[compute_plan]}
   [junit4]   2> 189963 DEBUG (AutoscalingActionExecutor-166-thread-1) [    ] o.a.s.c.s.c.a.PolicyHelper Creating a new session
   [junit4]   2> 189964 DEBUG (AutoscalingActionExecutor-166-thread-1) [    ] o.a.s.c.s.c.a.PolicyHelper New session created 
   [junit4]   2> 189996 INFO  (AutoscalingActionExecutor-166-thread-1) [    ] o.a.s.c.a.ComputePlanAction Computed Plan: action=MOVEREPLICA&collection=testNodeWithMultipleReplicasLost&targetNode=127.0.0.1:10003_solr&inPlaceMove=true&replica=core_node5
   [junit4]   2> 189997 INFO  (AutoscalingActionExecutor-166-thread-1) [    ] o.a.s.c.a.ComputePlanAction Computed Plan: action=MOVEREPLICA&collection=testNodeWithMultipleReplicasLost&targetNode=127.0.0.1:10000_solr&inPlaceMove=true&replica=core_node3
   [junit4]   2> 189998 INFO  (AutoscalingActionExecutor-166-thread-1) [    ] o.a.s.c.s.c.a.PolicyHelper returnSession, curr-time 18374824149 sessionWrapper.createTime 18374822483282842, this.sessionWrapper.createTime 18374822483282842 
   [junit4]   2> 189998 DEBUG (AutoscalingActionExecutor-166-thread-1) [    ] o.a.s.c.s.c.a.PolicyHelper session set to NULL
   [junit4]   2> 190000 INFO  (TEST-TestSimComputePlanAction.testNodeWithMultipleReplicasLost-seed#[544EF372C32DE5AA]) [    ] o.a.s.c.a.s.TestSimComputePlanAction action=MOVEREPLICA&collection=testNodeWithMultipleReplicasLost&targetNode=127.0.0.1:10003_solr&inPlaceMove=true&replica=core_node5
   [junit4]   2> 190000 INFO  (TEST-TestSimComputePlanAction.testNodeWithMultipleReplicasLost-seed#[544EF372C32DE5AA]) [    ] o.a.s.c.a.s.TestSimComputePlanAction action=MOVEREPLICA&collection=testNodeWithMultipleReplicasLost&targetNode=127.0.0.1:10000_solr&inPlaceMove=true&replica=core_node3
   [junit4]   2> 190001 INFO  (TE

[...truncated too long message...]

rty disallowed.ivy.jars.list as its length is 0.

-ivy-fail-disallowed-ivy-version:

ivy-fail:

ivy-fail:

ivy-configure:
[ivy:configure] :: loading settings :: file = /home/jenkins/jenkins-slave/workspace/Lucene-Solr-Tests-7.x/lucene/top-level-ivy-settings.xml

resolve:

ivy-availability-check:
[loadresource] Do not set property disallowed.ivy.jars.list as its length is 0.

-ivy-fail-disallowed-ivy-version:

ivy-fail:

ivy-configure:
[ivy:configure] :: loading settings :: file = /home/jenkins/jenkins-slave/workspace/Lucene-Solr-Tests-7.x/lucene/top-level-ivy-settings.xml

resolve:

ivy-availability-check:
[loadresource] Do not set property disallowed.ivy.jars.list as its length is 0.

-ivy-fail-disallowed-ivy-version:

ivy-fail:

ivy-fail:

ivy-configure:
[ivy:configure] :: loading settings :: file = /home/jenkins/jenkins-slave/workspace/Lucene-Solr-Tests-7.x/lucene/top-level-ivy-settings.xml

resolve:

ivy-availability-check:
[loadresource] Do not set property disallowed.ivy.jars.list as its length is 0.

-ivy-fail-disallowed-ivy-version:

ivy-fail:

ivy-configure:
[ivy:configure] :: loading settings :: file = /home/jenkins/jenkins-slave/workspace/Lucene-Solr-Tests-7.x/lucene/top-level-ivy-settings.xml

resolve:

ivy-availability-check:
[loadresource] Do not set property disallowed.ivy.jars.list as its length is 0.

-ivy-fail-disallowed-ivy-version:

ivy-fail:

ivy-fail:

ivy-configure:
[ivy:configure] :: loading settings :: file = /home/jenkins/jenkins-slave/workspace/Lucene-Solr-Tests-7.x/lucene/top-level-ivy-settings.xml

resolve:

ivy-availability-check:
[loadresource] Do not set property disallowed.ivy.jars.list as its length is 0.

-ivy-fail-disallowed-ivy-version:

ivy-fail:

ivy-fail:

ivy-configure:
[ivy:configure] :: loading settings :: file = /home/jenkins/jenkins-slave/workspace/Lucene-Solr-Tests-7.x/lucene/top-level-ivy-settings.xml

resolve:

ivy-availability-check:
[loadresource] Do not set property disallowed.ivy.jars.list as its length is 0.

-ivy-fail-disallowed-ivy-version:

ivy-fail:

ivy-fail:

ivy-configure:
[ivy:configure] :: loading settings :: file = /home/jenkins/jenkins-slave/workspace/Lucene-Solr-Tests-7.x/lucene/top-level-ivy-settings.xml

resolve:

ivy-availability-check:
[loadresource] Do not set property disallowed.ivy.jars.list as its length is 0.

-ivy-fail-disallowed-ivy-version:

ivy-fail:

ivy-fail:

ivy-configure:
[ivy:configure] :: loading settings :: file = /home/jenkins/jenkins-slave/workspace/Lucene-Solr-Tests-7.x/lucene/top-level-ivy-settings.xml

resolve:

ivy-availability-check:
[loadresource] Do not set property disallowed.ivy.jars.list as its length is 0.

-ivy-fail-disallowed-ivy-version:

ivy-fail:

ivy-fail:

ivy-configure:
[ivy:configure] :: loading settings :: file = /home/jenkins/jenkins-slave/workspace/Lucene-Solr-Tests-7.x/lucene/top-level-ivy-settings.xml

resolve:

ivy-availability-check:
[loadresource] Do not set property disallowed.ivy.jars.list as its length is 0.

-ivy-fail-disallowed-ivy-version:

ivy-fail:

ivy-fail:

ivy-configure:
[ivy:configure] :: loading settings :: file = /home/jenkins/jenkins-slave/workspace/Lucene-Solr-Tests-7.x/lucene/top-level-ivy-settings.xml

resolve:

ivy-availability-check:
[loadresource] Do not set property disallowed.ivy.jars.list as its length is 0.

-ivy-fail-disallowed-ivy-version:

ivy-fail:

ivy-fail:

ivy-configure:
[ivy:configure] :: loading settings :: file = /home/jenkins/jenkins-slave/workspace/Lucene-Solr-Tests-7.x/lucene/top-level-ivy-settings.xml

resolve:

ivy-availability-check:
[loadresource] Do not set property disallowed.ivy.jars.list as its length is 0.

-ivy-fail-disallowed-ivy-version:

ivy-fail:

ivy-fail:

ivy-configure:
[ivy:configure] :: loading settings :: file = /home/jenkins/jenkins-slave/workspace/Lucene-Solr-Tests-7.x/lucene/top-level-ivy-settings.xml

resolve:

ivy-availability-check:
[loadresource] Do not set property disallowed.ivy.jars.list as its length is 0.

-ivy-fail-disallowed-ivy-version:

ivy-fail:

ivy-fail:

ivy-configure:
[ivy:configure] :: loading settings :: file = /home/jenkins/jenkins-slave/workspace/Lucene-Solr-Tests-7.x/lucene/top-level-ivy-settings.xml

resolve:

ivy-availability-check:
[loadresource] Do not set property disallowed.ivy.jars.list as its length is 0.

-ivy-fail-disallowed-ivy-version:

ivy-fail:

ivy-fail:

ivy-configure:
[ivy:configure] :: loading settings :: file = /home/jenkins/jenkins-slave/workspace/Lucene-Solr-Tests-7.x/lucene/top-level-ivy-settings.xml

resolve:

jar-checksums:
    [mkdir] Created dir: /home/jenkins/jenkins-slave/workspace/Lucene-Solr-Tests-7.x/solr/null1866353118
     [copy] Copying 239 files to /home/jenkins/jenkins-slave/workspace/Lucene-Solr-Tests-7.x/solr/null1866353118
   [delete] Deleting directory /home/jenkins/jenkins-slave/workspace/Lucene-Solr-Tests-7.x/solr/null1866353118

check-working-copy:
[ivy:cachepath] :: resolving dependencies :: org.eclipse.jgit#org.eclipse.jgit-caller;working
[ivy:cachepath] 	confs: [default]
[ivy:cachepath] 	found org.eclipse.jgit#org.eclipse.jgit;4.6.0.201612231935-r in public
[ivy:cachepath] 	found com.jcraft#jsch;0.1.53 in public
[ivy:cachepath] 	found com.googlecode.javaewah#JavaEWAH;1.1.6 in public
[ivy:cachepath] 	found org.apache.httpcomponents#httpclient;4.3.6 in public
[ivy:cachepath] 	found org.apache.httpcomponents#httpcore;4.3.3 in public
[ivy:cachepath] 	found commons-logging#commons-logging;1.1.3 in public
[ivy:cachepath] 	found commons-codec#commons-codec;1.6 in public
[ivy:cachepath] 	found org.slf4j#slf4j-api;1.7.2 in public
[ivy:cachepath] :: resolution report :: resolve 56ms :: artifacts dl 1ms
	---------------------------------------------------------------------
	|                  |            modules            ||   artifacts   |
	|       conf       | number| search|dwnlded|evicted|| number|dwnlded|
	---------------------------------------------------------------------
	|      default     |   8   |   0   |   0   |   0   ||   8   |   0   |
	---------------------------------------------------------------------
[wc-checker] Initializing working copy...
[wc-checker] SLF4J: Failed to load class "org.slf4j.impl.StaticLoggerBinder".
[wc-checker] SLF4J: Defaulting to no-operation (NOP) logger implementation
[wc-checker] SLF4J: See http://www.slf4j.org/codes.html#StaticLoggerBinder for further details.
[wc-checker] Checking working copy status...

-jenkins-base:

BUILD SUCCESSFUL
Total time: 214 minutes 57 seconds
Archiving artifacts
java.lang.InterruptedException: no matches found within 10000
	at hudson.FilePath$34.hasMatch(FilePath.java:2678)
	at hudson.FilePath$34.invoke(FilePath.java:2557)
	at hudson.FilePath$34.invoke(FilePath.java:2547)
	at hudson.FilePath$FileCallableWrapper.call(FilePath.java:2918)
Also:   hudson.remoting.Channel$CallSiteStackTrace: Remote call to lucene2
		at hudson.remoting.Channel.attachCallSiteStackTrace(Channel.java:1741)
		at hudson.remoting.UserRequest$ExceptionResponse.retrieve(UserRequest.java:357)
		at hudson.remoting.Channel.call(Channel.java:955)
		at hudson.FilePath.act(FilePath.java:1036)
		at hudson.FilePath.act(FilePath.java:1025)
		at hudson.FilePath.validateAntFileMask(FilePath.java:2547)
		at hudson.tasks.ArtifactArchiver.perform(ArtifactArchiver.java:243)
		at hudson.tasks.BuildStepCompatibilityLayer.perform(BuildStepCompatibilityLayer.java:81)
		at hudson.tasks.BuildStepMonitor$1.perform(BuildStepMonitor.java:20)
		at hudson.model.AbstractBuild$AbstractBuildExecution.perform(AbstractBuild.java:744)
		at hudson.model.AbstractBuild$AbstractBuildExecution.performAllBuildSteps(AbstractBuild.java:690)
		at hudson.model.Build$BuildExecution.post2(Build.java:186)
		at hudson.model.AbstractBuild$AbstractBuildExecution.post(AbstractBuild.java:635)
		at hudson.model.Run.execute(Run.java:1819)
		at hudson.model.FreeStyleBuild.run(FreeStyleBuild.java:43)
		at hudson.model.ResourceController.execute(ResourceController.java:97)
		at hudson.model.Executor.run(Executor.java:429)
Caused: hudson.FilePath$TunneledInterruptedException
	at hudson.FilePath$FileCallableWrapper.call(FilePath.java:2920)
	at hudson.remoting.UserRequest.perform(UserRequest.java:212)
	at hudson.remoting.UserRequest.perform(UserRequest.java:54)
	at hudson.remoting.Request$2.run(Request.java:369)
	at hudson.remoting.InterceptingExecutorService$1.call(InterceptingExecutorService.java:72)
	at java.util.concurrent.FutureTask.run(FutureTask.java:266)
	at java.util.concurrent.ThreadPoolExecutor.runWorker(ThreadPoolExecutor.java:1142)
	at java.util.concurrent.ThreadPoolExecutor$Worker.run(ThreadPoolExecutor.java:617)
	at java.lang.Thread.run(Thread.java:748)
Caused: java.lang.InterruptedException: java.lang.InterruptedException: no matches found within 10000
	at hudson.FilePath.act(FilePath.java:1038)
	at hudson.FilePath.act(FilePath.java:1025)
	at hudson.FilePath.validateAntFileMask(FilePath.java:2547)
	at hudson.tasks.ArtifactArchiver.perform(ArtifactArchiver.java:243)
	at hudson.tasks.BuildStepCompatibilityLayer.perform(BuildStepCompatibilityLayer.java:81)
	at hudson.tasks.BuildStepMonitor$1.perform(BuildStepMonitor.java:20)
	at hudson.model.AbstractBuild$AbstractBuildExecution.perform(AbstractBuild.java:744)
	at hudson.model.AbstractBuild$AbstractBuildExecution.performAllBuildSteps(AbstractBuild.java:690)
	at hudson.model.Build$BuildExecution.post2(Build.java:186)
	at hudson.model.AbstractBuild$AbstractBuildExecution.post(AbstractBuild.java:635)
	at hudson.model.Run.execute(Run.java:1819)
	at hudson.model.FreeStyleBuild.run(FreeStyleBuild.java:43)
	at hudson.model.ResourceController.execute(ResourceController.java:97)
	at hudson.model.Executor.run(Executor.java:429)
No artifacts found that match the file pattern "**/*.events,heapdumps/**,**/hs_err_pid*". Configuration error?
Recording test results
Build step 'Publish JUnit test result report' changed build result to UNSTABLE
Email was triggered for: Unstable (Test Failures)
Sending email for trigger: Unstable (Test Failures)

Mime
View raw message