lucene-dev mailing list archives

Site index · List index
Message view « Date » · « Thread »
Top « Date » · « Thread »
From Policeman Jenkins Server <jenk...@thetaphi.de>
Subject [JENKINS] Lucene-Solr-master-Linux (64bit/jdk1.8.0_172) - Build # 22854 - Still Unstable!
Date Fri, 14 Sep 2018 02:15:05 GMT
Build: https://jenkins.thetaphi.de/job/Lucene-Solr-master-Linux/22854/
Java: 64bit/jdk1.8.0_172 -XX:+UseCompressedOops -XX:+UseSerialGC

1 tests failed.
FAILED:  org.apache.solr.cloud.autoscaling.NodeLostTriggerTest.testTrigger

Error Message:
[127.0.0.1:41477_solr] doesn't contain 127.0.0.1:41345_solr

Stack Trace:
java.lang.AssertionError: [127.0.0.1:41477_solr] doesn't contain 127.0.0.1:41345_solr
	at __randomizedtesting.SeedInfo.seed([39F6F71B76BC849D:5A3DC199EF73F7B0]:0)
	at org.junit.Assert.fail(Assert.java:93)
	at org.junit.Assert.assertTrue(Assert.java:43)
	at org.apache.solr.cloud.autoscaling.NodeLostTriggerTest.testTrigger(NodeLostTriggerTest.java:117)
	at sun.reflect.NativeMethodAccessorImpl.invoke0(Native Method)
	at sun.reflect.NativeMethodAccessorImpl.invoke(NativeMethodAccessorImpl.java:62)
	at sun.reflect.DelegatingMethodAccessorImpl.invoke(DelegatingMethodAccessorImpl.java:43)
	at java.lang.reflect.Method.invoke(Method.java:498)
	at com.carrotsearch.randomizedtesting.RandomizedRunner.invoke(RandomizedRunner.java:1742)
	at com.carrotsearch.randomizedtesting.RandomizedRunner$8.evaluate(RandomizedRunner.java:935)
	at com.carrotsearch.randomizedtesting.RandomizedRunner$9.evaluate(RandomizedRunner.java:971)
	at com.carrotsearch.randomizedtesting.RandomizedRunner$10.evaluate(RandomizedRunner.java:985)
	at com.carrotsearch.randomizedtesting.rules.SystemPropertiesRestoreRule$1.evaluate(SystemPropertiesRestoreRule.java:57)
	at org.apache.lucene.util.TestRuleSetupTeardownChained$1.evaluate(TestRuleSetupTeardownChained.java:49)
	at org.apache.lucene.util.AbstractBeforeAfterRule$1.evaluate(AbstractBeforeAfterRule.java:45)
	at org.apache.lucene.util.TestRuleThreadAndTestName$1.evaluate(TestRuleThreadAndTestName.java:48)
	at org.apache.lucene.util.TestRuleIgnoreAfterMaxFailures$1.evaluate(TestRuleIgnoreAfterMaxFailures.java:64)
	at org.apache.lucene.util.TestRuleMarkFailure$1.evaluate(TestRuleMarkFailure.java:47)
	at com.carrotsearch.randomizedtesting.rules.StatementAdapter.evaluate(StatementAdapter.java:36)
	at com.carrotsearch.randomizedtesting.ThreadLeakControl$StatementRunner.run(ThreadLeakControl.java:368)
	at com.carrotsearch.randomizedtesting.ThreadLeakControl.forkTimeoutingTask(ThreadLeakControl.java:817)
	at com.carrotsearch.randomizedtesting.ThreadLeakControl$3.evaluate(ThreadLeakControl.java:468)
	at com.carrotsearch.randomizedtesting.RandomizedRunner.runSingleTest(RandomizedRunner.java:944)
	at com.carrotsearch.randomizedtesting.RandomizedRunner$5.evaluate(RandomizedRunner.java:830)
	at com.carrotsearch.randomizedtesting.RandomizedRunner$6.evaluate(RandomizedRunner.java:880)
	at com.carrotsearch.randomizedtesting.RandomizedRunner$7.evaluate(RandomizedRunner.java:891)
	at com.carrotsearch.randomizedtesting.rules.StatementAdapter.evaluate(StatementAdapter.java:36)
	at com.carrotsearch.randomizedtesting.rules.SystemPropertiesRestoreRule$1.evaluate(SystemPropertiesRestoreRule.java:57)
	at org.apache.lucene.util.AbstractBeforeAfterRule$1.evaluate(AbstractBeforeAfterRule.java:45)
	at com.carrotsearch.randomizedtesting.rules.StatementAdapter.evaluate(StatementAdapter.java:36)
	at org.apache.lucene.util.TestRuleStoreClassName$1.evaluate(TestRuleStoreClassName.java:41)
	at com.carrotsearch.randomizedtesting.rules.NoShadowingOrOverridesOnMethodsRule$1.evaluate(NoShadowingOrOverridesOnMethodsRule.java:40)
	at com.carrotsearch.randomizedtesting.rules.NoShadowingOrOverridesOnMethodsRule$1.evaluate(NoShadowingOrOverridesOnMethodsRule.java:40)
	at com.carrotsearch.randomizedtesting.rules.StatementAdapter.evaluate(StatementAdapter.java:36)
	at com.carrotsearch.randomizedtesting.rules.StatementAdapter.evaluate(StatementAdapter.java:36)
	at com.carrotsearch.randomizedtesting.rules.StatementAdapter.evaluate(StatementAdapter.java:36)
	at org.apache.lucene.util.TestRuleAssertionsRequired$1.evaluate(TestRuleAssertionsRequired.java:53)
	at org.apache.lucene.util.TestRuleMarkFailure$1.evaluate(TestRuleMarkFailure.java:47)
	at org.apache.lucene.util.TestRuleIgnoreAfterMaxFailures$1.evaluate(TestRuleIgnoreAfterMaxFailures.java:64)
	at org.apache.lucene.util.TestRuleIgnoreTestSuites$1.evaluate(TestRuleIgnoreTestSuites.java:54)
	at com.carrotsearch.randomizedtesting.rules.StatementAdapter.evaluate(StatementAdapter.java:36)
	at com.carrotsearch.randomizedtesting.ThreadLeakControl$StatementRunner.run(ThreadLeakControl.java:368)
	at java.lang.Thread.run(Thread.java:748)




Build Log:
[...truncated 13493 lines...]
   [junit4] Suite: org.apache.solr.cloud.autoscaling.NodeLostTriggerTest
   [junit4]   2> Creating dataDir: /home/jenkins/workspace/Lucene-Solr-master-Linux/solr/build/solr-core/test/J0/temp/solr.cloud.autoscaling.NodeLostTriggerTest_39F6F71B76BC849D-001/init-core-data-001
   [junit4]   2> 974376 WARN  (SUITE-NodeLostTriggerTest-seed#[39F6F71B76BC849D]-worker) [    ] o.a.s.SolrTestCaseJ4 startTrackingSearchers: numOpens=1 numCloses=1
   [junit4]   2> 974376 INFO  (SUITE-NodeLostTriggerTest-seed#[39F6F71B76BC849D]-worker) [    ] o.a.s.SolrTestCaseJ4 Using PointFields (NUMERIC_POINTS_SYSPROP=true) w/NUMERIC_DOCVALUES_SYSPROP=true
   [junit4]   2> 974377 INFO  (SUITE-NodeLostTriggerTest-seed#[39F6F71B76BC849D]-worker) [    ] o.a.s.SolrTestCaseJ4 Randomized ssl (true) and clientAuth (true) via: @org.apache.solr.util.RandomizeSSL(reason=, ssl=NaN, value=NaN, clientAuth=NaN)
   [junit4]   2> 974377 INFO  (SUITE-NodeLostTriggerTest-seed#[39F6F71B76BC849D]-worker) [    ] o.a.s.SolrTestCaseJ4 SecureRandom sanity checks: test.solr.allowed.securerandom=null & java.security.egd=file:/dev/./urandom
   [junit4]   2> 974378 INFO  (SUITE-NodeLostTriggerTest-seed#[39F6F71B76BC849D]-worker) [    ] o.a.s.c.MiniSolrCloudCluster Starting cluster of 5 servers in /home/jenkins/workspace/Lucene-Solr-master-Linux/solr/build/solr-core/test/J0/temp/solr.cloud.autoscaling.NodeLostTriggerTest_39F6F71B76BC849D-001/tempDir-001
   [junit4]   2> 974378 INFO  (SUITE-NodeLostTriggerTest-seed#[39F6F71B76BC849D]-worker) [    ] o.a.s.c.ZkTestServer STARTING ZK TEST SERVER
   [junit4]   2> 974378 INFO  (Thread-3768) [    ] o.a.s.c.ZkTestServer client port:0.0.0.0/0.0.0.0:0
   [junit4]   2> 974378 INFO  (Thread-3768) [    ] o.a.s.c.ZkTestServer Starting server
   [junit4]   2> 974381 ERROR (Thread-3768) [    ] o.a.z.s.ZooKeeperServer ZKShutdownHandler is not registered, so ZooKeeper server won't take any action on ERROR or SHUTDOWN server state changes
   [junit4]   2> 974478 INFO  (SUITE-NodeLostTriggerTest-seed#[39F6F71B76BC849D]-worker) [    ] o.a.s.c.ZkTestServer start zk server on port:34981
   [junit4]   2> 974480 INFO  (zkConnectionManagerCallback-3236-thread-1) [    ] o.a.s.c.c.ConnectionManager zkClient has connected
   [junit4]   2> 974482 INFO  (jetty-launcher-3233-thread-4) [    ] o.e.j.s.Server jetty-9.4.11.v20180605; built: 2018-06-05T18:24:03.829Z; git: d5fc0523cfa96bfebfbda19606cad384d772f04c; jvm 1.8.0_172-b11
   [junit4]   2> 974482 INFO  (jetty-launcher-3233-thread-1) [    ] o.e.j.s.Server jetty-9.4.11.v20180605; built: 2018-06-05T18:24:03.829Z; git: d5fc0523cfa96bfebfbda19606cad384d772f04c; jvm 1.8.0_172-b11
   [junit4]   2> 974482 INFO  (jetty-launcher-3233-thread-2) [    ] o.e.j.s.Server jetty-9.4.11.v20180605; built: 2018-06-05T18:24:03.829Z; git: d5fc0523cfa96bfebfbda19606cad384d772f04c; jvm 1.8.0_172-b11
   [junit4]   2> 974482 INFO  (jetty-launcher-3233-thread-3) [    ] o.e.j.s.Server jetty-9.4.11.v20180605; built: 2018-06-05T18:24:03.829Z; git: d5fc0523cfa96bfebfbda19606cad384d772f04c; jvm 1.8.0_172-b11
   [junit4]   2> 974483 INFO  (jetty-launcher-3233-thread-5) [    ] o.e.j.s.Server jetty-9.4.11.v20180605; built: 2018-06-05T18:24:03.829Z; git: d5fc0523cfa96bfebfbda19606cad384d772f04c; jvm 1.8.0_172-b11
   [junit4]   2> 974483 INFO  (jetty-launcher-3233-thread-3) [    ] o.e.j.s.session DefaultSessionIdManager workerName=node0
   [junit4]   2> 974483 INFO  (jetty-launcher-3233-thread-3) [    ] o.e.j.s.session No SessionScavenger set, using defaults
   [junit4]   2> 974483 INFO  (jetty-launcher-3233-thread-3) [    ] o.e.j.s.session node0 Scavenging every 600000ms
   [junit4]   2> 974483 INFO  (jetty-launcher-3233-thread-2) [    ] o.e.j.s.session DefaultSessionIdManager workerName=node0
   [junit4]   2> 974483 INFO  (jetty-launcher-3233-thread-2) [    ] o.e.j.s.session No SessionScavenger set, using defaults
   [junit4]   2> 974483 INFO  (jetty-launcher-3233-thread-2) [    ] o.e.j.s.session node0 Scavenging every 600000ms
   [junit4]   2> 974483 INFO  (jetty-launcher-3233-thread-1) [    ] o.e.j.s.session DefaultSessionIdManager workerName=node0
   [junit4]   2> 974483 INFO  (jetty-launcher-3233-thread-1) [    ] o.e.j.s.session No SessionScavenger set, using defaults
   [junit4]   2> 974483 INFO  (jetty-launcher-3233-thread-1) [    ] o.e.j.s.session node0 Scavenging every 600000ms
   [junit4]   2> 974483 INFO  (jetty-launcher-3233-thread-3) [    ] o.e.j.s.h.ContextHandler Started o.e.j.s.ServletContextHandler@bcdebda{/solr,null,AVAILABLE}
   [junit4]   2> 974484 INFO  (jetty-launcher-3233-thread-2) [    ] o.e.j.s.h.ContextHandler Started o.e.j.s.ServletContextHandler@9f5252c{/solr,null,AVAILABLE}
   [junit4]   2> 974484 INFO  (jetty-launcher-3233-thread-4) [    ] o.e.j.s.session DefaultSessionIdManager workerName=node0
   [junit4]   2> 974484 INFO  (jetty-launcher-3233-thread-1) [    ] o.e.j.s.h.ContextHandler Started o.e.j.s.ServletContextHandler@69f86a1{/solr,null,AVAILABLE}
   [junit4]   2> 974484 INFO  (jetty-launcher-3233-thread-4) [    ] o.e.j.s.session No SessionScavenger set, using defaults
   [junit4]   2> 974484 INFO  (jetty-launcher-3233-thread-4) [    ] o.e.j.s.session node0 Scavenging every 660000ms
   [junit4]   2> 974484 INFO  (jetty-launcher-3233-thread-5) [    ] o.e.j.s.session DefaultSessionIdManager workerName=node0
   [junit4]   2> 974484 INFO  (jetty-launcher-3233-thread-5) [    ] o.e.j.s.session No SessionScavenger set, using defaults
   [junit4]   2> 974484 INFO  (jetty-launcher-3233-thread-5) [    ] o.e.j.s.session node0 Scavenging every 660000ms
   [junit4]   2> 974484 INFO  (jetty-launcher-3233-thread-4) [    ] o.e.j.s.h.ContextHandler Started o.e.j.s.ServletContextHandler@5787c0d9{/solr,null,AVAILABLE}
   [junit4]   2> 974484 INFO  (jetty-launcher-3233-thread-3) [    ] o.e.j.s.AbstractConnector Started ServerConnector@4d159df7{SSL,[ssl, http/1.1]}{127.0.0.1:41345}
   [junit4]   2> 974484 INFO  (jetty-launcher-3233-thread-2) [    ] o.e.j.s.AbstractConnector Started ServerConnector@33ffbd56{SSL,[ssl, http/1.1]}{127.0.0.1:34131}
   [junit4]   2> 974484 INFO  (jetty-launcher-3233-thread-3) [    ] o.e.j.s.Server Started @974510ms
   [junit4]   2> 974484 INFO  (jetty-launcher-3233-thread-2) [    ] o.e.j.s.Server Started @974510ms
   [junit4]   2> 974484 INFO  (jetty-launcher-3233-thread-3) [    ] o.a.s.c.s.e.JettySolrRunner Jetty properties: {hostContext=/solr, hostPort=41345}
   [junit4]   2> 974484 INFO  (jetty-launcher-3233-thread-2) [    ] o.a.s.c.s.e.JettySolrRunner Jetty properties: {hostContext=/solr, hostPort=34131}
   [junit4]   2> 974484 ERROR (jetty-launcher-3233-thread-2) [    ] o.a.s.u.StartupLoggingUtils Missing Java Option solr.log.dir. Logging may be missing or incomplete.
   [junit4]   2> 974484 ERROR (jetty-launcher-3233-thread-3) [    ] o.a.s.u.StartupLoggingUtils Missing Java Option solr.log.dir. Logging may be missing or incomplete.
   [junit4]   2> 974484 INFO  (jetty-launcher-3233-thread-2) [    ] o.a.s.s.SolrDispatchFilter Using logger factory org.apache.logging.slf4j.Log4jLoggerFactory
   [junit4]   2> 974484 INFO  (jetty-launcher-3233-thread-3) [    ] o.a.s.s.SolrDispatchFilter Using logger factory org.apache.logging.slf4j.Log4jLoggerFactory
   [junit4]   2> 974484 INFO  (jetty-launcher-3233-thread-2) [    ] o.a.s.s.SolrDispatchFilter  ___      _       Welcome to Apache Solr? version 8.0.0
   [junit4]   2> 974484 INFO  (jetty-launcher-3233-thread-3) [    ] o.a.s.s.SolrDispatchFilter  ___      _       Welcome to Apache Solr? version 8.0.0
   [junit4]   2> 974484 INFO  (jetty-launcher-3233-thread-2) [    ] o.a.s.s.SolrDispatchFilter / __| ___| |_ _   Starting in cloud mode on port null
   [junit4]   2> 974484 INFO  (jetty-launcher-3233-thread-3) [    ] o.a.s.s.SolrDispatchFilter / __| ___| |_ _   Starting in cloud mode on port null
   [junit4]   2> 974484 INFO  (jetty-launcher-3233-thread-2) [    ] o.a.s.s.SolrDispatchFilter \__ \/ _ \ | '_|  Install dir: null
   [junit4]   2> 974484 INFO  (jetty-launcher-3233-thread-3) [    ] o.a.s.s.SolrDispatchFilter \__ \/ _ \ | '_|  Install dir: null
   [junit4]   2> 974484 INFO  (jetty-launcher-3233-thread-3) [    ] o.a.s.s.SolrDispatchFilter |___/\___/_|_|    Start time: 2018-09-14T01:12:13.566Z
   [junit4]   2> 974484 INFO  (jetty-launcher-3233-thread-2) [    ] o.a.s.s.SolrDispatchFilter |___/\___/_|_|    Start time: 2018-09-14T01:12:13.566Z
   [junit4]   2> 974485 INFO  (jetty-launcher-3233-thread-5) [    ] o.e.j.s.h.ContextHandler Started o.e.j.s.ServletContextHandler@7aa81e71{/solr,null,AVAILABLE}
   [junit4]   2> 974485 INFO  (jetty-launcher-3233-thread-1) [    ] o.e.j.s.AbstractConnector Started ServerConnector@4a67fbe9{SSL,[ssl, http/1.1]}{127.0.0.1:41087}
   [junit4]   2> 974485 INFO  (jetty-launcher-3233-thread-4) [    ] o.e.j.s.AbstractConnector Started ServerConnector@1bf84a54{SSL,[ssl, http/1.1]}{127.0.0.1:36467}
   [junit4]   2> 974485 INFO  (jetty-launcher-3233-thread-5) [    ] o.e.j.s.AbstractConnector Started ServerConnector@4056811f{SSL,[ssl, http/1.1]}{127.0.0.1:37257}
   [junit4]   2> 974485 INFO  (jetty-launcher-3233-thread-1) [    ] o.e.j.s.Server Started @974512ms
   [junit4]   2> 974485 INFO  (jetty-launcher-3233-thread-4) [    ] o.e.j.s.Server Started @974512ms
   [junit4]   2> 974485 INFO  (jetty-launcher-3233-thread-5) [    ] o.e.j.s.Server Started @974512ms
   [junit4]   2> 974485 INFO  (jetty-launcher-3233-thread-1) [    ] o.a.s.c.s.e.JettySolrRunner Jetty properties: {hostContext=/solr, hostPort=41087}
   [junit4]   2> 974485 INFO  (jetty-launcher-3233-thread-5) [    ] o.a.s.c.s.e.JettySolrRunner Jetty properties: {hostContext=/solr, hostPort=37257}
   [junit4]   2> 974485 INFO  (jetty-launcher-3233-thread-4) [    ] o.a.s.c.s.e.JettySolrRunner Jetty properties: {hostContext=/solr, hostPort=36467}
   [junit4]   2> 974485 ERROR (jetty-launcher-3233-thread-1) [    ] o.a.s.u.StartupLoggingUtils Missing Java Option solr.log.dir. Logging may be missing or incomplete.
   [junit4]   2> 974485 INFO  (jetty-launcher-3233-thread-1) [    ] o.a.s.s.SolrDispatchFilter Using logger factory org.apache.logging.slf4j.Log4jLoggerFactory
   [junit4]   2> 974485 INFO  (jetty-launcher-3233-thread-1) [    ] o.a.s.s.SolrDispatchFilter  ___      _       Welcome to Apache Solr? version 8.0.0
   [junit4]   2> 974485 ERROR (jetty-launcher-3233-thread-5) [    ] o.a.s.u.StartupLoggingUtils Missing Java Option solr.log.dir. Logging may be missing or incomplete.
   [junit4]   2> 974485 ERROR (jetty-launcher-3233-thread-4) [    ] o.a.s.u.StartupLoggingUtils Missing Java Option solr.log.dir. Logging may be missing or incomplete.
   [junit4]   2> 974485 INFO  (jetty-launcher-3233-thread-1) [    ] o.a.s.s.SolrDispatchFilter / __| ___| |_ _   Starting in cloud mode on port null
   [junit4]   2> 974485 INFO  (jetty-launcher-3233-thread-4) [    ] o.a.s.s.SolrDispatchFilter Using logger factory org.apache.logging.slf4j.Log4jLoggerFactory
   [junit4]   2> 974485 INFO  (jetty-launcher-3233-thread-1) [    ] o.a.s.s.SolrDispatchFilter \__ \/ _ \ | '_|  Install dir: null
   [junit4]   2> 974485 INFO  (jetty-launcher-3233-thread-5) [    ] o.a.s.s.SolrDispatchFilter Using logger factory org.apache.logging.slf4j.Log4jLoggerFactory
   [junit4]   2> 974486 INFO  (jetty-launcher-3233-thread-1) [    ] o.a.s.s.SolrDispatchFilter |___/\___/_|_|    Start time: 2018-09-14T01:12:13.567Z
   [junit4]   2> 974486 INFO  (jetty-launcher-3233-thread-4) [    ] o.a.s.s.SolrDispatchFilter  ___      _       Welcome to Apache Solr? version 8.0.0
   [junit4]   2> 974486 INFO  (jetty-launcher-3233-thread-5) [    ] o.a.s.s.SolrDispatchFilter  ___      _       Welcome to Apache Solr? version 8.0.0
   [junit4]   2> 974486 INFO  (jetty-launcher-3233-thread-4) [    ] o.a.s.s.SolrDispatchFilter / __| ___| |_ _   Starting in cloud mode on port null
   [junit4]   2> 974486 INFO  (jetty-launcher-3233-thread-5) [    ] o.a.s.s.SolrDispatchFilter / __| ___| |_ _   Starting in cloud mode on port null
   [junit4]   2> 974486 INFO  (jetty-launcher-3233-thread-4) [    ] o.a.s.s.SolrDispatchFilter \__ \/ _ \ | '_|  Install dir: null
   [junit4]   2> 974486 INFO  (jetty-launcher-3233-thread-5) [    ] o.a.s.s.SolrDispatchFilter \__ \/ _ \ | '_|  Install dir: null
   [junit4]   2> 974486 INFO  (jetty-launcher-3233-thread-4) [    ] o.a.s.s.SolrDispatchFilter |___/\___/_|_|    Start time: 2018-09-14T01:12:13.568Z
   [junit4]   2> 974486 INFO  (jetty-launcher-3233-thread-5) [    ] o.a.s.s.SolrDispatchFilter |___/\___/_|_|    Start time: 2018-09-14T01:12:13.568Z
   [junit4]   2> 974486 INFO  (zkConnectionManagerCallback-3240-thread-1) [    ] o.a.s.c.c.ConnectionManager zkClient has connected
   [junit4]   2> 974487 INFO  (zkConnectionManagerCallback-3238-thread-1) [    ] o.a.s.c.c.ConnectionManager zkClient has connected
   [junit4]   2> 974487 INFO  (jetty-launcher-3233-thread-2) [    ] o.a.s.s.SolrDispatchFilter solr.xml found in ZooKeeper. Loading...
   [junit4]   2> 974487 INFO  (zkConnectionManagerCallback-3244-thread-1) [    ] o.a.s.c.c.ConnectionManager zkClient has connected
   [junit4]   2> 974487 INFO  (jetty-launcher-3233-thread-3) [    ] o.a.s.s.SolrDispatchFilter solr.xml found in ZooKeeper. Loading...
   [junit4]   2> 974487 INFO  (zkConnectionManagerCallback-3246-thread-1) [    ] o.a.s.c.c.ConnectionManager zkClient has connected
   [junit4]   2> 974487 INFO  (jetty-launcher-3233-thread-4) [    ] o.a.s.s.SolrDispatchFilter solr.xml found in ZooKeeper. Loading...
   [junit4]   2> 974488 INFO  (zkConnectionManagerCallback-3242-thread-1) [    ] o.a.s.c.c.ConnectionManager zkClient has connected
   [junit4]   2> 974488 INFO  (jetty-launcher-3233-thread-5) [    ] o.a.s.s.SolrDispatchFilter solr.xml found in ZooKeeper. Loading...
   [junit4]   2> 974488 INFO  (jetty-launcher-3233-thread-1) [    ] o.a.s.s.SolrDispatchFilter solr.xml found in ZooKeeper. Loading...
   [junit4]   2> 974506 WARN  (NIOServerCxn.Factory:0.0.0.0/0.0.0.0:0) [    ] o.a.z.s.NIOServerCnxn Unable to read additional data from client sessionid 0x1009402cb510004, likely client has closed socket
   [junit4]   2> 974507 WARN  (NIOServerCxn.Factory:0.0.0.0/0.0.0.0:0) [    ] o.a.z.s.NIOServerCnxn Unable to read additional data from client sessionid 0x1009402cb510001, likely client has closed socket
   [junit4]   2> 974507 WARN  (NIOServerCxn.Factory:0.0.0.0/0.0.0.0:0) [    ] o.a.z.s.NIOServerCnxn Unable to read additional data from client sessionid 0x1009402cb510002, likely client has closed socket
   [junit4]   2> 974507 WARN  (NIOServerCxn.Factory:0.0.0.0/0.0.0.0:0) [    ] o.a.z.s.NIOServerCnxn Unable to read additional data from client sessionid 0x1009402cb510003, likely client has closed socket
   [junit4]   2> 974550 INFO  (jetty-launcher-3233-thread-2) [    ] o.a.s.c.ZkContainer Zookeeper client=127.0.0.1:34981/solr
   [junit4]   2> 974577 INFO  (zkConnectionManagerCallback-3250-thread-1) [    ] o.a.s.c.c.ConnectionManager zkClient has connected
   [junit4]   2> 974587 INFO  (zkConnectionManagerCallback-3252-thread-1) [    ] o.a.s.c.c.ConnectionManager zkClient has connected
   [junit4]   2> 974589 INFO  (jetty-launcher-3233-thread-5) [    ] o.a.s.c.ZkContainer Zookeeper client=127.0.0.1:34981/solr
   [junit4]   2> 974601 INFO  (zkConnectionManagerCallback-3256-thread-1) [    ] o.a.s.c.c.ConnectionManager zkClient has connected
   [junit4]   2> 974617 INFO  (zkConnectionManagerCallback-3260-thread-1) [    ] o.a.s.c.c.ConnectionManager zkClient has connected
   [junit4]   2> 974622 INFO  (jetty-launcher-3233-thread-3) [    ] o.a.s.c.ZkContainer Zookeeper client=127.0.0.1:34981/solr
   [junit4]   2> 974623 INFO  (jetty-launcher-3233-thread-5) [n:127.0.0.1:37257_solr    ] o.a.s.c.OverseerElectionContext I am going to be the leader 127.0.0.1:37257_solr
   [junit4]   2> 974624 INFO  (jetty-launcher-3233-thread-5) [n:127.0.0.1:37257_solr    ] o.a.s.c.Overseer Overseer (id=72220333759856649-127.0.0.1:37257_solr-n_0000000000) starting
   [junit4]   2> 974629 INFO  (zkConnectionManagerCallback-3266-thread-1) [    ] o.a.s.c.c.ConnectionManager zkClient has connected
   [junit4]   2> 974631 INFO  (zkConnectionManagerCallback-3269-thread-1) [    ] o.a.s.c.c.ConnectionManager zkClient has connected
   [junit4]   2> 974631 INFO  (jetty-launcher-3233-thread-4) [    ] o.a.s.c.ZkContainer Zookeeper client=127.0.0.1:34981/solr
   [junit4]   2> 974633 INFO  (jetty-launcher-3233-thread-2) [n:127.0.0.1:34131_solr    ] o.a.s.c.ZkController Register node as live in ZooKeeper:/live_nodes/127.0.0.1:34131_solr
   [junit4]   2> 974634 INFO  (jetty-launcher-3233-thread-3) [n:127.0.0.1:41345_solr    ] o.a.s.c.c.ZkStateReader Updated live nodes from ZooKeeper... (0) -> (1)
   [junit4]   2> 974637 INFO  (jetty-launcher-3233-thread-3) [n:127.0.0.1:41345_solr    ] o.a.s.c.TransientSolrCoreCacheDefault Allocating transient cache for 2147483647 transient cores
   [junit4]   2> 974637 INFO  (jetty-launcher-3233-thread-3) [n:127.0.0.1:41345_solr    ] o.a.s.c.ZkController Register node as live in ZooKeeper:/live_nodes/127.0.0.1:41345_solr
   [junit4]   2> 974641 INFO  (zkCallback-3268-thread-1) [    ] o.a.s.c.c.ZkStateReader Updated live nodes from ZooKeeper... (1) -> (2)
   [junit4]   2> 974645 INFO  (zkConnectionManagerCallback-3275-thread-1) [    ] o.a.s.c.c.ConnectionManager zkClient has connected
   [junit4]   2> 974645 INFO  (zkCallback-3259-thread-1) [    ] o.a.s.c.c.ZkStateReader Updated live nodes from ZooKeeper... (0) -> (2)
   [junit4]   2> 974646 INFO  (jetty-launcher-3233-thread-5) [n:127.0.0.1:37257_solr    ] o.a.s.c.c.ZkStateReader Updated live nodes from ZooKeeper... (0) -> (2)
   [junit4]   2> 974647 INFO  (jetty-launcher-3233-thread-5) [n:127.0.0.1:37257_solr    ] o.a.s.c.s.i.ZkClientClusterStateProvider Cluster at 127.0.0.1:34981/solr ready
   [junit4]   2> 974649 INFO  (zkConnectionManagerCallback-3277-thread-1) [    ] o.a.s.c.c.ConnectionManager zkClient has connected
   [junit4]   2> 974650 INFO  (zkCallback-3251-thread-1) [    ] o.a.s.c.c.ZkStateReader Updated live nodes from ZooKeeper... (0) -> (2)
   [junit4]   2> 974650 INFO  (OverseerStateUpdate-72220333759856649-127.0.0.1:37257_solr-n_0000000000) [n:127.0.0.1:37257_solr    ] o.a.s.c.Overseer Starting to work on the main queue : 127.0.0.1:37257_solr
   [junit4]   2> 974650 DEBUG (OverseerAutoScalingTriggerThread-72220333759856649-127.0.0.1:37257_solr-n_0000000000) [    ] o.a.s.c.a.OverseerTriggerThread Adding .auto_add_replicas and .scheduled_maintenance triggers
   [junit4]   2> 974652 INFO  (jetty-launcher-3233-thread-5) [n:127.0.0.1:37257_solr    ] o.a.s.c.TransientSolrCoreCacheDefault Allocating transient cache for 2147483647 transient cores
   [junit4]   2> 974652 DEBUG (OverseerAutoScalingTriggerThread-72220333759856649-127.0.0.1:37257_solr-n_0000000000) [    ] o.a.s.c.a.OverseerTriggerThread Refreshing /autoscaling.json with znode version 1
   [junit4]   2> 974652 INFO  (jetty-launcher-3233-thread-5) [n:127.0.0.1:37257_solr    ] o.a.s.c.ZkController Register node as live in ZooKeeper:/live_nodes/127.0.0.1:37257_solr
   [junit4]   2> 974652 DEBUG (OverseerAutoScalingTriggerThread-72220333759856649-127.0.0.1:37257_solr-n_0000000000) [    ] o.a.s.c.a.OverseerTriggerThread Current znodeVersion 1, lastZnodeVersion -1
   [junit4]   2> 974652 DEBUG (OverseerAutoScalingTriggerThread-72220333759856649-127.0.0.1:37257_solr-n_0000000000) [    ] o.a.s.c.a.OverseerTriggerThread Processed trigger updates upto znodeVersion 1
   [junit4]   2> 974653 INFO  (zkConnectionManagerCallback-3285-thread-1) [    ] o.a.s.c.c.ConnectionManager zkClient has connected
   [junit4]   2> 974658 DEBUG (OverseerAutoScalingTriggerThread-72220333759856649-127.0.0.1:37257_solr-n_0000000000) [    ] o.a.s.c.a.NodeLostTrigger NodeLostTrigger .auto_add_replicas - Initial livenodes: [127.0.0.1:34131_solr, 127.0.0.1:41345_solr]
   [junit4]   2> 974662 INFO  (jetty-launcher-3233-thread-2) [n:127.0.0.1:34131_solr    ] o.a.s.c.c.ZkStateReader Updated live nodes from ZooKeeper... (0) -> (3)
   [junit4]   2> 974662 INFO  (jetty-launcher-3233-thread-2) [n:127.0.0.1:34131_solr    ] o.a.s.c.s.i.ZkClientClusterStateProvider Cluster at 127.0.0.1:34981/solr ready
   [junit4]   2> 974666 INFO  (zkCallback-3259-thread-1) [    ] o.a.s.c.c.ZkStateReader Updated live nodes from ZooKeeper... (2) -> (3)
   [junit4]   2> 974666 INFO  (zkCallback-3274-thread-1) [    ] o.a.s.c.c.ZkStateReader Updated live nodes from ZooKeeper... (2) -> (3)
   [junit4]   2> 974666 INFO  (zkCallback-3268-thread-1) [    ] o.a.s.c.c.ZkStateReader Updated live nodes from ZooKeeper... (2) -> (3)
   [junit4]   2> 974666 INFO  (zkCallback-3251-thread-1) [    ] o.a.s.c.c.ZkStateReader Updated live nodes from ZooKeeper... (2) -> (3)
   [junit4]   2> 974669 INFO  (zkConnectionManagerCallback-3291-thread-1) [    ] o.a.s.c.c.ConnectionManager zkClient has connected
   [junit4]   2> 974669 DEBUG (OverseerAutoScalingTriggerThread-72220333759856649-127.0.0.1:37257_solr-n_0000000000) [    ] o.a.s.c.a.OverseerTriggerThread -- clean old nodeAdded markers
   [junit4]   2> 974670 INFO  (jetty-launcher-3233-thread-2) [n:127.0.0.1:34131_solr    ] o.a.s.h.a.MetricsHistoryHandler No .system collection, keeping metrics history in memory.
   [junit4]   2> 974670 INFO  (zkConnectionManagerCallback-3289-thread-1) [    ] o.a.s.c.c.ConnectionManager zkClient has connected
   [junit4]   2> 974670 INFO  (jetty-launcher-3233-thread-3) [n:127.0.0.1:41345_solr    ] o.a.s.c.c.ZkStateReader Updated live nodes from ZooKeeper... (0) -> (3)
   [junit4]   2> 974670 DEBUG (ScheduledTrigger-5020-thread-3) [    ] o.a.s.c.a.NodeLostTrigger Running NodeLostTrigger: .auto_add_replicas with currently live nodes: 3
   [junit4]   2> 974671 INFO  (jetty-launcher-3233-thread-3) [n:127.0.0.1:41345_solr    ] o.a.s.c.s.i.ZkClientClusterStateProvider Cluster at 127.0.0.1:34981/solr ready
   [junit4]   2> 974673 DEBUG (OverseerAutoScalingTriggerThread-72220333759856649-127.0.0.1:37257_solr-n_0000000000) [    ] o.a.s.c.a.OverseerTriggerThread Current znodeVersion 1, lastZnodeVersion 1
   [junit4]   2> 974673 INFO  (jetty-launcher-3233-thread-4) [n:127.0.0.1:36467_solr    ] o.a.s.c.c.ZkStateReader Updated live nodes from ZooKeeper... (0) -> (3)
   [junit4]   2> 974675 INFO  (jetty-launcher-3233-thread-4) [n:127.0.0.1:36467_solr    ] o.a.s.c.TransientSolrCoreCacheDefault Allocating transient cache for 2147483647 transient cores
   [junit4]   2> 974675 INFO  (jetty-launcher-3233-thread-4) [n:127.0.0.1:36467_solr    ] o.a.s.c.ZkController Register node as live in ZooKeeper:/live_nodes/127.0.0.1:36467_solr
   [junit4]   2> 974676 INFO  (zkCallback-3268-thread-1) [    ] o.a.s.c.c.ZkStateReader Updated live nodes from ZooKeeper... (3) -> (4)
   [junit4]   2> 974677 INFO  (zkCallback-3251-thread-1) [    ] o.a.s.c.c.ZkStateReader Updated live nodes from ZooKeeper... (3) -> (4)
   [junit4]   2> 974681 INFO  (jetty-launcher-3233-thread-5) [n:127.0.0.1:37257_solr    ] o.a.s.h.a.MetricsHistoryHandler No .system collection, keeping metrics history in memory.
   [junit4]   2> 974686 INFO  (zkCallback-3274-thread-1) [    ] o.a.s.c.c.ZkStateReader Updated live nodes from ZooKeeper... (3) -> (4)
   [junit4]   2> 974687 INFO  (zkCallback-3288-thread-1) [    ] o.a.s.c.c.ZkStateReader Updated live nodes from ZooKeeper... (3) -> (4)
   [junit4]   2> 974690 INFO  (jetty-launcher-3233-thread-2) [n:127.0.0.1:34131_solr    ] o.a.s.m.r.SolrJmxReporter JMX monitoring for 'solr_34131.solr.node' (registry 'solr.node') enabled at server: com.sun.jmx.mbeanserver.JmxMBeanServer@474a80f9
   [junit4]   2> 974693 INFO  (zkCallback-3259-thread-2) [    ] o.a.s.c.c.ZkStateReader Updated live nodes from ZooKeeper... (3) -> (4)
   [junit4]   2> 974694 INFO  (jetty-launcher-3233-thread-2) [n:127.0.0.1:34131_solr    ] o.a.s.m.r.SolrJmxReporter JMX monitoring for 'solr_34131.solr.jvm' (registry 'solr.jvm') enabled at server: com.sun.jmx.mbeanserver.JmxMBeanServer@474a80f9
   [junit4]   2> 974694 INFO  (jetty-launcher-3233-thread-2) [n:127.0.0.1:34131_solr    ] o.a.s.m.r.SolrJmxReporter JMX monitoring for 'solr_34131.solr.jetty' (registry 'solr.jetty') enabled at server: com.sun.jmx.mbeanserver.JmxMBeanServer@474a80f9
   [junit4]   2> 974695 INFO  (zkCallback-3284-thread-1) [    ] o.a.s.c.c.ZkStateReader Updated live nodes from ZooKeeper... (3) -> (4)
   [junit4]   2> 974695 INFO  (jetty-launcher-3233-thread-2) [n:127.0.0.1:34131_solr    ] o.a.s.c.CorePropertiesLocator Found 0 core definitions underneath /home/jenkins/workspace/Lucene-Solr-master-Linux/solr/build/solr-core/test/J0/temp/solr.cloud.autoscaling.NodeLostTriggerTest_39F6F71B76BC849D-001/tempDir-001/node2/.
   [junit4]   2> 974695 INFO  (jetty-launcher-3233-thread-3) [n:127.0.0.1:41345_solr    ] o.a.s.h.a.MetricsHistoryHandler No .system collection, keeping metrics history in memory.
   [junit4]   2> 974699 INFO  (zkConnectionManagerCallback-3302-thread-1) [    ] o.a.s.c.c.ConnectionManager zkClient has connected
   [junit4]   2> 974699 INFO  (jetty-launcher-3233-thread-4) [n:127.0.0.1:36467_solr    ] o.a.s.c.c.ZkStateReader Updated live nodes from ZooKeeper... (0) -> (4)
   [junit4]   2> 974699 INFO  (jetty-launcher-3233-thread-4) [n:127.0.0.1:36467_solr    ] o.a.s.c.s.i.ZkClientClusterStateProvider Cluster at 127.0.0.1:34981/solr ready
   [junit4]   2> 974700 INFO  (jetty-launcher-3233-thread-4) [n:127.0.0.1:36467_solr    ] o.a.s.h.a.MetricsHistoryHandler No .system collection, keeping metrics history in memory.
   [junit4]   2> 974702 INFO  (zkCallback-3290-thread-1) [    ] o.a.s.c.c.ZkStateReader Updated live nodes from ZooKeeper... (3) -> (4)
   [junit4]   2> 974702 INFO  (jetty-launcher-3233-thread-1) [    ] o.a.s.c.ZkContainer Zookeeper client=127.0.0.1:34981/solr
   [junit4]   2> 974704 INFO  (zkConnectionManagerCallback-3306-thread-1) [    ] o.a.s.c.c.ConnectionManager zkClient has connected
   [junit4]   2> 974705 INFO  (zkConnectionManagerCallback-3308-thread-1) [    ] o.a.s.c.c.ConnectionManager zkClient has connected
   [junit4]   2> 974707 INFO  (jetty-launcher-3233-thread-1) [n:127.0.0.1:41087_solr    ] o.a.s.c.c.ZkStateReader Updated live nodes from ZooKeeper... (0) -> (4)
   [junit4]   2> 974709 INFO  (jetty-launcher-3233-thread-1) [n:127.0.0.1:41087_solr    ] o.a.s.c.TransientSolrCoreCacheDefault Allocating transient cache for 2147483647 transient cores
   [junit4]   2> 974709 INFO  (jetty-launcher-3233-thread-1) [n:127.0.0.1:41087_solr    ] o.a.s.c.ZkController Register node as live in ZooKeeper:/live_nodes/127.0.0.1:41087_solr
   [junit4]   2> 974713 INFO  (zkCallback-3259-thread-2) [    ] o.a.s.c.c.ZkStateReader Updated live nodes from ZooKeeper... (4) -> (5)
   [junit4]   2> 974713 INFO  (zkCallback-3268-thread-1) [    ] o.a.s.c.c.ZkStateReader Updated live nodes from ZooKeeper... (4) -> (5)
   [junit4]   2> 974730 INFO  (zkCallback-3290-thread-1) [    ] o.a.s.c.c.ZkStateReader Updated live nodes from ZooKeeper... (4) -> (5)
   [junit4]   2> 974730 INFO  (zkCallback-3284-thread-1) [    ] o.a.s.c.c.ZkStateReader Updated live nodes from ZooKeeper... (4) -> (5)
   [junit4]   2> 974730 INFO  (zkCallback-3307-thread-1) [    ] o.a.s.c.c.ZkStateReader Updated live nodes from ZooKeeper... (4) -> (5)
   [junit4]   2> 974730 INFO  (zkCallback-3274-thread-1) [    ] o.a.s.c.c.ZkStateReader Updated live nodes from ZooKeeper... (4) -> (5)
   [junit4]   2> 974730 INFO  (zkCallback-3251-thread-1) [    ] o.a.s.c.c.ZkStateReader Updated live nodes from ZooKeeper... (4) -> (5)
   [junit4]   2> 974730 INFO  (zkCallback-3288-thread-1) [    ] o.a.s.c.c.ZkStateReader Updated live nodes from ZooKeeper... (4) -> (5)
   [junit4]   2> 974730 INFO  (zkCallback-3301-thread-1) [    ] o.a.s.c.c.ZkStateReader Updated live nodes from ZooKeeper... (4) -> (5)
   [junit4]   2> 974736 INFO  (jetty-launcher-3233-thread-5) [n:127.0.0.1:37257_solr    ] o.a.s.m.r.SolrJmxReporter JMX monitoring for 'solr_37257.solr.node' (registry 'solr.node') enabled at server: com.sun.jmx.mbeanserver.JmxMBeanServer@474a80f9
   [junit4]   2> 974736 INFO  (jetty-launcher-3233-thread-4) [n:127.0.0.1:36467_solr    ] o.a.s.m.r.SolrJmxReporter JMX monitoring for 'solr_36467.solr.node' (registry 'solr.node') enabled at server: com.sun.jmx.mbeanserver.JmxMBeanServer@474a80f9
   [junit4]   2> 974737 INFO  (jetty-launcher-3233-thread-3) [n:127.0.0.1:41345_solr    ] o.a.s.m.r.SolrJmxReporter JMX monitoring for 'solr_41345.solr.node' (registry 'solr.node') enabled at server: com.sun.jmx.mbeanserver.JmxMBeanServer@474a80f9
   [junit4]   2> 974744 INFO  (jetty-launcher-3233-thread-4) [n:127.0.0.1:36467_solr    ] o.a.s.m.r.SolrJmxReporter JMX monitoring for 'solr_36467.solr.jvm' (registry 'solr.jvm') enabled at server: com.sun.jmx.mbeanserver.JmxMBeanServer@474a80f9
   [junit4]   2> 974744 INFO  (jetty-launcher-3233-thread-5) [n:127.0.0.1:37257_solr    ] o.a.s.m.r.SolrJmxReporter JMX monitoring for 'solr_37257.solr.jvm' (registry 'solr.jvm') enabled at server: com.sun.jmx.mbeanserver.JmxMBeanServer@474a80f9
   [junit4]   2> 974745 INFO  (jetty-launcher-3233-thread-4) [n:127.0.0.1:36467_solr    ] o.a.s.m.r.SolrJmxReporter JMX monitoring for 'solr_36467.solr.jetty' (registry 'solr.jetty') enabled at server: com.sun.jmx.mbeanserver.JmxMBeanServer@474a80f9
   [junit4]   2> 974745 INFO  (jetty-launcher-3233-thread-5) [n:127.0.0.1:37257_solr    ] o.a.s.m.r.SolrJmxReporter JMX monitoring for 'solr_37257.solr.jetty' (registry 'solr.jetty') enabled at server: com.sun.jmx.mbeanserver.JmxMBeanServer@474a80f9
   [junit4]   2> 974745 INFO  (jetty-launcher-3233-thread-4) [n:127.0.0.1:36467_solr    ] o.a.s.c.CorePropertiesLocator Found 0 core definitions underneath /home/jenkins/workspace/Lucene-Solr-master-Linux/solr/build/solr-core/test/J0/temp/solr.cloud.autoscaling.NodeLostTriggerTest_39F6F71B76BC849D-001/tempDir-001/node4/.
   [junit4]   2> 974746 INFO  (jetty-launcher-3233-thread-5) [n:127.0.0.1:37257_solr    ] o.a.s.c.CorePropertiesLocator Found 0 core definitions underneath /home/jenkins/workspace/Lucene-Solr-master-Linux/solr/build/solr-core/test/J0/temp/solr.cloud.autoscaling.NodeLostTriggerTest_39F6F71B76BC849D-001/tempDir-001/node5/.
   [junit4]   2> 974746 INFO  (zkConnectionManagerCallback-3315-thread-1) [    ] o.a.s.c.c.ConnectionManager zkClient has connected
   [junit4]   2> 974746 INFO  (jetty-launcher-3233-thread-3) [n:127.0.0.1:41345_solr    ] o.a.s.m.r.SolrJmxReporter JMX monitoring for 'solr_41345.solr.jvm' (registry 'solr.jvm') enabled at server: com.sun.jmx.mbeanserver.JmxMBeanServer@474a80f9
   [junit4]   2> 974746 INFO  (jetty-launcher-3233-thread-3) [n:127.0.0.1:41345_solr    ] o.a.s.m.r.SolrJmxReporter JMX monitoring for 'solr_41345.solr.jetty' (registry 'solr.jetty') enabled at server: com.sun.jmx.mbeanserver.JmxMBeanServer@474a80f9
   [junit4]   2> 974747 INFO  (jetty-launcher-3233-thread-3) [n:127.0.0.1:41345_solr    ] o.a.s.c.CorePropertiesLocator Found 0 core definitions underneath /home/jenkins/workspace/Lucene-Solr-master-Linux/solr/build/solr-core/test/J0/temp/solr.cloud.autoscaling.NodeLostTriggerTest_39F6F71B76BC849D-001/tempDir-001/node3/.
   [junit4]   2> 974749 INFO  (jetty-launcher-3233-thread-1) [n:127.0.0.1:41087_solr    ] o.a.s.c.c.ZkStateReader Updated live nodes from ZooKeeper... (0) -> (5)
   [junit4]   2> 974750 INFO  (jetty-launcher-3233-thread-1) [n:127.0.0.1:41087_solr    ] o.a.s.c.s.i.ZkClientClusterStateProvider Cluster at 127.0.0.1:34981/solr ready
   [junit4]   2> 974750 INFO  (jetty-launcher-3233-thread-1) [n:127.0.0.1:41087_solr    ] o.a.s.h.a.MetricsHistoryHandler No .system collection, keeping metrics history in memory.
   [junit4]   2> 974759 INFO  (jetty-launcher-3233-thread-1) [n:127.0.0.1:41087_solr    ] o.a.s.m.r.SolrJmxReporter JMX monitoring for 'solr_41087.solr.node' (registry 'solr.node') enabled at server: com.sun.jmx.mbeanserver.JmxMBeanServer@474a80f9
   [junit4]   2> 974764 INFO  (jetty-launcher-3233-thread-1) [n:127.0.0.1:41087_solr    ] o.a.s.m.r.SolrJmxReporter JMX monitoring for 'solr_41087.solr.jvm' (registry 'solr.jvm') enabled at server: com.sun.jmx.mbeanserver.JmxMBeanServer@474a80f9
   [junit4]   2> 974764 INFO  (jetty-launcher-3233-thread-1) [n:127.0.0.1:41087_solr    ] o.a.s.m.r.SolrJmxReporter JMX monitoring for 'solr_41087.solr.jetty' (registry 'solr.jetty') enabled at server: com.sun.jmx.mbeanserver.JmxMBeanServer@474a80f9
   [junit4]   2> 974765 INFO  (jetty-launcher-3233-thread-1) [n:127.0.0.1:41087_solr    ] o.a.s.c.CorePropertiesLocator Found 0 core definitions underneath /home/jenkins/workspace/Lucene-Solr-master-Linux/solr/build/solr-core/test/J0/temp/solr.cloud.autoscaling.NodeLostTriggerTest_39F6F71B76BC849D-001/tempDir-001/node1/.
   [junit4]   2> 974847 INFO  (zkConnectionManagerCallback-3318-thread-1) [    ] o.a.s.c.c.ConnectionManager zkClient has connected
   [junit4]   2> 974849 INFO  (zkConnectionManagerCallback-3323-thread-1) [    ] o.a.s.c.c.ConnectionManager zkClient has connected
   [junit4]   2> 974849 INFO  (SUITE-NodeLostTriggerTest-seed#[39F6F71B76BC849D]-worker) [    ] o.a.s.c.c.ZkStateReader Updated live nodes from ZooKeeper... (0) -> (5)
   [junit4]   2> 974849 INFO  (SUITE-NodeLostTriggerTest-seed#[39F6F71B76BC849D]-worker) [    ] o.a.s.c.s.i.ZkClientClusterStateProvider Cluster at 127.0.0.1:34981/solr ready
   [junit4]   2> 974881 INFO  (TEST-NodeLostTriggerTest.testActionLifecycle-seed#[39F6F71B76BC849D]) [    ] o.a.s.SolrTestCaseJ4 ###Starting testActionLifecycle
   [junit4]   2> 974882 DEBUG (TEST-NodeLostTriggerTest.testActionLifecycle-seed#[39F6F71B76BC849D]) [    ] o.a.s.c.a.NodeLostTrigger NodeLostTrigger node_added_trigger - Initial livenodes: [127.0.0.1:41087_solr, 127.0.0.1:37257_solr, 127.0.0.1:34131_solr, 127.0.0.1:41345_solr, 127.0.0.1:36467_solr]
   [junit4]   2> 974883 INFO  (TEST-NodeLostTriggerTest.testActionLifecycle-seed#[39F6F71B76BC849D]) [    ] o.a.s.SolrTestCaseJ4 ###Ending testActionLifecycle
   [junit4]   2> 974914 INFO  (TEST-NodeLostTriggerTest.testListenerAcceptance-seed#[39F6F71B76BC849D]) [    ] o.a.s.SolrTestCaseJ4 ###Starting testListenerAcceptance
   [junit4]   2> 974914 DEBUG (TEST-NodeLostTriggerTest.testListenerAcceptance-seed#[39F6F71B76BC849D]) [    ] o.a.s.c.a.NodeLostTrigger NodeLostTrigger node_added_trigger - Initial livenodes: [127.0.0.1:41087_solr, 127.0.0.1:37257_solr, 127.0.0.1:34131_solr, 127.0.0.1:41345_solr, 127.0.0.1:36467_solr]
   [junit4]   2> 974915 INFO  (TEST-NodeLostTriggerTest.testListenerAcceptance-seed#[39F6F71B76BC849D]) [    ] o.e.j.s.Server jetty-9.4.11.v20180605; built: 2018-06-05T18:24:03.829Z; git: d5fc0523cfa96bfebfbda19606cad384d772f04c; jvm 1.8.0_172-b11
   [junit4]   2> 974916 INFO  (TEST-NodeLostTriggerTest.testListenerAcceptance-seed#[39F6F71B76BC849D]) [    ] o.e.j.s.session DefaultSessionIdManager workerName=node0
   [junit4]   2> 974916 INFO  (TEST-NodeLostTriggerTest.testListenerAcceptance-seed#[39F6F71B76BC849D]) [    ] o.e.j.s.session No SessionScavenger set, using defaults
   [junit4]   2> 974916 INFO  (TEST-NodeLostTriggerTest.testListenerAcceptance-seed#[39F6F71B76BC849D]) [    ] o.e.j.s.session node0 Scavenging every 660000ms
   [junit4]   2> 974916 INFO  (TEST-NodeLostTriggerTest.testListenerAcceptance-seed#[39F6F71B76BC849D]) [    ] o.e.j.s.h.ContextHandler Started o.e.j.s.ServletContextHandler@bf68bf6{/solr,null,AVAILABLE}
   [junit4]   2> 974917 INFO  (TEST-NodeLostTriggerTest.testListenerAcceptance-seed#[39F6F71B76BC849D]) [    ] o.e.j.s.AbstractConnector Started ServerConnector@3bcafc80{SSL,[ssl, http/1.1]}{127.0.0.1:41477}
   [junit4]   2> 974917 INFO  (TEST-NodeLostTriggerTest.testListenerAcceptance-seed#[39F6F71B76BC849D]) [    ] o.e.j.s.Server Started @974943ms
   [junit4]   2> 974917 INFO  (TEST-NodeLostTriggerTest.testListenerAcceptance-seed#[39F6F71B76BC849D]) [    ] o.a.s.c.s.e.JettySolrRunner Jetty properties: {hostContext=/solr, hostPort=41477}
   [junit4]   2> 974917 ERROR (TEST-NodeLostTriggerTest.testListenerAcceptance-seed#[39F6F71B76BC849D]) [    ] o.a.s.u.StartupLoggingUtils Missing Java Option solr.log.dir. Logging may be missing or incomplete.
   [junit4]   2> 974917 INFO  (TEST-NodeLostTriggerTest.testListenerAcceptance-seed#[39F6F71B76BC849D]) [    ] o.a.s.s.SolrDispatchFilter Using logger factory org.apache.logging.slf4j.Log4jLoggerFactory
   [junit4]   2> 974917 INFO  (TEST-NodeLostTriggerTest.testListenerAcceptance-seed#[39F6F71B76BC849D]) [    ] o.a.s.s.SolrDispatchFilter  ___      _       Welcome to Apache Solr? version 8.0.0
   [junit4]   2> 974917 INFO  (TEST-NodeLostTriggerTest.testListenerAcceptance-seed#[39F6F71B76BC849D]) [    ] o.a.s.s.SolrDispatchFilter / __| ___| |_ _   Starting in cloud mode on port null
   [junit4]   2> 974917 INFO  (TEST-NodeLostTriggerTest.testListenerAcceptance-seed#[39F6F71B76BC849D]) [    ] o.a.s.s.SolrDispatchFilter \__ \/ _ \ | '_|  Install dir: null
   [junit4]   2> 974917 INFO  (TEST-NodeLostTriggerTest.testListenerAcceptance-seed#[39F6F71B76BC849D]) [    ] o.a.s.s.SolrDispatchFilter |___/\___/_|_|    Start time: 2018-09-14T01:12:13.999Z
   [junit4]   2> 974918 INFO  (zkConnectionManagerCallback-3325-thread-1) [    ] o.a.s.c.c.ConnectionManager zkClient has connected
   [junit4]   2> 974918 INFO  (TEST-NodeLostTriggerTest.testListenerAcceptance-seed#[39F6F71B76BC849D]) [    ] o.a.s.s.SolrDispatchFilter solr.xml found in ZooKeeper. Loading...
   [junit4]   2> 975131 INFO  (TEST-NodeLostTriggerTest.testListenerAcceptance-seed#[39F6F71B76BC849D]) [    ] o.a.s.c.ZkContainer Zookeeper client=127.0.0.1:34981/solr
   [junit4]   2> 975132 INFO  (zkConnectionManagerCallback-3329-thread-1) [    ] o.a.s.c.c.ConnectionManager zkClient has connected
   [junit4]   2> 975133 INFO  (zkConnectionManagerCallback-3331-thread-1) [    ] o.a.s.c.c.ConnectionManager zkClient has connected
   [junit4]   2> 975136 INFO  (TEST-NodeLostTriggerTest.testListenerAcceptance-seed#[39F6F71B76BC849D]) [n:127.0.0.1:41477_solr    ] o.a.s.c.c.ZkStateReader Updated live nodes from ZooKeeper... (0) -> (5)
   [junit4]   2> 975137 INFO  (TEST-NodeLostTriggerTest.testListenerAcceptance-seed#[39F6F71B76BC849D]) [n:127.0.0.1:41477_solr    ] o.a.s.c.TransientSolrCoreCacheDefault Allocating transient cache for 2147483647 transient cores
   [junit4]   2> 975137 INFO  (TEST-NodeLostTriggerTest.testListenerAcceptance-seed#[39F6F71B76BC849D]) [n:127.0.0.1:41477_solr    ] o.a.s.c.ZkController Register node as live in ZooKeeper:/live_nodes/127.0.0.1:41477_solr
   [junit4]   2> 975138 INFO  (zkCallback-3259-thread-2) [    ] o.a.s.c.c.ZkStateReader Updated live nodes from ZooKeeper... (5) -> (6)
   [junit4]   2> 975138 INFO  (zkCallback-3251-thread-1) [    ] o.a.s.c.c.ZkStateReader Updated live nodes from ZooKeeper... (5) -> (6)
   [junit4]   2> 975138 INFO  (zkCallback-3274-thread-1) [    ] o.a.s.c.c.ZkStateReader Updated live nodes from ZooKeeper... (5) -> (6)
   [junit4]   2> 975138 INFO  (zkCallback-3288-thread-1) [    ] o.a.s.c.c.ZkStateReader Updated live nodes from ZooKeeper... (5) -> (6)
   [junit4]   2> 975138 INFO  (zkCallback-3268-thread-1) [    ] o.a.s.c.c.ZkStateReader Updated live nodes from ZooKeeper... (5) -> (6)
   [junit4]   2> 975138 INFO  (zkCallback-3284-thread-1) [    ] o.a.s.c.c.ZkStateReader Updated live nodes from ZooKeeper... (5) -> (6)
   [junit4]   2> 975138 INFO  (zkCallback-3307-thread-1) [    ] o.a.s.c.c.ZkStateReader Updated live nodes from ZooKeeper... (5) -> (6)
   [junit4]   2> 975138 INFO  (zkCallback-3301-thread-1) [    ] o.a.s.c.c.ZkStateReader Updated live nodes from ZooKeeper... (5) -> (6)
   [junit4]   2> 975138 INFO  (zkCallback-3322-thread-1) [    ] o.a.s.c.c.ZkStateReader Updated live nodes from ZooKeeper... (5) -> (6)
   [junit4]   2> 975138 INFO  (zkCallback-3330-thread-1) [    ] o.a.s.c.c.ZkStateReader Updated live nodes from ZooKeeper... (5) -> (6)
   [junit4]   2> 975138 INFO  (zkCallback-3314-thread-1) [    ] o.a.s.c.c.ZkStateReader Updated live nodes from ZooKeeper... (5) -> (6)
   [junit4]   2> 975140 INFO  (zkCallback-3290-thread-1) [    ] o.a.s.c.c.ZkStateReader Updated live nodes from ZooKeeper... (5) -> (6)
   [junit4]   2> 975154 INFO  (zkConnectionManagerCallback-3338-thread-1) [    ] o.a.s.c.c.ConnectionManager zkClient has connected
   [junit4]   2> 975154 INFO  (TEST-NodeLostTriggerTest.testListenerAcceptance-seed#[39F6F71B76BC849D]) [n:127.0.0.1:41477_solr    ] o.a.s.c.c.ZkStateReader Updated live nodes from ZooKeeper... (0) -> (6)
   [junit4]   2> 975155 INFO  (TEST-NodeLostTriggerTest.testListenerAcceptance-seed#[39F6F71B76BC849D]) [n:127.0.0.1:41477_solr    ] o.a.s.c.s.i.ZkClientClusterStateProvider Cluster at 127.0.0.1:34981/solr ready
   [junit4]   2> 975155 INFO  (TEST-NodeLostTriggerTest.testListenerAcceptance-seed#[39F6F71B76BC849D]) [n:127.0.0.1:41477_solr    ] o.a.s.h.a.MetricsHistoryHandler No .system collection, keeping metrics history in memory.
   [junit4]   2> 975185 INFO  (TEST-NodeLostTriggerTest.testListenerAcceptance-seed#[39F6F71B76BC849D]) [n:127.0.0.1:41477_solr    ] o.a.s.m.r.SolrJmxReporter JMX monitoring for 'solr_41477.solr.node' (registry 'solr.node') enabled at server: com.sun.jmx.mbeanserver.JmxMBeanServer@474a80f9
   [junit4]   2> 975192 INFO  (TEST-NodeLostTriggerTest.testListenerAcceptance-seed#[39F6F71B76BC849D]) [n:127.0.0.1:41477_solr    ] o.a.s.m.r.SolrJmxReporter JMX monitoring for 'solr_41477.solr.jvm' (registry 'solr.jvm') enabled at server: com.sun.jmx.mbeanserver.JmxMBeanServer@474a80f9
   [junit4]   2> 975192 INFO  (TEST-NodeLostTriggerTest.testListenerAcceptance-seed#[39F6F71B76BC849D]) [n:127.0.0.1:41477_solr    ] o.a.s.m.r.SolrJmxReporter JMX monitoring for 'solr_41477.solr.jetty' (registry 'solr.jetty') enabled at server: com.sun.jmx.mbeanserver.JmxMBeanServer@474a80f9
   [junit4]   2> 975193 INFO  (TEST-NodeLostTriggerTest.testListenerAcceptance-seed#[39F6F71B76BC849D]) [n:127.0.0.1:41477_solr    ] o.a.s.c.CorePropertiesLocator Found 0 core definitions underneath /home/jenkins/workspace/Lucene-Solr-master-Linux/solr/build/solr-core/test/J0/temp/solr.cloud.autoscaling.NodeLostTriggerTest_39F6F71B76BC849D-001/tempDir-001/node6/.
   [junit4]   2> 975253 INFO  (zkConnectionManagerCallback-3341-thread-1) [    ] o.a.s.c.c.ConnectionManager zkClient has connected
   [junit4]   2> 975254 DEBUG (TEST-NodeLostTriggerTest.testListenerAcceptance-seed#[39F6F71B76BC849D]) [    ] o.a.s.c.a.NodeLostTrigger Running NodeLostTrigger: node_added_trigger with currently live nodes: 6
   [junit4]   2> 975254 INFO  (TEST-NodeLostTriggerTest.testListenerAcceptance-seed#[39F6F71B76BC849D]) [    ] o.e.j.s.AbstractConnector Stopped ServerConnector@3bcafc80{SSL,[ssl, http/1.1]}{127.0.0.1:0}
   [junit4]   2> 975255 INFO  (TEST-NodeLostTriggerTest.testListenerAcceptance-seed#[39F6F71B76BC849D]) [    ] o.a.s.c.CoreContainer Shutting down CoreContainer instance=2011917458
   [junit4]   2> 975255 INFO  (TEST-NodeLostTriggerTest.testListenerAcceptance-seed#[39F6F71B76BC849D]) [    ] o.a.s.m.SolrMetricManager Closing metric reporters for registry=solr.node, tag=null
   [junit4]   2> 975255 INFO  (TEST-NodeLostTriggerTest.testListenerAcceptance-seed#[39F6F71B76BC849D]) [    ] o.a.s.m.r.SolrJmxReporter Closing reporter [org.apache.solr.metrics.reporters.SolrJmxReporter@3fbd411d: rootName = solr_41477, domain = solr.node, service url = null, agent id = null] for registry solr.node / com.codahale.metrics.MetricRegistry@742d0e7c
   [junit4]   2> 975263 INFO  (TEST-NodeLostTriggerTest.testListenerAcceptance-seed#[39F6F71B76BC849D]) [    ] o.a.s.m.SolrMetricManager Closing metric reporters for registry=solr.jvm, tag=null
   [junit4]   2> 975263 INFO  (TEST-NodeLostTriggerTest.testListenerAcceptance-seed#[39F6F71B76BC849D]) [    ] o.a.s.m.r.SolrJmxReporter Closing reporter [org.apache.solr.metrics.reporters.SolrJmxReporter@5d48b6e7: rootName = solr_41477, domain = solr.jvm, service url = null, agent id = null] for registry solr.jvm / com.codahale.metrics.MetricRegistry@4cacfe20
   [junit4]   2> 975266 INFO  (TEST-NodeLostTriggerTest.testListenerAcceptance-seed#[39F6F71B76BC849D]) [    ] o.a.s.m.SolrMetricManager Closing metric reporters for registry=solr.jetty, tag=null
   [junit4]   2> 975266 INFO  (TEST-NodeLostTriggerTest.testListenerAcceptance-seed#[39F6F71B76BC849D]) [    ] o.a.s.m.r.SolrJmxReporter Closing reporter [org.apache.solr.metrics.reporters.SolrJmxReporter@7f1dc057: rootName = solr_41477, domain = solr.jetty, service url = null, agent id = null] for registry solr.jetty / com.codahale.metrics.MetricRegistry@7add2619
   [junit4]   2> 975267 INFO  (TEST-NodeLostTriggerTest.testListenerAcceptance-seed#[39F6F71B76BC849D]) [    ] o.a.s.c.ZkController Remove node as live in ZooKeeper:/live_nodes/127.0.0.1:41477_solr
   [junit4]   2> 975268 INFO  (zkCallback-3288-thread-1) [    ] o.a.s.c.c.ZkStateReader Updated live nodes from ZooKeeper... (6) -> (5)
   [junit4]   2> 975268 INFO  (zkCallback-3259-thread-2) [    ] o.a.s.c.c.ZkStateReader Updated live nodes from ZooKeeper... (6) -> (5)
   [junit4]   2> 975268 INFO  (zkCallback-3274-thread-1) [    ] o.a.s.c.c.ZkStateReader Updated live nodes from ZooKeeper... (6) -> (5)
   [junit4]   2> 975268 INFO  (TEST-NodeLostTriggerTest.testListenerAcceptance-seed#[39F6F71B76BC849D]) [    ] o.a.s.m.SolrMetricManager Closing metric reporters for registry=solr.cluster, tag=null
   [junit4]   2> 975268 INFO  (zkCallback-3284-thread-1) [    ] o.a.s.c.c.ZkStateReader Updated live nodes from ZooKeeper... (6) -> (5)
   [junit4]   2> 975268 INFO  (zkCallback-3301-thread-1) [    ] o.a.s.c.c.ZkStateReader Updated live nodes from ZooKeeper... (6) -> (5)
   [junit4]   2> 975268 INFO  (zkCallback-3251-thread-1) [    ] o.a.s.c.c.ZkStateReader Updated live nodes from ZooKeeper... (6) -> (5)
   [junit4]   2> 975268 INFO  (zkCallback-3314-thread-1) [    ] o.a.s.c.c.ZkStateReader Updated live nodes from ZooKeeper... (6) -> (5)
   [junit4]   2> 975268 INFO  (zkCallback-3268-thread-1) [    ] o.a.s.c.c.ZkStateReader Updated live nodes from ZooKeeper... (6) -> (5)
   [junit4]   2> 975268 INFO  (zkCallback-3322-thread-1) [    ] o.a.s.c.c.ZkStateReader Updated live nodes from ZooKeeper... (6) -> (5)
   [junit4]   2> 975268 INFO  (zkCallback-3330-thread-1) [    ] o.a.s.c.c.ZkStateReader Updated live nodes from ZooKeeper... (6) -> (5)
   [junit4]   2> 975268 INFO  (zkCallback-3337-thread-1) [    ] o.a.s.c.c.ZkStateReader Updated live nodes from ZooKeeper... (6) -> (5)
   [junit4]   2> 975268 INFO  (zkCallback-3290-thread-1) [    ] o.a.s.c.c.ZkStateReader Updated live nodes from ZooKeeper... (6) -> (5)
   [junit4]   2> 975269 INFO  (TEST-NodeLostTriggerTest.testListenerAcceptance-seed#[39F6F71B76BC849D]) [    ] o.e.j.s.h.ContextHandler Stopped o.e.j.s.ServletContextHandler@bf68bf6{/solr,null,UNAVAILABLE}
   [junit4]   2> 975269 INFO  (TEST-NodeLostTriggerTest.testListenerAcceptance-seed#[39F6F71B76BC849D]) [    ] o.e.j.s.session node0 Stopped scavenging
   [junit4]   2> 975270 INFO  (zkConnectionManagerCallback-3343-thread-1) [    ] o.a.s.c.c.ConnectionManager zkClient has connected
   [junit4]   2> 975270 DEBUG (TEST-NodeLostTriggerTest.testListenerAcceptance-seed#[39F6F71B76BC849D]) [    ] o.a.s.c.a.NodeLostTrigger Running NodeLostTrigger: node_added_trigger with currently live nodes: 5
   [junit4]   2> 975270 DEBUG (TEST-NodeLostTriggerTest.testListenerAcceptance-seed#[39F6F71B76BC849D]) [    ] o.a.s.c.a.NodeLostTrigger Tracking lost node: 127.0.0.1:41477_solr
   [junit4]   2> 975270 DEBUG (TEST-NodeLostTriggerTest.testListenerAcceptance-seed#[39F6F71B76BC849D]) [    ] o.a.s.c.a.NodeLostTrigger NodeLostTrigger firing registered processor for lost nodes: [127.0.0.1:41477_solr]
   [junit4]   2> 975271 DEBUG (TEST-NodeLostTriggerTest.testListenerAcceptance-seed#[39F6F71B76BC849D]) [    ] o.a.s.c.a.NodeLostTrigger NodeLostTrigger processor for lost nodes: [127.0.0.1:41477_solr] is not ready, will try later
   [junit4]   2> 975271 DEBUG (TEST-NodeLostTriggerTest.testListenerAcceptance-seed#[39F6F71B76BC849D]) [    ] o.a.s.c.a.NodeLostTrigger Running NodeLostTrigger: node_added_trigger with currently live nodes: 5
   [junit4]   2> 975271 DEBUG (TEST-NodeLostTriggerTest.testListenerAcceptance-seed#[39F6F71B76BC849D]) [    ] o.a.s.c.a.NodeLostTrigger NodeLostTrigger firing registered processor for lost nodes: [127.0.0.1:41477_solr]
   [junit4]   2> 975271 DEBUG (TEST-NodeLostTriggerTest.testListenerAcceptance-seed#[39F6F71B76BC849D]) [    ] o.a.s.c.a.NodeLostTrigger Running NodeLostTrigger: node_added_trigger with currently live nodes: 5
   [junit4]   2> 975271 INFO  (TEST-NodeLostTriggerTest.testListenerAcceptance-seed#[39F6F71B76BC849D]) [    ] o.a.s.SolrTestCaseJ4 ###Ending testListenerAcceptance
   [junit4]   2> 975276 INFO  (zkCallback-3307-thread-1) [    ] o.a.s.c.c.ZkStateReader Updated live nodes from ZooKeeper... (6) -> (5)
   [junit4]   2> 975304 INFO  (TEST-NodeLostTriggerTest.testTrigger-seed#[39F6F71B76BC849D]) [    ] o.a.s.SolrTestCaseJ4 ###Starting testTrigger
   [junit4]   2> 975304 DEBUG (TEST-NodeLostTriggerTest.testTrigger-seed#[39F6F71B76BC849D]) [    ] o.a.s.c.a.NodeLostTrigger NodeLostTrigger node_lost_trigger - Initial livenodes: [127.0.0.1:41087_solr, 127.0.0.1:37257_solr, 127.0.0.1:34131_solr, 127.0.0.1:41345_solr, 127.0.0.1:36467_solr]
   [junit4]   2> 975305 DEBUG (TEST-NodeLostTriggerTest.testTrigger-seed#[39F6F71B76BC849D]) [    ] o.a.s.c.a.NodeLostTrigger Adding lost node from marker path: 127.0.0.1:41477_solr
   [junit4]   2> 975305 DEBUG (TEST-NodeLostTriggerTest.testTrigger-seed#[39F6F71B76BC849D]) [    ] o.a.s.c.a.NodeLostTrigger Running NodeLostTrigger: node_lost_trigger with currently live nodes: 5
   [junit4]   2> 975305 INFO  (TEST-NodeLostTriggerTest.testTrigger-seed#[39F6F71B76BC849D]) [    ] o.e.j.s.AbstractConnector Stopped ServerConnector@4d159df7{SSL,[ssl, http/1.1]}{127.0.0.1:0}
   [junit4]   2> 975306 INFO  (TEST-NodeLostTriggerTest.testTrigger-seed#[39F6F71B76BC849D]) [    ] o.a.s.c.CoreContainer Shutting down CoreContainer instance=326498044
   [junit4]   2> 975306 INFO  (TEST-NodeLostTriggerTest.testTrigger-seed#[39F6F71B76BC849D]) [    ] o.a.s.m.SolrMetricManager Closing metric reporters for registry=solr.node, tag=null
   [junit4]   2> 975306 INFO  (TEST-NodeLostTriggerTest.testTrigger-seed#[39F6F71B76BC849D]) [    ] o.a.s.m.r.SolrJmxReporter Closing reporter [org.apache.solr.metrics.reporters.SolrJmxReporter@45cb8f4f: rootName = solr_41345, domain = solr.node, service url = null, agent id = null] for registry solr.node / com.codahale.metrics.MetricRegistry@55433a18
   [junit4]   2> 975311 INFO  (TEST-NodeLostTriggerTest.testTrigger-seed#[39F6F71B76BC849D]) [    ] o.a.s.m.SolrMetricManager Closing metric reporters for registry=solr.jvm, tag=null
   [junit4]   2> 975312 INFO  (TEST-NodeLostTriggerTest.testTrigger-seed#[39F6F71B76BC849D]) [    ] o.a.s.m.r.SolrJmxReporter Closing reporter [org.apache.solr.metrics.reporters.SolrJmxReporter@7950d43d: rootName = solr_41345, domain = solr.jvm, service url = null, agent id = null] for registry solr.jvm / com.codahale.metrics.MetricRegistry@4cacfe20
   [junit4]   2> 975314 INFO  (TEST-NodeLostTriggerTest.testTrigger-seed#[39F6F71B76BC849D]) [    ] o.a.s.m.SolrMetricManager Closing metric reporters for registry=solr.jetty, tag=null
   [junit4]   2> 975314 INFO  (TEST-NodeLostTriggerTest.testTrigger-seed#[39F6F71B76BC849D]) [    ] o.a.s.m.r.SolrJmxReporter Closing reporter [org.apache.solr.metrics.reporters.SolrJmxReporter@5a9e2039: rootName = solr_41345, domain = solr.jetty, service url = null, agent id = null] for registry solr.jetty / com.codahale.metrics.MetricRegistry@7add2619
   [junit4]   2> 975315 INFO  (TEST-NodeLostTriggerTest.testTrigger-seed#[39F6F71B76BC849D]) [    ] o.a.s.c.ZkController Remove node as live in ZooKeeper:/live_nodes/127.0.0.1:41345_solr
   [junit4]   2> 975316 INFO  (zkCallback-3259-thread-2) [    ] o.a.s.c.c.ZkStateReader Updated live nodes from ZooKeeper... (5) -> (4)
   [junit4]   2> 975316 INFO  (zkCallback-3307-thread-1) [    ] o.a.s.c.c.ZkStateReader Updated live nodes from ZooKeeper... (5) -> (4)
   [junit4]   2> 975316 INFO  (zkCallback-3274-thread-1) [    ] o.a.s.c.c.ZkStateReader Updated live nodes from ZooKeeper... (5) -> (4)
   [junit4]   2> 975316 INFO  (zkCallback-3288-thread-1) [    ] o.a.s.c.c.ZkStateReader Updated live nodes from ZooKeeper... (5) -> (4)
   [junit4]   2> 975316 INFO  (TEST-NodeLostTriggerTest.testTrigger-seed#[39F6F71B76BC849D]) [    ] o.a.s.m.SolrMetricManager Closing metric reporters for registry=solr.cluster, tag=null
   [junit4]   2> 975316 INFO  (zkCallback-3322-thread-1) [    ] o.a.s.c.c.ZkStateReader Updated live nodes from ZooKeeper... (5) -> (4)
   [junit4]   2> 975316 INFO  (zkCallback-3290-thread-1) [    ] o.a.s.c.c.ZkStateReader Updated live nodes from ZooKeeper... (5) -> (4)
   [junit4]   2> 975316 INFO  (zkCallback-3301-thread-1) [    ] o.a.s.c.c.ZkStateReader Updated live nodes from ZooKeeper... (5) -> (4)
   [junit4]   2> 975316 INFO  (zkCallback-3314-thread-1) [    ] o.a.s.c.c.ZkStateReader Updated live nodes from ZooKeeper... (5) -> (4)
   [junit4]   2> 975316 INFO  (zkCallback-3251-thread-1) [    ] o.a.s.c.c.ZkStateReader Updated live nodes from ZooKeeper... (5) -> (4)
   [junit4]   2> 975316 INFO  (zkCallback-3284-thread-1) [    ] o.a.s.c.c.ZkStateReader Updated live nodes from ZooKeeper... (5) -> (4)
   [junit4]   2> 975316 INFO  (zkCallback-3268-thread-1) [    ] o.a.s.c.c.ZkStateReader Updated live nodes from ZooKeeper... (5) -> (4)
   [junit4]   2> 975318 INFO  (TEST-NodeLostTriggerTest.testTrigger-seed#[39F6F71B76BC849D]) [    ] o.e.j.s.h.ContextHandler Stopped o.e.j.s.ServletContextHandler@bcdebda{/solr,null,UNAVAILABLE}
   [junit4]   2> 975319 INFO  (TEST-NodeLostTriggerTest.testTrigger-seed#[39F6F71B76BC849D]) [    ] o.e.j.s.session node0 Stopped scavenging
   [junit4]   2> 975319 INFO  (TEST-NodeLostTriggerTest.testTrigger-seed#[39F6F71B76BC849D]) [    ] o.e.j.s.AbstractConnector Stopped ServerConnector@4a67fbe9{SSL,[ssl, http/1.1]}{127.0.0.1:0}
   [junit4]   2> 975320 INFO  (TEST-NodeLostTriggerTest.testTrigger-seed#[39F6F71B76BC849D]) [    ] o.a.s.c.CoreContainer Shutting down CoreContainer instance=1722133855
   [junit4]   2> 975320 INFO  (TEST-NodeLostTriggerTest.testTrigger-seed#[39F6F71B76BC849D]) [    ] o.a.s.m.SolrMetricManager Closing metric reporters for registry=solr.node, tag=null
   [junit4]   2> 975320 INFO  (TEST-NodeLostTriggerTest.testTrigger-seed#[39F6F71B76BC849D]) [    ] o.a.s.m.r.SolrJmxReporter Closing reporter [org.apache.solr.metrics.reporters.SolrJmxReporter@40f024ab: rootName = solr_41087, domain = solr.node, service url = null, agent id = null] for registry solr.node / com.codahale.metrics.MetricRegistry@a99d1f6
   [junit4]   2> 975325 INFO  (TEST-NodeLostTriggerTest.testTrigger-seed#[39F6F71B76BC849D]) [    ] o.a.s.m.SolrMetricManager Closing metric reporters for registry=solr.jvm, tag=null
   [junit4]   2> 975325 INFO  (TEST-NodeLostTriggerTest.testTrigger-seed#[39F6F71B76BC849D]) [    ] o.a.s.m.r.SolrJmxReporter Closing reporter [org.apache.solr.metrics.reporters.SolrJmxReporter@74f90e4f: rootName = solr_41087, domain = solr.jvm, service url = null, agent id = null] for registry solr.jvm / com.codahale.metrics.MetricRegistry@4cacfe20
   [junit4]   2> 975328 INFO  (TEST-NodeLostTriggerTest.testTrigger-seed#[39F6F71B76BC849D]) [    ] o.a.s.m.SolrMetricManager Closing metric reporters for registry=solr.jetty, tag=null
   [junit4]   2> 975328 INFO  (TEST-NodeLostTriggerTest.testTrigger-seed#[39F6F71B76BC849D]) [    ] o.a.s.m.r.SolrJmxReporter Closing reporter [org.apache.solr.metrics.reporters.SolrJmxReporter@5a8d221b: rootName = solr_41087, domain = solr.jetty, service url = null, agent id = null] for registry solr.jetty / com.codahale.metrics.MetricRegistry@7add2619
   [junit4]   2> 975329 INFO  (TEST-NodeLostTriggerTest.testTrigger-seed#[39F6F71B76BC849D]) [    ] o.a.s.c.ZkController Remove node as live in ZooKeeper:/live_nodes/127.0.0.1:41087_solr
   [junit4]   2> 975329 INFO  (TEST-NodeLostTriggerTest.testTrigger-seed#[39F6F71B76BC849D]) [    ] o.a.s.m.SolrMetricManager Closing metric reporters for registry=solr.cluster, tag=null
   [junit4]   2> 975329 INFO  (zkCallback-3274-thread-1) [    ] o.a.s.c.c.ZkStateReader Updated live nodes from ZooKeeper... (4) -> (3)
   [junit4]   2> 975329 INFO  (zkCallback-3251-thread-1) [    ] o.a.s.c.c.ZkStateReader Updated live nodes from ZooKeeper... (4) -> (3)
   [junit4]   2> 975329 INFO  (zkCallback-3301-thread-1) [    ] o.a.s.c.c.ZkStateReader Updated live nodes from ZooKeeper... (4) -> (3)
   [junit4]   2> 975329 INFO  (zkCallback-3307-thread-1) [    ] o.a.s.c.c.ZkStateReader Updated live nodes from ZooKeeper... (4) -> (3)
   [junit4]   2> 975329 INFO  (zkCallback-3314-thread-1) [    ] o.a.s.c.c.ZkStateReader Updated live nodes from ZooKeeper... (4) -> (3)
   [junit4]   2> 975330 INFO  (zkCallback-3259-thread-2) [    ] o.a.s.c.c.ZkStateReader Updated live nodes from ZooKeeper... (4) -> (3)
   [junit4]   2> 975330 INFO  (zkCallback-3284-thread-1) [    ] o.a.s.c.c.ZkStateReader Updated live nodes from ZooKeeper... (4) -> (3)
   [junit4]   2> 975330 INFO  (zkCallback-3290-thread-1) [    ] o.a.s.c.c.ZkStateReader Updated live nodes from ZooKeeper... (4) -> (3)
   [junit4]   2> 975330 INFO  (zkCallback-3322-thread-1) [    ] o.a.s.c.c.ZkStateReader Updated live nodes from ZooKeeper... (4) -> (3)
   [junit4]   2> 975332 INFO  (TEST-NodeLostTriggerTest.testTrigger-seed#[39F6F71B76BC849D]) [    ] o.e.j.s.h.ContextHandler Stopped o.e.j.s.ServletContextHandler@69f86a1{/solr,null,UNAVAILABLE}
   [junit4]   2> 975332 INFO  (TEST-NodeLostTriggerTest.testTrigger-seed#[39F6F71B76BC849D]) [    ] o.e.j.s.session node0 Stopped scavenging
   [junit4]   2> 975671 DEBUG (ScheduledTrigger-5020-thread-2) [    ] o.a.s.c.a.NodeLostTrigger Running NodeLostTrigger: .auto_add_replicas with currently live nodes: 3
   [junit4]   2> 975671 DEBUG (ScheduledTrigger-5020-thread-2) [    ] o.a.s.c.a.NodeLostTrigger Tracking lost node: 127.0.0.1:41345_solr
   [junit4]   2> 976334 DEBUG (TEST-NodeLostTriggerTest.testTrigger-seed#[39F6F71B76BC849D]) [    ] o.a.s.c.a.NodeLostTrigger Running NodeLostTrigger: node_lost_trigger with currently live nodes: 3
   [junit4]   2> 976334 DEBUG (TEST-NodeLostTriggerTest.testTrigger-seed#[39F6F71B76BC849D]) [    ] o.a.s.c.a.NodeLostTrigger Tracking lost node: 127.0.0.1:41087_solr
   [junit4]   2> 976334 DEBUG (TEST-NodeLostTriggerTest.testTrigger-seed#[39F6F71B76BC849D]) [    ] o.a.s.c.a.NodeLostTrigger Tracking lost node: 127.0.0.1:41345_solr
   [junit4]   2> 976672 DEBUG (ScheduledTrigger-5020-thread-4) [    ] o.a.s.c.a.NodeLostTrigger Running NodeLostTrigger: .auto_add_replicas with currently live nodes: 3
   [junit4]   2> 977334 DEBUG (TEST-NodeLostTriggerTest.testTrigger-seed#[39F6F71B76BC849D]) [    ] o.a.s.c.a.NodeLostTrigger Running NodeLostTrigger: node_lost_trigger with currently live nodes: 3
   [junit4]   2> 977672 DEBUG (ScheduledTrigger-5020-thread-2) [    ] o.a.s.c.a.NodeLostTrigger Running NodeLostTrigger: .auto_add_replicas with currently live nodes: 3
   [junit4]   2> 978334 DEBUG (TEST-NodeLostTriggerTest.testTrigger-seed#[39F6F71B76BC849D]) [    ] o.a.s.c.a.NodeLostTrigger Running NodeLostTrigger: node_lost_trigger with currently live nodes: 3
   [junit4]   2> 978334 DEBUG (TEST-NodeLostTriggerTest.testTrigger-seed#[39F6F71B76BC849D]) [    ] o.a.s.c.a.NodeLostTrigger NodeLostTrigger firing registered processor for lost nodes: [127.0.0.1:41477_solr]
   [junit4]   2> 978672 DEBUG (ScheduledTrigger-5020-thread-4) [    ] o.a.s.c.a.NodeLostTrigger Running NodeLostTrigger: .auto_add_replicas with currently live nodes: 3
   [junit4]   2> 979335 INFO  (TEST-NodeLostTriggerTest.testTrigger-seed#[39F6F71B76BC849D]) [    ] o.a.s.SolrTestCaseJ4 ###Ending testTrigger
   [junit4]   2> NOTE: reproduce with: ant test  -Dtestcase=NodeLostTriggerTest -Dtests.method=testTrigger -Dtests.seed=39F6F71B76BC849D -Dtests.multiplier=3 -Dtests.slow=true -Dtests.locale=en-US -Dtests.timezone=US/Eastern -Dtests.asserts=true -Dtests.file.encoding=US-ASCII
   [junit4] FAILURE 4.07s J0 | NodeLostTriggerTest.testTrigger <<<
   [junit4]    > Throwable #1: java.lang.AssertionError: [127.0.0.1:41477_solr] doesn't contain 127.0.0.1:41345_solr
   [junit4]    > 	at __randomizedtesting.SeedInfo.seed([39F6F71B76BC849D:5A3DC199EF73F7B0]:0)
   [junit4]    > 	at org.apache.solr.cloud.autoscaling.NodeLostTriggerTest.testTrigger(NodeLostTriggerTest.java:117)
   [junit4]    > 	at java.lang.Thread.run(Thread.java:748)
   [junit4]   2> 979353 INFO  (TEST-NodeLostTriggerTest.testRestoreState-seed#[39F6F71B76BC849D]) [    ] o.a.s.SolrTestCaseJ4 ###Starting testRestoreState
   [junit4]   2> 979354 INFO  (TEST-NodeLostTriggerTest.testRestoreState-seed#[39F6F71B76BC849D]) [    ] o.e.j.s.Server jetty-9.4.11.v20180605; built: 2018-06-05T18:24:03.829Z; git: d5fc0523cfa96bfebfbda19606cad384d772f04c; jvm 1.8.0_172-b11
   [junit4]   2> 979358 INFO  (TEST-NodeLostTriggerTest.testRestoreState-seed#[39F6F71B76BC849D]) [    ] o.e.j.s.session DefaultSessionIdManager workerName=node0
   [junit4]   2> 979358 INFO  (TEST-NodeLostTriggerTest.testRestoreState-seed#[39F6F71B76BC849D]) [    ] o.e.j.s.session No SessionScavenger set, using defaults
   [junit4]   2> 979358 INFO  (TEST-NodeLostTriggerTest.testRestoreState-seed#[39F6F71B76BC849D]) [    ] o.e.j.s.session node0 Scavenging every 660000ms
   [junit4]   2> 979358 INFO  (TEST-NodeLostTriggerTest.testRestoreState-seed#[39F6F71B76BC849D]) [    ] o.e.j.s.h.ContextHandler Started o.e.j.s.ServletContextHandler@33d71d26{/solr,null,AVAILABLE}
   [junit4]   2> 979359 INFO  (TEST-NodeLostTriggerTest.testRestoreState-seed#[39F6F71B76BC849D]) [    ] o.e.j.s.AbstractConnector Started ServerConnector@171957d8{SSL,[ssl, http/1.1]}{127.0.0.1:36183}
   [junit4]   2> 979359 INFO  (TEST-NodeLostTriggerTest.testRestoreState-seed#[39F6F71B76BC849D]) [    ] o.e.j.s.Server Started @979385ms
   [junit4]   2> 979359 INFO  (TEST-NodeLostTriggerTest.testRestoreState-seed#[39F6F71B76BC849D]) [    ] o.a.s.c.s.e.JettySolrRunner Jetty properties: {hostContext=/solr, hostPort=36183}
   [junit4]   2> 979359 ERROR (TEST-NodeLostTriggerTest.testRestoreState-seed#[39F6F71B76BC849D]) [    ] o.a.s.u.StartupLoggingUtils Missing Java Option solr.log.dir. Logging may be missing or incomplete.
   [junit4]   2> 979359 INFO  (TEST-NodeLostTriggerTest.testRestoreState-seed#[39F6F71B76BC849D]) [    ] o.a.s.s.SolrDispatchFilter Using logger factory org.apache.logging.slf4j.Log4jLoggerFactory
   [junit4]   2> 979359 INFO  (TEST-NodeLostTriggerTest.testRestoreState-seed#[39F6F71B76BC849D]) [    ] o.a.s.s.SolrDispatchFilter  ___      _       Welcome to Apache Solr? version 8.0.0
   [junit4]   2> 979359 INFO  (TEST-NodeLostTriggerTest.testRestoreState-seed#[39F6F71B76BC849D]) [    ] o.a.s.s.SolrDispatchFilter / __| ___| |_ _   Starting in cloud mode on port null
   [junit4]   2> 979359 INFO  (TEST-NodeLostTriggerTest.testRestoreState-seed#[39F6F71B76BC849D]) [    ] o.a.s.s.SolrDispatchFilter \__ \/ _ \ | '_|  Install dir: null
   [junit4]   2> 979359 INFO  (TEST-NodeLostTriggerTest.testRestoreState-seed#[39F6F71B76BC849D]) [    ] o.a.s.s.SolrDispatchFilter |___/\___/_|_|    Start time: 2018-09-14T01:12:18.441Z
   [junit4]   2> 979360 INFO  (zkConnectionManagerCallback-3345-thread-1) [    ] o.a.s.c.c.ConnectionManager zkClient has connected
   [junit4]   2> 979360 INFO  (TEST-NodeLostTriggerTest.testRestoreState-seed#[39F6F71B76BC849D]) [    ] o.a.s.s.SolrDispatchFilter solr.xml found in ZooKeeper. Loading...
   [junit4]   2> 979418 INFO  (TEST-NodeLostTriggerTest.testRestoreState-seed#[39F6F71B76BC849D]) [    ] o.a.s.c.ZkContainer Zookeeper client=127.0.0.1:34981/solr
   [junit4]   2> 979418 INFO  (zkConnectionManagerCallback-3349-thread-1) [    ] o.a.s.c.c.ConnectionManager zkClient has connected
   [junit4]   2> 979419 INFO  (zkConnectionManagerCallback-3351-thread-1) [    ] o.a.s.c.c.ConnectionManager zkClient has connected
   [junit4]   2> 979422 INFO  (TEST-NodeLostTriggerTest.testRestoreState-seed#[39F6F71B76BC849D]) [    ] o.a.s.c.c.ZkStateReader Updated live nodes from ZooKeeper... (0) -> (3)
   [junit4]   2> 979424 INFO  (TEST-NodeLostTriggerTest.testRestoreState-seed#[39F6F71B76BC849D]) [    ] o.a.s.c.TransientSolrCoreCacheDefault Allocating transient cache for 2147483647 transient cores
   [junit4]   2> 979424 INFO  (TEST-NodeLostTriggerTest.testRestoreState-seed#[39F6F71B76BC849D]) [    ] o.a.s.c.ZkController Register node as live in ZooKeeper:/live_nodes/127.0.0.1:36183_solr
   [junit4]   2> 979424 INFO  (zkCallback-3301-thread-1) [    ] o.a.s.c.c.ZkStateReader Updated live nodes from ZooKeeper... (3) -> (4)
   [junit4]   2> 979424 INFO  (zkCallback-3290-thread-1) [    ] o.a.s.c.c.ZkStateReader Updated live nodes from ZooKeeper... (3) -> (4)
   [junit4]   2> 979424 INFO  (zkCallback-3322-thread-1) [    ] o.a.s.c.c.ZkStateReader Updated live nodes from ZooKeeper... (3) -> (4)
   [junit4]   2> 979424 INFO  (zkCallback-3284-thread-1) [    ] o.a.s.c.c.ZkStateReader Updated live nodes from ZooKeeper... (3) -> (4)
   [junit4]   2> 979424 INFO  (zkCallback-3251-thread-1) [    ] o.a.s.c.c.ZkStateReader Updated live nodes from ZooKeeper... (3) -> (4)
   [junit4]   2> 979424 INFO  (zkCallback-3259-thread-2) [    ] o.a.s.c.c.ZkStateReader Updated live nodes from ZooKeeper... (3) -> (4)
   [junit4]   2> 979424 INFO  (zkCallback-3350-thread-1) [    ] o.a.s.c.c.ZkStateReader Updated live nodes from ZooKeeper... (3) -> (4)
   [junit4]   2> 979425 INFO  (zkCallback-3274-thread-1) [    ] o.a.s.c.c.ZkStateReader Updated live nodes from ZooKeeper... (3) -> (4)
   [junit4]   2> 979442 INFO  (zkConnectionManagerCallback-3358-thread-1) [    ] o.a.s.c.c.ConnectionManager zkClient has connected
   [junit4]   2> 979442 INFO  (TEST-NodeLostTriggerTest.testRestoreState-seed#[39F6F71B76BC849D]) [    ] o.a.s.c.c.ZkStateReader Updated live nodes from ZooKeeper... (0) -> (4)
   [junit4]   2> 979443 INFO  (TEST-NodeLostTriggerTest.testRestoreState-seed#[39F6F71B76BC849D]) [    ] o.a.s.c.s.i.ZkClientClusterStateProvider Cluster at 127.0.0.1:34981/solr ready
   [junit4]   2> 979443 INFO  (TEST-NodeLostTriggerTest.testRestoreState-seed#[39F6F71B76BC849D]) [    ] o.a.s.h.a.MetricsHistoryHandler No .system collection, keeping metrics history in memory.
   [junit4]   2> 979460 INFO  (TEST-NodeLostTriggerTest.testRestoreState-seed#[39F6F71B76BC849D]) [    ] o.a.s.m.r.SolrJmxReporter JMX monitoring for 'solr_36183.solr.node' (registry 'solr.node') enabled at server: com.sun.jmx.mbeanserver.JmxMBeanServer@474a80f9
   [junit4]   2> 979468 INFO  (TEST-NodeLostTriggerTest.testRestoreState-seed#[39F6F71B76BC849D]) [    ] o.a.s.m.r.SolrJmxReporter JMX monitoring for 'solr_36183.solr.jvm' (registry 'solr.jvm') enabled at server: com.sun.jmx.mbeanserver.JmxMBeanServer@474a80f9
   [junit4]   2> 979468 INFO  (TEST-NodeLostTriggerTest.testRestoreState-seed#[39F6F71B76BC849D]) [    ] o.a.s.m.r.SolrJmxReporter JMX monitoring for 'solr_36183.solr.jetty' (registry 'solr.jetty') enabled at server: com.sun.jmx.mbeanserver.JmxMBeanServer@474a80f9
   [junit4]   2> 979470 INFO  (TEST-NodeLostTriggerTest.testRestoreState-seed#[39F6F71B76BC849D]) [    ] o.a.s.c.CorePropertiesLocator Found 0 core definitions underneath /home/jenkins/workspace/Lucene-Solr-master-Linux/solr/build/solr-core/test/J0/temp/solr.cloud.autoscaling.NodeLostTriggerTest_39F6F71B76BC849D-001/tempDir-001/node7/.
   [junit4]   2> 979511 DEBUG (TEST-NodeLostTriggerTest.testRestoreState-seed#[39F6F71B76BC849D]) [    ] o.a.s.c.a.NodeLostTrigger NodeLostTrigger node_lost_trigger - Initial livenodes: [127.0.0.1:36183_solr, 127.0.0.1:37257_solr, 127.0.0.1:34131_solr, 127.0.0.1:36467_solr]
   [junit4]   2> 979511 DEBUG (TEST-NodeLostTriggerTest.testRestoreState-seed#[39F6F71B76BC849D]) [    ] o.a.s.c.a.NodeLostTrigger Adding lost node from marker path: 127.0.0.1:41087_solr
   [junit4]   2> 979511 DEBUG (TEST-NodeLostTriggerTest.testRestoreState-seed#[39F6F71B76BC849D]) [    ] o.a.s.c.a.NodeLostTrigger Adding lost node from marker path: 127.0.0.1:41345_solr
   [junit4]   2> 979512 DEBUG (TEST-NodeLostTriggerTest.testRestoreState-seed#[39F6F71B76BC849D]) [    ] o.a.s.c.a.NodeLostTrigger Running NodeLostTrigger: node_lost_trigger with currently live nodes: 4
   [junit4]   2> 979512 INFO  (TEST-NodeLostTriggerTest.testRestoreState-seed#[39F6F71B76BC849D]) [    ] o.e.j.s.AbstractConnector Stopped ServerConnector@171957d8{SSL,[ssl, http/1.1]}{127.0.0.1:0}
   [junit4]   2> 979513 INFO  (TEST-NodeLostTriggerTest.testRestoreState-seed#[39F6F71B76BC849D]) [    ] o.a.s.c.CoreContainer Shutting down CoreContainer instance=534992206
   [junit4]   2> 979513 INFO  (TEST-NodeLostTriggerTest.testRestoreState-seed#[39F6F71B76BC849D]) [    ] o.a.s.m.SolrMetricManager Closing metric reporters for registry=solr.node, tag=null
   [junit4]   2> 979513 INFO  (TEST-NodeLostTriggerTest.testRestoreState-seed#[39F6F71B76BC849D]) [    ] o.a.s.m.r.SolrJmxReporter Closing reporter [org.apache.solr.metrics.reporters.SolrJmxReporter@5e4b0801: rootName = solr_36183, domain = solr.node, service url = null, agent id = null] for registry solr.node / com.codahale.metrics.MetricRegistry@3071a358
   [junit4]   2> 979522 INFO  (TEST-NodeLostTriggerTest.testRestoreState-seed#[39F6F71B76BC849D]) [    ] o.a.s.m.SolrMetricManager Closing metric reporters for registry=solr.jvm, tag=null
   [junit4]   2> 979522 INFO  (TEST-NodeLostTriggerTest.testRestoreState-seed#[39F6F71B76BC849D]) [    ] o.a.s.m.r.SolrJmxReporter Closing reporter [org.apache.solr.metrics.reporters.SolrJmxReporter@419ac204: rootName = solr_36183, domain = solr.jvm, service url = null, agent id = null] for registry solr.jvm / com.codahale.metrics.MetricRegistry@4cacfe20
   [junit4]   2> 979525 INFO  (TEST-NodeLostTriggerTest.testRestoreState-seed#[39F6F71B76BC849D]) [    ] o.a.s.m.SolrMetricManager Closing metric reporters for registry=solr.jetty, tag=null
   [junit4]   2> 979525 INFO  (TEST-NodeLostTriggerTest.testRestoreState-seed#[39F6F71B76BC849D]) [    ] o.a.s.m.r.SolrJmxReporter Closing reporter [org.apache.solr.metrics.reporters.SolrJmxReporter@33ad148a: rootName = solr_36183, domain = solr.jetty, service url = null, agent id = null] for registry solr.jetty / com.codahale.metrics.MetricRegistry@7add2619
   [junit4]   2> 979525 INFO  (TEST-NodeLostTriggerTest.testRestoreState-seed#[39F6F71B76BC849D]) [    ] o.a.s.c.ZkController Remove node as live in ZooKeeper:/live_nodes/127.0.0.1:36183_solr
   [junit4]   2> 979526 INFO  (TEST-NodeLostTriggerTest.testRestoreState-seed#[39F6F71B76BC849D]) [    ] o.a.s.m.SolrMetricManager Closing metric reporters for registry=solr.cluster, tag=null
   [junit4]   2> 979526 INFO  (zkCallback-3274-thread-1) [    ] o.a.s.c.c.ZkStateReader Updated live nodes from ZooKeeper... (4) -> (3)
   [junit4]   2> 979526 INFO  (zkCallback-3322-thread-1) [    ] o.a.s.c.c.ZkStateReader Updated live nodes from ZooKeeper... (4) -> (3)
   [junit4]   2> 979526 INFO  (zkCallback-3251-thread-1) [    ] o.a.s.c.c.ZkStateReader Updated live nodes from ZooKeeper... (4) -> (3)
   [junit4]   2> 979526 INFO  (zkCallback-3284-thread-1) [    ] o.a.s.c.c.ZkStateReader Updated live nodes from ZooKeeper... (4) -> (3)
   [junit4]   2> 979526 INFO  (zkCallback-3290-thread-1) [    ] o.a.s.c.c.ZkStateReader Updated live nodes from ZooKeeper... (4) -> (3)
   [junit4]   2> 979526 INFO  (zkCallback-3259-thread-2) [    ] o.a.s.c.c.ZkStateReader Updated live nodes from ZooKeeper... (4) -> (3)
   [junit4]   2> 979526 INFO  (zkCallback-3357-thread-1) [    ] o.a.s.c.c.ZkStateReader Updated live nodes from ZooKeeper... (4) -> (3)
   [junit4]   2> 979526 INFO  (zkCallback-3301-thread-1) [    ] o.a.s.c.c.ZkStateReader Updated live nodes from ZooKeeper... (4) -> (3)
   [junit4]   2> 979526 INFO  (zkCallback-3350-thread-1) [    ] o.a.s.c.c.ZkStateReader Updated live nodes from ZooKeeper... (4) -> (3)
   [junit4]   2> 979526 INFO  (TEST-NodeLostTriggerTest.testRestoreState-seed#[39F6F71B76BC849D]) [    ] o.e.j.s.h.ContextHandler Stopped o.e.j.s.ServletContextHandler@33d71d26{/solr,null,UNAVAILABLE}
   [junit4]   2> 979527 INFO  (TEST-NodeLostTriggerTest.testRestoreState-seed#[39F6F71B76BC849D]) [    ] o.e.j.s.session node0 Stopped scavenging
   [junit4]   2> 979527 DEBUG (TEST-NodeLostTriggerTest.testRestoreState-seed#[39F6F71B76BC849D]) [    ] o.a.s.c.a.NodeLostTrigger Running NodeLostTrigger: node_lost_trigger with currently live nodes: 3
   [junit4]   2> 979527 DEBUG (TEST-NodeLostTriggerTest.testRestoreState-seed#[39F6F71B76BC849D]) [    ] o.a.s.c.a.NodeLostTrigger Tracking lost node: 127.0.0.1:36183_solr
   [junit4]   2> 979527 DEBUG (TEST-NodeLostTriggerTest.testRestoreState-seed#[39F6F71B76BC849D]) [    ] o.a.s.c.a.NodeLostTrigger NodeLostTrigger some_different_name - Initial livenodes: [127.0.0.1:37257_solr, 127.0.0.1:34131_solr, 127.0.0.1:36467_solr]
   [junit4]   2> 979527 DEBUG (TEST-NodeLostTriggerTest.testRestoreState-seed#[39F6F71B76BC849D]) [    ] o.a.s.c.a.NodeLostTrigger Adding lost node from marker path: 127.0.0.1:36183_solr
   [junit4]   2> 979527 DEBUG (TEST-NodeLostTriggerTest.testRestoreState-seed#[39F6F71B76BC849D]) [    ] o.a.s.c.a.NodeLostTrigger NodeLostTrigger node_lost_trigger - Initial livenodes: [127.0.0.1:37257_solr, 127.0.0.1:34131_solr, 127.0.0.1:36467_solr]
   [junit4]   2> 979528 DEBUG (TEST-NodeLostTriggerTest.testRestoreState-seed#[39F6F71B76BC849D]) [    ] o.a.s.c.a.NodeLostTrigger Running NodeLostTrigger: node_lost_trigger with currently live nodes: 3
   [junit4]   2> 979673 DEBUG (ScheduledTrigger-5020-thread-2) [    ] o.a.s.c.a.NodeLostTrigger Running NodeLostTrigger: .auto_add_replicas with currently live nodes: 3
   [junit4]   2> 980528 DEBUG (TEST-NodeLostTriggerTest.testRestoreState-seed#[39F6F71B76BC849D]) [    ] o.a.s.c.a.NodeLostTrigger Running NodeLostTrigger: node_lost_trigger with currently live nodes: 3
   [junit4]   2> 980673 DEBUG (ScheduledTrigger-5020-thread-4) [    ] o.a.s.c.a.NodeLostTrigger Running NodeLostTrigger: .auto_add_replicas with currently live nodes: 3
   [junit4]   2> 981528 DEBUG (TEST-NodeLostTriggerTest.testRestoreState-seed#[39F6F71B76BC849D]) [    ] o.a.s.c.a.NodeLostTrigger Running NodeLostTrigger: node_lost_trigger with currently live nodes: 3
   [junit4]   2> 981673 DEBUG (ScheduledTrigger-5020-thread-2) [    ] o.a.s.c.a.NodeLostTrigger Running NodeLostTrigger: .auto_add_replicas with currently live nodes: 3
   [junit4]   2> 982528 DEBUG (TEST-NodeLostTriggerTest.testRestoreState-seed#[39F6F71B76BC849D]) [    ] o.a.s.c.a.NodeLostTrigger Running NodeLostTrigger: node_lost_trigger with currently live nodes: 3
   [junit4]   2> 982673 DEBUG (ScheduledTrigger-5020-thread-4) [    ] o.a.s.c.a.NodeLostTrigger Running NodeLostTrigger: .auto_add_replicas with currently live nodes: 3
   [junit4]   2> 983528 DEBUG (TEST-NodeLostTriggerTest.testRestoreState-seed#[39F6F71B76BC849D]) [    ] o.a.s.c.a.NodeLostTrigger Running NodeLostTrigger: node_lost_trigger with currently live nodes: 3
   [junit4]   2> 983528 DEBUG (TEST-NodeLostTriggerTest.testRestoreState-seed#[39F6F71B76BC849D]) [    ] o.a.s.c.a.NodeLostTrigger NodeLostTrigger firing registered processor for lost nodes: [127.0.0.1:41087_solr, 127.0.0.1:41345_solr, 127.0.0.1:36183_solr]
   [junit4]   2> 983673 DEBUG (ScheduledTrigger-5020-thread-2) [    ] o.a.s.c.a.NodeLostTrigger Running NodeLostTrigger: .auto_add_replicas with currently live nodes: 3
   [junit4]   2> 984529 INFO  (TEST-NodeLostTriggerTest.testRestoreState-seed#[39F6F71B76BC849D]) [    ] o.a.s.SolrTestCaseJ4 ###Ending testRestoreState
   [junit4]   2> 984531 INFO  (jetty-closer-3234-thread-3) [    ] o.e.j.s.AbstractConnector Stopped ServerConnector@1bf84a54{SSL,[ssl, http/1.1]}{127.0.0.1:0}
   [junit4]   2> 984531 INFO  (jetty-closer-3234-thread-1) [    ] o.e.j.s.AbstractConnector Stopped ServerConnector@33ffbd56{SSL,[ssl, http/1.1]}{127.0.0.1:0}
   [junit4]   2> 984531 INFO  (jetty-closer-3234-thread-2) [    ] o.e.j.s.AbstractConnector Stopped ServerConnector@4056811f{SSL,[ssl, http/1.1]}{127.0.0.1:0}
   [junit4]   2> 984531 INFO  (jetty-closer-3234-thread-3) [    ] o.a.s.c.CoreContainer Shutting down CoreContainer instance=186822345
   [junit4]   2> 984532 INFO  (jetty-closer-3234-thread-1) [    ] o.a.s.c.CoreContainer Shutting down CoreContainer instance=1076740704
   [junit4]   2> 984532 INFO  (jetty-closer-3234-thread-2) [    ] o.a.s.c.CoreContainer Shutting down CoreContainer instance=222948190
   [junit4]   2> 984532 INFO  (jetty-closer-3234-thread-3) [    ] o.a.s.m.SolrMetricManager Closing metric reporters for registry=solr.node, tag=null
   [junit4]   2> 984532 INFO  (jetty-closer-3234-thread-3) [    ] o.a.s.m.r.SolrJmxReporter Closing reporter [org.apache.solr.metrics.reporters.SolrJmxReporter@3152ccf6: rootName = solr_36467, domain = solr.node, service url = null, agent id = null] for registry solr.node / com.codahale.metrics.MetricRegistry@31e69f36
   [junit4]   2> 984532 INFO  (jetty-closer-3234-thread-2) [    ] o.a.s.m.SolrMetricManager Closing metric reporters for registry=solr.node, tag=null
   [junit4]   2> 984532 INFO  (jetty-closer-3234-thread-2) [    ] o.a.s.m.r.SolrJmxReporter Closing reporter [org.apache.solr.metrics.reporters.SolrJmxReporter@5848cf04: rootName = solr_37257, domain = solr.node, service url = null, agent id = null] for registry solr.node / com.codahale.metrics.MetricRegistry@160cc169
   [junit4]   2> 984533 INFO  (jetty-closer-3234-thread-1) [    ] o.a.s.m.SolrMetricManager Closing metric reporters for registry=solr.node, tag=null
   [junit4]   2> 984533 INFO  (jetty-closer-3234-thread-1) [    ] o.a.s.m.r.SolrJmxReporter Closing reporter [org.apache.solr.metrics.reporters.SolrJmxReporter@41e5d385: rootName = solr_34131, domain = solr.node, service url = null, agent id = null] for registry solr.node / com.codahale.metrics.MetricRegistry@7ed3df1
   [junit4]   2> 984537 INFO  (jetty-closer-3234-thread-1) [    ] o.a.s.m.SolrMetricManager Closing metric reporters for registry=solr.jvm, tag=null
   [junit4]   2> 984537 INFO  (jetty-closer-3234-thread-1) [    ] o.a.s.m.r.SolrJmxReporter Closing reporter [org.apache.solr.metrics.reporters.SolrJmxReporter@330a252b: rootName = solr_34131, domain = solr.jvm, service url = null, agent id = null] for registry solr.jvm / com.codahale.metrics.MetricRegistry@4cacfe20
   [junit4]   2> 984538 INFO  (jetty-closer-3234-thread-3) [    ] o.a.s.m.SolrMetricManager Closing metric reporters for registry=solr.jvm, tag=null
   [junit4]   2> 984538 INFO  (jetty-closer-3234-thread-2) [    ] o.a.s.m.SolrMetricManager Closing metric reporters for registry=solr.jvm, tag=null
   [junit4]   2> 984538 INFO  (jetty-closer-3234-thread-3) [    ] o.a.s.m.r.SolrJmxReporter Closing reporter [org.apache.solr.metrics.reporters.SolrJmxReporter@3441f910: rootName = solr_36467, domain = solr.jvm, service url = null, agent id = null] for registry solr.jvm / com.codahale.metrics.MetricRegistry@4cacfe20
   [junit4]   2> 984538 INFO  (jetty-closer-3234-thread-2) [    ] o.a.s.m.r.SolrJmxReporter Closing reporter [org.apache.solr.metrics.reporters.SolrJmxReporter@683a9f4c: rootName = solr_37257, domain = solr.jvm, service url = null, agent id = null] for registry solr.jvm / com.codahale.metrics.MetricRegistry@4cacfe20
   [junit4]   2> 984540 INFO  (jetty-closer-3234-thread-1) [    ] o.a.s.m.SolrMetricManager Closing metric reporters for registry=solr.jetty, tag=null
   [junit4]   2> 984540 INFO  (jetty-closer-3234-thread-1) [    ] o.a.s.m.r.SolrJmxReporter Closing reporter [org.apache.solr.metrics.reporters.SolrJmxReporter@7d44689c: rootName = solr_34131, domain = solr.jetty, service url = null, agent id = null] for registry solr.jetty / com.codahale.metrics.MetricRegistry@7add2619
   [junit4]   2> 984541 INFO  (jetty-closer-3234-thread-1) [    ] o.a.s.c.ZkController Remove node as live in ZooKeeper:/live_nodes/127.0.0.1:34131_solr
   [junit4]   2> 984541 INFO  (zkCallback-3290-thread-1) [    ] o.a.s.c.c.ZkStateReader Updated live nodes from ZooKeeper... (3) -> (2)
   [junit4]   2> 984541 INFO  (zkCallback-3301-thread-1) [    ] o.a.s.c.c.ZkStateReader Updated live nodes from ZooKeeper... (3) -> (2)
   [junit4]   2> 984541 INFO  (zkCallback-3284-thread-1) [    ] o.a.s.c.c.ZkStateReader Updated live nodes from ZooKeeper... (3) -> (2)
   [junit4]   2> 984541 INFO  (zkCallback-3274-thread-1) [    ] o.a.s.c.c.ZkStateReader Updated live nodes from ZooKeeper... (3) -> (2)
   [junit4]   2> 984541 INFO  (zkCallback-3259-thread-2) [    ] o.a.s.c.c.ZkStateReader Updated live nodes from ZooKeeper... (3) -> (2)
   [junit4]   2> 984541 INFO  (jetty-closer-3234-thread-1) [    ] o.a.s.m.SolrMetricManager Closing metric reporters for registry=solr.cluster, tag=null
   [junit4]   2> 984542 INFO  (jetty-closer-3234-thread-1) [    ] o.a.s.c.TransientSolrCoreCacheDefault Allocating transient cache for 2147483647 transient cores
   [junit4]   2> 984542 INFO  (zkCallback-3251-thread-1) [    ] o.a.s.c.c.ZkStateReader Updated live nodes from ZooKeeper... (3) -> (2)
   [junit4]   2> 984542 INFO  (jetty-closer-3234-thread-2) [    ] o.a.s.m.SolrMetricManager Closing metric reporters for registry=solr.jetty, tag=null
   [junit4]   2> 984542 INFO  (jetty-closer-3234-thread-2) [    ] o.a.s.m.r.SolrJmxReporter Closing reporter [org.apache.solr.metrics.reporters.SolrJmxReporter@6af5228f: rootName = solr_37257, domain = solr.jetty, service url = null, agent id = null] for registry solr.jetty / com.codahale.metrics.MetricRegistry@7add2619
   [junit4]   2> 984543 INFO  (jetty-closer-3234-thread-3) [    ] o.a.s.m.SolrMetricManager Closing metric reporters for registry=solr.jetty, tag=null
   [junit4]   2> 984543 INFO  (jetty-closer-3234-thread-3) [    ] o.a.s.m.r.SolrJmxReporter Closing reporter [org.apache.solr.metrics.reporters.SolrJmxReporter@515d8acf: rootName = solr_36467, domain = solr.jetty, service url = null, agent id = null] for registry solr.jetty / com.codahale.metrics.MetricRegistry@7add2619
   [junit4]   2> 984543 INFO  (jetty-closer-3234-thread-1) [    ] o.e.j.s.h.ContextHandler Stopped o.e.j.s.ServletContextHandler@9f5252c{/solr,null,UNAVAILABLE}
   [junit4]   2> 984543 INFO  (jetty-closer-3234-thread-1) [    ] o.e.j.s.session node0 Stopped scavenging
   [junit4]   2> 984544 INFO  (jetty-closer-3234-thread-2) [    ] o.a.s.c.ZkController Remove node as live in ZooKeeper:/live_nodes/127.0.0.1:37257_solr
   [junit4]   2> 984544 INFO  (jetty-closer-3234-thread-3) [    ] o.a.s.c.ZkController Remove node as live in ZooKeeper:/live_nodes/127.0.0.1:36467_solr
   [junit4]   2> 984544 INFO  (jetty-closer-3234-thread-3) [    ] o.a.s.m.SolrMetricManager Closing metric reporters for registry=solr.cluster, tag=null
   [junit4]   2> 984544 INFO  (zkCallback-3290-thread-1) [    ] o.a.s.c.c.ZkStateReader Updated live nodes from ZooKeeper... (2) -> (0)
   [junit4]   2> 984544 INFO  (zkCallback-3274-thread-1) [    ] o.a.s.c.c.ZkStateReader Updated live nodes from ZooKeeper... (2) -> (0)
   [junit4]   2> 984544 INFO  (jetty-closer-3234-thread-2) [    ] o.a.s.m.SolrMetricManager Closing metric reporters for registry=solr.cluster, tag=null
   [junit4]   2> 984544 INFO  (zkCallback-3259-thread-2) [    ] o.a.s.c.c.ZkStateReader Updated live nodes from ZooKeeper... (2) -> (0)
   [junit4]   2> 984545 INFO  (zkCallback-3301-thread-1) [    ] o.a.s.c.c.ZkStateReader Updated live nodes from ZooKeeper... (2) -> (0)
   [junit4]   2> 984545 INFO  (jetty-closer-3234-thread-2) [    ] o.a.s.c.Overseer Overseer (id=72220333759856649-127.0.0.1:37257_solr-n_0000000000) closing
   [junit4]   2> 984545 WARN  (OverseerAutoScalingTriggerThread-72220333759856649-127.0.0.1:37257_solr-n_0000000000) [    ] o.a.s.c.a.OverseerTriggerThread OverseerTriggerThread woken up but we are closed, exiting.
   [junit4]   2> 984545 DEBUG (jetty-closer-3234-thread-2) [    ] o.a.s.c.a.ScheduledTriggers Shutting down scheduled thread pool executor now
   [junit4]   2> 984545 DEBUG (jetty-closer-3234-thread-2) [    ] o.a.s.c.a.ScheduledTriggers Shutting down action executor now
   [junit4]   2> 984545 INFO  (OverseerStateUpdate-72220333759856649-127.0.0.1:37257_solr-n_0000000000) [n:127.0.0.1:37257_solr    ] o.a.s.c.Overseer Overseer Loop exiting : 127.0.0.1:37257_solr
   [junit4]   2> 984545 DEBUG (jetty-closer-3234-thread-2) [    ] o.a.s.c.a.ScheduledTriggers Awaiting termination for action executor
   [junit4]   2> 984545 DEBUG (jetty-closer-3234-thread-2) [    ] o.a.s.c.a.ScheduledTriggers Awaiting termination for scheduled thread pool executor
   [junit4]   2> 984545 DEBUG (jetty-closer-3234-thread-2) [    ] o.a.s.c.a.ScheduledTriggers ScheduledTriggers closed completely
   [junit4]   2> 984545 DEBUG (jetty-closer-3234-thread-2) [    ] o.a.s.c.a.OverseerTriggerThread OverseerTriggerThread has been closed explicitly
   [junit4]   2> 984547 INFO  (jetty-closer-3234-thread-2) [    ] o.e.j.s.h.ContextHandler Stopped o.e.j.s.ServletContextHandler@7aa81e71{/solr,null,UNAVAILABLE}
   [junit4]   2> 984547 INFO  (jetty-closer-3234-thread-2) [    ] o.e.j.s.session node0 Stopped scavenging
   [junit4]   2> 986046 WARN  (zkCallback-3290-thread-1) [    ] o.a.s.c.ZkController Unable to register nodeLost path for 127.0.0.1:37257_solr
   [junit4]   2> org.apache.zookeeper.KeeperException$SessionExpiredException: KeeperErrorCode = Session expired for /autoscaling/nodeLost/127.0.0.1:37257_solr
   [junit4]   2> 	at org.apache.zookeeper.KeeperException.create(KeeperException.java:130) ~[zookeeper-3.4.11.jar:3.4.11-37e277162d567b55a07d1755f0b31c32e93c01a0]
   [junit4]   2

[...truncated too long message...]

ompile-lucene-core:

init:

-clover.disable:

-clover.load:

-clover.classpath:

-clover.setup:

clover:

compile-core:

-clover.disable:

-clover.load:

-clover.classpath:

-clover.setup:

clover:

common.compile-core:

compile-core:

common.compile-test:
    [mkdir] Created dir: /home/jenkins/workspace/Lucene-Solr-master-Linux/solr/build/solr-core/classes/test
    [javac] Compiling 932 source files to /home/jenkins/workspace/Lucene-Solr-master-Linux/solr/build/solr-core/classes/test
    [javac] Note: Some input files use or override a deprecated API.
    [javac] Note: Recompile with -Xlint:deprecation for details.
    [javac] Note: Some input files use unchecked or unsafe operations.
    [javac] Note: Recompile with -Xlint:unchecked for details.
    [javac] Creating empty /home/jenkins/workspace/Lucene-Solr-master-Linux/solr/build/solr-core/classes/test/org/apache/solr/cloud/autoscaling/sim/package-info.class
     [copy] Copying 1 file to /home/jenkins/workspace/Lucene-Solr-master-Linux/solr/build/solr-core/classes/test

common-solr.compile-test:

compile-test:

BUILD SUCCESSFUL
Total time: 47 seconds
[repro] ant test-nocompile -Dtests.dups=5 -Dtests.maxfailures=5 -Dtests.class="*.NodeLostTriggerTest" -Dtests.showOutput=onerror "-Dargs=-XX:+UseCompressedOops -XX:+UseSerialGC" -Dtests.seed=39F6F71B76BC849D -Dtests.multiplier=3 -Dtests.slow=true -Dtests.locale=en-US -Dtests.timezone=US/Eastern -Dtests.asserts=true -Dtests.file.encoding=US-ASCII
Buildfile: /home/jenkins/workspace/Lucene-Solr-master-Linux/solr/core/build.xml

-clover.disable:

ivy-configure:
[ivy:configure] :: Apache Ivy 2.4.0 - 20141213170938 :: http://ant.apache.org/ivy/ ::
[ivy:configure] :: loading settings :: file = /home/jenkins/workspace/Lucene-Solr-master-Linux/lucene/top-level-ivy-settings.xml

install-junit4-taskdef:

ivy-availability-check:
[loadresource] Do not set property disallowed.ivy.jars.list as its length is 0.

-ivy-fail-disallowed-ivy-version:

ivy-fail:

resolve-groovy:
[ivy:cachepath] :: resolving dependencies :: org.codehaus.groovy#groovy-all-caller;working
[ivy:cachepath] 	confs: [default]
[ivy:cachepath] 	found org.codehaus.groovy#groovy-all;2.4.15 in public
[ivy:cachepath] :: resolution report :: resolve 17ms :: artifacts dl 0ms
	---------------------------------------------------------------------
	|                  |            modules            ||   artifacts   |
	|       conf       | number| search|dwnlded|evicted|| number|dwnlded|
	---------------------------------------------------------------------
	|      default     |   1   |   0   |   0   |   0   ||   1   |   0   |
	---------------------------------------------------------------------

-init-totals:

-test:
    [mkdir] Created dir: /home/jenkins/workspace/Lucene-Solr-master-Linux/solr/build/solr-core/test
[junit4:pickseed] Seed property 'tests.seed' already defined: 39F6F71B76BC849D
    [mkdir] Created dir: /home/jenkins/workspace/Lucene-Solr-master-Linux/solr/build/solr-core/test/temp
   [junit4] <JUnit4> says g'day! Master seed: 39F6F71B76BC849D
   [junit4] Executing 5 suites with 3 JVMs.
   [junit4] 
   [junit4] Started J2 PID(2337@serv1.sd-datasolutions.de).
   [junit4] Started J1 PID(2342@serv1.sd-datasolutions.de).
   [junit4] Started J0 PID(2341@serv1.sd-datasolutions.de).
   [junit4] Suite: org.apache.solr.cloud.autoscaling.NodeLostTriggerTest
   [junit4] OK      0.19s J0 | NodeLostTriggerTest.testActionLifecycle
   [junit4] OK      0.62s J0 | NodeLostTriggerTest.testListenerAcceptance
   [junit4] OK      10.3s J0 | NodeLostTriggerTest.testTrigger
   [junit4] OK      5.23s J0 | NodeLostTriggerTest.testRestoreState
   [junit4] Completed [1/5] on J0 in 23.37s, 4 tests
   [junit4] 
   [junit4] Suite: org.apache.solr.cloud.autoscaling.NodeLostTriggerTest
   [junit4] OK      0.08s J1 | NodeLostTriggerTest.testActionLifecycle
   [junit4] OK      0.64s J1 | NodeLostTriggerTest.testListenerAcceptance
   [junit4] OK      10.5s J1 | NodeLostTriggerTest.testTrigger
   [junit4] OK      5.29s J1 | NodeLostTriggerTest.testRestoreState
   [junit4] Completed [2/5] on J1 in 24.87s, 4 tests
   [junit4] 
   [junit4] Duplicate suite name used with XML reports: org.apache.solr.cloud.autoscaling.NodeLostTriggerTest. This may confuse tools that process XML reports. Set 'ignoreDuplicateSuites' to true to skip this message.
   [junit4] Suite: org.apache.solr.cloud.autoscaling.NodeLostTriggerTest
   [junit4] OK      0.16s J2 | NodeLostTriggerTest.testActionLifecycle
   [junit4] OK      1.06s J2 | NodeLostTriggerTest.testListenerAcceptance
   [junit4] OK      10.3s J2 | NodeLostTriggerTest.testTrigger
   [junit4] OK      5.24s J2 | NodeLostTriggerTest.testRestoreState
   [junit4] Completed [3/5] on J2 in 25.11s, 4 tests
   [junit4] 
   [junit4] Suite: org.apache.solr.cloud.autoscaling.NodeLostTriggerTest
   [junit4] OK      0.03s J1 | NodeLostTriggerTest.testActionLifecycle
   [junit4] OK      0.37s J1 | NodeLostTriggerTest.testListenerAcceptance
   [junit4] OK      10.2s J1 | NodeLostTriggerTest.testTrigger
   [junit4] OK      5.26s J1 | NodeLostTriggerTest.testRestoreState
   [junit4] Completed [4/5] on J1 in 17.01s, 4 tests
   [junit4] 
   [junit4] Suite: org.apache.solr.cloud.autoscaling.NodeLostTriggerTest
   [junit4] OK      0.03s J0 | NodeLostTriggerTest.testActionLifecycle
   [junit4] OK      0.25s J0 | NodeLostTriggerTest.testListenerAcceptance
   [junit4] OK      10.3s J0 | NodeLostTriggerTest.testTrigger
   [junit4] OK      5.19s J0 | NodeLostTriggerTest.testRestoreState
   [junit4] Completed [5/5] on J0 in 18.66s, 4 tests
   [junit4] 
   [junit4] JVM J0:     0.41 ..    43.31 =    42.90s
   [junit4] JVM J1:     0.40 ..    42.99 =    42.60s
   [junit4] JVM J2:     0.36 ..    26.17 =    25.81s
   [junit4] Execution time total: 43 seconds
   [junit4] Tests summary: 5 suites, 20 tests
   [junit4] Could not remove temporary path: /home/jenkins/workspace/Lucene-Solr-master-Linux/solr/build/solr-core/test/J0 (java.nio.file.DirectoryNotEmptyException: Remaining files: [/home/jenkins/workspace/Lucene-Solr-master-Linux/solr/build/solr-core/test/J0/temp])
   [junit4] Could not remove temporary path: /home/jenkins/workspace/Lucene-Solr-master-Linux/solr/build/solr-core/test/J1 (java.nio.file.DirectoryNotEmptyException: Remaining files: [/home/jenkins/workspace/Lucene-Solr-master-Linux/solr/build/solr-core/test/J1/temp])
   [junit4] Could not remove temporary path: /home/jenkins/workspace/Lucene-Solr-master-Linux/solr/build/solr-core/test/J2 (java.nio.file.DirectoryNotEmptyException: Remaining files: [/home/jenkins/workspace/Lucene-Solr-master-Linux/solr/build/solr-core/test/J2/temp])
     [echo] 5 slowest tests:
[junit4:tophints] 1230.89s | org.apache.solr.cloud.BasicDistributedZkTest
[junit4:tophints] 1060.59s | org.apache.solr.cloud.cdcr.CdcrOpsAndBoundariesTest
[junit4:tophints] 992.13s | org.apache.solr.cloud.cdcr.CdcrWithNodesRestartsTest
[junit4:tophints] 499.19s | org.apache.solr.cloud.api.collections.ShardSplitTest
[junit4:tophints] 212.52s | org.apache.solr.update.TestInPlaceUpdatesDistrib

-check-totals:

test-nocompile:

BUILD SUCCESSFUL
Total time: 45 seconds
[repro] Failures:
[repro]   0/5 failed: org.apache.solr.cloud.autoscaling.NodeLostTriggerTest
[repro] Exiting with code 0
+ mv lucene/build lucene/build.repro
+ mv solr/build solr/build.repro
+ mv lucene/build.orig lucene/build
+ mv solr/build.orig solr/build
Archiving artifacts
Setting ANT_1_8_2_HOME=/var/lib/jenkins/tools/hudson.tasks.Ant_AntInstallation/ANT_1.8.2
java.lang.InterruptedException: no matches found within 10000
	at hudson.FilePath$ValidateAntFileMask.hasMatch(FilePath.java:2845)
	at hudson.FilePath$ValidateAntFileMask.invoke(FilePath.java:2724)
	at hudson.FilePath$ValidateAntFileMask.invoke(FilePath.java:2705)
	at hudson.FilePath.act(FilePath.java:1076)
	at hudson.FilePath.act(FilePath.java:1059)
	at hudson.FilePath.validateAntFileMask(FilePath.java:2703)
	at hudson.tasks.ArtifactArchiver.perform(ArtifactArchiver.java:243)
	at hudson.tasks.BuildStepCompatibilityLayer.perform(BuildStepCompatibilityLayer.java:81)
	at hudson.tasks.BuildStepMonitor$1.perform(BuildStepMonitor.java:20)
	at hudson.model.AbstractBuild$AbstractBuildExecution.perform(AbstractBuild.java:744)
	at hudson.model.AbstractBuild$AbstractBuildExecution.performAllBuildSteps(AbstractBuild.java:690)
	at hudson.model.Build$BuildExecution.post2(Build.java:186)
	at hudson.model.AbstractBuild$AbstractBuildExecution.post(AbstractBuild.java:635)
	at hudson.model.Run.execute(Run.java:1840)
	at hudson.model.FreeStyleBuild.run(FreeStyleBuild.java:43)
	at hudson.model.ResourceController.execute(ResourceController.java:97)
	at hudson.model.Executor.run(Executor.java:429)
No artifacts found that match the file pattern "**/*.events,heapdumps/**,**/*_pid*.log". Configuration error?
[WARNINGS] Parsing warnings in console log with parser Java Compiler (javac)
Setting ANT_1_8_2_HOME=/var/lib/jenkins/tools/hudson.tasks.Ant_AntInstallation/ANT_1.8.2
Setting ANT_1_8_2_HOME=/var/lib/jenkins/tools/hudson.tasks.Ant_AntInstallation/ANT_1.8.2
<Git Blamer> Using GitBlamer to create author and commit information for all warnings.
<Git Blamer> GIT_COMMIT=d6641ffb1d5fd5c9d3743561e2c5158951317713, workspace=/var/lib/jenkins/workspace/Lucene-Solr-master-Linux
[WARNINGS] Computing warning deltas based on reference build #22853
Recording test results
Setting ANT_1_8_2_HOME=/var/lib/jenkins/tools/hudson.tasks.Ant_AntInstallation/ANT_1.8.2
Build step 'Publish JUnit test result report' changed build result to UNSTABLE
Email was triggered for: Unstable (Test Failures)
Sending email for trigger: Unstable (Test Failures)
Setting ANT_1_8_2_HOME=/var/lib/jenkins/tools/hudson.tasks.Ant_AntInstallation/ANT_1.8.2
Setting ANT_1_8_2_HOME=/var/lib/jenkins/tools/hudson.tasks.Ant_AntInstallation/ANT_1.8.2
Setting ANT_1_8_2_HOME=/var/lib/jenkins/tools/hudson.tasks.Ant_AntInstallation/ANT_1.8.2
Setting ANT_1_8_2_HOME=/var/lib/jenkins/tools/hudson.tasks.Ant_AntInstallation/ANT_1.8.2

Mime
View raw message