lucene-dev mailing list archives

Site index · List index
Message view « Date » · « Thread »
Top « Date » · « Thread »
From Policeman Jenkins Server <jenk...@thetaphi.de>
Subject [JENKINS-EA] Lucene-Solr-7.x-Windows (64bit/jdk-11-ea+28) - Build # 767 - Failure!
Date Sun, 02 Sep 2018 00:25:16 GMT
Build: https://jenkins.thetaphi.de/job/Lucene-Solr-7.x-Windows/767/
Java: 64bit/jdk-11-ea+28 -XX:+UseCompressedOops -XX:+UseConcMarkSweepGC

4 tests failed.
FAILED:  org.apache.solr.cloud.TestPullReplica.testKillPullReplica

Error Message:
IOException occured when talking to server at: https://127.0.0.1:63363/solr

Stack Trace:
org.apache.solr.client.solrj.SolrServerException: IOException occured when talking to server at: https://127.0.0.1:63363/solr
	at __randomizedtesting.SeedInfo.seed([B652312A41EF8EA:87943F8704AF19D2]:0)
	at org.apache.solr.client.solrj.impl.HttpSolrClient.executeMethod(HttpSolrClient.java:657)
	at org.apache.solr.client.solrj.impl.HttpSolrClient.request(HttpSolrClient.java:255)
	at org.apache.solr.client.solrj.impl.HttpSolrClient.request(HttpSolrClient.java:244)
	at org.apache.solr.client.solrj.impl.LBHttpSolrClient.doRequest(LBHttpSolrClient.java:483)
	at org.apache.solr.client.solrj.impl.LBHttpSolrClient.request(LBHttpSolrClient.java:413)
	at org.apache.solr.client.solrj.impl.CloudSolrClient.sendRequest(CloudSolrClient.java:1109)
	at org.apache.solr.client.solrj.impl.CloudSolrClient.requestWithRetryOnStaleState(CloudSolrClient.java:886)
	at org.apache.solr.client.solrj.impl.CloudSolrClient.request(CloudSolrClient.java:819)
	at org.apache.solr.client.solrj.SolrRequest.process(SolrRequest.java:194)
	at org.apache.solr.client.solrj.SolrRequest.process(SolrRequest.java:211)
	at org.apache.solr.cloud.TestPullReplica.tearDown(TestPullReplica.java:116)
	at jdk.internal.reflect.GeneratedMethodAccessor13.invoke(Unknown Source)
	at java.base/jdk.internal.reflect.DelegatingMethodAccessorImpl.invoke(DelegatingMethodAccessorImpl.java:43)
	at java.base/java.lang.reflect.Method.invoke(Method.java:566)
	at com.carrotsearch.randomizedtesting.RandomizedRunner.invoke(RandomizedRunner.java:1737)
	at com.carrotsearch.randomizedtesting.RandomizedRunner$10.evaluate(RandomizedRunner.java:992)
	at com.carrotsearch.randomizedtesting.rules.SystemPropertiesRestoreRule$1.evaluate(SystemPropertiesRestoreRule.java:57)
	at org.apache.lucene.util.TestRuleSetupTeardownChained$1.evaluate(TestRuleSetupTeardownChained.java:49)
	at org.apache.lucene.util.AbstractBeforeAfterRule$1.evaluate(AbstractBeforeAfterRule.java:45)
	at org.apache.lucene.util.TestRuleThreadAndTestName$1.evaluate(TestRuleThreadAndTestName.java:48)
	at org.apache.lucene.util.TestRuleIgnoreAfterMaxFailures$1.evaluate(TestRuleIgnoreAfterMaxFailures.java:64)
	at org.apache.lucene.util.TestRuleMarkFailure$1.evaluate(TestRuleMarkFailure.java:47)
	at com.carrotsearch.randomizedtesting.rules.StatementAdapter.evaluate(StatementAdapter.java:36)
	at com.carrotsearch.randomizedtesting.ThreadLeakControl$StatementRunner.run(ThreadLeakControl.java:368)
	at com.carrotsearch.randomizedtesting.ThreadLeakControl.forkTimeoutingTask(ThreadLeakControl.java:817)
	at com.carrotsearch.randomizedtesting.ThreadLeakControl$3.evaluate(ThreadLeakControl.java:468)
	at com.carrotsearch.randomizedtesting.RandomizedRunner.runSingleTest(RandomizedRunner.java:943)
	at com.carrotsearch.randomizedtesting.RandomizedRunner$5.evaluate(RandomizedRunner.java:829)
	at com.carrotsearch.randomizedtesting.RandomizedRunner$6.evaluate(RandomizedRunner.java:879)
	at com.carrotsearch.randomizedtesting.RandomizedRunner$7.evaluate(RandomizedRunner.java:890)
	at com.carrotsearch.randomizedtesting.rules.StatementAdapter.evaluate(StatementAdapter.java:36)
	at com.carrotsearch.randomizedtesting.rules.SystemPropertiesRestoreRule$1.evaluate(SystemPropertiesRestoreRule.java:57)
	at org.apache.lucene.util.AbstractBeforeAfterRule$1.evaluate(AbstractBeforeAfterRule.java:45)
	at com.carrotsearch.randomizedtesting.rules.StatementAdapter.evaluate(StatementAdapter.java:36)
	at org.apache.lucene.util.TestRuleStoreClassName$1.evaluate(TestRuleStoreClassName.java:41)
	at com.carrotsearch.randomizedtesting.rules.NoShadowingOrOverridesOnMethodsRule$1.evaluate(NoShadowingOrOverridesOnMethodsRule.java:40)
	at com.carrotsearch.randomizedtesting.rules.NoShadowingOrOverridesOnMethodsRule$1.evaluate(NoShadowingOrOverridesOnMethodsRule.java:40)
	at com.carrotsearch.randomizedtesting.rules.StatementAdapter.evaluate(StatementAdapter.java:36)
	at com.carrotsearch.randomizedtesting.rules.StatementAdapter.evaluate(StatementAdapter.java:36)
	at org.apache.lucene.util.TestRuleAssertionsRequired$1.evaluate(TestRuleAssertionsRequired.java:53)
	at org.apache.lucene.util.TestRuleMarkFailure$1.evaluate(TestRuleMarkFailure.java:47)
	at org.apache.lucene.util.TestRuleIgnoreAfterMaxFailures$1.evaluate(TestRuleIgnoreAfterMaxFailures.java:64)
	at org.apache.lucene.util.TestRuleIgnoreTestSuites$1.evaluate(TestRuleIgnoreTestSuites.java:54)
	at com.carrotsearch.randomizedtesting.rules.StatementAdapter.evaluate(StatementAdapter.java:36)
	at com.carrotsearch.randomizedtesting.ThreadLeakControl$StatementRunner.run(ThreadLeakControl.java:368)
	at java.base/java.lang.Thread.run(Thread.java:834)
Caused by: javax.net.ssl.SSLProtocolException: Software caused connection abort: recv failed
	at java.base/sun.security.ssl.Alert.createSSLException(Alert.java:126)
	at java.base/sun.security.ssl.TransportContext.fatal(TransportContext.java:321)
	at java.base/sun.security.ssl.TransportContext.fatal(TransportContext.java:264)
	at java.base/sun.security.ssl.TransportContext.fatal(TransportContext.java:259)
	at java.base/sun.security.ssl.SSLSocketImpl.handleException(SSLSocketImpl.java:1314)
	at java.base/sun.security.ssl.SSLSocketImpl$AppInputStream.read(SSLSocketImpl.java:839)
	at org.apache.http.impl.io.SessionInputBufferImpl.streamRead(SessionInputBufferImpl.java:137)
	at org.apache.http.impl.io.SessionInputBufferImpl.fillBuffer(SessionInputBufferImpl.java:153)
	at org.apache.http.impl.io.SessionInputBufferImpl.readLine(SessionInputBufferImpl.java:282)
	at org.apache.http.impl.conn.DefaultHttpResponseParser.parseHead(DefaultHttpResponseParser.java:138)
	at org.apache.http.impl.conn.DefaultHttpResponseParser.parseHead(DefaultHttpResponseParser.java:56)
	at org.apache.http.impl.io.AbstractMessageParser.parse(AbstractMessageParser.java:259)
	at org.apache.http.impl.DefaultBHttpClientConnection.receiveResponseHeader(DefaultBHttpClientConnection.java:163)
	at org.apache.http.impl.conn.CPoolProxy.receiveResponseHeader(CPoolProxy.java:165)
	at org.apache.http.protocol.HttpRequestExecutor.doReceiveResponse(HttpRequestExecutor.java:273)
	at org.apache.http.protocol.HttpRequestExecutor.execute(HttpRequestExecutor.java:125)
	at org.apache.http.impl.execchain.MainClientExec.execute(MainClientExec.java:272)
	at org.apache.http.impl.execchain.ProtocolExec.execute(ProtocolExec.java:185)
	at org.apache.http.impl.execchain.RetryExec.execute(RetryExec.java:89)
	at org.apache.http.impl.execchain.RedirectExec.execute(RedirectExec.java:111)
	at org.apache.http.impl.client.InternalHttpClient.doExecute(InternalHttpClient.java:185)
	at org.apache.http.impl.client.CloseableHttpClient.execute(CloseableHttpClient.java:83)
	at org.apache.http.impl.client.CloseableHttpClient.execute(CloseableHttpClient.java:56)
	at org.apache.solr.client.solrj.impl.HttpSolrClient.executeMethod(HttpSolrClient.java:542)
	... 45 more
Caused by: java.net.SocketException: Software caused connection abort: recv failed
	at java.base/java.net.SocketInputStream.socketRead0(Native Method)
	at java.base/java.net.SocketInputStream.socketRead(SocketInputStream.java:115)
	at java.base/java.net.SocketInputStream.read(SocketInputStream.java:168)
	at java.base/java.net.SocketInputStream.read(SocketInputStream.java:140)
	at java.base/sun.security.ssl.SSLSocketInputRecord.read(SSLSocketInputRecord.java:448)
	at java.base/sun.security.ssl.SSLSocketInputRecord.bytesInCompletePacket(SSLSocketInputRecord.java:68)
	at java.base/sun.security.ssl.SSLSocketImpl.readApplicationRecord(SSLSocketImpl.java:1104)
	at java.base/sun.security.ssl.SSLSocketImpl$AppInputStream.read(SSLSocketImpl.java:823)
	... 63 more


FAILED:  org.apache.solr.handler.RequestLoggingTest.testLogBeforeExecuteWithCoreLogger

Error Message:


Stack Trace:
java.lang.AssertionError
	at __randomizedtesting.SeedInfo.seed([B652312A41EF8EA:C7E3239C5AD7937C]:0)
	at org.junit.Assert.fail(Assert.java:92)
	at org.junit.Assert.assertTrue(Assert.java:43)
	at org.junit.Assert.assertTrue(Assert.java:54)
	at org.apache.solr.handler.RequestLoggingTest.testLogBeforeExecute(RequestLoggingTest.java:88)
	at org.apache.solr.handler.RequestLoggingTest.testLogBeforeExecuteWithCoreLogger(RequestLoggingTest.java:65)
	at java.base/jdk.internal.reflect.NativeMethodAccessorImpl.invoke0(Native Method)
	at java.base/jdk.internal.reflect.NativeMethodAccessorImpl.invoke(NativeMethodAccessorImpl.java:62)
	at java.base/jdk.internal.reflect.DelegatingMethodAccessorImpl.invoke(DelegatingMethodAccessorImpl.java:43)
	at java.base/java.lang.reflect.Method.invoke(Method.java:566)
	at com.carrotsearch.randomizedtesting.RandomizedRunner.invoke(RandomizedRunner.java:1737)
	at com.carrotsearch.randomizedtesting.RandomizedRunner$8.evaluate(RandomizedRunner.java:934)
	at com.carrotsearch.randomizedtesting.RandomizedRunner$9.evaluate(RandomizedRunner.java:970)
	at com.carrotsearch.randomizedtesting.RandomizedRunner$10.evaluate(RandomizedRunner.java:984)
	at com.carrotsearch.randomizedtesting.rules.SystemPropertiesRestoreRule$1.evaluate(SystemPropertiesRestoreRule.java:57)
	at org.apache.lucene.util.TestRuleSetupTeardownChained$1.evaluate(TestRuleSetupTeardownChained.java:49)
	at org.apache.lucene.util.AbstractBeforeAfterRule$1.evaluate(AbstractBeforeAfterRule.java:45)
	at org.apache.lucene.util.TestRuleThreadAndTestName$1.evaluate(TestRuleThreadAndTestName.java:48)
	at org.apache.lucene.util.TestRuleIgnoreAfterMaxFailures$1.evaluate(TestRuleIgnoreAfterMaxFailures.java:64)
	at org.apache.lucene.util.TestRuleMarkFailure$1.evaluate(TestRuleMarkFailure.java:47)
	at com.carrotsearch.randomizedtesting.rules.StatementAdapter.evaluate(StatementAdapter.java:36)
	at com.carrotsearch.randomizedtesting.ThreadLeakControl$StatementRunner.run(ThreadLeakControl.java:368)
	at com.carrotsearch.randomizedtesting.ThreadLeakControl.forkTimeoutingTask(ThreadLeakControl.java:817)
	at com.carrotsearch.randomizedtesting.ThreadLeakControl$3.evaluate(ThreadLeakControl.java:468)
	at com.carrotsearch.randomizedtesting.RandomizedRunner.runSingleTest(RandomizedRunner.java:943)
	at com.carrotsearch.randomizedtesting.RandomizedRunner$5.evaluate(RandomizedRunner.java:829)
	at com.carrotsearch.randomizedtesting.RandomizedRunner$6.evaluate(RandomizedRunner.java:879)
	at com.carrotsearch.randomizedtesting.RandomizedRunner$7.evaluate(RandomizedRunner.java:890)
	at com.carrotsearch.randomizedtesting.rules.StatementAdapter.evaluate(StatementAdapter.java:36)
	at com.carrotsearch.randomizedtesting.rules.SystemPropertiesRestoreRule$1.evaluate(SystemPropertiesRestoreRule.java:57)
	at org.apache.lucene.util.AbstractBeforeAfterRule$1.evaluate(AbstractBeforeAfterRule.java:45)
	at com.carrotsearch.randomizedtesting.rules.StatementAdapter.evaluate(StatementAdapter.java:36)
	at org.apache.lucene.util.TestRuleStoreClassName$1.evaluate(TestRuleStoreClassName.java:41)
	at com.carrotsearch.randomizedtesting.rules.NoShadowingOrOverridesOnMethodsRule$1.evaluate(NoShadowingOrOverridesOnMethodsRule.java:40)
	at com.carrotsearch.randomizedtesting.rules.NoShadowingOrOverridesOnMethodsRule$1.evaluate(NoShadowingOrOverridesOnMethodsRule.java:40)
	at com.carrotsearch.randomizedtesting.rules.StatementAdapter.evaluate(StatementAdapter.java:36)
	at com.carrotsearch.randomizedtesting.rules.StatementAdapter.evaluate(StatementAdapter.java:36)
	at org.apache.lucene.util.TestRuleAssertionsRequired$1.evaluate(TestRuleAssertionsRequired.java:53)
	at org.apache.lucene.util.TestRuleMarkFailure$1.evaluate(TestRuleMarkFailure.java:47)
	at org.apache.lucene.util.TestRuleIgnoreAfterMaxFailures$1.evaluate(TestRuleIgnoreAfterMaxFailures.java:64)
	at org.apache.lucene.util.TestRuleIgnoreTestSuites$1.evaluate(TestRuleIgnoreTestSuites.java:54)
	at com.carrotsearch.randomizedtesting.rules.StatementAdapter.evaluate(StatementAdapter.java:36)
	at com.carrotsearch.randomizedtesting.ThreadLeakControl$StatementRunner.run(ThreadLeakControl.java:368)
	at java.base/java.lang.Thread.run(Thread.java:834)


FAILED:  org.apache.solr.handler.RequestLoggingTest.testLogBeforeExecuteWithRequestLogger

Error Message:


Stack Trace:
java.lang.AssertionError
	at __randomizedtesting.SeedInfo.seed([B652312A41EF8EA:BA0C031D09E840A4]:0)
	at org.junit.Assert.fail(Assert.java:92)
	at org.junit.Assert.assertTrue(Assert.java:43)
	at org.junit.Assert.assertTrue(Assert.java:54)
	at org.apache.solr.handler.RequestLoggingTest.testLogBeforeExecute(RequestLoggingTest.java:88)
	at org.apache.solr.handler.RequestLoggingTest.testLogBeforeExecuteWithRequestLogger(RequestLoggingTest.java:71)
	at java.base/jdk.internal.reflect.NativeMethodAccessorImpl.invoke0(Native Method)
	at java.base/jdk.internal.reflect.NativeMethodAccessorImpl.invoke(NativeMethodAccessorImpl.java:62)
	at java.base/jdk.internal.reflect.DelegatingMethodAccessorImpl.invoke(DelegatingMethodAccessorImpl.java:43)
	at java.base/java.lang.reflect.Method.invoke(Method.java:566)
	at com.carrotsearch.randomizedtesting.RandomizedRunner.invoke(RandomizedRunner.java:1737)
	at com.carrotsearch.randomizedtesting.RandomizedRunner$8.evaluate(RandomizedRunner.java:934)
	at com.carrotsearch.randomizedtesting.RandomizedRunner$9.evaluate(RandomizedRunner.java:970)
	at com.carrotsearch.randomizedtesting.RandomizedRunner$10.evaluate(RandomizedRunner.java:984)
	at com.carrotsearch.randomizedtesting.rules.SystemPropertiesRestoreRule$1.evaluate(SystemPropertiesRestoreRule.java:57)
	at org.apache.lucene.util.TestRuleSetupTeardownChained$1.evaluate(TestRuleSetupTeardownChained.java:49)
	at org.apache.lucene.util.AbstractBeforeAfterRule$1.evaluate(AbstractBeforeAfterRule.java:45)
	at org.apache.lucene.util.TestRuleThreadAndTestName$1.evaluate(TestRuleThreadAndTestName.java:48)
	at org.apache.lucene.util.TestRuleIgnoreAfterMaxFailures$1.evaluate(TestRuleIgnoreAfterMaxFailures.java:64)
	at org.apache.lucene.util.TestRuleMarkFailure$1.evaluate(TestRuleMarkFailure.java:47)
	at com.carrotsearch.randomizedtesting.rules.StatementAdapter.evaluate(StatementAdapter.java:36)
	at com.carrotsearch.randomizedtesting.ThreadLeakControl$StatementRunner.run(ThreadLeakControl.java:368)
	at com.carrotsearch.randomizedtesting.ThreadLeakControl.forkTimeoutingTask(ThreadLeakControl.java:817)
	at com.carrotsearch.randomizedtesting.ThreadLeakControl$3.evaluate(ThreadLeakControl.java:468)
	at com.carrotsearch.randomizedtesting.RandomizedRunner.runSingleTest(RandomizedRunner.java:943)
	at com.carrotsearch.randomizedtesting.RandomizedRunner$5.evaluate(RandomizedRunner.java:829)
	at com.carrotsearch.randomizedtesting.RandomizedRunner$6.evaluate(RandomizedRunner.java:879)
	at com.carrotsearch.randomizedtesting.RandomizedRunner$7.evaluate(RandomizedRunner.java:890)
	at com.carrotsearch.randomizedtesting.rules.StatementAdapter.evaluate(StatementAdapter.java:36)
	at com.carrotsearch.randomizedtesting.rules.SystemPropertiesRestoreRule$1.evaluate(SystemPropertiesRestoreRule.java:57)
	at org.apache.lucene.util.AbstractBeforeAfterRule$1.evaluate(AbstractBeforeAfterRule.java:45)
	at com.carrotsearch.randomizedtesting.rules.StatementAdapter.evaluate(StatementAdapter.java:36)
	at org.apache.lucene.util.TestRuleStoreClassName$1.evaluate(TestRuleStoreClassName.java:41)
	at com.carrotsearch.randomizedtesting.rules.NoShadowingOrOverridesOnMethodsRule$1.evaluate(NoShadowingOrOverridesOnMethodsRule.java:40)
	at com.carrotsearch.randomizedtesting.rules.NoShadowingOrOverridesOnMethodsRule$1.evaluate(NoShadowingOrOverridesOnMethodsRule.java:40)
	at com.carrotsearch.randomizedtesting.rules.StatementAdapter.evaluate(StatementAdapter.java:36)
	at com.carrotsearch.randomizedtesting.rules.StatementAdapter.evaluate(StatementAdapter.java:36)
	at org.apache.lucene.util.TestRuleAssertionsRequired$1.evaluate(TestRuleAssertionsRequired.java:53)
	at org.apache.lucene.util.TestRuleMarkFailure$1.evaluate(TestRuleMarkFailure.java:47)
	at org.apache.lucene.util.TestRuleIgnoreAfterMaxFailures$1.evaluate(TestRuleIgnoreAfterMaxFailures.java:64)
	at org.apache.lucene.util.TestRuleIgnoreTestSuites$1.evaluate(TestRuleIgnoreTestSuites.java:54)
	at com.carrotsearch.randomizedtesting.rules.StatementAdapter.evaluate(StatementAdapter.java:36)
	at com.carrotsearch.randomizedtesting.ThreadLeakControl$StatementRunner.run(ThreadLeakControl.java:368)
	at java.base/java.lang.Thread.run(Thread.java:834)


FAILED:  org.apache.solr.schema.TestBulkSchemaConcurrent.test

Error Message:
Captured an uncaught exception in thread: Thread[id=40483, name=Thread-5964, state=RUNNABLE, group=TGRP-TestBulkSchemaConcurrent]

Stack Trace:
com.carrotsearch.randomizedtesting.UncaughtExceptionError: Captured an uncaught exception in thread: Thread[id=40483, name=Thread-5964, state=RUNNABLE, group=TGRP-TestBulkSchemaConcurrent]
	at __randomizedtesting.SeedInfo.seed([B652312A41EF8EA:83311CC80AE29512]:0)
Caused by: java.lang.ArrayIndexOutOfBoundsException: Index 1 out of bounds for length 0
	at __randomizedtesting.SeedInfo.seed([B652312A41EF8EA]:0)
	at java.base/java.util.ArrayList.add(ArrayList.java:486)
	at java.base/java.util.ArrayList.add(ArrayList.java:498)
	at org.apache.solr.schema.TestBulkSchemaConcurrent$1.run(TestBulkSchemaConcurrent.java:71)




Build Log:
[...truncated 1936 lines...]
   [junit4] JVM J1: stderr was not empty, see: C:\Users\jenkins\workspace\Lucene-Solr-7.x-Windows\lucene\build\core\test\temp\junit4-J1-20180901_224326_6927269137955429623715.syserr
   [junit4] >>> JVM J1 emitted unexpected output (verbatim) ----
   [junit4] OpenJDK 64-Bit Server VM warning: Option UseConcMarkSweepGC was deprecated in version 9.0 and will likely be removed in a future release.
   [junit4] <<< JVM J1: EOF ----

[...truncated 5 lines...]
   [junit4] JVM J0: stderr was not empty, see: C:\Users\jenkins\workspace\Lucene-Solr-7.x-Windows\lucene\build\core\test\temp\junit4-J0-20180901_224326_6915391545832572797815.syserr
   [junit4] >>> JVM J0 emitted unexpected output (verbatim) ----
   [junit4] OpenJDK 64-Bit Server VM warning: Option UseConcMarkSweepGC was deprecated in version 9.0 and will likely be removed in a future release.
   [junit4] <<< JVM J0: EOF ----

[...truncated 316 lines...]
   [junit4] JVM J1: stderr was not empty, see: C:\Users\jenkins\workspace\Lucene-Solr-7.x-Windows\lucene\build\test-framework\test\temp\junit4-J1-20180901_224955_96513787732770025950475.syserr
   [junit4] >>> JVM J1 emitted unexpected output (verbatim) ----
   [junit4] Suite: org.apache.lucene.util.TestWorstCaseTestBehavior
   [junit4] Completed [41/41] on J0 in 0.01s, 6 tests, 6 skipped
   [junit4] 
   [junit4] OpenJDK 64-Bit Server VM warning: Option UseConcMarkSweepGC was deprecated in version 9.0 and will likely be removed in a future release.
   [junit4] <<< JVM J1: EOF ----

   [junit4] JVM J0: stderr was not empty, see: C:\Users\jenkins\workspace\Lucene-Solr-7.x-Windows\lucene\build\test-framework\test\temp\junit4-J0-20180901_224955_9651713755646010700197.syserr
   [junit4] >>> JVM J0 emitted unexpected output (verbatim) ----
   [junit4] OpenJDK 64-Bit Server VM warning: Option UseConcMarkSweepGC was deprecated in version 9.0 and will likely be removed in a future release.
   [junit4] <<< JVM J0: EOF ----

[...truncated 1081 lines...]
   [junit4] JVM J1: stderr was not empty, see: C:\Users\jenkins\workspace\Lucene-Solr-7.x-Windows\lucene\build\analysis\common\test\temp\junit4-J1-20180901_225101_56513321042004766716765.syserr
   [junit4] >>> JVM J1 emitted unexpected output (verbatim) ----
   [junit4] OpenJDK 64-Bit Server VM warning: Option UseConcMarkSweepGC was deprecated in version 9.0 and will likely be removed in a future release.
   [junit4] <<< JVM J1: EOF ----

[...truncated 3 lines...]
   [junit4] JVM J0: stderr was not empty, see: C:\Users\jenkins\workspace\Lucene-Solr-7.x-Windows\lucene\build\analysis\common\test\temp\junit4-J0-20180901_225101_5654933521576557947717.syserr
   [junit4] >>> JVM J0 emitted unexpected output (verbatim) ----
   [junit4] OpenJDK 64-Bit Server VM warning: Option UseConcMarkSweepGC was deprecated in version 9.0 and will likely be removed in a future release.
   [junit4] <<< JVM J0: EOF ----

[...truncated 260 lines...]
   [junit4] JVM J0: stderr was not empty, see: C:\Users\jenkins\workspace\Lucene-Solr-7.x-Windows\lucene\build\analysis\icu\test\temp\junit4-J0-20180901_225330_8415018794044785887161.syserr
   [junit4] >>> JVM J0 emitted unexpected output (verbatim) ----
   [junit4] OpenJDK 64-Bit Server VM warning: Option UseConcMarkSweepGC was deprecated in version 9.0 and will likely be removed in a future release.
   [junit4] <<< JVM J0: EOF ----

   [junit4] JVM J1: stderr was not empty, see: C:\Users\jenkins\workspace\Lucene-Solr-7.x-Windows\lucene\build\analysis\icu\test\temp\junit4-J1-20180901_225330_84217694839141356488534.syserr
   [junit4] >>> JVM J1 emitted unexpected output (verbatim) ----
   [junit4] OpenJDK 64-Bit Server VM warning: Option UseConcMarkSweepGC was deprecated in version 9.0 and will likely be removed in a future release.
   [junit4] <<< JVM J1: EOF ----

[...truncated 251 lines...]
   [junit4] JVM J1: stderr was not empty, see: C:\Users\jenkins\workspace\Lucene-Solr-7.x-Windows\lucene\build\analysis\kuromoji\test\temp\junit4-J1-20180901_225343_44412766900115351087686.syserr
   [junit4] >>> JVM J1 emitted unexpected output (verbatim) ----
   [junit4] OpenJDK 64-Bit Server VM warning: Option UseConcMarkSweepGC was deprecated in version 9.0 and will likely be removed in a future release.
   [junit4] <<< JVM J1: EOF ----

[...truncated 6 lines...]
   [junit4] JVM J0: stderr was not empty, see: C:\Users\jenkins\workspace\Lucene-Solr-7.x-Windows\lucene\build\analysis\kuromoji\test\temp\junit4-J0-20180901_225343_44417200554068827006323.syserr
   [junit4] >>> JVM J0 emitted unexpected output (verbatim) ----
   [junit4] OpenJDK 64-Bit Server VM warning: Option UseConcMarkSweepGC was deprecated in version 9.0 and will likely be removed in a future release.
   [junit4] <<< JVM J0: EOF ----

[...truncated 163 lines...]
   [junit4] JVM J0: stderr was not empty, see: C:\Users\jenkins\workspace\Lucene-Solr-7.x-Windows\lucene\build\analysis\morfologik\test\temp\junit4-J0-20180901_225411_15416164329887995910970.syserr
   [junit4] >>> JVM J0 emitted unexpected output (verbatim) ----
   [junit4] OpenJDK 64-Bit Server VM warning: Option UseConcMarkSweepGC was deprecated in version 9.0 and will likely be removed in a future release.
   [junit4] <<< JVM J0: EOF ----

[...truncated 3 lines...]
   [junit4] JVM J1: stderr was not empty, see: C:\Users\jenkins\workspace\Lucene-Solr-7.x-Windows\lucene\build\analysis\morfologik\test\temp\junit4-J1-20180901_225411_1541939061341355535948.syserr
   [junit4] >>> JVM J1 emitted unexpected output (verbatim) ----
   [junit4] OpenJDK 64-Bit Server VM warning: Option UseConcMarkSweepGC was deprecated in version 9.0 and will likely be removed in a future release.
   [junit4] <<< JVM J1: EOF ----

[...truncated 205 lines...]
   [junit4] JVM J1: stderr was not empty, see: C:\Users\jenkins\workspace\Lucene-Solr-7.x-Windows\lucene\build\analysis\nori\test\temp\junit4-J1-20180901_225415_97717407257845743180114.syserr
   [junit4] >>> JVM J1 emitted unexpected output (verbatim) ----
   [junit4] OpenJDK 64-Bit Server VM warning: Option UseConcMarkSweepGC was deprecated in version 9.0 and will likely be removed in a future release.
   [junit4] <<< JVM J1: EOF ----

[...truncated 6 lines...]
   [junit4] JVM J0: stderr was not empty, see: C:\Users\jenkins\workspace\Lucene-Solr-7.x-Windows\lucene\build\analysis\nori\test\temp\junit4-J0-20180901_225415_9763227088391532855635.syserr
   [junit4] >>> JVM J0 emitted unexpected output (verbatim) ----
   [junit4] OpenJDK 64-Bit Server VM warning: Option UseConcMarkSweepGC was deprecated in version 9.0 and will likely be removed in a future release.
   [junit4] <<< JVM J0: EOF ----

[...truncated 172 lines...]
   [junit4] JVM J1: stderr was not empty, see: C:\Users\jenkins\workspace\Lucene-Solr-7.x-Windows\lucene\build\analysis\opennlp\test\temp\junit4-J1-20180901_225424_3208377526773290351815.syserr
   [junit4] >>> JVM J1 emitted unexpected output (verbatim) ----
   [junit4] OpenJDK 64-Bit Server VM warning: Option UseConcMarkSweepGC was deprecated in version 9.0 and will likely be removed in a future release.
   [junit4] <<< JVM J1: EOF ----

   [junit4] JVM J0: stderr was not empty, see: C:\Users\jenkins\workspace\Lucene-Solr-7.x-Windows\lucene\build\analysis\opennlp\test\temp\junit4-J0-20180901_225424_3209121262165310851690.syserr
   [junit4] >>> JVM J0 emitted unexpected output (verbatim) ----
   [junit4] OpenJDK 64-Bit Server VM warning: Option UseConcMarkSweepGC was deprecated in version 9.0 and will likely be removed in a future release.
   [junit4] <<< JVM J0: EOF ----

[...truncated 177 lines...]
   [junit4] JVM J1: stderr was not empty, see: C:\Users\jenkins\workspace\Lucene-Solr-7.x-Windows\lucene\build\analysis\phonetic\test\temp\junit4-J1-20180901_225428_7373654465556844584321.syserr
   [junit4] >>> JVM J1 emitted unexpected output (verbatim) ----
   [junit4] OpenJDK 64-Bit Server VM warning: Option UseConcMarkSweepGC was deprecated in version 9.0 and will likely be removed in a future release.
   [junit4] <<< JVM J1: EOF ----

[...truncated 3 lines...]
   [junit4] JVM J0: stderr was not empty, see: C:\Users\jenkins\workspace\Lucene-Solr-7.x-Windows\lucene\build\analysis\phonetic\test\temp\junit4-J0-20180901_225428_7355507500448175666450.syserr
   [junit4] >>> JVM J0 emitted unexpected output (verbatim) ----
   [junit4] OpenJDK 64-Bit Server VM warning: Option UseConcMarkSweepGC was deprecated in version 9.0 and will likely be removed in a future release.
   [junit4] <<< JVM J0: EOF ----

[...truncated 160 lines...]
   [junit4] JVM J0: stderr was not empty, see: C:\Users\jenkins\workspace\Lucene-Solr-7.x-Windows\lucene\build\analysis\smartcn\test\temp\junit4-J0-20180901_225438_1703239458274635807683.syserr
   [junit4] >>> JVM J0 emitted unexpected output (verbatim) ----
   [junit4] OpenJDK 64-Bit Server VM warning: Option UseConcMarkSweepGC was deprecated in version 9.0 and will likely be removed in a future release.
   [junit4] <<< JVM J0: EOF ----

[...truncated 3 lines...]
   [junit4] JVM J1: stderr was not empty, see: C:\Users\jenkins\workspace\Lucene-Solr-7.x-Windows\lucene\build\analysis\smartcn\test\temp\junit4-J1-20180901_225438_17012518220154563108657.syserr
   [junit4] >>> JVM J1 emitted unexpected output (verbatim) ----
   [junit4] OpenJDK 64-Bit Server VM warning: Option UseConcMarkSweepGC was deprecated in version 9.0 and will likely be removed in a future release.
   [junit4] <<< JVM J1: EOF ----

[...truncated 168 lines...]
   [junit4] JVM J0: stderr was not empty, see: C:\Users\jenkins\workspace\Lucene-Solr-7.x-Windows\lucene\build\analysis\stempel\test\temp\junit4-J0-20180901_225446_0297606947985502569392.syserr
   [junit4] >>> JVM J0 emitted unexpected output (verbatim) ----
   [junit4] OpenJDK 64-Bit Server VM warning: Option UseConcMarkSweepGC was deprecated in version 9.0 and will likely be removed in a future release.
   [junit4] <<< JVM J0: EOF ----

   [junit4] JVM J1: stderr was not empty, see: C:\Users\jenkins\workspace\Lucene-Solr-7.x-Windows\lucene\build\analysis\stempel\test\temp\junit4-J1-20180901_225446_02910242152073314930700.syserr
   [junit4] >>> JVM J1 emitted unexpected output (verbatim) ----
   [junit4] OpenJDK 64-Bit Server VM warning: Option UseConcMarkSweepGC was deprecated in version 9.0 and will likely be removed in a future release.
   [junit4] <<< JVM J1: EOF ----

[...truncated 213 lines...]
   [junit4] JVM J0: stderr was not empty, see: C:\Users\jenkins\workspace\Lucene-Solr-7.x-Windows\lucene\build\backward-codecs\test\temp\junit4-J0-20180901_225450_59616435622555120598914.syserr
   [junit4] >>> JVM J0 emitted unexpected output (verbatim) ----
   [junit4] OpenJDK 64-Bit Server VM warning: Option UseConcMarkSweepGC was deprecated in version 9.0 and will likely be removed in a future release.
   [junit4] <<< JVM J0: EOF ----

[...truncated 19 lines...]
   [junit4] JVM J1: stderr was not empty, see: C:\Users\jenkins\workspace\Lucene-Solr-7.x-Windows\lucene\build\backward-codecs\test\temp\junit4-J1-20180901_225450_5967285771666603187411.syserr
   [junit4] >>> JVM J1 emitted unexpected output (verbatim) ----
   [junit4] OpenJDK 64-Bit Server VM warning: Option UseConcMarkSweepGC was deprecated in version 9.0 and will likely be removed in a future release.
   [junit4] <<< JVM J1: EOF ----

[...truncated 1420 lines...]
   [junit4] JVM J0: stderr was not empty, see: C:\Users\jenkins\workspace\Lucene-Solr-7.x-Windows\lucene\build\benchmark\test\temp\junit4-J0-20180901_225559_06216865383669851985858.syserr
   [junit4] >>> JVM J0 emitted unexpected output (verbatim) ----
   [junit4] OpenJDK 64-Bit Server VM warning: Option UseConcMarkSweepGC was deprecated in version 9.0 and will likely be removed in a future release.
   [junit4] <<< JVM J0: EOF ----

[...truncated 3 lines...]
   [junit4] JVM J1: stderr was not empty, see: C:\Users\jenkins\workspace\Lucene-Solr-7.x-Windows\lucene\build\benchmark\test\temp\junit4-J1-20180901_225559_06213694092772045972467.syserr
   [junit4] >>> JVM J1 emitted unexpected output (verbatim) ----
   [junit4] OpenJDK 64-Bit Server VM warning: Option UseConcMarkSweepGC was deprecated in version 9.0 and will likely be removed in a future release.
   [junit4] <<< JVM J1: EOF ----

[...truncated 252 lines...]
   [junit4] JVM J0: stderr was not empty, see: C:\Users\jenkins\workspace\Lucene-Solr-7.x-Windows\lucene\build\classification\test\temp\junit4-J0-20180901_225610_11814420992569926618989.syserr
   [junit4] >>> JVM J0 emitted unexpected output (verbatim) ----
   [junit4] OpenJDK 64-Bit Server VM warning: Option UseConcMarkSweepGC was deprecated in version 9.0 and will likely be removed in a future release.
   [junit4] <<< JVM J0: EOF ----

[...truncated 3 lines...]
   [junit4] JVM J1: stderr was not empty, see: C:\Users\jenkins\workspace\Lucene-Solr-7.x-Windows\lucene\build\classification\test\temp\junit4-J1-20180901_225610_1181902002753442862107.syserr
   [junit4] >>> JVM J1 emitted unexpected output (verbatim) ----
   [junit4] OpenJDK 64-Bit Server VM warning: Option UseConcMarkSweepGC was deprecated in version 9.0 and will likely be removed in a future release.
   [junit4] <<< JVM J1: EOF ----

[...truncated 268 lines...]
   [junit4] JVM J1: stderr was not empty, see: C:\Users\jenkins\workspace\Lucene-Solr-7.x-Windows\lucene\build\codecs\test\temp\junit4-J1-20180901_225623_2174513521613557800010.syserr
   [junit4] >>> JVM J1 emitted unexpected output (verbatim) ----
   [junit4] OpenJDK 64-Bit Server VM warning: Option UseConcMarkSweepGC was deprecated in version 9.0 and will likely be removed in a future release.
   [junit4] <<< JVM J1: EOF ----

[...truncated 3 lines...]
   [junit4] JVM J0: stderr was not empty, see: C:\Users\jenkins\workspace\Lucene-Solr-7.x-Windows\lucene\build\codecs\test\temp\junit4-J0-20180901_225623_2175589102266019252322.syserr
   [junit4] >>> JVM J0 emitted unexpected output (verbatim) ----
   [junit4] OpenJDK 64-Bit Server VM warning: Option UseConcMarkSweepGC was deprecated in version 9.0 and will likely be removed in a future release.
   [junit4] <<< JVM J0: EOF ----

[...truncated 235 lines...]
   [junit4] JVM J1: stderr was not empty, see: C:\Users\jenkins\workspace\Lucene-Solr-7.x-Windows\lucene\build\demo\test\temp\junit4-J1-20180901_225747_39217620659678249834073.syserr
   [junit4] >>> JVM J1 emitted unexpected output (verbatim) ----
   [junit4] OpenJDK 64-Bit Server VM warning: Option UseConcMarkSweepGC was deprecated in version 9.0 and will likely be removed in a future release.
   [junit4] <<< JVM J1: EOF ----

   [junit4] JVM J0: stderr was not empty, see: C:\Users\jenkins\workspace\Lucene-Solr-7.x-Windows\lucene\build\demo\test\temp\junit4-J0-20180901_225747_39216121472356980211607.syserr
   [junit4] >>> JVM J0 emitted unexpected output (verbatim) ----
   [junit4] OpenJDK 64-Bit Server VM warning: Option UseConcMarkSweepGC was deprecated in version 9.0 and will likely be removed in a future release.
   [junit4] <<< JVM J0: EOF ----

[...truncated 168 lines...]
   [junit4] JVM J0: stderr was not empty, see: C:\Users\jenkins\workspace\Lucene-Solr-7.x-Windows\lucene\build\expressions\test\temp\junit4-J0-20180901_225751_43111987620857491388919.syserr
   [junit4] >>> JVM J0 emitted unexpected output (verbatim) ----
   [junit4] OpenJDK 64-Bit Server VM warning: Option UseConcMarkSweepGC was deprecated in version 9.0 and will likely be removed in a future release.
   [junit4] <<< JVM J0: EOF ----

[...truncated 9 lines...]
   [junit4] JVM J1: stderr was not empty, see: C:\Users\jenkins\workspace\Lucene-Solr-7.x-Windows\lucene\build\expressions\test\temp\junit4-J1-20180901_225751_43116273706547693602754.syserr
   [junit4] >>> JVM J1 emitted unexpected output (verbatim) ----
   [junit4] OpenJDK 64-Bit Server VM warning: Option UseConcMarkSweepGC was deprecated in version 9.0 and will likely be removed in a future release.
   [junit4] <<< JVM J1: EOF ----

[...truncated 237 lines...]
   [junit4] JVM J0: stderr was not empty, see: C:\Users\jenkins\workspace\Lucene-Solr-7.x-Windows\lucene\build\facet\test\temp\junit4-J0-20180901_225757_89512995229433241241332.syserr
   [junit4] >>> JVM J0 emitted unexpected output (verbatim) ----
   [junit4] OpenJDK 64-Bit Server VM warning: Option UseConcMarkSweepGC was deprecated in version 9.0 and will likely be removed in a future release.
   [junit4] <<< JVM J0: EOF ----

[...truncated 3 lines...]
   [junit4] JVM J1: stderr was not empty, see: C:\Users\jenkins\workspace\Lucene-Solr-7.x-Windows\lucene\build\facet\test\temp\junit4-J1-20180901_225757_8955018568526234489554.syserr
   [junit4] >>> JVM J1 emitted unexpected output (verbatim) ----
   [junit4] OpenJDK 64-Bit Server VM warning: Option UseConcMarkSweepGC was deprecated in version 9.0 and will likely be removed in a future release.
   [junit4] <<< JVM J1: EOF ----

[...truncated 186 lines...]
   [junit4] JVM J1: stderr was not empty, see: C:\Users\jenkins\workspace\Lucene-Solr-7.x-Windows\lucene\build\grouping\test\temp\junit4-J1-20180901_225824_2156754508058446276517.syserr
   [junit4] >>> JVM J1 emitted unexpected output (verbatim) ----
   [junit4] OpenJDK 64-Bit Server VM warning: Option UseConcMarkSweepGC was deprecated in version 9.0 and will likely be removed in a future release.
   [junit4] <<< JVM J1: EOF ----

   [junit4] JVM J0: stderr was not empty, see: C:\Users\jenkins\workspace\Lucene-Solr-7.x-Windows\lucene\build\grouping\test\temp\junit4-J0-20180901_225824_21513657568495924670221.syserr
   [junit4] >>> JVM J0 emitted unexpected output (verbatim) ----
   [junit4] OpenJDK 64-Bit Server VM warning: Option UseConcMarkSweepGC was deprecated in version 9.0 and will likely be removed in a future release.
   [junit4] <<< JVM J0: EOF ----

[...truncated 249 lines...]
   [junit4] JVM J1: stderr was not empty, see: C:\Users\jenkins\workspace\Lucene-Solr-7.x-Windows\lucene\build\highlighter\test\temp\junit4-J1-20180901_225833_9778167535621995632372.syserr
   [junit4] >>> JVM J1 emitted unexpected output (verbatim) ----
   [junit4] OpenJDK 64-Bit Server VM warning: Option UseConcMarkSweepGC was deprecated in version 9.0 and will likely be removed in a future release.
   [junit4] <<< JVM J1: EOF ----

[...truncated 3 lines...]
   [junit4] JVM J0: stderr was not empty, see: C:\Users\jenkins\workspace\Lucene-Solr-7.x-Windows\lucene\build\highlighter\test\temp\junit4-J0-20180901_225833_9778619218578409467441.syserr
   [junit4] >>> JVM J0 emitted unexpected output (verbatim) ----
   [junit4] OpenJDK 64-Bit Server VM warning: Option UseConcMarkSweepGC was deprecated in version 9.0 and will likely be removed in a future release.
   [junit4] <<< JVM J0: EOF ----

[...truncated 167 lines...]
   [junit4] JVM J0: stderr was not empty, see: C:\Users\jenkins\workspace\Lucene-Solr-7.x-Windows\lucene\build\join\test\temp\junit4-J0-20180901_225852_3123861286339430076767.syserr
   [junit4] >>> JVM J0 emitted unexpected output (verbatim) ----
   [junit4] OpenJDK 64-Bit Server VM warning: Option UseConcMarkSweepGC was deprecated in version 9.0 and will likely be removed in a future release.
   [junit4] <<< JVM J0: EOF ----

[...truncated 3 lines...]
   [junit4] JVM J1: stderr was not empty, see: C:\Users\jenkins\workspace\Lucene-Solr-7.x-Windows\lucene\build\join\test\temp\junit4-J1-20180901_225852_31413282327822942607992.syserr
   [junit4] >>> JVM J1 emitted unexpected output (verbatim) ----
   [junit4] OpenJDK 64-Bit Server VM warning: Option UseConcMarkSweepGC was deprecated in version 9.0 and will likely be removed in a future release.
   [junit4] <<< JVM J1: EOF ----

[...truncated 156 lines...]
   [junit4] JVM J0: stderr was not empty, see: C:\Users\jenkins\workspace\Lucene-Solr-7.x-Windows\lucene\build\memory\test\temp\junit4-J0-20180901_225909_463592031344797721364.syserr
   [junit4] >>> JVM J0 emitted unexpected output (verbatim) ----
   [junit4] OpenJDK 64-Bit Server VM warning: Option UseConcMarkSweepGC was deprecated in version 9.0 and will likely be removed in a future release.
   [junit4] <<< JVM J0: EOF ----

[...truncated 3 lines...]
   [junit4] JVM J1: stderr was not empty, see: C:\Users\jenkins\workspace\Lucene-Solr-7.x-Windows\lucene\build\memory\test\temp\junit4-J1-20180901_225909_4639520120251604620545.syserr
   [junit4] >>> JVM J1 emitted unexpected output (verbatim) ----
   [junit4] OpenJDK 64-Bit Server VM warning: Option UseConcMarkSweepGC was deprecated in version 9.0 and will likely be removed in a future release.
   [junit4] <<< JVM J1: EOF ----

[...truncated 196 lines...]
   [junit4] JVM J0: stderr was not empty, see: C:\Users\jenkins\workspace\Lucene-Solr-7.x-Windows\lucene\build\misc\test\temp\junit4-J0-20180901_225916_2412509929065900520721.syserr
   [junit4] >>> JVM J0 emitted unexpected output (verbatim) ----
   [junit4] OpenJDK 64-Bit Server VM warning: Option UseConcMarkSweepGC was deprecated in version 9.0 and will likely be removed in a future release.
   [junit4] <<< JVM J0: EOF ----

[...truncated 3 lines...]
   [junit4] JVM J1: stderr was not empty, see: C:\Users\jenkins\workspace\Lucene-Solr-7.x-Windows\lucene\build\misc\test\temp\junit4-J1-20180901_225916_2415905690568175506182.syserr
   [junit4] >>> JVM J1 emitted unexpected output (verbatim) ----
   [junit4] OpenJDK 64-Bit Server VM warning: Option UseConcMarkSweepGC was deprecated in version 9.0 and will likely be removed in a future release.
   [junit4] <<< JVM J1: EOF ----

[...truncated 339 lines...]
   [junit4] JVM J1: stderr was not empty, see: C:\Users\jenkins\workspace\Lucene-Solr-7.x-Windows\lucene\build\queries\test\temp\junit4-J1-20180901_225936_88010458706132853968796.syserr
   [junit4] >>> JVM J1 emitted unexpected output (verbatim) ----
   [junit4] OpenJDK 64-Bit Server VM warning: Option UseConcMarkSweepGC was deprecated in version 9.0 and will likely be removed in a future release.
   [junit4] <<< JVM J1: EOF ----

[...truncated 3 lines...]
   [junit4] JVM J0: stderr was not empty, see: C:\Users\jenkins\workspace\Lucene-Solr-7.x-Windows\lucene\build\queries\test\temp\junit4-J0-20180901_225936_880869066434412173769.syserr
   [junit4] >>> JVM J0 emitted unexpected output (verbatim) ----
   [junit4] OpenJDK 64-Bit Server VM warning: Option UseConcMarkSweepGC was deprecated in version 9.0 and will likely be removed in a future release.
   [junit4] <<< JVM J0: EOF ----

[...truncated 235 lines...]
   [junit4] JVM J0: stderr was not empty, see: C:\Users\jenkins\workspace\Lucene-Solr-7.x-Windows\lucene\build\queryparser\test\temp\junit4-J0-20180901_225947_37213459018072444904078.syserr
   [junit4] >>> JVM J0 emitted unexpected output (verbatim) ----
   [junit4] OpenJDK 64-Bit Server VM warning: Option UseConcMarkSweepGC was deprecated in version 9.0 and will likely be removed in a future release.
   [junit4] <<< JVM J0: EOF ----

   [junit4] JVM J1: stderr was not empty, see: C:\Users\jenkins\workspace\Lucene-Solr-7.x-Windows\lucene\build\queryparser\test\temp\junit4-J1-20180901_225947_37110244831555301438432.syserr
   [junit4] >>> JVM J1 emitted unexpected output (verbatim) ----
   [junit4] OpenJDK 64-Bit Server VM warning: Option UseConcMarkSweepGC was deprecated in version 9.0 and will likely be removed in a future release.
   [junit4] <<< JVM J1: EOF ----

[...truncated 214 lines...]
   [junit4] JVM J1: stderr was not empty, see: C:\Users\jenkins\workspace\Lucene-Solr-7.x-Windows\lucene\build\replicator\test\temp\junit4-J1-20180901_225957_02912263379666136899627.syserr
   [junit4] >>> JVM J1 emitted unexpected output (verbatim) ----
   [junit4] OpenJDK 64-Bit Server VM warning: Option UseConcMarkSweepGC was deprecated in version 9.0 and will likely be removed in a future release.
   [junit4] <<< JVM J1: EOF ----

[...truncated 6 lines...]
   [junit4] JVM J0: stderr was not empty, see: C:\Users\jenkins\workspace\Lucene-Solr-7.x-Windows\lucene\build\replicator\test\temp\junit4-J0-20180901_225957_0297886901100199287681.syserr
   [junit4] >>> JVM J0 emitted unexpected output (verbatim) ----
   [junit4] OpenJDK 64-Bit Server VM warning: Option UseConcMarkSweepGC was deprecated in version 9.0 and will likely be removed in a future release.
   [junit4] <<< JVM J0: EOF ----

[...truncated 212 lines...]
   [junit4] JVM J0: stderr was not empty, see: C:\Users\jenkins\workspace\Lucene-Solr-7.x-Windows\lucene\build\sandbox\test\temp\junit4-J0-20180901_230012_6594786009379401918287.syserr
   [junit4] >>> JVM J0 emitted unexpected output (verbatim) ----
   [junit4] OpenJDK 64-Bit Server VM warning: Option UseConcMarkSweepGC was deprecated in version 9.0 and will likely be removed in a future release.
   [junit4] <<< JVM J0: EOF ----

[...truncated 3 lines...]
   [junit4] JVM J1: stderr was not empty, see: C:\Users\jenkins\workspace\Lucene-Solr-7.x-Windows\lucene\build\sandbox\test\temp\junit4-J1-20180901_230012_65915024537467065190406.syserr
   [junit4] >>> JVM J1 emitted unexpected output (verbatim) ----
   [junit4] OpenJDK 64-Bit Server VM warning: Option UseConcMarkSweepGC was deprecated in version 9.0 and will likely be removed in a future release.
   [junit4] <<< JVM J1: EOF ----

[...truncated 297 lines...]
   [junit4] JVM J0: stderr was not empty, see: C:\Users\jenkins\workspace\Lucene-Solr-7.x-Windows\lucene\build\spatial-extras\test\temp\junit4-J0-20180901_230051_6325544416794482051682.syserr
   [junit4] >>> JVM J0 emitted unexpected output (verbatim) ----
   [junit4] OpenJDK 64-Bit Server VM warning: Option UseConcMarkSweepGC was deprecated in version 9.0 and will likely be removed in a future release.
   [junit4] <<< JVM J0: EOF ----

[...truncated 3 lines...]
   [junit4] JVM J1: stderr was not empty, see: C:\Users\jenkins\workspace\Lucene-Solr-7.x-Windows\lucene\build\spatial-extras\test\temp\junit4-J1-20180901_230051_63217148809636515859714.syserr
   [junit4] >>> JVM J1 emitted unexpected output (verbatim) ----
   [junit4] OpenJDK 64-Bit Server VM warning: Option UseConcMarkSweepGC was deprecated in version 9.0 and will likely be removed in a future release.
   [junit4] <<< JVM J1: EOF ----

[...truncated 190 lines...]
   [junit4] JVM J0: stderr was not empty, see: C:\Users\jenkins\workspace\Lucene-Solr-7.x-Windows\lucene\build\spatial3d\test\temp\junit4-J0-20180901_230134_53016885396889796624928.syserr
   [junit4] >>> JVM J0 emitted unexpected output (verbatim) ----
   [junit4] OpenJDK 64-Bit Server VM warning: Option UseConcMarkSweepGC was deprecated in version 9.0 and will likely be removed in a future release.
   [junit4] <<< JVM J0: EOF ----

[...truncated 8 lines...]
   [junit4] JVM J1: stderr was not empty, see: C:\Users\jenkins\workspace\Lucene-Solr-7.x-Windows\lucene\build\spatial3d\test\temp\junit4-J1-20180901_230134_53010580569815130246723.syserr
   [junit4] >>> JVM J1 emitted unexpected output (verbatim) ----
   [junit4] OpenJDK 64-Bit Server VM warning: Option UseConcMarkSweepGC was deprecated in version 9.0 and will likely be removed in a future release.
   [junit4] <<< JVM J1: EOF ----

[...truncated 152 lines...]
   [junit4] JVM J0: stderr was not empty, see: C:\Users\jenkins\workspace\Lucene-Solr-7.x-Windows\lucene\build\spatial\test\temp\junit4-J0-20180901_230219_42812358177161325586481.syserr
   [junit4] >>> JVM J0 emitted unexpected output (verbatim) ----
   [junit4] OpenJDK 64-Bit Server VM warning: Option UseConcMarkSweepGC was deprecated in version 9.0 and will likely be removed in a future release.
   [junit4] <<< JVM J0: EOF ----

[...truncated 256 lines...]
   [junit4] JVM J1: stderr was not empty, see: C:\Users\jenkins\workspace\Lucene-Solr-7.x-Windows\lucene\build\suggest\test\temp\junit4-J1-20180901_230227_8243812793331991474200.syserr
   [junit4] >>> JVM J1 emitted unexpected output (verbatim) ----
   [junit4] OpenJDK 64-Bit Server VM warning: Option UseConcMarkSweepGC was deprecated in version 9.0 and will likely be removed in a future release.
   [junit4] <<< JVM J1: EOF ----

[...truncated 3 lines...]
   [junit4] JVM J0: stderr was not empty, see: C:\Users\jenkins\workspace\Lucene-Solr-7.x-Windows\lucene\build\suggest\test\temp\junit4-J0-20180901_230227_82411211278636281662315.syserr
   [junit4] >>> JVM J0 emitted unexpected output (verbatim) ----
   [junit4] OpenJDK 64-Bit Server VM warning: Option UseConcMarkSweepGC was deprecated in version 9.0 and will likely be removed in a future release.
   [junit4] <<< JVM J0: EOF ----

[...truncated 2659 lines...]
   [junit4] Suite: org.apache.solr.cloud.TestPullReplica
   [junit4]   2> Creating dataDir: C:\Users\jenkins\workspace\Lucene-Solr-7.x-Windows\solr\build\solr-core\test\J1\temp\solr.cloud.TestPullReplica_B652312A41EF8EA-001\init-core-data-001
   [junit4]   2> 1543699 INFO  (SUITE-TestPullReplica-seed#[B652312A41EF8EA]-worker) [    ] o.a.s.SolrTestCaseJ4 Using TrieFields (NUMERIC_POINTS_SYSPROP=false) w/NUMERIC_DOCVALUES_SYSPROP=false
   [junit4]   2> 1543700 INFO  (SUITE-TestPullReplica-seed#[B652312A41EF8EA]-worker) [    ] o.a.s.SolrTestCaseJ4 Randomized ssl (true) and clientAuth (false) via: @org.apache.solr.util.RandomizeSSL(reason="", value=0.0/0.0, ssl=0.0/0.0, clientAuth=0.0/0.0)
   [junit4]   2> 1543700 INFO  (SUITE-TestPullReplica-seed#[B652312A41EF8EA]-worker) [    ] o.a.s.SolrTestCaseJ4 SecureRandom sanity checks: test.solr.allowed.securerandom=null & java.security.egd=file:/dev/./urandom
   [junit4]   2> 1543701 INFO  (SUITE-TestPullReplica-seed#[B652312A41EF8EA]-worker) [    ] o.a.s.c.MiniSolrCloudCluster Starting cluster of 2 servers in C:\Users\jenkins\workspace\Lucene-Solr-7.x-Windows\solr\build\solr-core\test\J1\temp\solr.cloud.TestPullReplica_B652312A41EF8EA-001\tempDir-001
   [junit4]   2> 1543701 INFO  (SUITE-TestPullReplica-seed#[B652312A41EF8EA]-worker) [    ] o.a.s.c.ZkTestServer STARTING ZK TEST SERVER
   [junit4]   2> 1543701 INFO  (Thread-2033) [    ] o.a.s.c.ZkTestServer client port:0.0.0.0/0.0.0.0:0
   [junit4]   2> 1543701 INFO  (Thread-2033) [    ] o.a.s.c.ZkTestServer Starting server
   [junit4]   2> 1543705 ERROR (Thread-2033) [    ] o.a.z.s.ZooKeeperServer ZKShutdownHandler is not registered, so ZooKeeper server won't take any action on ERROR or SHUTDOWN server state changes
   [junit4]   2> 1543802 INFO  (SUITE-TestPullReplica-seed#[B652312A41EF8EA]-worker) [    ] o.a.s.c.ZkTestServer start zk server on port:63359
   [junit4]   2> 1543805 INFO  (zkConnectionManagerCallback-2964-thread-1) [    ] o.a.s.c.c.ConnectionManager zkClient has connected
   [junit4]   2> 1543824 INFO  (jetty-launcher-2961-thread-2) [    ] o.e.j.s.Server jetty-9.4.11.v20180605; built: 2018-06-05T18:24:03.829Z; git: d5fc0523cfa96bfebfbda19606cad384d772f04c; jvm 11+28
   [junit4]   2> 1543825 INFO  (jetty-launcher-2961-thread-1) [    ] o.e.j.s.Server jetty-9.4.11.v20180605; built: 2018-06-05T18:24:03.829Z; git: d5fc0523cfa96bfebfbda19606cad384d772f04c; jvm 11+28
   [junit4]   2> 1543825 INFO  (jetty-launcher-2961-thread-2) [    ] o.e.j.s.session DefaultSessionIdManager workerName=node0
   [junit4]   2> 1543825 INFO  (jetty-launcher-2961-thread-2) [    ] o.e.j.s.session No SessionScavenger set, using defaults
   [junit4]   2> 1543825 INFO  (jetty-launcher-2961-thread-2) [    ] o.e.j.s.session node0 Scavenging every 600000ms
   [junit4]   2> 1543825 INFO  (jetty-launcher-2961-thread-2) [    ] o.e.j.s.h.ContextHandler Started o.e.j.s.ServletContextHandler@73eb7ed{/solr,null,AVAILABLE}
   [junit4]   2> 1543825 INFO  (jetty-launcher-2961-thread-1) [    ] o.e.j.s.session DefaultSessionIdManager workerName=node0
   [junit4]   2> 1543825 INFO  (jetty-launcher-2961-thread-1) [    ] o.e.j.s.session No SessionScavenger set, using defaults
   [junit4]   2> 1543825 INFO  (jetty-launcher-2961-thread-1) [    ] o.e.j.s.session node0 Scavenging every 600000ms
   [junit4]   2> 1543826 INFO  (jetty-launcher-2961-thread-1) [    ] o.e.j.s.h.ContextHandler Started o.e.j.s.ServletContextHandler@dfe16d5{/solr,null,AVAILABLE}
   [junit4]   2> 1543827 INFO  (jetty-launcher-2961-thread-2) [    ] o.e.j.s.AbstractConnector Started ServerConnector@3afb818a{SSL,[ssl, http/1.1]}{127.0.0.1:63363}
   [junit4]   2> 1543827 INFO  (jetty-launcher-2961-thread-2) [    ] o.e.j.s.Server Started @1543873ms
   [junit4]   2> 1543827 INFO  (jetty-launcher-2961-thread-2) [    ] o.a.s.c.s.e.JettySolrRunner Jetty properties: {hostContext=/solr, hostPort=63363}
   [junit4]   2> 1543827 ERROR (jetty-launcher-2961-thread-2) [    ] o.a.s.u.StartupLoggingUtils Missing Java Option solr.log.dir. Logging may be missing or incomplete.
   [junit4]   2> 1543827 INFO  (jetty-launcher-2961-thread-2) [    ] o.a.s.s.SolrDispatchFilter Using logger factory org.apache.logging.slf4j.Log4jLoggerFactory
   [junit4]   2> 1543827 INFO  (jetty-launcher-2961-thread-2) [    ] o.a.s.s.SolrDispatchFilter  ___      _       Welcome to Apache Solr™ version 7.5.0
   [junit4]   2> 1543827 INFO  (jetty-launcher-2961-thread-2) [    ] o.a.s.s.SolrDispatchFilter / __| ___| |_ _   Starting in cloud mode on port null
   [junit4]   2> 1543827 INFO  (jetty-launcher-2961-thread-2) [    ] o.a.s.s.SolrDispatchFilter \__ \/ _ \ | '_|  Install dir: null
   [junit4]   2> 1543827 INFO  (jetty-launcher-2961-thread-2) [    ] o.a.s.s.SolrDispatchFilter |___/\___/_|_|    Start time: 2018-09-01T23:30:27.641403100Z
   [junit4]   2> 1543827 INFO  (jetty-launcher-2961-thread-1) [    ] o.e.j.s.AbstractConnector Started ServerConnector@145a5284{SSL,[ssl, http/1.1]}{127.0.0.1:63364}
   [junit4]   2> 1543827 INFO  (jetty-launcher-2961-thread-1) [    ] o.e.j.s.Server Started @1543873ms
   [junit4]   2> 1543827 INFO  (jetty-launcher-2961-thread-1) [    ] o.a.s.c.s.e.JettySolrRunner Jetty properties: {hostContext=/solr, hostPort=63364}
   [junit4]   2> 1543828 ERROR (jetty-launcher-2961-thread-1) [    ] o.a.s.u.StartupLoggingUtils Missing Java Option solr.log.dir. Logging may be missing or incomplete.
   [junit4]   2> 1543828 INFO  (jetty-launcher-2961-thread-1) [    ] o.a.s.s.SolrDispatchFilter Using logger factory org.apache.logging.slf4j.Log4jLoggerFactory
   [junit4]   2> 1543828 INFO  (jetty-launcher-2961-thread-1) [    ] o.a.s.s.SolrDispatchFilter  ___      _       Welcome to Apache Solr™ version 7.5.0
   [junit4]   2> 1543828 INFO  (jetty-launcher-2961-thread-1) [    ] o.a.s.s.SolrDispatchFilter / __| ___| |_ _   Starting in cloud mode on port null
   [junit4]   2> 1543828 INFO  (jetty-launcher-2961-thread-1) [    ] o.a.s.s.SolrDispatchFilter \__ \/ _ \ | '_|  Install dir: null
   [junit4]   2> 1543828 INFO  (jetty-launcher-2961-thread-1) [    ] o.a.s.s.SolrDispatchFilter |___/\___/_|_|    Start time: 2018-09-01T23:30:27.642510700Z
   [junit4]   2> 1543832 INFO  (zkConnectionManagerCallback-2968-thread-1) [    ] o.a.s.c.c.ConnectionManager zkClient has connected
   [junit4]   2> 1543832 INFO  (zkConnectionManagerCallback-2966-thread-1) [    ] o.a.s.c.c.ConnectionManager zkClient has connected
   [junit4]   2> 1543832 INFO  (jetty-launcher-2961-thread-1) [    ] o.a.s.s.SolrDispatchFilter solr.xml found in ZooKeeper. Loading...
   [junit4]   2> 1543832 INFO  (jetty-launcher-2961-thread-2) [    ] o.a.s.s.SolrDispatchFilter solr.xml found in ZooKeeper. Loading...
   [junit4]   2> 1543835 WARN  (NIOServerCxn.Factory:0.0.0.0/0.0.0.0:0) [    ] o.a.z.s.NIOServerCnxn Unable to read additional data from client sessionid 0x10055daee380002, likely client has closed socket
   [junit4]   2> 1543931 INFO  (jetty-launcher-2961-thread-2) [    ] o.a.s.c.ZkContainer Zookeeper client=127.0.0.1:63359/solr
   [junit4]   2> 1543933 INFO  (zkConnectionManagerCallback-2972-thread-1) [    ] o.a.s.c.c.ConnectionManager zkClient has connected
   [junit4]   2> 1543934 WARN  (NIOServerCxn.Factory:0.0.0.0/0.0.0.0:0) [    ] o.a.z.s.NIOServerCnxn Unable to read additional data from client sessionid 0x10055daee380003, likely client has closed socket
   [junit4]   2> 1543936 INFO  (zkConnectionManagerCallback-2974-thread-1) [    ] o.a.s.c.c.ConnectionManager zkClient has connected
   [junit4]   2> 1543939 INFO  (jetty-launcher-2961-thread-1) [    ] o.a.s.c.ZkContainer Zookeeper client=127.0.0.1:63359/solr
   [junit4]   2> 1543941 INFO  (zkConnectionManagerCallback-2978-thread-1) [    ] o.a.s.c.c.ConnectionManager zkClient has connected
   [junit4]   2> 1543943 INFO  (zkConnectionManagerCallback-2980-thread-1) [    ] o.a.s.c.c.ConnectionManager zkClient has connected
   [junit4]   2> 1544026 INFO  (jetty-launcher-2961-thread-2) [n:127.0.0.1:63363_solr    ] o.a.s.c.OverseerElectionContext I am going to be the leader 127.0.0.1:63363_solr
   [junit4]   2> 1544026 INFO  (jetty-launcher-2961-thread-2) [n:127.0.0.1:63363_solr    ] o.a.s.c.Overseer Overseer (id=72151992825806852-127.0.0.1:63363_solr-n_0000000000) starting
   [junit4]   2> 1544026 INFO  (jetty-launcher-2961-thread-1) [n:127.0.0.1:63364_solr    ] o.a.s.c.ZkController Register node as live in ZooKeeper:/live_nodes/127.0.0.1:63364_solr
   [junit4]   2> 1544028 INFO  (zkCallback-2979-thread-1) [    ] o.a.s.c.c.ZkStateReader Updated live nodes from ZooKeeper... (0) -> (1)
   [junit4]   2> 1544028 INFO  (zkCallback-2973-thread-1) [    ] o.a.s.c.c.ZkStateReader Updated live nodes from ZooKeeper... (0) -> (1)
   [junit4]   2> 1544033 INFO  (zkConnectionManagerCallback-2989-thread-1) [    ] o.a.s.c.c.ConnectionManager zkClient has connected
   [junit4]   2> 1544034 INFO  (jetty-launcher-2961-thread-2) [n:127.0.0.1:63363_solr    ] o.a.s.c.c.ZkStateReader Updated live nodes from ZooKeeper... (0) -> (1)
   [junit4]   2> 1544035 INFO  (jetty-launcher-2961-thread-2) [n:127.0.0.1:63363_solr    ] o.a.s.c.s.i.ZkClientClusterStateProvider Cluster at 127.0.0.1:63359/solr ready
   [junit4]   2> 1544036 INFO  (OverseerStateUpdate-72151992825806852-127.0.0.1:63363_solr-n_0000000000) [n:127.0.0.1:63363_solr    ] o.a.s.c.Overseer Starting to work on the main queue : 127.0.0.1:63363_solr
   [junit4]   2> 1544037 INFO  (jetty-launcher-2961-thread-2) [n:127.0.0.1:63363_solr    ] o.a.s.c.TransientSolrCoreCacheDefault Allocating transient cache for 2147483647 transient cores
   [junit4]   2> 1544037 INFO  (jetty-launcher-2961-thread-2) [n:127.0.0.1:63363_solr    ] o.a.s.c.ZkController Register node as live in ZooKeeper:/live_nodes/127.0.0.1:63363_solr
   [junit4]   2> 1544038 INFO  (zkCallback-2979-thread-1) [    ] o.a.s.c.c.ZkStateReader Updated live nodes from ZooKeeper... (1) -> (2)
   [junit4]   2> 1544039 INFO  (zkCallback-2973-thread-1) [    ] o.a.s.c.c.ZkStateReader Updated live nodes from ZooKeeper... (1) -> (2)
   [junit4]   2> 1544042 INFO  (zkCallback-2988-thread-1) [    ] o.a.s.c.c.ZkStateReader Updated live nodes from ZooKeeper... (1) -> (2)
   [junit4]   2> 1544058 INFO  (zkConnectionManagerCallback-2994-thread-1) [    ] o.a.s.c.c.ConnectionManager zkClient has connected
   [junit4]   2> 1544059 INFO  (jetty-launcher-2961-thread-1) [n:127.0.0.1:63364_solr    ] o.a.s.c.c.ZkStateReader Updated live nodes from ZooKeeper... (0) -> (2)
   [junit4]   2> 1544059 INFO  (jetty-launcher-2961-thread-1) [n:127.0.0.1:63364_solr    ] o.a.s.c.s.i.ZkClientClusterStateProvider Cluster at 127.0.0.1:63359/solr ready
   [junit4]   2> 1544059 INFO  (jetty-launcher-2961-thread-1) [n:127.0.0.1:63364_solr    ] o.a.s.h.a.MetricsHistoryHandler No .system collection, keeping metrics history in memory.
   [junit4]   2> 1544060 INFO  (jetty-launcher-2961-thread-2) [n:127.0.0.1:63363_solr    ] o.a.s.h.a.MetricsHistoryHandler No .system collection, keeping metrics history in memory.
   [junit4]   2> 1544082 INFO  (jetty-launcher-2961-thread-1) [n:127.0.0.1:63364_solr    ] o.a.s.m.r.SolrJmxReporter JMX monitoring for 'solr_63364.solr.node' (registry 'solr.node') enabled at server: com.sun.jmx.mbeanserver.JmxMBeanServer@2fb5be2d
   [junit4]   2> 1544084 INFO  (jetty-launcher-2961-thread-2) [n:127.0.0.1:63363_solr    ] o.a.s.m.r.SolrJmxReporter JMX monitoring for 'solr_63363.solr.node' (registry 'solr.node') enabled at server: com.sun.jmx.mbeanserver.JmxMBeanServer@2fb5be2d
   [junit4]   2> 1544089 INFO  (jetty-launcher-2961-thread-1) [n:127.0.0.1:63364_solr    ] o.a.s.m.r.SolrJmxReporter JMX monitoring for 'solr_63364.solr.jvm' (registry 'solr.jvm') enabled at server: com.sun.jmx.mbeanserver.JmxMBeanServer@2fb5be2d
   [junit4]   2> 1544090 INFO  (jetty-launcher-2961-thread-2) [n:127.0.0.1:63363_solr    ] o.a.s.m.r.SolrJmxReporter JMX monitoring for 'solr_63363.solr.jvm' (registry 'solr.jvm') enabled at server: com.sun.jmx.mbeanserver.JmxMBeanServer@2fb5be2d
   [junit4]   2> 1544090 INFO  (jetty-launcher-2961-thread-1) [n:127.0.0.1:63364_solr    ] o.a.s.m.r.SolrJmxReporter JMX monitoring for 'solr_63364.solr.jetty' (registry 'solr.jetty') enabled at server: com.sun.jmx.mbeanserver.JmxMBeanServer@2fb5be2d
   [junit4]   2> 1544090 INFO  (jetty-launcher-2961-thread-2) [n:127.0.0.1:63363_solr    ] o.a.s.m.r.SolrJmxReporter JMX monitoring for 'solr_63363.solr.jetty' (registry 'solr.jetty') enabled at server: com.sun.jmx.mbeanserver.JmxMBeanServer@2fb5be2d
   [junit4]   2> 1544091 INFO  (jetty-launcher-2961-thread-1) [n:127.0.0.1:63364_solr    ] o.a.s.c.CorePropertiesLocator Found 0 core definitions underneath C:\Users\jenkins\workspace\Lucene-Solr-7.x-Windows\solr\build\solr-core\test\J1\temp\solr.cloud.TestPullReplica_B652312A41EF8EA-001\tempDir-001\node1\.
   [junit4]   2> 1544091 INFO  (jetty-launcher-2961-thread-2) [n:127.0.0.1:63363_solr    ] o.a.s.c.CorePropertiesLocator Found 0 core definitions underneath C:\Users\jenkins\workspace\Lucene-Solr-7.x-Windows\solr\build\solr-core\test\J1\temp\solr.cloud.TestPullReplica_B652312A41EF8EA-001\tempDir-001\node2\.
   [junit4]   2> 1544123 INFO  (zkConnectionManagerCallback-2998-thread-1) [    ] o.a.s.c.c.ConnectionManager zkClient has connected
   [junit4]   2> 1544127 INFO  (zkConnectionManagerCallback-3003-thread-1) [    ] o.a.s.c.c.ConnectionManager zkClient has connected
   [junit4]   2> 1544129 INFO  (SUITE-TestPullReplica-seed#[B652312A41EF8EA]-worker) [    ] o.a.s.c.c.ZkStateReader Updated live nodes from ZooKeeper... (0) -> (2)
   [junit4]   2> 1544129 INFO  (SUITE-TestPullReplica-seed#[B652312A41EF8EA]-worker) [    ] o.a.s.c.s.i.ZkClientClusterStateProvider Cluster at 127.0.0.1:63359/solr ready
   [junit4]   2> 1544133 INFO  (SUITE-TestPullReplica-seed#[B652312A41EF8EA]-worker) [    ] o.a.s.c.TestPullReplica Using legacyCloud?: false
   [junit4]   2> 1544145 INFO  (qtp356056994-9788) [n:127.0.0.1:63363_solr    ] o.a.s.h.a.CollectionsHandler Invoked Collection Action :clusterprop with params val=false&name=legacyCloud&action=CLUSTERPROP&wt=javabin&version=2 and sendToOCPQueue=true
   [junit4]   2> 1544150 INFO  (qtp356056994-9788) [n:127.0.0.1:63363_solr    ] o.a.s.s.HttpSolrCall [admin] webapp=null path=/admin/collections params={val=false&name=legacyCloud&action=CLUSTERPROP&wt=javabin&version=2} status=0 QTime=1
   [junit4]   2> 1544162 INFO  (TEST-TestPullReplica.testAddRemovePullReplica-seed#[B652312A41EF8EA]) [    ] o.a.s.SolrTestCaseJ4 ###Starting testAddRemovePullReplica
   [junit4]   2> 1544165 INFO  (qtp356056994-9793) [n:127.0.0.1:63363_solr    ] o.a.s.h.a.CollectionsHandler Invoked Collection Action :create with params pullReplicas=0&collection.configName=conf&maxShardsPerNode=100&name=pull_replica_test_add_remove_pull_replica&nrtReplicas=1&action=CREATE&numShards=2&tlogReplicas=0&wt=javabin&version=2 and sendToOCPQueue=true
   [junit4]   2> 1544167 INFO  (OverseerThreadFactory-4297-thread-1-processing-n:127.0.0.1:63363_solr) [n:127.0.0.1:63363_solr    ] o.a.s.c.a.c.CreateCollectionCmd Create collection pull_replica_test_add_remove_pull_replica
   [junit4]   2> 1544279 INFO  (OverseerStateUpdate-72151992825806852-127.0.0.1:63363_solr-n_0000000000) [n:127.0.0.1:63363_solr    ] o.a.s.c.o.SliceMutator createReplica() {
   [junit4]   2>   "operation":"ADDREPLICA",
   [junit4]   2>   "collection":"pull_replica_test_add_remove_pull_replica",
   [junit4]   2>   "shard":"shard1",
   [junit4]   2>   "core":"pull_replica_test_add_remove_pull_replica_shard1_replica_n1",
   [junit4]   2>   "state":"down",
   [junit4]   2>   "base_url":"https://127.0.0.1:63364/solr",
   [junit4]   2>   "type":"NRT",
   [junit4]   2>   "waitForFinalState":"false"} 
   [junit4]   2> 1544280 INFO  (OverseerStateUpdate-72151992825806852-127.0.0.1:63363_solr-n_0000000000) [n:127.0.0.1:63363_solr    ] o.a.s.c.o.SliceMutator createReplica() {
   [junit4]   2>   "operation":"ADDREPLICA",
   [junit4]   2>   "collection":"pull_replica_test_add_remove_pull_replica",
   [junit4]   2>   "shard":"shard2",
   [junit4]   2>   "core":"pull_replica_test_add_remove_pull_replica_shard2_replica_n2",
   [junit4]   2>   "state":"down",
   [junit4]   2>   "base_url":"https://127.0.0.1:63363/solr",
   [junit4]   2>   "type":"NRT",
   [junit4]   2>   "waitForFinalState":"false"} 
   [junit4]   2> 1544495 INFO  (qtp356056994-9792) [n:127.0.0.1:63363_solr    x:pull_replica_test_add_remove_pull_replica_shard2_replica_n2] o.a.s.h.a.CoreAdminOperation core create command qt=/admin/cores&coreNodeName=core_node4&collection.configName=conf&newCollection=true&name=pull_replica_test_add_remove_pull_replica_shard2_replica_n2&action=CREATE&numShards=2&collection=pull_replica_test_add_remove_pull_replica&shard=shard2&wt=javabin&version=2&replicaType=NRT
   [junit4]   2> 1544504 INFO  (qtp674082211-9804) [n:127.0.0.1:63364_solr    x:pull_replica_test_add_remove_pull_replica_shard1_replica_n1] o.a.s.h.a.CoreAdminOperation core create command qt=/admin/cores&coreNodeName=core_node3&collection.configName=conf&newCollection=true&name=pull_replica_test_add_remove_pull_replica_shard1_replica_n1&action=CREATE&numShards=2&collection=pull_replica_test_add_remove_pull_replica&shard=shard1&wt=javabin&version=2&replicaType=NRT
   [junit4]   2> 1544505 INFO  (qtp674082211-9804) [n:127.0.0.1:63364_solr    x:pull_replica_test_add_remove_pull_replica_shard1_replica_n1] o.a.s.c.TransientSolrCoreCacheDefault Allocating transient cache for 2147483647 transient cores
   [junit4]   2> 1545514 INFO  (qtp356056994-9792) [n:127.0.0.1:63363_solr c:pull_replica_test_add_remove_pull_replica s:shard2 r:core_node4 x:pull_replica_test_add_remove_pull_replica_shard2_replica_n2] o.a.s.c.SolrConfig Using Lucene MatchVersion: 7.5.0
   [junit4]   2> 1545518 INFO  (qtp674082211-9804) [n:127.0.0.1:63364_solr c:pull_replica_test_add_remove_pull_replica s:shard1 r:core_node3 x:pull_replica_test_add_remove_pull_replica_shard1_replica_n1] o.a.s.c.SolrConfig Using Lucene MatchVersion: 7.5.0
   [junit4]   2> 1545526 INFO  (qtp356056994-9792) [n:127.0.0.1:63363_solr c:pull_replica_test_add_remove_pull_replica s:shard2 r:core_node4 x:pull_replica_test_add_remove_pull_replica_shard2_replica_n2] o.a.s.s.IndexSchema [pull_replica_test_add_remove_pull_replica_shard2_replica_n2] Schema name=minimal
   [junit4]   2> 1545527 INFO  (qtp674082211-9804) [n:127.0.0.1:63364_solr c:pull_replica_test_add_remove_pull_replica s:shard1 r:core_node3 x:pull_replica_test_add_remove_pull_replica_shard1_replica_n1] o.a.s.s.IndexSchema [pull_replica_test_add_remove_pull_replica_shard1_replica_n1] Schema name=minimal
   [junit4]   2> 1545528 INFO  (qtp356056994-9792) [n:127.0.0.1:63363_solr c:pull_replica_test_add_remove_pull_replica s:shard2 r:core_node4 x:pull_replica_test_add_remove_pull_replica_shard2_replica_n2] o.a.s.s.IndexSchema Loaded schema minimal/1.1 with uniqueid field id
   [junit4]   2> 1545528 INFO  (qtp356056994-9792) [n:127.0.0.1:63363_solr c:pull_replica_test_add_remove_pull_replica s:shard2 r:core_node4 x:pull_replica_test_add_remove_pull_replica_shard2_replica_n2] o.a.s.c.CoreContainer Creating SolrCore 'pull_replica_test_add_remove_pull_replica_shard2_replica_n2' using configuration from collection pull_replica_test_add_remove_pull_replica, trusted=true
   [junit4]   2> 1545528 INFO  (qtp674082211-9804) [n:127.0.0.1:63364_solr c:pull_replica_test_add_remove_pull_replica s:shard1 r:core_node3 x:pull_replica_test_add_remove_pull_replica_shard1_replica_n1] o.a.s.s.IndexSchema Loaded schema minimal/1.1 with uniqueid field id
   [junit4]   2> 1545528 INFO  (qtp674082211-9804) [n:127.0.0.1:63364_solr c:pull_replica_test_add_remove_pull_replica s:shard1 r:core_node3 x:pull_replica_test_add_remove_pull_replica_shard1_replica_n1] o.a.s.c.CoreContainer Creating SolrCore 'pull_replica_test_add_remove_pull_replica_shard1_replica_n1' using configuration from collection pull_replica_test_add_remove_pull_replica, trusted=true
   [junit4]   2> 1545529 INFO  (qtp356056994-9792) [n:127.0.0.1:63363_solr c:pull_replica_test_add_remove_pull_replica s:shard2 r:core_node4 x:pull_replica_test_add_remove_pull_replica_shard2_replica_n2] o.a.s.m.r.SolrJmxReporter JMX monitoring for 'solr_63363.solr.core.pull_replica_test_add_remove_pull_replica.shard2.replica_n2' (registry 'solr.core.pull_replica_test_add_remove_pull_replica.shard2.replica_n2') enabled at server: com.sun.jmx.mbeanserver.JmxMBeanServer@2fb5be2d
   [junit4]   2> 1545529 INFO  (qtp674082211-9804) [n:127.0.0.1:63364_solr c:pull_replica_test_add_remove_pull_replica s:shard1 r:core_node3 x:pull_replica_test_add_remove_pull_replica_shard1_replica_n1] o.a.s.m.r.SolrJmxReporter JMX monitoring for 'solr_63364.solr.core.pull_replica_test_add_remove_pull_replica.shard1.replica_n1' (registry 'solr.core.pull_replica_test_add_remove_pull_replica.shard1.replica_n1') enabled at server: com.sun.jmx.mbeanserver.JmxMBeanServer@2fb5be2d
   [junit4]   2> 1545529 INFO  (qtp356056994-9792) [n:127.0.0.1:63363_solr c:pull_replica_test_add_remove_pull_replica s:shard2 r:core_node4 x:pull_replica_test_add_remove_pull_replica_shard2_replica_n2] o.a.s.c.SolrCore solr.RecoveryStrategy.Builder
   [junit4]   2> 1545529 INFO  (qtp674082211-9804) [n:127.0.0.1:63364_solr c:pull_replica_test_add_remove_pull_replica s:shard1 r:core_node3 x:pull_replica_test_add_remove_pull_replica_shard1_replica_n1] o.a.s.c.SolrCore solr.RecoveryStrategy.Builder
   [junit4]   2> 1545529 INFO  (qtp356056994-9792) [n:127.0.0.1:63363_solr c:pull_replica_test_add_remove_pull_replica s:shard2 r:core_node4 x:pull_replica_test_add_remove_pull_replica_shard2_replica_n2] o.a.s.c.SolrCore [[pull_replica_test_add_remove_pull_replica_shard2_replica_n2] ] Opening new SolrCore at [C:\Users\jenkins\workspace\Lucene-Solr-7.x-Windows\solr\build\solr-core\test\J1\temp\solr.cloud.TestPullReplica_B652312A41EF8EA-001\tempDir-001\node2\pull_replica_test_add_remove_pull_replica_shard2_replica_n2], dataDir=[C:\Users\jenkins\workspace\Lucene-Solr-7.x-Windows\solr\build\solr-core\test\J1\temp\solr.cloud.TestPullReplica_B652312A41EF8EA-001\tempDir-001\node2\.\pull_replica_test_add_remove_pull_replica_shard2_replica_n2\data\]
   [junit4]   2> 1545529 INFO  (qtp674082211-9804) [n:127.0.0.1:63364_solr c:pull_replica_test_add_remove_pull_replica s:shard1 r:core_node3 x:pull_replica_test_add_remove_pull_replica_shard1_replica_n1] o.a.s.c.SolrCore [[pull_replica_test_add_remove_pull_replica_shard1_replica_n1] ] Opening new SolrCore at [C:\Users\jenkins\workspace\Lucene-Solr-7.x-Windows\solr\build\solr-core\test\J1\temp\solr.cloud.TestPullReplica_B652312A41EF8EA-001\tempDir-001\node1\pull_replica_test_add_remove_pull_replica_shard1_replica_n1], dataDir=[C:\Users\jenkins\workspace\Lucene-Solr-7.x-Windows\solr\build\solr-core\test\J1\temp\solr.cloud.TestPullReplica_B652312A41EF8EA-001\tempDir-001\node1\.\pull_replica_test_add_remove_pull_replica_shard1_replica_n1\data\]
   [junit4]   2> 1545594 INFO  (qtp356056994-9792) [n:127.0.0.1:63363_solr c:pull_replica_test_add_remove_pull_replica s:shard2 r:core_node4 x:pull_replica_test_add_remove_pull_replica_shard2_replica_n2] o.a.s.u.UpdateHandler Using UpdateLog implementation: org.apache.solr.update.UpdateLog
   [junit4]   2> 1545594 INFO  (qtp356056994-9792) [n:127.0.0.1:63363_solr c:pull_replica_test_add_remove_pull_replica s:shard2 r:core_node4 x:pull_replica_test_add_remove_pull_replica_shard2_replica_n2] o.a.s.u.UpdateLog Initializing UpdateLog: dataDir=null defaultSyncLevel=FLUSH numRecordsToKeep=100 maxNumLogsToKeep=10 numVersionBuckets=65536
   [junit4]   2> 1545596 INFO  (qtp356056994-9792) [n:127.0.0.1:63363_solr c:pull_replica_test_add_remove_pull_replica s:shard2 r:core_node4 x:pull_replica_test_add_remove_pull_replica_shard2_replica_n2] o.a.s.u.CommitTracker Hard AutoCommit: disabled
   [junit4]   2> 1545596 INFO  (qtp356056994-9792) [n:127.0.0.1:63363_solr c:pull_replica_test_add_remove_pull_replica s:shard2 r:core_node4 x:pull_replica_test_add_remove_pull_replica_shard2_replica_n2] o.a.s.u.CommitTracker Soft AutoCommit: disabled
   [junit4]   2> 1545608 INFO  (qtp356056994-9792) [n:127.0.0.1:63363_solr c:pull_replica_test_add_remove_pull_replica s:shard2 r:core_node4 x:pull_replica_test_add_remove_pull_replica_shard2_replica_n2] o.a.s.s.SolrIndexSearcher Opening [Searcher@30668ebd[pull_replica_test_add_remove_pull_replica_shard2_replica_n2] main]
   [junit4]   2> 1545609 INFO  (qtp356056994-9792) [n:127.0.0.1:63363_solr c:pull_replica_test_add_remove_pull_replica s:shard2 r:core_node4 x:pull_replica_test_add_remove_pull_replica_shard2_replica_n2] o.a.s.r.ManagedResourceStorage Configured ZooKeeperStorageIO with znodeBase: /configs/conf
   [junit4]   2> 1545610 INFO  (qtp356056994-9792) [n:127.0.0.1:63363_solr c:pull_replica_test_add_remove_pull_replica s:shard2 r:core_node4 x:pull_replica_test_add_remove_pull_replica_shard2_replica_n2] o.a.s.r.ManagedResourceStorage Loaded null at path _rest_managed.json using ZooKeeperStorageIO:path=/configs/conf
   [junit4]   2> 1545610 INFO  (qtp356056994-9792) [n:127.0.0.1:63363_solr c:pull_replica_test_add_remove_pull_replica s:shard2 r:core_node4 x:pull_replica_test_add_remove_pull_replica_shard2_replica_n2] o.a.s.h.ReplicationHandler Commits will be reserved for 10000ms.
   [junit4]   2> 1545610 INFO  (qtp356056994-9792) [n:127.0.0.1:63363_solr c:pull_replica_test_add_remove_pull_replica s:shard2 r:core_node4 x:pull_replica_test_add_remove_pull_replica_shard2_replica_n2] o.a.s.u.UpdateLog Could not find max version in index or recent updates, using new clock 1610449818142900224
   [junit4]   2> 1545611 INFO  (searcherExecutor-4306-thread-1-processing-n:127.0.0.1:63363_solr x:pull_replica_test_add_remove_pull_replica_shard2_replica_n2 c:pull_replica_test_add_remove_pull_replica s:shard2 r:core_node4) [n:127.0.0.1:63363_solr c:pull_replica_test_add_remove_pull_replica s:shard2 r:core_node4 x:pull_replica_test_add_remove_pull_replica_shard2_replica_n2] o.a.s.c.SolrCore [pull_replica_test_add_remove_pull_replica_shard2_replica_n2] Registered new searcher Searcher@30668ebd[pull_replica_test_add_remove_pull_replica_shard2_replica_n2] main{ExitableDirectoryReader(UninvertingDirectoryReader())}
   [junit4]   2> 1545617 INFO  (qtp356056994-9792) [n:127.0.0.1:63363_solr c:pull_replica_test_add_remove_pull_replica s:shard2 r:core_node4 x:pull_replica_test_add_remove_pull_replica_shard2_replica_n2] o.a.s.c.ZkShardTerms Successful update of terms at /collections/pull_replica_test_add_remove_pull_replica/terms/shard2 to Terms{values={core_node4=0}, version=0}
   [junit4]   2> 1545619 INFO  (qtp356056994-9792) [n:127.0.0.1:63363_solr c:pull_replica_test_add_remove_pull_replica s:shard2 r:core_node4 x:pull_replica_test_add_remove_pull_replica_shard2_replica_n2] o.a.s.c.ShardLeaderElectionContext Enough replicas found to continue.
   [junit4]   2> 1545619 INFO  (qtp356056994-9792) [n:127.0.0.1:63363_solr c:pull_replica_test_add_remove_pull_replica s:shard2 r:core_node4 x:pull_replica_test_add_remove_pull_replica_shard2_replica_n2] o.a.s.c.ShardLeaderElectionContext I may be the new leader - try and sync
   [junit4]   2> 1545620 INFO  (qtp356056994-9792) [n:127.0.0.1:63363_solr c:pull_replica_test_add_remove_pull_replica s:shard2 r:core_node4 x:pull_replica_test_add_remove_pull_replica_shard2_replica_n2] o.a.s.c.SyncStrategy Sync replicas to https://127.0.0.1:63363/solr/pull_replica_test_add_remove_pull_replica_shard2_replica_n2/
   [junit4]   2> 1545620 INFO  (qtp356056994-9792) [n:127.0.0.1:63363_solr c:pull_replica_test_add_remove_pull_replica s:shard2 r:core_node4 x:pull_replica_test_add_remove_pull_replica_shard2_replica_n2] o.a.s.c.SyncStrategy Sync Success - now sync replicas to me
   [junit4]   2> 1545620 INFO  (qtp356056994-9792) [n:127.0.0.1:63363_solr c:pull_replica_test_add_remove_pull_replica s:shard2 r:core_node4 x:pull_replica_test_add_remove_pull_replica_shard2_replica_n2] o.a.s.c.SyncStrategy https://127.0.0.1:63363/solr/pull_replica_test_add_remove_pull_replica_shard2_replica_n2/ has no replicas
   [junit4]   2> 1545620 INFO  (qtp356056994-9792) [n:127.0.0.1:63363_solr c:pull_replica_test_add_remove_pull_replica s:shard2 r:core_node4 x:pull_replica_test_add_remove_pull_replica_shard2_replica_n2] o.a.s.c.ShardLeaderElectionContext Found all replicas participating in election, clear LIR
   [junit4]   2> 1545623 INFO  (qtp356056994-9792) [n:127.0.0.1:63363_solr c:pull_replica_test_add_remove_pull_replica s:shard2 r:core_node4 x:pull_replica_test_add_remove_pull_replica_shard2_replica_n2] o.a.s.c.ShardLeaderElectionContext I am the new leader: https://127.0.0.1:63363/solr/pull_replica_test_add_remove_pull_replica_shard2_replica_n2/ shard2
   [junit4]   2> 1545639 INFO  (qtp674082211-9804) [n:127.0.0.1:63364_solr c:pull_replica_test_add_remove_pull_replica s:shard1 r:core_node3 x:pull_replica_test_add_remove_pull_replica_shard1_replica_n1] o.a.s.u.UpdateHandler Using UpdateLog implementation: org.apache.solr.update.UpdateLog
   [junit4]   2> 1545639 INFO  (qtp674082211-9804) [n:127.0.0.1:63364_solr c:pull_replica_test_add_remove_pull_replica s:shard1 r:core_node3 x:pull_replica_test_add_remove_pull_replica_shard1_replica_n1] o.a.s.u.UpdateLog Initializing UpdateLog: dataDir=null defaultSyncLevel=FLUSH numRecordsToKeep=100 maxNumLogsToKeep=10 numVersionBuckets=65536
   [junit4]   2> 1545641 INFO  (qtp674082211-9804) [n:127.0.0.1:63364_solr c:pull_replica_test_add_remove_pull_replica s:shard1 r:core_node3 x:pull_replica_test_add_remove_pull_replica_shard1_replica_n1] o.a.s.u.CommitTracker Hard AutoCommit: disabled
   [junit4]   2> 1545641 INFO  (qtp674082211-9804) [n:127.0.0.1:63364_solr c:pull_replica_test_add_remove_pull_replica s:shard1 r:core_node3 x:pull_replica_test_add_remove_pull_replica_shard1_replica_n1] o.a.s.u.CommitTracker Soft AutoCommit: disabled
   [junit4]   2> 1545643 INFO  (qtp674082211-9804) [n:127.0.0.1:63364_solr c:pull_replica_test_add_remove_pull_replica s:shard1 r:core_node3 x:pull_replica_test_add_remove_pull_replica_shard1_replica_n1] o.a.s.s.SolrIndexSearcher Opening [Searcher@7e68f1d9[pull_replica_test_add_remove_pull_replica_shard1_replica_n1] main]
   [junit4]   2> 1545644 INFO  (qtp674082211-9804) [n:127.0.0.1:63364_solr c:pull_replica_test_add_remove_pull_replica s:shard1 r:core_node3 x:pull_replica_test_add_remove_pull_replica_shard1_replica_n1] o.a.s.r.ManagedResourceStorage Configured ZooKeeperStorageIO with znodeBase: /configs/conf
   [junit4]   2> 1545645 INFO  (qtp674082211-9804) [n:127.0.0.1:63364_solr c:pull_replica_test_add_remove_pull_replica s:shard1 r:core_node3 x:pull_replica_test_add_remove_pull_replica_shard1_replica_n1] o.a.s.r.ManagedResourceStorage Loaded null at path _rest_managed.json using ZooKeeperStorageIO:path=/configs/conf
   [junit4]   2> 1545645 INFO  (qtp674082211-9804) [n:127.0.0.1:63364_solr c:pull_replica_test_add_remove_pull_replica s:shard1 r:core_node3 x:pull_replica_test_add_remove_pull_replica_shard1_replica_n1] o.a.s.h.ReplicationHandler Commits will be reserved for 10000ms.
   [junit4]   2> 1545645 INFO  (qtp674082211-9804) [n:127.0.0.1:63364_solr c:pull_replica_test_add_remove_pull_replica s:shard1 r:core_node3 x:pull_replica_test_add_remove_pull_replica_shard1_replica_n1] o.a.s.u.UpdateLog Could not find max version in index or recent updates, using new clock 1610449818179600384
   [junit4]   2> 1545646 INFO  (searcherExecutor-4307-thread-1-processing-n:127.0.0.1:63364_solr x:pull_replica_test_add_remove_pull_replica_shard1_replica_n1 c:pull_replica_test_add_remove_pull_replica s:shard1 r:core_node3) [n:127.0.0.1:63364_solr c:pull_replica_test_add_remove_pull_replica s:shard1 r:core_node3 x:pull_replica_test_add_remove_pull_replica_shard1_replica_n1] o.a.s.c.SolrCore [pull_replica_test_add_remove_pull_replica_shard1_replica_n1] Registered new searcher Searcher@7e68f1d9[pull_replica_test_add_remove_pull_replica_shard1_replica_n1] main{ExitableDirectoryReader(UninvertingDirectoryReader())}
   [junit4]   2> 1545649 INFO  (qtp674082211-9804) [n:127.0.0.1:63364_solr c:pull_replica_test_add_remove_pull_replica s:shard1 r:core_node3 x:pull_replica_test_add_remove_pull_replica_shard1_replica_n1] o.a.s.c.ZkShardTerms Successful update of terms at /collections/pull_replica_test_add_remove_pull_replica/terms/shard1 to Terms{values={core_node3=0}, version=0}
   [junit4]   2> 1545652 INFO  (qtp674082211-9804) [n:127.0.0.1:63364_solr c:pull_replica_test_add_remove_pull_replica s:shard1 r:core_node3 x:pull_replica_test_add_remove_pull_replica_shard1_replica_n1] o.a.s.c.ShardLeaderElectionContext Enough replicas found to continue.
   [junit4]   2> 1545652 INFO  (qtp674082211-9804) [n:127.0.0.1:63364_solr c:pull_replica_test_add_remove_pull_replica s:shard1 r:core_node3 x:pull_replica_test_add_remove_pull_replica_shard1_replica_n1] o.a.s.c.ShardLeaderElectionContext I may be the new leader - try and sync
   [junit4]   2> 1545652 INFO  (qtp674082211-9804) [n:127.0.0.1:63364_solr c:pull_replica_test_add_remove_pull_replica s:shard1 r:core_node3 x:pull_replica_test_add_remove_pull_replica_shard1_replica_n1] o.a.s.c.SyncStrategy Sync replicas to https://127.0.0.1:63364/solr/pull_replica_test_add_remove_pull_replica_shard1_replica_n1/
   [junit4]   2> 1545652 INFO  (qtp674082211-9804) [n:127.0.0.1:63364_solr c:pull_replica_test_add_remove_pull_replica s:shard1 r:core_node3 x:pull_replica_test_add_remove_pull_replica_shard1_replica_n1] o.a.s.c.SyncStrategy Sync Success - now sync replicas to me
   [junit4]   2> 1545652 INFO  (qtp674082211-9804) [n:127.0.0.1:63364_solr c:pull_replica_test_add_remove_pull_replica s:shard1 r:core_node3 x:pull_replica_test_add_remove_pull_replica_shard1_replica_n1] o.a.s.c.SyncStrategy https://127.0.0.1:63364/solr/pull_replica_test_add_remove_pull_replica_shard1_replica_n1/ has no replicas
   [junit4]   2> 1545652 INFO  (qtp674082211-9804) [n:127.0.0.1:63364_solr c:pull_replica_test_add_remove_pull_replica s:shard1 r:core_node3 x:pull_replica_test_add_remove_pull_replica_shard1_replica_n1] o.a.s.c.ShardLeaderElectionContext Found all replicas participating in election, clear LIR
   [junit4]   2> 1545655 INFO  (qtp674082211-9804) [n:127.0.0.1:63364_solr c:pull_replica_test_add_remove_pull_replica s:shard1 r:core_node3 x:pull_replica_test_add_remove_pull_replica_shard1_replica_n1] o.a.s.c.ShardLeaderElectionContext I am the new leader: https://127.0.0.1:63364/solr/pull_replica_test_add_remove_pull_replica_shard1_replica_n1/ shard1
   [junit4]   2> 1545776 INFO  (qtp356056994-9792) [n:127.0.0.1:63363_solr c:pull_replica_test_add_remove_pull_replica s:shard2 r:core_node4 x:pull_replica_test_add_remove_pull_replica_shard2_replica_n2] o.a.s.c.ZkController I am the leader, no recovery necessary
   [junit4]   2> 1545778 INFO  (qtp356056994-9792) [n:127.0.0.1:63363_solr c:pull_replica_test_add_remove_pull_replica s:shard2 r:core_node4 x:pull_replica_test_add_remove_pull_replica_shard2_replica_n2] o.a.s.s.HttpSolrCall [admin] webapp=null path=/admin/cores params={qt=/admin/cores&coreNodeName=core_node4&collection.configName=conf&newCollection=true&name=pull_replica_test_add_remove_pull_replica_shard2_replica_n2&action=CREATE&numShards=2&collection=pull_replica_test_add_remove_pull_replica&shard=shard2&wt=javabin&version=2&replicaType=NRT} status=0 QTime=1283
   [junit4]   2> 1545808 INFO  (qtp674082211-9804) [n:127.0.0.1:63364_solr c:pull_replica_test_add_remove_pull_replica s:shard1 r:core_node3 x:pull_replica_test_add_remove_pull_replica_shard1_replica_n1] o.a.s.c.ZkController I am the leader, no recovery necessary
   [junit4]   2> 1545811 INFO  (qtp674082211-9804) [n:127.0.0.1:63364_solr c:pull_replica_test_add_remove_pull_replica s:shard1 r:core_node3 x:pull_replica_test_add_remove_pull_replica_shard1_replica_n1] o.a.s.s.HttpSolrCall [admin] webapp=null path=/admin/cores params={qt=/admin/cores&coreNodeName=core_node3&collection.configName=conf&newCollection=true&name=pull_replica_test_add_remove_pull_replica_shard1_replica_n1&action=CREATE&numShards=2&collection=pull_replica_test_add_remove_pull_replica&shard=shard1&wt=javabin&version=2&replicaType=NRT} status=0 QTime=1307
   [junit4]   2> 1545813 INFO  (qtp356056994-9793) [n:127.0.0.1:63363_solr    ] o.a.s.h.a.CollectionsHandler Wait for new collection to be active for at most 30 seconds. Check all shard replicas
   [junit4]   2> 1545911 INFO  (zkCallback-2979-thread-1) [    ] o.a.s.c.c.ZkStateReader A cluster state change: [WatchedEvent state:SyncConnected type:NodeDataChanged path:/collections/pull_replica_test_add_remove_pull_replica/state.json] for collection [pull_replica_test_add_remove_pull_replica] has occurred - updating... (live nodes size: [2])
   [junit4]   2> 1545911 INFO  (zkCallback-2973-thread-1) [    ] o.a.s.c.c.ZkStateReader A cluster state change: [WatchedEvent state:SyncConnected type:NodeDataChanged path:/collections/pull_replica_test_add_remove_pull_replica/state.json] for collection [pull_replica_test_add_remove_pull_replica] has occurred - updating... (live nodes size: [2])
   [junit4]   2> 1546168 INFO  (OverseerCollectionConfigSetProcessor-72151992825806852-127.0.0.1:63363_solr-n_0000000000) [n:127.0.0.1:63363_solr    ] o.a.s.c.OverseerTaskQueue Response ZK path: /overseer/collection-queue-work/qnr-0000000000 doesn't exist.  Requestor may have disconnected from ZooKeeper
   [junit4]   2> 1546814 INFO  (qtp356056994-9793) [n:127.0.0.1:63363_solr    ] o.a.s.s.HttpSolrCall [admin] webapp=null path=/admin/collections params={pullReplicas=0&collection.configName=conf&maxShardsPerNode=100&name=pull_replica_test_add_remove_pull_replica&nrtReplicas=1&action=CREATE&numShards=2&tlogReplicas=0&wt=javabin&version=2} status=0 QTime=2649
   [junit4]   2> 1546831 INFO  (OverseerThreadFactory-4297-thread-2-processing-n:127.0.0.1:63363_solr) [n:127.0.0.1:63363_solr c:pull_replica_test_add_remove_pull_replica s:shard1  ] o.a.s.c.a.c.AddReplicaCmd Node Identified 127.0.0.1:63363_solr for creating new replica of shard shard1
   [junit4]   2> 1546833 INFO  (OverseerStateUpdate-72151992825806852-127.0.0.1:63363_solr-n_0000000000) [n:127.0.0.1:63363_solr    ] o.a.s.c.o.SliceMutator createReplica() {
   [junit4]   2>   "operation":"addreplica",
   [junit4]   2>   "collection":"pull_replica_test_add_remove_pull_replica",
   [junit4]   2>   "shard":"shard1",
   [junit4]   2>   "core":"pull_replica_test_add_remove_pull_replica_shard1_replica_p5",
   [junit4]   2>   "state":"down",
   [junit4]   2>   "base_url":"https://127.0.0.1:63363/solr",
   [junit4]   2>   "node_name":"127.0.0.1:63363_solr",
   [junit4]   2>   "type":"PULL"} 
   [junit4]   2> 1546936 INFO  (zkCallback-2979-thread-1) [    ] o.a.s.c.c.ZkStateReader A cluster state change: [WatchedEvent state:SyncConnected type:NodeDataChanged path:/collections/pull_replica_test_add_remove_pull_replica/state.json] for collection [pull_replica_test_add_remove_pull_replica] has occurred - updating... (live nodes size: [2])
   [junit4]   2> 1546936 INFO  (zkCallback-2973-thread-1) [    ] o.a.s.c.c.ZkStateReader A cluster state change: [WatchedEvent state:SyncConnected type:NodeDataChanged path:/collections/pull_replica_test_add_remove_pull_replica/state.json] for collection [pull_replica_test_add_remove_pull_replica] has occurred - updating... (live nodes size: [2])
   [junit4]   2> 1547035 INFO  (qtp356056994-9791) [n:127.0.0.1:63363_solr    x:pull_replica_test_add_remove_pull_replica_shard1_replica_p5] o.a.s.h.a.CoreAdminOperation core create command qt=/admin/cores&coreNodeName=core_node6&collection.configName=conf&name=pull_replica_test_add_remove_pull_replica_shard1_replica_p5&action=CREATE&collection=pull_replica_test_add_remove_pull_replica&shard=shard1&wt=javabin&version=2&replicaType=PULL
   [junit4]   2> 1547126 INFO  (qtp356056994-9791) [n:127.0.0.1:63363_solr c:pull_replica_test_add_remove_pull_replica s:shard1 r:core_node6 x:pull_replica_test_add_remove_pull_replica_shard1_replica_p5] o.a.s.c.SolrConfig Using Lucene MatchVersion: 7.5.0
   [junit4]   2> 1547135 INFO  (qtp356056994-9791) [n:127.0.0.1:63363_solr c:pull_replica_test_add_remove_pull_replica s:shard1 r:core_node6 x:pull_replica_test_add_remove_pull_replica_shard1_replica_p5] o.a.s.s.IndexSchema [pull_replica_test_add_remove_pull_replica_shard1_replica_p5] Schema name=minimal
   [junit4]   2> 1547137 INFO  (qtp356056994-9791) [n:127.0.0.1:63363_solr c:pull_replica_test_add_remove_pull_replica s:shard1 r:core_node6 x:pull_replica_test_add_remove_pull_replica_shard1_replica_p5] o.a.s.s.IndexSchema Loaded schema minimal/1.1 with uniqueid field id
   [junit4]   2> 1547137 INFO  (qtp356056994-9791) [n:127.0.0.1:63363_solr c:pull_replica_test_add_remove_pull_replica s:shard1 r:core_node6 x:pull_replica_test_add_remove_pull_replica_shard1_replica_p5] o.a.s.c.CoreContainer Creating SolrCore 'pull_replica_test_add_remove_pull_replica_shard1_replica_p5' using configuration from collection pull_replica_test_add_remove_pull_replica, trusted=true
   [junit4]   2> 1547137 INFO  (qtp356056994-9791) [n:127.0.0.1:63363_solr c:pull_replica_test_add_remove_pull_replica s:shard1 r:core_node6 x:pull_replica_test_add_remove_pull_replica_shard1_replica_p5] o.a.s.m.r.SolrJmxReporter JMX monitoring for 'solr_63363.solr.core.pull_replica_test_add_remove_pull_replica.shard1.replica_p5' (registry 'solr.core.pull_replica_test_add_remove_pull_replica.shard1.replica_p5') enabled at server: com.sun.jmx.mbeanserver.JmxMBeanServer@2fb5be2d
   [junit4]   2> 1547137 INFO  (qtp356056994-9791) [n:127.0.0.1:63363_solr c:pull_replica_test_add_remove_pull_replica s:shard1 r:core_node6 x:pull_replica_test_add_remove_pull_replica_shard1_replica_p5] o.a.s.c.SolrCore solr.RecoveryStrategy.Builder
   [junit4]   2> 1547137 INFO  (qtp356056994-9791) [n:127.0.0.1:63363_solr c:pull_replica_test_add_remove_pull_replica s:shard1 r:core_node6 x:pull_replica_test_add_remove_pull_replica_shard1_replica_p5] o.a.s.c.SolrCore [[pull_replica_test_add_remove_pull_replica_shard1_replica_p5] ] Opening new SolrCore at [C:\Users\jenkins\workspace\Lucene-Solr-7.x-Windows\solr\build\solr-core\test\J1\temp\solr.cloud.TestPullReplica_B652312A41EF8EA-001\tempDir-001\node2\pull_replica_test_add_remove_pull_replica_shard1_replica_p5], dataDir=[C:\Users\jenkins\workspace\Lucene-Solr-7.x-Windows\solr\build\solr-core\test\J1\temp\solr.cloud.TestPullReplica_B652312A41EF8EA-001\tempDir-001\node2\.\pull_replica_test_add_remove_pull_replica_shard1_replica_p5\data\]
   [junit4]   2> 1547205 INFO  (qtp356056994-9791) [n:127.0.0.1:63363_solr c:pull_replica_test_add_remove_pull_replica s:shard1 r:core_node6 x:pull_replica_test_add_remove_pull_replica_shard1_replica_p5] o.a.s.u.CommitTracker Hard AutoCommit: disabled
   [junit4]   2> 1547205 INFO  (qtp356056994-9791) [n:127.0.0.1:63363_solr c:pull_replica_test_add_remove_pull_replica s:shard1 r:core_node6 x:pull_replica_test_add_remove_pull_replica_shard1_replica_p5] o.a.s.u.CommitTracker Soft AutoCommit: disabled
   [junit4]   2> 1547206 INFO  (qtp356056994-9791) [n:127.0.0.1:63363_solr c:pull_replica_test_add_remove_pull_replica s:shard1 r:core_node6 x:pull_replica_test_add_remove_pull_replica_shard1_replica_p5] o.a.s.s.SolrIndexSearcher Opening [Searcher@6ccec3bc[pull_replica_test_add_remove_pull_replica_shard1_replica_p5] main]
   [junit4]   2> 1547207 INFO  (qtp356056994-9791) [n:127.0.0.1:63363_solr c:pull_replica_test_add_remove_pull_replica s:shard1 r:core_node6 x:pull_replica_test_add_remove_pull_replica_shard1_replica_p5] o.a.s.r.ManagedResourceStorage Configured ZooKeeperStorageIO with znodeBase: /configs/conf
   [junit4]   2> 1547207 INFO  (qtp356056994-9791) [n:127.0.0.1:63363_solr c:pull_replica_test_add_remove_pull_replica s:shard1 r:core_node6 x:pull_replica_test_add_remove_pull_replica_shard1_replica_p5] o.a.s.r.

[...truncated too long message...]

terceptors-collective-2.0.0-M15.jar;C:\Users\jenkins\workspace\Lucene-Solr-7.x-Windows\solr\core\test-lib\apacheds-interceptors-event-2.0.0-M15.jar;C:\Users\jenkins\workspace\Lucene-Solr-7.x-Windows\solr\core\test-lib\apacheds-interceptors-exception-2.0.0-M15.jar;C:\Users\jenkins\workspace\Lucene-Solr-7.x-Windows\solr\core\test-lib\apacheds-interceptors-journal-2.0.0-M15.jar;C:\Users\jenkins\workspace\Lucene-Solr-7.x-Windows\solr\core\test-lib\apacheds-interceptors-normalization-2.0.0-M15.jar;C:\Users\jenkins\workspace\Lucene-Solr-7.x-Windows\solr\core\test-lib\apacheds-interceptors-operational-2.0.0-M15.jar;C:\Users\jenkins\workspace\Lucene-Solr-7.x-Windows\solr\core\test-lib\apacheds-interceptors-referral-2.0.0-M15.jar;C:\Users\jenkins\workspace\Lucene-Solr-7.x-Windows\solr\core\test-lib\apacheds-interceptors-schema-2.0.0-M15.jar;C:\Users\jenkins\workspace\Lucene-Solr-7.x-Windows\solr\core\test-lib\apacheds-interceptors-subtree-2.0.0-M15.jar;C:\Users\jenkins\workspace\Lucene-Solr-7.x-Windows\solr\core\test-lib\apacheds-interceptors-trigger-2.0.0-M15.jar;C:\Users\jenkins\workspace\Lucene-Solr-7.x-Windows\solr\core\test-lib\apacheds-jdbm-partition-2.0.0-M15.jar;C:\Users\jenkins\workspace\Lucene-Solr-7.x-Windows\solr\core\test-lib\apacheds-jdbm1-2.0.0-M2.jar;C:\Users\jenkins\workspace\Lucene-Solr-7.x-Windows\solr\core\test-lib\apacheds-kerberos-codec-2.0.0-M15.jar;C:\Users\jenkins\workspace\Lucene-Solr-7.x-Windows\solr\core\test-lib\apacheds-ldif-partition-2.0.0-M15.jar;C:\Users\jenkins\workspace\Lucene-Solr-7.x-Windows\solr\core\test-lib\apacheds-mavibot-partition-2.0.0-M15.jar;C:\Users\jenkins\workspace\Lucene-Solr-7.x-Windows\solr\core\test-lib\apacheds-protocol-kerberos-2.0.0-M15.jar;C:\Users\jenkins\workspace\Lucene-Solr-7.x-Windows\solr\core\test-lib\apacheds-protocol-ldap-2.0.0-M15.jar;C:\Users\jenkins\workspace\Lucene-Solr-7.x-Windows\solr\core\test-lib\apacheds-protocol-shared-2.0.0-M15.jar;C:\Users\jenkins\workspace\Lucene-Solr-7.x-Windows\solr\core\test-lib\apacheds-xdbm-partition-2.0.0-M15.jar;C:\Users\jenkins\workspace\Lucene-Solr-7.x-Windows\solr\core\test-lib\api-all-1.0.0-M20.jar;C:\Users\jenkins\workspace\Lucene-Solr-7.x-Windows\solr\core\test-lib\bcprov-jdk15on-1.54.jar;C:\Users\jenkins\workspace\Lucene-Solr-7.x-Windows\solr\core\test-lib\byte-buddy-1.6.2.jar;C:\Users\jenkins\workspace\Lucene-Solr-7.x-Windows\solr\core\test-lib\commons-collections-3.2.2.jar;C:\Users\jenkins\workspace\Lucene-Solr-7.x-Windows\solr\core\test-lib\commons-math3-3.6.1.jar;C:\Users\jenkins\workspace\Lucene-Solr-7.x-Windows\solr\core\test-lib\ehcache-core-2.4.4.jar;C:\Users\jenkins\workspace\Lucene-Solr-7.x-Windows\solr\core\test-lib\hadoop-common-2.7.4-tests.jar;C:\Users\jenkins\workspace\Lucene-Solr-7.x-Windows\solr\core\test-lib\hadoop-hdfs-2.7.4-tests.jar;C:\Users\jenkins\workspace\Lucene-Solr-7.x-Windows\solr\core\test-lib\hadoop-minikdc-2.7.4.jar;C:\Users\jenkins\workspace\Lucene-Solr-7.x-Windows\solr\core\test-lib\htrace-core-3.2.0-incubating.jar;C:\Users\jenkins\workspace\Lucene-Solr-7.x-Windows\solr\core\test-lib\jersey-core-1.9.jar;C:\Users\jenkins\workspace\Lucene-Solr-7.x-Windows\solr\core\test-lib\jersey-server-1.9.jar;C:\Users\jenkins\workspace\Lucene-Solr-7.x-Windows\solr\core\test-lib\jetty-6.1.26.jar;C:\Users\jenkins\workspace\Lucene-Solr-7.x-Windows\solr\core\test-lib\jetty-sslengine-6.1.26.jar;C:\Users\jenkins\workspace\Lucene-Solr-7.x-Windows\solr\core\test-lib\jetty-util-6.1.26.jar;C:\Users\jenkins\workspace\Lucene-Solr-7.x-Windows\solr\core\test-lib\mina-core-2.0.0-M5.jar;C:\Users\jenkins\workspace\Lucene-Solr-7.x-Windows\solr\core\test-lib\mockito-core-2.6.2.jar;C:\Users\jenkins\workspace\Lucene-Solr-7.x-Windows\solr\core\test-lib\netty-all-4.0.36.Final.jar;C:\Users\jenkins\workspace\Lucene-Solr-7.x-Windows\solr\core\test-lib\objenesis-2.5.jar;C:\Users\jenkins\workspace\Lucene-Solr-7.x-Windows\lucene\build\analysis\icu\lucene-analyzers-icu-7.5.0-SNAPSHOT.jar;C:\Users\jenkins\workspace\Lucene-Solr-7.x-Windows\solr\build\contrib\solr-analysis-extras\classes\java;C:\Users\jenkins\workspace\Lucene-Solr-7.x-Windows\lucene\build\queryparser\classes\test;C:\Users\jenkins\workspace\Lucene-Solr-7.x-Windows\lucene\build\backward-codecs\classes\test;C:\Users\jenkins\workspace\Lucene-Solr-7.x-Windows\solr\contrib\analysis-extras\lib\icu4j-62.1.jar;C:\Users\jenkins\tools\hudson.tasks.Ant_AntInstallation\ANT_1.8.2\lib\ant-launcher.jar;C:\Users\jenkins\.ant\lib\ivy-2.4.0.jar;C:\Users\jenkins\tools\hudson.tasks.Ant_AntInstallation\ANT_1.8.2\lib\ant-antlr.jar;C:\Users\jenkins\tools\hudson.tasks.Ant_AntInstallation\ANT_1.8.2\lib\ant-apache-bcel.jar;C:\Users\jenkins\tools\hudson.tasks.Ant_AntInstallation\ANT_1.8.2\lib\ant-apache-bsf.jar;C:\Users\jenkins\tools\hudson.tasks.Ant_AntInstallation\ANT_1.8.2\lib\ant-apache-log4j.jar;C:\Users\jenkins\tools\hudson.tasks.Ant_AntInstallation\ANT_1.8.2\lib\ant-apache-oro.jar;C:\Users\jenkins\tools\hudson.tasks.Ant_AntInstallation\ANT_1.8.2\lib\ant-apache-regexp.jar;C:\Users\jenkins\tools\hudson.tasks.Ant_AntInstallation\ANT_1.8.2\lib\ant-apache-resolver.jar;C:\Users\jenkins\tools\hudson.tasks.Ant_AntInstallation\ANT_1.8.2\lib\ant-apache-xalan2.jar;C:\Users\jenkins\tools\hudson.tasks.Ant_AntInstallation\ANT_1.8.2\lib\ant-commons-logging.jar;C:\Users\jenkins\tools\hudson.tasks.Ant_AntInstallation\ANT_1.8.2\lib\ant-commons-net.jar;C:\Users\jenkins\tools\hudson.tasks.Ant_AntInstallation\ANT_1.8.2\lib\ant-jai.jar;C:\Users\jenkins\tools\hudson.tasks.Ant_AntInstallation\ANT_1.8.2\lib\ant-javamail.jar;C:\Users\jenkins\tools\hudson.tasks.Ant_AntInstallation\ANT_1.8.2\lib\ant-jdepend.jar;C:\Users\jenkins\tools\hudson.tasks.Ant_AntInstallation\ANT_1.8.2\lib\ant-jmf.jar;C:\Users\jenkins\tools\hudson.tasks.Ant_AntInstallation\ANT_1.8.2\lib\ant-jsch.jar;C:\Users\jenkins\tools\hudson.tasks.Ant_AntInstallation\ANT_1.8.2\lib\ant-junit.jar;C:\Users\jenkins\tools\hudson.tasks.Ant_AntInstallation\ANT_1.8.2\lib\ant-junit4.jar;C:\Users\jenkins\tools\hudson.tasks.Ant_AntInstallation\ANT_1.8.2\lib\ant-netrexx.jar;C:\Users\jenkins\tools\hudson.tasks.Ant_AntInstallation\ANT_1.8.2\lib\ant-swing.jar;C:\Users\jenkins\tools\hudson.tasks.Ant_AntInstallation\ANT_1.8.2\lib\ant-testutil.jar;C:\Users\jenkins\tools\hudson.tasks.Ant_AntInstallation\ANT_1.8.2\lib\ant.jar;C:\Users\jenkins\.ivy2\cache\com.carrotsearch.randomizedtesting\junit4-ant\jars\junit4-ant-2.6.0.jar com.carrotsearch.ant.tasks.junit4.slave.SlaveMainSafe -eventsfile C:\Users\jenkins\workspace\Lucene-Solr-7.x-Windows\solr\build\solr-core\test\temp\junit4-J0-20180901_230443_65915518898023627163031.events @C:\Users\jenkins\workspace\Lucene-Solr-7.x-Windows\solr\build\solr-core\test\temp\junit4-J0-20180901_230443_6595185465785793281903.suites -stdin
   [junit4] ERROR: JVM J0 ended with an exception: Forked process returned with error code: 1. Very likely a JVM crash.  See process stdout at: C:\Users\jenkins\workspace\Lucene-Solr-7.x-Windows\solr\build\solr-core\test\temp\junit4-J0-20180901_230443_6594648646963460368273.sysout See process stderr at: C:\Users\jenkins\workspace\Lucene-Solr-7.x-Windows\solr\build\solr-core\test\temp\junit4-J0-20180901_230443_6596526656844232106875.syserr
   [junit4] 	at com.carrotsearch.ant.tasks.junit4.JUnit4.executeSlave(JUnit4.java:1519)
   [junit4] 	at com.carrotsearch.ant.tasks.junit4.JUnit4.access$000(JUnit4.java:126)
   [junit4] 	at com.carrotsearch.ant.tasks.junit4.JUnit4$2.call(JUnit4.java:982)
   [junit4] 	at com.carrotsearch.ant.tasks.junit4.JUnit4$2.call(JUnit4.java:979)
   [junit4] 	at java.base/java.util.concurrent.FutureTask.run(FutureTask.java:264)
   [junit4] 	at java.base/java.util.concurrent.ThreadPoolExecutor.runWorker(ThreadPoolExecutor.java:1128)
   [junit4] 	at java.base/java.util.concurrent.ThreadPoolExecutor$Worker.run(ThreadPoolExecutor.java:628)
   [junit4] 	at java.base/java.lang.Thread.run(Thread.java:834)

BUILD FAILED
C:\Users\jenkins\workspace\Lucene-Solr-7.x-Windows\build.xml:633: The following error occurred while executing this line:
C:\Users\jenkins\workspace\Lucene-Solr-7.x-Windows\build.xml:577: The following error occurred while executing this line:
C:\Users\jenkins\workspace\Lucene-Solr-7.x-Windows\build.xml:59: The following error occurred while executing this line:
C:\Users\jenkins\workspace\Lucene-Solr-7.x-Windows\solr\build.xml:267: The following error occurred while executing this line:
C:\Users\jenkins\workspace\Lucene-Solr-7.x-Windows\solr\common-build.xml:558: The following error occurred while executing this line:
C:\Users\jenkins\workspace\Lucene-Solr-7.x-Windows\lucene\common-build.xml:1568: The following error occurred while executing this line:
C:\Users\jenkins\workspace\Lucene-Solr-7.x-Windows\lucene\common-build.xml:1092: At least one slave process threw an exception, first: Forked process returned with error code: 1. Very likely a JVM crash.  See process stdout at: C:\Users\jenkins\workspace\Lucene-Solr-7.x-Windows\solr\build\solr-core\test\temp\junit4-J0-20180901_230443_6594648646963460368273.sysout See process stderr at: C:\Users\jenkins\workspace\Lucene-Solr-7.x-Windows\solr\build\solr-core\test\temp\junit4-J0-20180901_230443_6596526656844232106875.syserr

Total time: 102 minutes 5 seconds
Build step 'Invoke Ant' marked build as failure
Archiving artifacts
Setting ANT_1_8_2_HOME=C:\Users\jenkins\tools\hudson.tasks.Ant_AntInstallation\ANT_1.8.2
[WARNINGS] Skipping publisher since build result is FAILURE
Recording test results
Setting ANT_1_8_2_HOME=C:\Users\jenkins\tools\hudson.tasks.Ant_AntInstallation\ANT_1.8.2
Email was triggered for: Failure - Any
Sending email for trigger: Failure - Any
Setting ANT_1_8_2_HOME=C:\Users\jenkins\tools\hudson.tasks.Ant_AntInstallation\ANT_1.8.2
Setting ANT_1_8_2_HOME=C:\Users\jenkins\tools\hudson.tasks.Ant_AntInstallation\ANT_1.8.2
Setting ANT_1_8_2_HOME=C:\Users\jenkins\tools\hudson.tasks.Ant_AntInstallation\ANT_1.8.2
Setting ANT_1_8_2_HOME=C:\Users\jenkins\tools\hudson.tasks.Ant_AntInstallation\ANT_1.8.2

Mime
View raw message