lucene-dev mailing list archives

Site index · List index
Message view « Date » · « Thread »
Top « Date » · « Thread »
From Policeman Jenkins Server <jenk...@thetaphi.de>
Subject [JENKINS] Lucene-Solr-master-Solaris (64bit/jdk1.8.0) - Build # 2045 - Still Unstable!
Date Tue, 04 Sep 2018 17:39:31 GMT
Build: https://jenkins.thetaphi.de/job/Lucene-Solr-master-Solaris/2045/
Java: 64bit/jdk1.8.0 -XX:+UseCompressedOops -XX:+UseConcMarkSweepGC

5 tests failed.
FAILED:  junit.framework.TestSuite.org.apache.solr.core.TestConfigOverlay

Error Message:
1 thread leaked from SUITE scope at org.apache.solr.core.TestConfigOverlay:     1) Thread[id=13, name=Log4j2-TF-1-AsyncLoggerConfig--1, state=TIMED_WAITING, group=TGRP-TestConfigOverlay]         at sun.misc.Unsafe.park(Native Method)         at java.util.concurrent.locks.LockSupport.parkNanos(LockSupport.java:215)         at java.util.concurrent.locks.AbstractQueuedSynchronizer$ConditionObject.awaitNanos(AbstractQueuedSynchronizer.java:2078)         at com.lmax.disruptor.TimeoutBlockingWaitStrategy.waitFor(TimeoutBlockingWaitStrategy.java:38)         at com.lmax.disruptor.ProcessingSequenceBarrier.waitFor(ProcessingSequenceBarrier.java:56)         at com.lmax.disruptor.BatchEventProcessor.run(BatchEventProcessor.java:128)         at java.lang.Thread.run(Thread.java:748)

Stack Trace:
com.carrotsearch.randomizedtesting.ThreadLeakError: 1 thread leaked from SUITE scope at org.apache.solr.core.TestConfigOverlay: 
   1) Thread[id=13, name=Log4j2-TF-1-AsyncLoggerConfig--1, state=TIMED_WAITING, group=TGRP-TestConfigOverlay]
        at sun.misc.Unsafe.park(Native Method)
        at java.util.concurrent.locks.LockSupport.parkNanos(LockSupport.java:215)
        at java.util.concurrent.locks.AbstractQueuedSynchronizer$ConditionObject.awaitNanos(AbstractQueuedSynchronizer.java:2078)
        at com.lmax.disruptor.TimeoutBlockingWaitStrategy.waitFor(TimeoutBlockingWaitStrategy.java:38)
        at com.lmax.disruptor.ProcessingSequenceBarrier.waitFor(ProcessingSequenceBarrier.java:56)
        at com.lmax.disruptor.BatchEventProcessor.run(BatchEventProcessor.java:128)
        at java.lang.Thread.run(Thread.java:748)
	at __randomizedtesting.SeedInfo.seed([8EAEF3F3AD3A1333]:0)


FAILED:  junit.framework.TestSuite.org.apache.solr.core.TestConfigOverlay

Error Message:
There are still zombie threads that couldn't be terminated:    1) Thread[id=13, name=Log4j2-TF-1-AsyncLoggerConfig--1, state=TIMED_WAITING, group=TGRP-TestConfigOverlay]         at sun.misc.Unsafe.park(Native Method)         at java.util.concurrent.locks.LockSupport.parkNanos(LockSupport.java:215)         at java.util.concurrent.locks.AbstractQueuedSynchronizer$ConditionObject.awaitNanos(AbstractQueuedSynchronizer.java:2078)         at com.lmax.disruptor.TimeoutBlockingWaitStrategy.waitFor(TimeoutBlockingWaitStrategy.java:38)         at com.lmax.disruptor.ProcessingSequenceBarrier.waitFor(ProcessingSequenceBarrier.java:56)         at com.lmax.disruptor.BatchEventProcessor.run(BatchEventProcessor.java:128)         at java.lang.Thread.run(Thread.java:748)

Stack Trace:
com.carrotsearch.randomizedtesting.ThreadLeakError: There are still zombie threads that couldn't be terminated:
   1) Thread[id=13, name=Log4j2-TF-1-AsyncLoggerConfig--1, state=TIMED_WAITING, group=TGRP-TestConfigOverlay]
        at sun.misc.Unsafe.park(Native Method)
        at java.util.concurrent.locks.LockSupport.parkNanos(LockSupport.java:215)
        at java.util.concurrent.locks.AbstractQueuedSynchronizer$ConditionObject.awaitNanos(AbstractQueuedSynchronizer.java:2078)
        at com.lmax.disruptor.TimeoutBlockingWaitStrategy.waitFor(TimeoutBlockingWaitStrategy.java:38)
        at com.lmax.disruptor.ProcessingSequenceBarrier.waitFor(ProcessingSequenceBarrier.java:56)
        at com.lmax.disruptor.BatchEventProcessor.run(BatchEventProcessor.java:128)
        at java.lang.Thread.run(Thread.java:748)
	at __randomizedtesting.SeedInfo.seed([8EAEF3F3AD3A1333]:0)


FAILED:  junit.framework.TestSuite.org.apache.solr.core.TestConfigOverlay

Error Message:
1 thread leaked from SUITE scope at org.apache.solr.core.TestConfigOverlay:     1) Thread[id=13, name=Log4j2-TF-1-AsyncLoggerConfig--1, state=TIMED_WAITING, group=TGRP-TestConfigOverlay]         at sun.misc.Unsafe.park(Native Method)         at java.util.concurrent.locks.LockSupport.parkNanos(LockSupport.java:215)         at java.util.concurrent.locks.AbstractQueuedSynchronizer$ConditionObject.awaitNanos(AbstractQueuedSynchronizer.java:2078)         at com.lmax.disruptor.TimeoutBlockingWaitStrategy.waitFor(TimeoutBlockingWaitStrategy.java:38)         at com.lmax.disruptor.ProcessingSequenceBarrier.waitFor(ProcessingSequenceBarrier.java:56)         at com.lmax.disruptor.BatchEventProcessor.run(BatchEventProcessor.java:128)         at java.lang.Thread.run(Thread.java:748)

Stack Trace:
com.carrotsearch.randomizedtesting.ThreadLeakError: 1 thread leaked from SUITE scope at org.apache.solr.core.TestConfigOverlay: 
   1) Thread[id=13, name=Log4j2-TF-1-AsyncLoggerConfig--1, state=TIMED_WAITING, group=TGRP-TestConfigOverlay]
        at sun.misc.Unsafe.park(Native Method)
        at java.util.concurrent.locks.LockSupport.parkNanos(LockSupport.java:215)
        at java.util.concurrent.locks.AbstractQueuedSynchronizer$ConditionObject.awaitNanos(AbstractQueuedSynchronizer.java:2078)
        at com.lmax.disruptor.TimeoutBlockingWaitStrategy.waitFor(TimeoutBlockingWaitStrategy.java:38)
        at com.lmax.disruptor.ProcessingSequenceBarrier.waitFor(ProcessingSequenceBarrier.java:56)
        at com.lmax.disruptor.BatchEventProcessor.run(BatchEventProcessor.java:128)
        at java.lang.Thread.run(Thread.java:748)
	at __randomizedtesting.SeedInfo.seed([8EAEF3F3AD3A1333]:0)


FAILED:  junit.framework.TestSuite.org.apache.solr.core.TestConfigOverlay

Error Message:
There are still zombie threads that couldn't be terminated:    1) Thread[id=13, name=Log4j2-TF-1-AsyncLoggerConfig--1, state=TIMED_WAITING, group=TGRP-TestConfigOverlay]         at sun.misc.Unsafe.park(Native Method)         at java.util.concurrent.locks.LockSupport.parkNanos(LockSupport.java:215)         at java.util.concurrent.locks.AbstractQueuedSynchronizer$ConditionObject.awaitNanos(AbstractQueuedSynchronizer.java:2078)         at com.lmax.disruptor.TimeoutBlockingWaitStrategy.waitFor(TimeoutBlockingWaitStrategy.java:38)         at com.lmax.disruptor.ProcessingSequenceBarrier.waitFor(ProcessingSequenceBarrier.java:56)         at com.lmax.disruptor.BatchEventProcessor.run(BatchEventProcessor.java:128)         at java.lang.Thread.run(Thread.java:748)

Stack Trace:
com.carrotsearch.randomizedtesting.ThreadLeakError: There are still zombie threads that couldn't be terminated:
   1) Thread[id=13, name=Log4j2-TF-1-AsyncLoggerConfig--1, state=TIMED_WAITING, group=TGRP-TestConfigOverlay]
        at sun.misc.Unsafe.park(Native Method)
        at java.util.concurrent.locks.LockSupport.parkNanos(LockSupport.java:215)
        at java.util.concurrent.locks.AbstractQueuedSynchronizer$ConditionObject.awaitNanos(AbstractQueuedSynchronizer.java:2078)
        at com.lmax.disruptor.TimeoutBlockingWaitStrategy.waitFor(TimeoutBlockingWaitStrategy.java:38)
        at com.lmax.disruptor.ProcessingSequenceBarrier.waitFor(ProcessingSequenceBarrier.java:56)
        at com.lmax.disruptor.BatchEventProcessor.run(BatchEventProcessor.java:128)
        at java.lang.Thread.run(Thread.java:748)
	at __randomizedtesting.SeedInfo.seed([8EAEF3F3AD3A1333]:0)


FAILED:  org.apache.solr.search.TestRandomCollapseQParserPlugin.testRandomCollpaseWithSort

Error Message:
BUG using params: sort=bin_dv_last+asc,+score+desc,+bin+desc,+enum_last+asc,+id+asc&rows=200&fq={!collapse+size%3D3729+nullPolicy%3Dexpand+field%3Dfloat+sort%3D'date_dv_first+asc,+if(exists(date_dv),47,83)+asc,+id+desc'} + q=*:*&fl=id,float

Stack Trace:
java.lang.RuntimeException: BUG using params: sort=bin_dv_last+asc,+score+desc,+bin+desc,+enum_last+asc,+id+asc&rows=200&fq={!collapse+size%3D3729+nullPolicy%3Dexpand+field%3Dfloat+sort%3D'date_dv_first+asc,+if(exists(date_dv),47,83)+asc,+id+desc'} + q=*:*&fl=id,float
	at __randomizedtesting.SeedInfo.seed([8EAEF3F3AD3A1333:8B13803A869220C0]:0)
	at org.apache.solr.search.TestRandomCollapseQParserPlugin.testRandomCollpaseWithSort(TestRandomCollapseQParserPlugin.java:202)
	at sun.reflect.NativeMethodAccessorImpl.invoke0(Native Method)
	at sun.reflect.NativeMethodAccessorImpl.invoke(NativeMethodAccessorImpl.java:62)
	at sun.reflect.DelegatingMethodAccessorImpl.invoke(DelegatingMethodAccessorImpl.java:43)
	at java.lang.reflect.Method.invoke(Method.java:498)
	at com.carrotsearch.randomizedtesting.RandomizedRunner.invoke(RandomizedRunner.java:1737)
	at com.carrotsearch.randomizedtesting.RandomizedRunner$8.evaluate(RandomizedRunner.java:934)
	at com.carrotsearch.randomizedtesting.RandomizedRunner$9.evaluate(RandomizedRunner.java:970)
	at com.carrotsearch.randomizedtesting.RandomizedRunner$10.evaluate(RandomizedRunner.java:984)
	at com.carrotsearch.randomizedtesting.rules.SystemPropertiesRestoreRule$1.evaluate(SystemPropertiesRestoreRule.java:57)
	at org.apache.lucene.util.TestRuleSetupTeardownChained$1.evaluate(TestRuleSetupTeardownChained.java:49)
	at org.apache.lucene.util.AbstractBeforeAfterRule$1.evaluate(AbstractBeforeAfterRule.java:45)
	at org.apache.lucene.util.TestRuleThreadAndTestName$1.evaluate(TestRuleThreadAndTestName.java:48)
	at org.apache.lucene.util.TestRuleIgnoreAfterMaxFailures$1.evaluate(TestRuleIgnoreAfterMaxFailures.java:64)
	at org.apache.lucene.util.TestRuleMarkFailure$1.evaluate(TestRuleMarkFailure.java:47)
	at com.carrotsearch.randomizedtesting.rules.StatementAdapter.evaluate(StatementAdapter.java:36)
	at com.carrotsearch.randomizedtesting.ThreadLeakControl$StatementRunner.run(ThreadLeakControl.java:368)
	at com.carrotsearch.randomizedtesting.ThreadLeakControl.forkTimeoutingTask(ThreadLeakControl.java:817)
	at com.carrotsearch.randomizedtesting.ThreadLeakControl$3.evaluate(ThreadLeakControl.java:468)
	at com.carrotsearch.randomizedtesting.RandomizedRunner.runSingleTest(RandomizedRunner.java:943)
	at com.carrotsearch.randomizedtesting.RandomizedRunner$5.evaluate(RandomizedRunner.java:829)
	at com.carrotsearch.randomizedtesting.RandomizedRunner$6.evaluate(RandomizedRunner.java:879)
	at com.carrotsearch.randomizedtesting.RandomizedRunner$7.evaluate(RandomizedRunner.java:890)
	at com.carrotsearch.randomizedtesting.rules.StatementAdapter.evaluate(StatementAdapter.java:36)
	at com.carrotsearch.randomizedtesting.rules.SystemPropertiesRestoreRule$1.evaluate(SystemPropertiesRestoreRule.java:57)
	at org.apache.lucene.util.AbstractBeforeAfterRule$1.evaluate(AbstractBeforeAfterRule.java:45)
	at com.carrotsearch.randomizedtesting.rules.StatementAdapter.evaluate(StatementAdapter.java:36)
	at org.apache.lucene.util.TestRuleStoreClassName$1.evaluate(TestRuleStoreClassName.java:41)
	at com.carrotsearch.randomizedtesting.rules.NoShadowingOrOverridesOnMethodsRule$1.evaluate(NoShadowingOrOverridesOnMethodsRule.java:40)
	at com.carrotsearch.randomizedtesting.rules.NoShadowingOrOverridesOnMethodsRule$1.evaluate(NoShadowingOrOverridesOnMethodsRule.java:40)
	at com.carrotsearch.randomizedtesting.rules.StatementAdapter.evaluate(StatementAdapter.java:36)
	at com.carrotsearch.randomizedtesting.rules.StatementAdapter.evaluate(StatementAdapter.java:36)
	at com.carrotsearch.randomizedtesting.rules.StatementAdapter.evaluate(StatementAdapter.java:36)
	at org.apache.lucene.util.TestRuleAssertionsRequired$1.evaluate(TestRuleAssertionsRequired.java:53)
	at org.apache.lucene.util.TestRuleMarkFailure$1.evaluate(TestRuleMarkFailure.java:47)
	at org.apache.lucene.util.TestRuleIgnoreAfterMaxFailures$1.evaluate(TestRuleIgnoreAfterMaxFailures.java:64)
	at org.apache.lucene.util.TestRuleIgnoreTestSuites$1.evaluate(TestRuleIgnoreTestSuites.java:54)
	at com.carrotsearch.randomizedtesting.rules.StatementAdapter.evaluate(StatementAdapter.java:36)
	at com.carrotsearch.randomizedtesting.ThreadLeakControl$StatementRunner.run(ThreadLeakControl.java:368)
	at java.lang.Thread.run(Thread.java:748)
Caused by: org.apache.solr.client.solrj.SolrServerException: org.apache.solr.client.solrj.SolrServerException: java.lang.NullPointerException
	at org.apache.solr.client.solrj.embedded.EmbeddedSolrServer.request(EmbeddedSolrServer.java:233)
	at org.apache.solr.client.solrj.SolrRequest.process(SolrRequest.java:194)
	at org.apache.solr.client.solrj.SolrClient.query(SolrClient.java:942)
	at org.apache.solr.client.solrj.SolrClient.query(SolrClient.java:957)
	at org.apache.solr.search.TestRandomCollapseQParserPlugin.testRandomCollpaseWithSort(TestRandomCollapseQParserPlugin.java:158)
	... 39 more
Caused by: org.apache.solr.client.solrj.SolrServerException: java.lang.NullPointerException
	at org.apache.solr.client.solrj.embedded.EmbeddedSolrServer.checkForExceptions(EmbeddedSolrServer.java:301)
	at org.apache.solr.client.solrj.embedded.EmbeddedSolrServer.request(EmbeddedSolrServer.java:192)
	... 43 more
Caused by: java.lang.NullPointerException
	at org.apache.solr.search.CollapsingQParserPlugin$IntSortSpecStrategy.collapse(CollapsingQParserPlugin.java:2513)
	at org.apache.solr.search.CollapsingQParserPlugin$IntFieldValueCollector.collect(CollapsingQParserPlugin.java:1170)
	at org.apache.lucene.search.MatchAllDocsQuery$1$1.score(MatchAllDocsQuery.java:62)
	at org.apache.lucene.search.BulkScorer.score(BulkScorer.java:39)
	at org.apache.lucene.search.IndexSearcher.search(IndexSearcher.java:652)
	at org.apache.lucene.search.IndexSearcher.search(IndexSearcher.java:443)
	at org.apache.solr.search.SolrIndexSearcher.buildAndRunCollectorChain(SolrIndexSearcher.java:217)
	at org.apache.solr.search.SolrIndexSearcher.getDocListNC(SolrIndexSearcher.java:1622)
	at org.apache.solr.search.SolrIndexSearcher.getDocListC(SolrIndexSearcher.java:1438)
	at org.apache.solr.search.SolrIndexSearcher.search(SolrIndexSearcher.java:585)
	at org.apache.solr.handler.component.QueryComponent.doProcessUngroupedSearch(QueryComponent.java:1436)
	at org.apache.solr.handler.component.QueryComponent.process(QueryComponent.java:375)
	at org.apache.solr.handler.component.SearchHandler.handleRequestBody(SearchHandler.java:298)
	at org.apache.solr.handler.RequestHandlerBase.handleRequest(RequestHandlerBase.java:199)
	at org.apache.solr.core.SolrCore.execute(SolrCore.java:2541)
	at org.apache.solr.client.solrj.embedded.EmbeddedSolrServer.request(EmbeddedSolrServer.java:191)
	... 43 more




Build Log:
[...truncated 12300 lines...]
   [junit4] Suite: org.apache.solr.core.TestConfigOverlay
   [junit4]   2> Sep 04, 2018 4:43:04 PM com.carrotsearch.randomizedtesting.ThreadLeakControl checkThreadLeaks
   [junit4]   2> WARNING: Will linger awaiting termination of 1 leaked thread(s).
   [junit4]   2> Sep 04, 2018 4:43:24 PM com.carrotsearch.randomizedtesting.ThreadLeakControl checkThreadLeaks
   [junit4]   2> SEVERE: 1 thread leaked from SUITE scope at org.apache.solr.core.TestConfigOverlay: 
   [junit4]   2>    1) Thread[id=13, name=Log4j2-TF-1-AsyncLoggerConfig--1, state=TIMED_WAITING, group=TGRP-TestConfigOverlay]
   [junit4]   2>         at sun.misc.Unsafe.park(Native Method)
   [junit4]   2>         at java.util.concurrent.locks.LockSupport.parkNanos(LockSupport.java:215)
   [junit4]   2>         at java.util.concurrent.locks.AbstractQueuedSynchronizer$ConditionObject.awaitNanos(AbstractQueuedSynchronizer.java:2078)
   [junit4]   2>         at com.lmax.disruptor.TimeoutBlockingWaitStrategy.waitFor(TimeoutBlockingWaitStrategy.java:38)
   [junit4]   2>         at com.lmax.disruptor.ProcessingSequenceBarrier.waitFor(ProcessingSequenceBarrier.java:56)
   [junit4]   2>         at com.lmax.disruptor.BatchEventProcessor.run(BatchEventProcessor.java:128)
   [junit4]   2>         at java.lang.Thread.run(Thread.java:748)
   [junit4]   2> Sep 04, 2018 4:43:24 PM com.carrotsearch.randomizedtesting.ThreadLeakControl tryToInterruptAll
   [junit4]   2> INFO: Starting to interrupt leaked threads:
   [junit4]   2>    1) Thread[id=13, name=Log4j2-TF-1-AsyncLoggerConfig--1, state=TIMED_WAITING, group=TGRP-TestConfigOverlay]
   [junit4]   2> AsyncLogger error handling event seq=0, value='null':
   [junit4]   2> java.lang.InterruptedException
   [junit4]   2> 	at java.util.concurrent.locks.AbstractQueuedSynchronizer$ConditionObject.reportInterruptAfterWait(AbstractQueuedSynchronizer.java:2014)
   [junit4]   2> 	at java.util.concurrent.locks.AbstractQueuedSynchronizer$ConditionObject.awaitNanos(AbstractQueuedSynchronizer.java:2088)
   [junit4]   2> 	at com.lmax.disruptor.TimeoutBlockingWaitStrategy.waitFor(TimeoutBlockingWaitStrategy.java:38)
   [junit4]   2> 	at com.lmax.disruptor.ProcessingSequenceBarrier.waitFor(ProcessingSequenceBarrier.java:56)
   [junit4]   2> 	at com.lmax.disruptor.BatchEventProcessor.run(BatchEventProcessor.java:128)
   [junit4]   2> 	at java.lang.Thread.run(Thread.java:748)
   [junit4]   2> AsyncLogger error handling event seq=1, value='null':
   [junit4]   2> java.lang.InterruptedException
   [junit4]   2> 	at java.util.concurrent.locks.AbstractQueuedSynchronizer$ConditionObject.reportInterruptAfterWait(AbstractQueuedSynchronizer.java:2014)
   [junit4]   2> 	at java.util.concurrent.locks.AbstractQueuedSynchronizer$ConditionObject.awaitNanos(AbstractQueuedSynchronizer.java:2088)
   [junit4]   2> 	at com.lmax.disruptor.TimeoutBlockingWaitStrategy.waitFor(TimeoutBlockingWaitStrategy.java:38)
   [junit4]   2> 	at com.lmax.disruptor.ProcessingSequenceBarrier.waitFor(ProcessingSequenceBarrier.java:56)
   [junit4]   2> 	at com.lmax.disruptor.BatchEventProcessor.run(BatchEventProcessor.java:128)
   [junit4]   2> 	at java.lang.Thread.run(Thread.java:748)
   [junit4]   2> AsyncLogger error handling event seq=2, value='null':
   [junit4]   2> java.lang.InterruptedException
   [junit4]   2> 	at java.util.concurrent.locks.AbstractQueuedSynchronizer$ConditionObject.awaitNanos(AbstractQueuedSynchronizer.java:2067)
   [junit4]   2> 	at com.lmax.disruptor.TimeoutBlockingWaitStrategy.waitFor(TimeoutBlockingWaitStrategy.java:38)
   [junit4]   2> 	at com.lmax.disruptor.ProcessingSequenceBarrier.waitFor(ProcessingSequenceBarrier.java:56)
   [junit4]   2> 	at com.lmax.disruptor.BatchEventProcessor.run(BatchEventProcessor.java:128)
   [junit4]   2> 	at java.lang.Thread.run(Thread.java:748)
   [junit4]   2> AsyncLogger error handling event seq=3, value='null':
   [junit4]   2> java.lang.InterruptedException
   [junit4]   2> 	at java.util.concurrent.locks.AbstractQueuedSynchronizer$ConditionObject.reportInterruptAfterWait(AbstractQueuedSynchronizer.java:2014)
   [junit4]   2> 	at java.util.concurrent.locks.AbstractQueuedSynchronizer$ConditionObject.awaitNanos(AbstractQueuedSynchronizer.java:2088)
   [junit4]   2> 	at com.lmax.disruptor.TimeoutBlockingWaitStrategy.waitFor(TimeoutBlockingWaitStrategy.java:38)
   [junit4]   2> 	at com.lmax.disruptor.ProcessingSequenceBarrier.waitFor(ProcessingSequenceBarrier.java:56)
   [junit4]   2> 	at com.lmax.disruptor.BatchEventProcessor.run(BatchEventProcessor.java:128)
   [junit4]   2> 	at java.lang.Thread.run(Thread.java:748)
   [junit4]   2> AsyncLogger error handling event seq=4, value='null':
   [junit4]   2> java.lang.InterruptedException
   [junit4]   2> 	at java.util.concurrent.locks.AbstractQueuedSynchronizer$ConditionObject.reportInterruptAfterWait(AbstractQueuedSynchronizer.java:2014)
   [junit4]   2> 	at java.util.concurrent.locks.AbstractQueuedSynchronizer$ConditionObject.awaitNanos(AbstractQueuedSynchronizer.java:2088)
   [junit4]   2> 	at com.lmax.disruptor.TimeoutBlockingWaitStrategy.waitFor(TimeoutBlockingWaitStrategy.java:38)
   [junit4]   2> 	at com.lmax.disruptor.ProcessingSequenceBarrier.waitFor(ProcessingSequenceBarrier.java:56)
   [junit4]   2> 	at com.lmax.disruptor.BatchEventProcessor.run(BatchEventProcessor.java:128)
   [junit4]   2> 	at java.lang.Thread.run(Thread.java:748)
   [junit4]   2> AsyncLogger error handling event seq=5, value='null':
   [junit4]   2> java.lang.InterruptedException
   [junit4]   2> 	at java.util.concurrent.locks.AbstractQueuedSynchronizer$ConditionObject.reportInterruptAfterWait(AbstractQueuedSynchronizer.java:2014)
   [junit4]   2> 	at java.util.concurrent.locks.AbstractQueuedSynchronizer$ConditionObject.awaitNanos(AbstractQueuedSynchronizer.java:2088)
   [junit4]   2> 	at com.lmax.disruptor.TimeoutBlockingWaitStrategy.waitFor(TimeoutBlockingWaitStrategy.java:38)
   [junit4]   2> 	at com.lmax.disruptor.ProcessingSequenceBarrier.waitFor(ProcessingSequenceBarrier.java:56)
   [junit4]   2> 	at com.lmax.disruptor.BatchEventProcessor.run(BatchEventProcessor.java:128)
   [junit4]   2> 	at java.lang.Thread.run(Thread.java:748)
   [junit4]   2> Sep 04, 2018 4:43:27 PM com.carrotsearch.randomizedtesting.ThreadLeakControl tryToInterruptAll
   [junit4]   2> SEVERE: There are still zombie threads that couldn't be terminated:
   [junit4]   2>    1) Thread[id=13, name=Log4j2-TF-1-AsyncLoggerConfig--1, state=TIMED_WAITING, group=TGRP-TestConfigOverlay]
   [junit4]   2>         at sun.misc.Unsafe.park(Native Method)
   [junit4]   2>         at java.util.concurrent.locks.LockSupport.parkNanos(LockSupport.java:215)
   [junit4]   2>         at java.util.concurrent.locks.AbstractQueuedSynchronizer$ConditionObject.awaitNanos(AbstractQueuedSynchronizer.java:2078)
   [junit4]   2>         at com.lmax.disruptor.TimeoutBlockingWaitStrategy.waitFor(TimeoutBlockingWaitStrategy.java:38)
   [junit4]   2>         at com.lmax.disruptor.ProcessingSequenceBarrier.waitFor(ProcessingSequenceBarrier.java:56)
   [junit4]   2>         at com.lmax.disruptor.BatchEventProcessor.run(BatchEventProcessor.java:128)
   [junit4]   2>         at java.lang.Thread.run(Thread.java:748)
   [junit4]   2> NOTE: test params are: codec=Asserting(Lucene80): {}, docValues:{}, maxPointsInLeafNode=1093, maxMBSortInHeap=6.512445874673418, sim=Asserting(org.apache.lucene.search.similarities.AssertingSimilarity@7851f2f3), locale=da-DK, timezone=Asia/Bahrain
   [junit4]   2> NOTE: SunOS 5.11 amd64/Oracle Corporation 1.8.0_172 (64-bit)/cpus=3,threads=2,free=67767712,total=97320960
   [junit4]   2> NOTE: All tests run in this JVM: [TestConfigOverlay]
   [junit4]   2> NOTE: reproduce with: ant test  -Dtestcase=TestConfigOverlay -Dtests.seed=8EAEF3F3AD3A1333 -Dtests.slow=true -Dtests.locale=da-DK -Dtests.timezone=Asia/Bahrain -Dtests.asserts=true -Dtests.file.encoding=US-ASCII
   [junit4] ERROR   0.00s J0 | TestConfigOverlay (suite) <<<
   [junit4]    > Throwable #1: com.carrotsearch.randomizedtesting.ThreadLeakError: 1 thread leaked from SUITE scope at org.apache.solr.core.TestConfigOverlay: 
   [junit4]    >    1) Thread[id=13, name=Log4j2-TF-1-AsyncLoggerConfig--1, state=TIMED_WAITING, group=TGRP-TestConfigOverlay]
   [junit4]    >         at sun.misc.Unsafe.park(Native Method)
   [junit4]    >         at java.util.concurrent.locks.LockSupport.parkNanos(LockSupport.java:215)
   [junit4]    >         at java.util.concurrent.locks.AbstractQueuedSynchronizer$ConditionObject.awaitNanos(AbstractQueuedSynchronizer.java:2078)
   [junit4]    >         at com.lmax.disruptor.TimeoutBlockingWaitStrategy.waitFor(TimeoutBlockingWaitStrategy.java:38)
   [junit4]    >         at com.lmax.disruptor.ProcessingSequenceBarrier.waitFor(ProcessingSequenceBarrier.java:56)
   [junit4]    >         at com.lmax.disruptor.BatchEventProcessor.run(BatchEventProcessor.java:128)
   [junit4]    >         at java.lang.Thread.run(Thread.java:748)
   [junit4]    > 	at __randomizedtesting.SeedInfo.seed([8EAEF3F3AD3A1333]:0)Throwable #2: com.carrotsearch.randomizedtesting.ThreadLeakError: There are still zombie threads that couldn't be terminated:
   [junit4]    >    1) Thread[id=13, name=Log4j2-TF-1-AsyncLoggerConfig--1, state=TIMED_WAITING, group=TGRP-TestConfigOverlay]
   [junit4]    >         at sun.misc.Unsafe.park(Native Method)
   [junit4]    >         at java.util.concurrent.locks.LockSupport.parkNanos(LockSupport.java:215)
   [junit4]    >         at java.util.concurrent.locks.AbstractQueuedSynchronizer$ConditionObject.awaitNanos(AbstractQueuedSynchronizer.java:2078)
   [junit4]    >         at com.lmax.disruptor.TimeoutBlockingWaitStrategy.waitFor(TimeoutBlockingWaitStrategy.java:38)
   [junit4]    >         at com.lmax.disruptor.ProcessingSequenceBarrier.waitFor(ProcessingSequenceBarrier.java:56)
   [junit4]    >         at com.lmax.disruptor.BatchEventProcessor.run(BatchEventProcessor.java:128)
   [junit4]    >         at java.lang.Thread.run(Thread.java:748)
   [junit4]    > 	at __randomizedtesting.SeedInfo.seed([8EAEF3F3AD3A1333]:0)
   [junit4] Completed [7/832 (1!)] on J0 in 25.09s, 2 tests, 2 errors <<< FAILURES!

[...truncated 2713 lines...]
   [junit4] Suite: org.apache.solr.search.TestRandomCollapseQParserPlugin
   [junit4]   2> Creating dataDir: /export/home/jenkins/workspace/Lucene-Solr-master-Solaris/solr/build/solr-core/test/J1/temp/solr.search.TestRandomCollapseQParserPlugin_8EAEF3F3AD3A1333-001/init-core-data-001
   [junit4]   2> 1883447 INFO  (SUITE-TestRandomCollapseQParserPlugin-seed#[8EAEF3F3AD3A1333]-worker) [    ] o.a.s.c.SolrResourceLoader [null] Added 2 libs to classloader, from paths: [/export/home/jenkins/workspace/Lucene-Solr-master-Solaris/solr/core/src/test-files/solr/collection1/lib, /export/home/jenkins/workspace/Lucene-Solr-master-Solaris/solr/core/src/test-files/solr/collection1/lib/classes]
   [junit4]   2> 1883462 INFO  (SUITE-TestRandomCollapseQParserPlugin-seed#[8EAEF3F3AD3A1333]-worker) [    ] o.a.s.c.SolrConfig Using Lucene MatchVersion: 8.0.0
   [junit4]   2> 1883470 INFO  (SUITE-TestRandomCollapseQParserPlugin-seed#[8EAEF3F3AD3A1333]-worker) [    ] o.a.s.s.IndexSchema [null] Schema name=sortable
   [junit4]   2> 1883766 INFO  (SUITE-TestRandomCollapseQParserPlugin-seed#[8EAEF3F3AD3A1333]-worker) [    ] o.a.s.s.IndexSchema Loaded schema sortable/1.6 with uniqueid field id
   [junit4]   2> 1884098 INFO  (SUITE-TestRandomCollapseQParserPlugin-seed#[8EAEF3F3AD3A1333]-worker) [    ] o.a.s.c.TransientSolrCoreCacheDefault Allocating transient cache for 2147483647 transient cores
   [junit4]   2> 1884098 INFO  (SUITE-TestRandomCollapseQParserPlugin-seed#[8EAEF3F3AD3A1333]-worker) [    ] o.a.s.h.a.MetricsHistoryHandler No .system collection, keeping metrics history in memory.
   [junit4]   2> 1884109 INFO  (SUITE-TestRandomCollapseQParserPlugin-seed#[8EAEF3F3AD3A1333]-worker) [    ] o.a.s.m.r.SolrJmxReporter JMX monitoring for 'solr.node' (registry 'solr.node') enabled at server: com.sun.jmx.mbeanserver.JmxMBeanServer@3e75ab68
   [junit4]   2> 1884114 INFO  (SUITE-TestRandomCollapseQParserPlugin-seed#[8EAEF3F3AD3A1333]-worker) [    ] o.a.s.m.r.SolrJmxReporter JMX monitoring for 'solr.jvm' (registry 'solr.jvm') enabled at server: com.sun.jmx.mbeanserver.JmxMBeanServer@3e75ab68
   [junit4]   2> 1884114 INFO  (SUITE-TestRandomCollapseQParserPlugin-seed#[8EAEF3F3AD3A1333]-worker) [    ] o.a.s.m.r.SolrJmxReporter JMX monitoring for 'solr.jetty' (registry 'solr.jetty') enabled at server: com.sun.jmx.mbeanserver.JmxMBeanServer@3e75ab68
   [junit4]   2> 1884115 INFO  (coreLoadExecutor-8221-thread-1) [    x:collection1] o.a.s.c.SolrResourceLoader [null] Added 2 libs to classloader, from paths: [/export/home/jenkins/workspace/Lucene-Solr-master-Solaris/solr/core/src/test-files/solr/collection1/lib, /export/home/jenkins/workspace/Lucene-Solr-master-Solaris/solr/core/src/test-files/solr/collection1/lib/classes]
   [junit4]   2> 1884137 INFO  (coreLoadExecutor-8221-thread-1) [    x:collection1] o.a.s.c.SolrConfig Using Lucene MatchVersion: 8.0.0
   [junit4]   2> 1884146 INFO  (coreLoadExecutor-8221-thread-1) [    x:collection1] o.a.s.s.IndexSchema [collection1] Schema name=sortable
   [junit4]   2> 1884200 INFO  (coreLoadExecutor-8221-thread-1) [    x:collection1] o.a.s.s.IndexSchema Loaded schema sortable/1.6 with uniqueid field id
   [junit4]   2> 1884200 INFO  (coreLoadExecutor-8221-thread-1) [    x:collection1] o.a.s.c.CoreContainer Creating SolrCore 'collection1' using configuration from instancedir /export/home/jenkins/workspace/Lucene-Solr-master-Solaris/solr/core/src/test-files/solr/collection1, trusted=true
   [junit4]   2> 1884200 INFO  (coreLoadExecutor-8221-thread-1) [    x:collection1] o.a.s.m.r.SolrJmxReporter JMX monitoring for 'solr.core.collection1' (registry 'solr.core.collection1') enabled at server: com.sun.jmx.mbeanserver.JmxMBeanServer@3e75ab68
   [junit4]   2> 1884200 INFO  (coreLoadExecutor-8221-thread-1) [    x:collection1] o.a.s.c.SolrCore solr.RecoveryStrategy.Builder
   [junit4]   2> 1884200 INFO  (coreLoadExecutor-8221-thread-1) [    x:collection1] o.a.s.c.SolrCore [[collection1] ] Opening new SolrCore at [/export/home/jenkins/workspace/Lucene-Solr-master-Solaris/solr/core/src/test-files/solr/collection1], dataDir=[/export/home/jenkins/workspace/Lucene-Solr-master-Solaris/solr/build/solr-core/test/J1/temp/solr.search.TestRandomCollapseQParserPlugin_8EAEF3F3AD3A1333-001/init-core-data-001/]
   [junit4]   2> 1884201 INFO  (coreLoadExecutor-8221-thread-1) [    x:collection1] o.a.s.u.RandomMergePolicy RandomMergePolicy wrapping class org.apache.lucene.index.AlcoholicMergePolicy: [AlcoholicMergePolicy: minMergeSize=0, mergeFactor=10, maxMergeSize=189651390, maxMergeSizeForForcedMerge=9223372036854775807, calibrateSizeByDeletes=true, maxMergeDocs=2147483647, maxCFSSegmentSizeMB=8.796093022207999E12, noCFSRatio=0.1]
   [junit4]   2> 1884234 INFO  (coreLoadExecutor-8221-thread-1) [    x:collection1] o.a.s.u.CommitTracker Hard AutoCommit: disabled
   [junit4]   2> 1884234 INFO  (coreLoadExecutor-8221-thread-1) [    x:collection1] o.a.s.u.CommitTracker Soft AutoCommit: disabled
   [junit4]   2> 1884234 INFO  (coreLoadExecutor-8221-thread-1) [    x:collection1] o.a.s.u.RandomMergePolicy RandomMergePolicy wrapping class org.apache.lucene.index.LogByteSizeMergePolicy: [LogByteSizeMergePolicy: minMergeSize=1677721, mergeFactor=14, maxMergeSize=2147483648, maxMergeSizeForForcedMerge=9223372036854775807, calibrateSizeByDeletes=true, maxMergeDocs=2147483647, maxCFSSegmentSizeMB=8.796093022207999E12, noCFSRatio=0.0]
   [junit4]   2> 1884235 INFO  (coreLoadExecutor-8221-thread-1) [    x:collection1] o.a.s.s.SolrIndexSearcher Opening [Searcher@4a57f51[collection1] main]
   [junit4]   2> 1884235 WARN  (coreLoadExecutor-8221-thread-1) [    x:collection1] o.a.s.r.ManagedResourceStorage Cannot write to config directory /export/home/jenkins/workspace/Lucene-Solr-master-Solaris/solr/core/src/test-files/solr/collection1/conf; switching to use InMemory storage instead.
   [junit4]   2> 1884235 INFO  (coreLoadExecutor-8221-thread-1) [    x:collection1] o.a.s.h.ReplicationHandler Commits will be reserved for 10000ms.
   [junit4]   2> 1884236 INFO  (searcherExecutor-8222-thread-1-processing-x:collection1) [    x:collection1] o.a.s.c.SolrCore [collection1] Registered new searcher Searcher@4a57f51[collection1] main{ExitableDirectoryReader(UninvertingDirectoryReader())}
   [junit4]   2> 1884256 INFO  (SUITE-TestRandomCollapseQParserPlugin-seed#[8EAEF3F3AD3A1333]-worker) [    ] o.a.s.u.p.LogUpdateProcessorFactory [collection1]  webapp=null path=null params={}{add=[1]} 0 13
   [junit4]   2> 1884259 INFO  (SUITE-TestRandomCollapseQParserPlugin-seed#[8EAEF3F3AD3A1333]-worker) [    ] o.a.s.u.p.LogUpdateProcessorFactory [collection1]  webapp=null path=null params={}{add=[2]} 0 1
   [junit4]   2> 1884260 INFO  (SUITE-TestRandomCollapseQParserPlugin-seed#[8EAEF3F3AD3A1333]-worker) [    ] o.a.s.u.p.LogUpdateProcessorFactory [collection1]  webapp=null path=null params={}{add=[3]} 0 0
   [junit4]   2> 1884261 INFO  (SUITE-TestRandomCollapseQParserPlugin-seed#[8EAEF3F3AD3A1333]-worker) [    ] o.a.s.u.p.LogUpdateProcessorFactory [collection1]  webapp=null path=null params={}{add=[4]} 0 0
   [junit4]   2> 1884263 INFO  (SUITE-TestRandomCollapseQParserPlugin-seed#[8EAEF3F3AD3A1333]-worker) [    ] o.a.s.u.p.LogUpdateProcessorFactory [collection1]  webapp=null path=null params={}{add=[5]} 0 1
   [junit4]   2> 1884265 INFO  (SUITE-TestRandomCollapseQParserPlugin-seed#[8EAEF3F3AD3A1333]-worker) [    ] o.a.s.u.p.LogUpdateProcessorFactory [collection1]  webapp=null path=null params={}{add=[6]} 0 0
   [junit4]   2> 1884267 INFO  (SUITE-TestRandomCollapseQParserPlugin-seed#[8EAEF3F3AD3A1333]-worker) [    ] o.a.s.u.p.LogUpdateProcessorFactory [collection1]  webapp=null path=null params={}{add=[7]} 0 0
   [junit4]   2> 1884268 INFO  (SUITE-TestRandomCollapseQParserPlugin-seed#[8EAEF3F3AD3A1333]-worker) [    ] o.a.s.u.p.LogUpdateProcessorFactory [collection1]  webapp=null path=null params={}{add=[8]} 0 0
   [junit4]   2> 1884268 INFO  (SUITE-TestRandomCollapseQParserPlugin-seed#[8EAEF3F3AD3A1333]-worker) [    ] o.a.s.u.p.LogUpdateProcessorFactory [collection1]  webapp=null path=null params={}{add=[9]} 0 0
   [junit4]   2> 1884269 INFO  (SUITE-TestRandomCollapseQParserPlugin-seed#[8EAEF3F3AD3A1333]-worker) [    ] o.a.s.u.p.LogUpdateProcessorFactory [collection1]  webapp=null path=null params={}{add=[10]} 0 0
   [junit4]   2> 1884270 INFO  (SUITE-TestRandomCollapseQParserPlugin-seed#[8EAEF3F3AD3A1333]-worker) [    ] o.a.s.u.p.LogUpdateProcessorFactory [collection1]  webapp=null path=null params={}{add=[11]} 0 0
   [junit4]   2> 1884271 INFO  (SUITE-TestRandomCollapseQParserPlugin-seed#[8EAEF3F3AD3A1333]-worker) [    ] o.a.s.u.p.LogUpdateProcessorFactory [collection1]  webapp=null path=null params={}{add=[12]} 0 0
   [junit4]   2> 1884272 INFO  (SUITE-TestRandomCollapseQParserPlugin-seed#[8EAEF3F3AD3A1333]-worker) [    ] o.a.s.u.p.LogUpdateProcessorFactory [collection1]  webapp=null path=null params={}{add=[13]} 0 0
   [junit4]   2> 1884272 INFO  (SUITE-TestRandomCollapseQParserPlugin-seed#[8EAEF3F3AD3A1333]-worker) [    ] o.a.s.u.p.LogUpdateProcessorFactory [collection1]  webapp=null path=null params={}{add=[14]} 0 0
   [junit4]   2> 1884273 INFO  (SUITE-TestRandomCollapseQParserPlugin-seed#[8EAEF3F3AD3A1333]-worker) [    ] o.a.s.u.p.LogUpdateProcessorFactory [collection1]  webapp=null path=null params={}{add=[15]} 0 0
   [junit4]   2> 1884274 INFO  (SUITE-TestRandomCollapseQParserPlugin-seed#[8EAEF3F3AD3A1333]-worker) [    ] o.a.s.u.p.LogUpdateProcessorFactory [collection1]  webapp=null path=null params={}{add=[16]} 0 0
   [junit4]   2> 1884275 INFO  (SUITE-TestRandomCollapseQParserPlugin-seed#[8EAEF3F3AD3A1333]-worker) [    ] o.a.s.u.p.LogUpdateProcessorFactory [collection1]  webapp=null path=null params={}{add=[17]} 0 0
   [junit4]   2> 1884280 INFO  (SUITE-TestRandomCollapseQParserPlugin-seed#[8EAEF3F3AD3A1333]-worker) [    ] o.a.s.u.p.LogUpdateProcessorFactory [collection1]  webapp=null path=null params={}{add=[18]} 0 0
   [junit4]   2> 1884281 INFO  (SUITE-TestRandomCollapseQParserPlugin-seed#[8EAEF3F3AD3A1333]-worker) [    ] o.a.s.u.p.LogUpdateProcessorFactory [collection1]  webapp=null path=null params={}{add=[19]} 0 0
   [junit4]   2> 1884282 INFO  (SUITE-TestRandomCollapseQParserPlugin-seed#[8EAEF3F3AD3A1333]-worker) [    ] o.a.s.u.p.LogUpdateProcessorFactory [collection1]  webapp=null path=null params={}{add=[20]} 0 0
   [junit4]   2> 1884283 INFO  (SUITE-TestRandomCollapseQParserPlugin-seed#[8EAEF3F3AD3A1333]-worker) [    ] o.a.s.u.p.LogUpdateProcessorFactory [collection1]  webapp=null path=null params={}{add=[21]} 0 0
   [junit4]   2> 1884284 INFO  (SUITE-TestRandomCollapseQParserPlugin-seed#[8EAEF3F3AD3A1333]-worker) [    ] o.a.s.u.p.LogUpdateProcessorFactory [collection1]  webapp=null path=null params={}{add=[22]} 0 0
   [junit4]   2> 1884285 INFO  (SUITE-TestRandomCollapseQParserPlugin-seed#[8EAEF3F3AD3A1333]-worker) [    ] o.a.s.u.p.LogUpdateProcessorFactory [collection1]  webapp=null path=null params={}{add=[23]} 0 0
   [junit4]   2> 1884285 INFO  (SUITE-TestRandomCollapseQParserPlugin-seed#[8EAEF3F3AD3A1333]-worker) [    ] o.a.s.u.p.LogUpdateProcessorFactory [collection1]  webapp=null path=null params={}{add=[24]} 0 0
   [junit4]   2> 1884286 INFO  (SUITE-TestRandomCollapseQParserPlugin-seed#[8EAEF3F3AD3A1333]-worker) [    ] o.a.s.u.p.LogUpdateProcessorFactory [collection1]  webapp=null path=null params={}{add=[25]} 0 0
   [junit4]   2> 1884287 INFO  (SUITE-TestRandomCollapseQParserPlugin-seed#[8EAEF3F3AD3A1333]-worker) [    ] o.a.s.u.p.LogUpdateProcessorFactory [collection1]  webapp=null path=null params={}{add=[26]} 0 0
   [junit4]   2> 1884287 INFO  (SUITE-TestRandomCollapseQParserPlugin-seed#[8EAEF3F3AD3A1333]-worker) [    ] o.a.s.u.p.LogUpdateProcessorFactory [collection1]  webapp=null path=null params={}{add=[27]} 0 0
   [junit4]   2> 1884287 INFO  (SUITE-TestRandomCollapseQParserPlugin-seed#[8EAEF3F3AD3A1333]-worker) [    ] o.a.s.u.p.LogUpdateProcessorFactory [collection1]  webapp=null path=null params={}{add=[28]} 0 0
   [junit4]   2> 1884287 INFO  (SUITE-TestRandomCollapseQParserPlugin-seed#[8EAEF3F3AD3A1333]-worker) [    ] o.a.s.u.p.LogUpdateProcessorFactory [collection1]  webapp=null path=null params={}{add=[29]} 0 0
   [junit4]   2> 1884287 INFO  (SUITE-TestRandomCollapseQParserPlugin-seed#[8EAEF3F3AD3A1333]-worker) [    ] o.a.s.u.p.LogUpdateProcessorFactory [collection1]  webapp=null path=null params={}{add=[30]} 0 0
   [junit4]   2> 1884292 INFO  (SUITE-TestRandomCollapseQParserPlugin-seed#[8EAEF3F3AD3A1333]-worker) [    ] o.a.s.u.p.LogUpdateProcessorFactory [collection1]  webapp=null path=null params={}{add=[31]} 0 4
   [junit4]   2> 1884292 INFO  (SUITE-TestRandomCollapseQParserPlugin-seed#[8EAEF3F3AD3A1333]-worker) [    ] o.a.s.u.p.LogUpdateProcessorFactory [collection1]  webapp=null path=null params={}{add=[32]} 0 0
   [junit4]   2> 1884293 INFO  (SUITE-TestRandomCollapseQParserPlugin-seed#[8EAEF3F3AD3A1333]-worker) [    ] o.a.s.u.p.LogUpdateProcessorFactory [collection1]  webapp=null path=null params={}{add=[33]} 0 0
   [junit4]   2> 1884294 INFO  (SUITE-TestRandomCollapseQParserPlugin-seed#[8EAEF3F3AD3A1333]-worker) [    ] o.a.s.u.p.LogUpdateProcessorFactory [collection1]  webapp=null path=null params={}{add=[34]} 0 0
   [junit4]   2> 1884295 INFO  (SUITE-TestRandomCollapseQParserPlugin-seed#[8EAEF3F3AD3A1333]-worker) [    ] o.a.s.u.p.LogUpdateProcessorFactory [collection1]  webapp=null path=null params={}{add=[35]} 0 0
   [junit4]   2> 1884295 INFO  (SUITE-TestRandomCollapseQParserPlugin-seed#[8EAEF3F3AD3A1333]-worker) [    ] o.a.s.u.p.LogUpdateProcessorFactory [collection1]  webapp=null path=null params={}{add=[36]} 0 0
   [junit4]   2> 1884296 INFO  (SUITE-TestRandomCollapseQParserPlugin-seed#[8EAEF3F3AD3A1333]-worker) [    ] o.a.s.u.p.LogUpdateProcessorFactory [collection1]  webapp=null path=null params={}{add=[37]} 0 0
   [junit4]   2> 1884297 INFO  (SUITE-TestRandomCollapseQParserPlugin-seed#[8EAEF3F3AD3A1333]-worker) [    ] o.a.s.u.p.LogUpdateProcessorFactory [collection1]  webapp=null path=null params={}{add=[38]} 0 0
   [junit4]   2> 1884298 INFO  (SUITE-TestRandomCollapseQParserPlugin-seed#[8EAEF3F3AD3A1333]-worker) [    ] o.a.s.u.p.LogUpdateProcessorFactory [collection1]  webapp=null path=null params={}{add=[39]} 0 0
   [junit4]   2> 1884299 INFO  (SUITE-TestRandomCollapseQParserPlugin-seed#[8EAEF3F3AD3A1333]-worker) [    ] o.a.s.u.p.LogUpdateProcessorFactory [collection1]  webapp=null path=null params={}{add=[40]} 0 0
   [junit4]   2> 1884300 INFO  (SUITE-TestRandomCollapseQParserPlugin-seed#[8EAEF3F3AD3A1333]-worker) [    ] o.a.s.u.p.LogUpdateProcessorFactory [collection1]  webapp=null path=null params={}{add=[41]} 0 0
   [junit4]   2> 1884301 INFO  (SUITE-TestRandomCollapseQParserPlugin-seed#[8EAEF3F3AD3A1333]-worker) [    ] o.a.s.u.p.LogUpdateProcessorFactory [collection1]  webapp=null path=null params={}{add=[42]} 0 0
   [junit4]   2> 1884301 INFO  (SUITE-TestRandomCollapseQParserPlugin-seed#[8EAEF3F3AD3A1333]-worker) [    ] o.a.s.u.p.LogUpdateProcessorFactory [collection1]  webapp=null path=null params={}{add=[43]} 0 0
   [junit4]   2> 1884302 INFO  (SUITE-TestRandomCollapseQParserPlugin-seed#[8EAEF3F3AD3A1333]-worker) [    ] o.a.s.u.p.LogUpdateProcessorFactory [collection1]  webapp=null path=null params={}{add=[44]} 0 0
   [junit4]   2> 1884303 INFO  (SUITE-TestRandomCollapseQParserPlugin-seed#[8EAEF3F3AD3A1333]-worker) [    ] o.a.s.u.p.LogUpdateProcessorFactory [collection1]  webapp=null path=null params={}{add=[45]} 0 0
   [junit4]   2> 1884304 INFO  (SUITE-TestRandomCollapseQParserPlugin-seed#[8EAEF3F3AD3A1333]-worker) [    ] o.a.s.u.p.LogUpdateProcessorFactory [collection1]  webapp=null path=null params={}{add=[46]} 0 0
   [junit4]   2> 1884305 INFO  (SUITE-TestRandomCollapseQParserPlugin-seed#[8EAEF3F3AD3A1333]-worker) [    ] o.a.s.u.p.LogUpdateProcessorFactory [collection1]  webapp=null path=null params={}{add=[47]} 0 0
   [junit4]   2> 1884305 INFO  (SUITE-TestRandomCollapseQParserPlugin-seed#[8EAEF3F3AD3A1333]-worker) [    ] o.a.s.u.p.LogUpdateProcessorFactory [collection1]  webapp=null path=null params={}{add=[48]} 0 0
   [junit4]   2> 1884306 INFO  (SUITE-TestRandomCollapseQParserPlugin-seed#[8EAEF3F3AD3A1333]-worker) [    ] o.a.s.u.p.LogUpdateProcessorFactory [collection1]  webapp=null path=null params={}{add=[49]} 0 0
   [junit4]   2> 1884307 INFO  (SUITE-TestRandomCollapseQParserPlugin-seed#[8EAEF3F3AD3A1333]-worker) [    ] o.a.s.u.p.LogUpdateProcessorFactory [collection1]  webapp=null path=null params={}{add=[50]} 0 0
   [junit4]   2> 1884309 INFO  (SUITE-TestRandomCollapseQParserPlugin-seed#[8EAEF3F3AD3A1333]-worker) [    ] o.a.s.u.p.LogUpdateProcessorFactory [collection1]  webapp=null path=null params={}{add=[51]} 0 1
   [junit4]   2> 1884310 INFO  (SUITE-TestRandomCollapseQParserPlugin-seed#[8EAEF3F3AD3A1333]-worker) [    ] o.a.s.u.p.LogUpdateProcessorFactory [collection1]  webapp=null path=null params={}{add=[52]} 0 0
   [junit4]   2> 1884311 INFO  (SUITE-TestRandomCollapseQParserPlugin-seed#[8EAEF3F3AD3A1333]-worker) [    ] o.a.s.u.p.LogUpdateProcessorFactory [collection1]  webapp=null path=null params={}{add=[53]} 0 0
   [junit4]   2> 1884312 INFO  (SUITE-TestRandomCollapseQParserPlugin-seed#[8EAEF3F3AD3A1333]-worker) [    ] o.a.s.u.p.LogUpdateProcessorFactory [collection1]  webapp=null path=null params={}{add=[54]} 0 0
   [junit4]   2> 1884313 INFO  (SUITE-TestRandomCollapseQParserPlugin-seed#[8EAEF3F3AD3A1333]-worker) [    ] o.a.s.u.p.LogUpdateProcessorFactory [collection1]  webapp=null path=null params={}{add=[55]} 0 0
   [junit4]   2> 1884313 INFO  (SUITE-TestRandomCollapseQParserPlugin-seed#[8EAEF3F3AD3A1333]-worker) [    ] o.a.s.u.p.LogUpdateProcessorFactory [collection1]  webapp=null path=null params={}{add=[56]} 0 0
   [junit4]   2> 1884314 INFO  (SUITE-TestRandomCollapseQParserPlugin-seed#[8EAEF3F3AD3A1333]-worker) [    ] o.a.s.u.p.LogUpdateProcessorFactory [collection1]  webapp=null path=null params={}{add=[57]} 0 0
   [junit4]   2> 1884315 INFO  (SUITE-TestRandomCollapseQParserPlugin-seed#[8EAEF3F3AD3A1333]-worker) [    ] o.a.s.u.p.LogUpdateProcessorFactory [collection1]  webapp=null path=null params={}{add=[58]} 0 0
   [junit4]   2> 1884316 INFO  (SUITE-TestRandomCollapseQParserPlugin-seed#[8EAEF3F3AD3A1333]-worker) [    ] o.a.s.u.p.LogUpdateProcessorFactory [collection1]  webapp=null path=null params={}{add=[59]} 0 0
   [junit4]   2> 1884317 INFO  (SUITE-TestRandomCollapseQParserPlugin-seed#[8EAEF3F3AD3A1333]-worker) [    ] o.a.s.u.p.LogUpdateProcessorFactory [collection1]  webapp=null path=null params={}{add=[60]} 0 0
   [junit4]   2> 1884317 INFO  (SUITE-TestRandomCollapseQParserPlugin-seed#[8EAEF3F3AD3A1333]-worker) [    ] o.a.s.u.p.LogUpdateProcessorFactory [collection1]  webapp=null path=null params={}{add=[61]} 0 0
   [junit4]   2> 1884322 INFO  (SUITE-TestRandomCollapseQParserPlugin-seed#[8EAEF3F3AD3A1333]-worker) [    ] o.a.s.u.p.LogUpdateProcessorFactory [collection1]  webapp=null path=null params={}{add=[62]} 0 4
   [junit4]   2> 1884323 INFO  (SUITE-TestRandomCollapseQParserPlugin-seed#[8EAEF3F3AD3A1333]-worker) [    ] o.a.s.u.p.LogUpdateProcessorFactory [collection1]  webapp=null path=null params={}{add=[63]} 0 0
   [junit4]   2> 1884323 INFO  (SUITE-TestRandomCollapseQParserPlugin-seed#[8EAEF3F3AD3A1333]-worker) [    ] o.a.s.u.p.LogUpdateProcessorFactory [collection1]  webapp=null path=null params={}{add=[64]} 0 0
   [junit4]   2> 1884324 INFO  (SUITE-TestRandomCollapseQParserPlugin-seed#[8EAEF3F3AD3A1333]-worker) [    ] o.a.s.u.p.LogUpdateProcessorFactory [collection1]  webapp=null path=null params={}{add=[65]} 0 0
   [junit4]   2> 1884325 INFO  (SUITE-TestRandomCollapseQParserPlugin-seed#[8EAEF3F3AD3A1333]-worker) [    ] o.a.s.u.p.LogUpdateProcessorFactory [collection1]  webapp=null path=null params={}{add=[66]} 0 0
   [junit4]   2> 1884326 INFO  (SUITE-TestRandomCollapseQParserPlugin-seed#[8EAEF3F3AD3A1333]-worker) [    ] o.a.s.u.p.LogUpdateProcessorFactory [collection1]  webapp=null path=null params={}{add=[67]} 0 0
   [junit4]   2> 1884327 INFO  (SUITE-TestRandomCollapseQParserPlugin-seed#[8EAEF3F3AD3A1333]-worker) [    ] o.a.s.u.p.LogUpdateProcessorFactory [collection1]  webapp=null path=null params={}{add=[68]} 0 0
   [junit4]   2> 1884327 INFO  (SUITE-TestRandomCollapseQParserPlugin-seed#[8EAEF3F3AD3A1333]-worker) [    ] o.a.s.u.p.LogUpdateProcessorFactory [collection1]  webapp=null path=null params={}{add=[69]} 0 0
   [junit4]   2> 1884328 INFO  (SUITE-TestRandomCollapseQParserPlugin-seed#[8EAEF3F3AD3A1333]-worker) [    ] o.a.s.u.p.LogUpdateProcessorFactory [collection1]  webapp=null path=null params={}{add=[70]} 0 0
   [junit4]   2> 1884329 INFO  (SUITE-TestRandomCollapseQParserPlugin-seed#[8EAEF3F3AD3A1333]-worker) [    ] o.a.s.u.p.LogUpdateProcessorFactory [collection1]  webapp=null path=null params={}{add=[71]} 0 0
   [junit4]   2> 1884330 INFO  (SUITE-TestRandomCollapseQParserPlugin-seed#[8EAEF3F3AD3A1333]-worker) [    ] o.a.s.u.p.LogUpdateProcessorFactory [collection1]  webapp=null path=null params={}{add=[72]} 0 0
   [junit4]   2> 1884330 INFO  (SUITE-TestRandomCollapseQParserPlugin-seed#[8EAEF3F3AD3A1333]-worker) [    ] o.a.s.u.p.LogUpdateProcessorFactory [collection1]  webapp=null path=null params={}{add=[73]} 0 0
   [junit4]   2> 1884331 INFO  (SUITE-TestRandomCollapseQParserPlugin-seed#[8EAEF3F3AD3A1333]-worker) [    ] o.a.s.u.p.LogUpdateProcessorFactory [collection1]  webapp=null path=null params={}{add=[74]} 0 0
   [junit4]   2> 1884332 INFO  (SUITE-TestRandomCollapseQParserPlugin-seed#[8EAEF3F3AD3A1333]-worker) [    ] o.a.s.u.p.LogUpdateProcessorFactory [collection1]  webapp=null path=null params={}{add=[75]} 0 0
   [junit4]   2> 1884333 INFO  (SUITE-TestRandomCollapseQParserPlugin-seed#[8EAEF3F3AD3A1333]-worker) [    ] o.a.s.u.p.LogUpdateProcessorFactory [collection1]  webapp=null path=null params={}{add=[76]} 0 0
   [junit4]   2> 1884334 INFO  (SUITE-TestRandomCollapseQParserPlugin-seed#[8EAEF3F3AD3A1333]-worker) [    ] o.a.s.u.p.LogUpdateProcessorFactory [collection1]  webapp=null path=null params={}{add=[77]} 0 0
   [junit4]   2> 1884334 INFO  (SUITE-TestRandomCollapseQParserPlugin-seed#[8EAEF3F3AD3A1333]-worker) [    ] o.a.s.u.p.LogUpdateProcessorFactory [collection1]  webapp=null path=null params={}{add=[78]} 0 0
   [junit4]   2> 1884335 INFO  (SUITE-TestRandomCollapseQParserPlugin-seed#[8EAEF3F3AD3A1333]-worker) [    ] o.a.s.u.p.LogUpdateProcessorFactory [collection1]  webapp=null path=null params={}{add=[79]} 0 0
   [junit4]   2> 1884336 INFO  (SUITE-TestRandomCollapseQParserPlugin-seed#[8EAEF3F3AD3A1333]-worker) [    ] o.a.s.u.p.LogUpdateProcessorFactory [collection1]  webapp=null path=null params={}{add=[80]} 0 0
   [junit4]   2> 1884342 INFO  (SUITE-TestRandomCollapseQParserPlugin-seed#[8EAEF3F3AD3A1333]-worker) [    ] o.a.s.u.p.LogUpdateProcessorFactory [collection1]  webapp=null path=null params={}{add=[81]} 0 0
   [junit4]   2> 1884343 INFO  (SUITE-TestRandomCollapseQParserPlugin-seed#[8EAEF3F3AD3A1333]-worker) [    ] o.a.s.u.p.LogUpdateProcessorFactory [collection1]  webapp=null path=null params={}{add=[82]} 0 0
   [junit4]   2> 1884344 INFO  (SUITE-TestRandomCollapseQParserPlugin-seed#[8EAEF3F3AD3A1333]-worker) [    ] o.a.s.u.p.LogUpdateProcessorFactory [collection1]  webapp=null path=null params={}{add=[83]} 0 0
   [junit4]   2> 1884344 INFO  (SUITE-TestRandomCollapseQParserPlugin-seed#[8EAEF3F3AD3A1333]-worker) [    ] o.a.s.u.p.LogUpdateProcessorFactory [collection1]  webapp=null path=null params={}{add=[84]} 0 0
   [junit4]   2> 1884345 INFO  (SUITE-TestRandomCollapseQParserPlugin-seed#[8EAEF3F3AD3A1333]-worker) [    ] o.a.s.u.p.LogUpdateProcessorFactory [collection1]  webapp=null path=null params={}{add=[85]} 0 0
   [junit4]   2> 1884345 INFO  (SUITE-TestRandomCollapseQParserPlugin-seed#[8EAEF3F3AD3A1333]-worker) [    ] o.a.s.u.p.LogUpdateProcessorFactory [collection1]  webapp=null path=null params={}{add=[86]} 0 0
   [junit4]   2> 1884346 INFO  (SUITE-TestRandomCollapseQParserPlugin-seed#[8EAEF3F3AD3A1333]-worker) [    ] o.a.s.u.p.LogUpdateProcessorFactory [collection1]  webapp=null path=null params={}{add=[87]} 0 0
   [junit4]   2> 1884347 INFO  (SUITE-TestRandomCollapseQParserPlugin-seed#[8EAEF3F3AD3A1333]-worker) [    ] o.a.s.u.p.LogUpdateProcessorFactory [collection1]  webapp=null path=null params={}{add=[88]} 0 0
   [junit4]   2> 1884348 INFO  (SUITE-TestRandomCollapseQParserPlugin-seed#[8EAEF3F3AD3A1333]-worker) [    ] o.a.s.u.p.LogUpdateProcessorFactory [collection1]  webapp=null path=null params={}{add=[89]} 0 0
   [junit4]   2> 1884348 INFO  (SUITE-TestRandomCollapseQParserPlugin-seed#[8EAEF3F3AD3A1333]-worker) [    ] o.a.s.u.p.LogUpdateProcessorFactory [collection1]  webapp=null path=null params={}{add=[90]} 0 0
   [junit4]   2> 1884349 INFO  (SUITE-TestRandomCollapseQParserPlugin-seed#[8EAEF3F3AD3A1333]-worker) [    ] o.a.s.u.p.LogUpdateProcessorFactory [collection1]  webapp=null path=null params={}{add=[91]} 0 0
   [junit4]   2> 1884349 INFO  (SUITE-TestRandomCollapseQParserPlugin-seed#[8EAEF3F3AD3A1333]-worker) [    ] o.a.s.u.p.LogUpdateProcessorFactory [collection1]  webapp=null path=null params={}{add=[92]} 0 0
   [junit4]   2> 1884350 INFO  (SUITE-TestRandomCollapseQParserPlugin-seed#[8EAEF3F3AD3A1333]-worker) [    ] o.a.s.u.p.LogUpdateProcessorFactory [collection1]  webapp=null path=null params={}{add=[93]} 0 0
   [junit4]   2> 1884351 INFO  (SUITE-TestRandomCollapseQParserPlugin-seed#[8EAEF3F3AD3A1333]-worker) [    ] o.a.s.u.p.LogUpdateProcessorFactory [collection1]  webapp=null path=null params={}{add=[94]} 0 0
   [junit4]   2> 1884352 INFO  (SUITE-TestRandomCollapseQParserPlugin-seed#[8EAEF3F3AD3A1333]-worker) [    ] o.a.s.u.p.LogUpdateProcessorFactory [collection1]  webapp=null path=null params={}{add=[95]} 0 1
   [junit4]   2> 1884353 INFO  (SUITE-TestRandomCollapseQParserPlugin-seed#[8EAEF3F3AD3A1333]-worker) [    ] o.a.s.u.p.LogUpdateProcessorFactory [collection1]  webapp=null path=null params={}{add=[96]} 0 0
   [junit4]   2> 1884354 INFO  (SUITE-TestRandomCollapseQParserPlugin-seed#[8EAEF3F3AD3A1333]-worker) [    ] o.a.s.u.p.LogUpdateProcessorFactory [collection1]  webapp=null path=null params={}{add=[97]} 0 0
   [junit4]   2> 1884354 INFO  (SUITE-TestRandomCollapseQParserPlugin-seed#[8EAEF3F3AD3A1333]-worker) [    ] o.a.s.u.p.LogUpdateProcessorFactory [collection1]  webapp=null path=null params={}{add=[98]} 0 0
   [junit4]   2> 1884355 INFO  (SUITE-TestRandomCollapseQParserPlugin-seed#[8EAEF3F3AD3A1333]-worker) [    ] o.a.s.u.p.LogUpdateProcessorFactory [collection1]  webapp=null path=null params={}{add=[99]} 0 0
   [junit4]   2> 1884356 INFO  (SUITE-TestRandomCollapseQParserPlugin-seed#[8EAEF3F3AD3A1333]-worker) [    ] o.a.s.u.p.LogUpdateProcessorFactory [collection1]  webapp=null path=null params={}{add=[100]} 0 0
   [junit4]   2> 1884356 INFO  (SUITE-TestRandomCollapseQParserPlugin-seed#[8EAEF3F3AD3A1333]-worker) [    ] o.a.s.u.p.LogUpdateProcessorFactory [collection1]  webapp=null path=null params={}{add=[101]} 0 0
   [junit4]   2> 1884357 INFO  (SUITE-TestRandomCollapseQParserPlugin-seed#[8EAEF3F3AD3A1333]-worker) [    ] o.a.s.u.p.LogUpdateProcessorFactory [collection1]  webapp=null path=null params={}{add=[102]} 0 0
   [junit4]   2> 1884358 INFO  (SUITE-TestRandomCollapseQParserPlugin-seed#[8EAEF3F3AD3A1333]-worker) [    ] o.a.s.u.p.LogUpdateProcessorFactory [collection1]  webapp=null path=null params={}{add=[103]} 0 0
   [junit4]   2> 1884358 INFO  (SUITE-TestRandomCollapseQParserPlugin-seed#[8EAEF3F3AD3A1333]-worker) [    ] o.a.s.u.p.LogUpdateProcessorFactory [collection1]  webapp=null path=null params={}{add=[104]} 0 0
   [junit4]   2> 1884359 INFO  (SUITE-TestRandomCollapseQParserPlugin-seed#[8EAEF3F3AD3A1333]-worker) [    ] o.a.s.u.p.LogUpdateProcessorFactory [collection1]  webapp=null path=null params={}{add=[105]} 0 0
   [junit4]   2> 1884360 INFO  (SUITE-TestRandomCollapseQParserPlugin-seed#[8EAEF3F3AD3A1333]-worker) [    ] o.a.s.u.p.LogUpdateProcessorFactory [collection1]  webapp=null path=null params={}{add=[106]} 0 0
   [junit4]   2> 1884360 INFO  (SUITE-TestRandomCollapseQParserPlugin-seed#[8EAEF3F3AD3A1333]-worker) [    ] o.a.s.u.p.LogUpdateProcessorFactory [collection1]  webapp=null path=null params={}{add=[107]} 0 0
   [junit4]   2> 1884361 INFO  (SUITE-TestRandomCollapseQParserPlugin-seed#[8EAEF3F3AD3A1333]-worker) [    ] o.a.s.u.p.LogUpdateProcessorFactory [collection1]  webapp=null path=null params={}{add=[108]} 0 0
   [junit4]   2> 1884362 INFO  (SUITE-TestRandomCollapseQParserPlugin-seed#[8EAEF3F3AD3A1333]-worker) [    ] o.a.s.u.p.LogUpdateProcessorFactory [collection1]  webapp=null path=null params={}{add=[109]} 0 0
   [junit4]   2> 1884363 INFO  (SUITE-TestRandomCollapseQParserPlugin-seed#[8EAEF3F3AD3A1333]-worker) [    ] o.a.s.u.p.LogUpdateProcessorFactory [collection1]  webapp=null path=null params={}{add=[110]} 0 0
   [junit4]   2> 1884363 INFO  (SUITE-TestRandomCollapseQParserPlugin-seed#[8EAEF3F3AD3A1333]-worker) [    ] o.a.s.u.p.LogUpdateProcessorFactory [collection1]  webapp=null path=null params={}{add=[111]} 0 0
   [junit4]   2> 1884364 INFO  (SUITE-TestRandomCollapseQParserPlugin-seed#[8EAEF3F3AD3A1333]-worker) [    ] o.a.s.u.p.LogUpdateProcessorFactory [collection1]  webapp=null path=null params={}{add=[112]} 0 0
   [junit4]   2> 1884364 INFO  (SUITE-TestRandomCollapseQParserPlugin-seed#[8EAEF3F3AD3A1333]-worker) [    ] o.a.s.u.p.LogUpdateProcessorFactory [collection1]  webapp=null path=null params={}{add=[113]} 0 0
   [junit4]   2> 1884365 INFO  (SUITE-TestRandomCollapseQParserPlugin-seed#[8EAEF3F3AD3A1333]-worker) [    ] o.a.s.u.p.LogUpdateProcessorFactory [collection1]  webapp=null path=null params={}{add=[114]} 0 0
   [junit4]   2> 1884366 INFO  (SUITE-TestRandomCollapseQParserPlugin-seed#[8EAEF3F3AD3A1333]-worker) [    ] o.a.s.u.p.LogUpdateProcessorFactory [collection1]  webapp=null path=null params={}{add=[115]} 0 0
   [junit4]   2> 1884366 INFO  (SUITE-TestRandomCollapseQParserPlugin-seed#[8EAEF3F3AD3A1333]-worker) [    ] o.a.s.u.p.LogUpdateProcessorFactory [collection1]  webapp=null path=null params={}{add=[116]} 0 0
   [junit4]   2> 1884367 INFO  (SUITE-TestRandomCollapseQParserPlugin-seed#[8EAEF3F3AD3A1333]-worker) [    ] o.a.s.u.p.LogUpdateProcessorFactory [collection1]  webapp=null path=null params={}{add=[117]} 0 0
   [junit4]   2> 1884367 INFO  (SUITE-TestRandomCollapseQParserPlugin-seed#[8EAEF3F3AD3A1333]-worker) [    ] o.a.s.u.p.LogUpdateProcessorFactory [collection1]  webapp=null path=null params={}{add=[118]} 0 0
   [junit4]   2> 1884368 INFO  (SUITE-TestRandomCollapseQParserPlugin-seed#[8EAEF3F3AD3A1333]-worker) [    ] o.a.s.u.p.LogUpdateProcessorFactory [collection1]  webapp=null path=null params={}{add=[119]} 0 0
   [junit4]   2> 1884368 INFO  (SUITE-TestRandomCollapseQParserPlugin-seed#[8EAEF3F3AD3A1333]-worker) [    ] o.a.s.u.p.LogUpdateProcessorFactory [collection1]  webapp=null path=null params={}{add=[120]} 0 0
   [junit4]   2> 1884369 INFO  (SUITE-TestRandomCollapseQParserPlugin-seed#[8EAEF3F3AD3A1333]-worker) [    ] o.a.s.u.p.LogUpdateProcessorFactory [collection1]  webapp=null path=null params={}{add=[121]} 0 0
   [junit4]   2> 1884369 INFO  (SUITE-TestRandomCollapseQParserPlugin-seed#[8EAEF3F3AD3A1333]-worker) [    ] o.a.s.u.p.LogUpdateProcessorFactory [collection1]  webapp=null path=null params={}{add=[122]} 0 0
   [junit4]   2> 1884370 INFO  (SUITE-TestRandomCollapseQParserPlugin-seed#[8EAEF3F3AD3A1333]-worker) [    ] o.a.s.u.p.LogUpdateProcessorFactory [collection1]  webapp=null path=null params={}{add=[123]} 0 0
   [junit4]   2> 1884371 INFO  (SUITE-TestRandomCollapseQParserPlugin-seed#[8EAEF3F3AD3A1333]-worker) [    ] o.a.s.u.p.LogUpdateProcessorFactory [collection1]  webapp=null path=null params={}{add=[124]} 0 0
   [junit4]   2> 1884372 INFO  (SUITE-TestRandomCollapseQParserPlugin-seed#[8EAEF3F3AD3A1333]-worker) [    ] o.a.s.u.p.LogUpdateProcessorFactory [collection1]  webapp=null path=null params={}{add=[125]} 0 0
   [junit4]   2> 1884372 INFO  (SUITE-TestRandomCollapseQParserPlugin-seed#[8EAEF3F3AD3A1333]-worker) [    ] o.a.s.u.p.LogUpdateProcessorFactory [collection1]  webapp=null path=null params={}{add=[126]} 0 0
   [junit4]   2> 1884373 INFO  (SUITE-TestRandomCollapseQParserPlugin-seed#[8EAEF3F3AD3A1333]-worker) [    ] o.a.s.u.p.LogUpdateProcessorFactory [collection1]  webapp=null path=null params={}{add=[127]} 0 0
   [junit4]   2> 1884374 INFO  (SUITE-TestRandomCollapseQParserPlugin-seed#[8EAEF3F3AD3A1333]-worker) [    ] o.a.s.u.p.LogUpdateProcessorFactory [collection1]  webapp=null path=null params={}{add=[128]} 0 0
   [junit4]   2> 1884374 INFO  (SUITE-TestRandomCollapseQParserPlugin-seed#[8EAEF3F3AD3A1333]-worker) [    ] o.a.s.u.p.LogUpdateProcessorFactory [collection1]  webapp=null path=null params={}{add=[129]} 0 0
   [junit4]   2> 1884375 INFO  (SUITE-TestRandomCollapseQParserPlugin-seed#[8EAEF3F3AD3A1333]-worker) [    ] o.a.s.u.p.LogUpdateProcessorFactory [collection1]  webapp=null path=null params={}{add=[130]} 0 0
   [junit4]   2> 1884375 INFO  (SUITE-TestRandomCollapseQParserPlugin-seed#[8EAEF3F3AD3A1333]-worker) [    ] o.a.s.u.p.LogUpdateProcessorFactory [collection1]  webapp=null path=null params={}{add=[131]} 0 0
   [junit4]   2> 1884376 INFO  (SUITE-TestRandomCollapseQParserPlugin-seed#[8EAEF3F3AD3A1333]-worker) [    ] o.a.s.u.p.LogUpdateProcessorFactory [collection1]  webapp=null path=null params={}{add=[132]} 0 0
   [junit4]   2> 1884377 INFO  (SUITE-TestRandomCollapseQParserPlugin-seed#[8EAEF3F3AD3A1333]-worker) [    ] o.a.s.u.p.LogUpdateProcessorFactory [collection1]  webapp=null path=null params={}{add=[133]} 0 0
   [junit4]   2> 1884377 INFO  (SUITE-TestRandomCollapseQParserPlugin-seed#[8EAEF3F3AD3A1333]-worker) [    ] o.a.s.u.p.LogUpdateProcessorFactory [collection1]  webapp=null path=null params={}{add=[134]} 0 0
   [junit4]   2> 1884378 INFO  (SUITE-TestRandomCollapseQParserPlugin-seed#[8EAEF3F3AD3A1333]-worker) [    ] o.a.s.u.p.LogUpdateProcessorFactory [collection1]  webapp=null path=null params={}{add=[135]} 0 0
   [junit4]   2> 1884379 INFO  (SUITE-TestRandomCollapseQParserPlugin-seed#[8EAEF3F3AD3A1333]-worker) [    ] o.a.s.u.p.LogUpdateProcessorFactory [collection1]  webapp=null path=null params={}{add=[136]} 0 0
   [junit4]   2> 1884379 INFO  (SUITE-TestRandomCollapseQParserPlugin-seed#[8EAEF3F3AD3A1333]-worker) [    ] o.a.s.u.p.LogUpdateProcessorFactory [collection1]  webapp=null path=null params={}{add=[137]} 0 0
   [junit4]   2> 1884380 INFO  (SUITE-TestRandomCollapseQParserPlugin-seed#[8EAEF3F3AD3A1333]-worker) [    ] o.a.s.u.p.LogUpdateProcessorFactory [collection1]  webapp=null path=null params={}{add=[138]} 0 0
   [junit4]   2> 1884380 INFO  (SUITE-TestRandomCollapseQParserPlugin-seed#[8EAEF3F3AD3A1333]-worker) [    ] o.a.s.u.p.LogUpdateProcessorFactory [collection1]  webapp=null path=null params={}{add=[139]} 0 0
   [junit4]   2> 1884381 INFO  (SUITE-TestRandomCollapseQParserPlugin-seed#[8EAEF3F3AD3A1333]-worker) [    ] o.a.s.u.p.LogUpdateProcessorFactory [collection1]  webapp=null path=null params={}{add=[140]} 0 0
   [junit4]   2> 1884381 INFO  (SUITE-TestRandomCollapseQParserPlugin-seed#[8EAEF3F3AD3A1333]-worker) [    ] o.a.s.u.p.LogUpdateProcessorFactory [collection1]  webapp=null path=null params={}{add=[141]} 0 0
   [junit4]   2> 1884382 INFO  (SUITE-TestRandomCollapseQParserPlugin-seed#[8EAEF3F3AD3A1333]-worker) [    ] o.a.s.u.p.LogUpdateProcessorFactory [collection1]  webapp=null path=null params={}{add=[142]} 0 0
   [junit4]   2> 1884383 INFO  (SUITE-TestRandomCollapseQParserPlugin-seed#[8EAEF3F3AD3A1333]-worker) [    ] o.a.s.u.p.LogUpdateProcessorFactory [collection1]  webapp=null path=null params={}{add=[143]} 0 0
   [junit4]   2> 1884387 INFO  (SUITE-TestRandomCollapseQParserPlugin-seed#[8EAEF3F3AD3A1333]-worker) [    ] o.a.s.u.p.LogUpdateProcessorFactory [collection1]  webapp=null path=null params={}{add=[144]} 0 0
   [junit4]   2> 1884387 INFO  (SUITE-TestRandomCollapseQParserPlugin-seed#[8EAEF3F3AD3A1333]-worker) [    ] o.a.s.u.p.LogUpdateProcessorFactory [collection1]  webapp=null path=null params={}{add=[145]} 0 0
   [junit4]   2> 1884388 INFO  (SUITE-TestRandomCollapseQParserPlugin-seed#[8EAEF3F3AD3A1333]-worker) [    ] o.a.s.u.p.LogUpdateProcessorFactory [collection1]  webapp=null path=null params={}{add=[146]} 0 0
   [junit4]   2> 1884389 INFO  (SUITE-TestRandomCollapseQParserPlugin-seed#[8EAEF3F3AD3A1333]-worker) [    ] o.a.s.u.p.LogUpdateProcessorFactory [collection1]  webapp=null path=null params={}{add=[147]} 0 0
   [junit4]   2> 1884390 INFO  (SUITE-TestRandomCollapseQParserPlugin-seed#[8EAEF3F3AD3A1333]-worker) [    ] o.a.s.u.p.LogUpdateProcessorFactory [collection1]  webapp=null path=null params={}{add=[148]} 0 0
   [junit4]   2> 1884391 INFO  (SUITE-TestRandomCollapseQParserPlugin-seed#[8EAEF3F3AD3A1333]-worker) [    ] o.a.s.u.p.LogUpdateProcessorFactory [collection1]  webapp=null path=null params={}{add=[149]} 0 0
   [junit4]   2> 1884391 INFO  (SUITE-TestRandomCollapseQParserPlugin-seed#[8EAEF3F3AD3A1333]-worker) [    ] o.a.s.u.p.LogUpdateProcessorFactory [collection1]  webapp=null path=null params={}{add=[150]} 0 0
   [junit4]   2> 1884392 INFO  (SUITE-TestRandomCollapseQParserPlugin-seed#[8EAEF3F3AD3A1333]-worker) [    ] o.a.s.u.p.LogUpdateProcessorFactory [collection1]  webapp=null path=null params={}{add=[151]} 0 0
   [junit4]   2> 1884392 INFO  (SUITE-TestRandomCollapseQParserPlugin-seed#[8EAEF3F3AD3A1333]-worker) [    ] o.a.s.u.p.LogUpdateProcessorFactory [collection1]  webapp=null path=null params={}{add=[152]} 0 0
   [junit4]   2> 1884393 INFO  (SUITE-TestRandomCollapseQParserPlugin-seed#[8EAEF3F3AD3A1333]-worker) [    ] o.a.s.u.p.LogUpdateProcessorFactory [collection1]  webapp=null path=null params={}{add=[153]} 0 0
   [junit4]   2> 1884393 INFO  (SUITE-TestRandomCollapseQParserPlugin-seed#[8EAEF3F3AD3A1333]-worker) [    ] o.a.s.u.p.LogUpdateProcessorFactory [collection1]  webapp=null path=null params={}{add=[154]} 0 0
   [junit4]   2> 1884397 INFO  (SUITE-TestRandomCollapseQParserPlugin-seed#[8EAEF3F3AD3A1333]-worker) [    ] o.a.s.u.p.LogUpdateProcessorFactory [collection1]  webapp=null path=null params={}{add=[155]} 0 3
   [junit4]   2> 1884397 INFO  (SUITE-TestRandomCollapseQParserPlugin-seed#[8EAEF3F3AD3A1333]-worker) [    ] o.a.s.u.p.LogUpdateProcessorFactory [collection1]  webapp=null path=null params={}{add=[156]} 0 0
   [junit4]   2> 1884398 INFO  (SUITE-TestRandomCollapseQParserPlugin-seed#[8EAEF3F3AD3A1333]-worker) [    ] o.a.s.u.p.LogUpdateProcessorFactory [collection1]  webapp=null path=null params={}{add=[157]} 0 0
   [junit4]   2> 1884398 INFO  (SUITE-TestRandomCollapseQParserPlugin-seed#[8EAEF3F3AD3A1333]-worker) [    ] o.a.s.u.p.LogUpdateProcessorFactory [collection1]  webapp=null path=null params={}{add=[158]} 0 0
   [junit4]   2> 1884399 INFO  (SUITE-TestRandomCollapseQParserPlugin-seed#[8EAEF3F3AD3A1333]-worker) [    ] o.a.s.u.p.LogUpdateProcessorFactory [collection1]  webapp=null path=null params={}{add=[159]} 0 0
   [junit4]   2> 1884399 INFO  (SUITE-TestRandomCollapseQParserPlugin-seed#[8EAEF3F3AD3A1333]-worker) [    ] o.a.s.u.p.LogUpdateProcessorFactory [collection1]  webapp=null path=null params={}{add=[160]} 0 0
   [junit4]   2> 1884400 INFO  (SUITE-TestRandomCollapseQParserPlugin-seed#[8EAEF3F3AD3A1333]-worker) [    ] o.a.s.u.p.LogUpdateProcessorFactory [collection1]  webapp=null path=null params={}{add=[161]} 0 0
   [junit4]   2> 1884400 INFO  (SUITE-TestRandomCollapseQParserPlugin-seed#[8EAEF3F3AD3A1333]-worker) [    ] o.a.s.u.p.LogUpdateProcessorFactory [collection1]  webapp=null path=null params={}{add=[162]} 0 0
   [junit4]   2> 1884401 INFO  (SUITE-TestRandomCollapseQParserPlugin-seed#[8EAEF3F3AD3A1333]-worker) [    ] o.a.s.u.p.LogUpdateProcessorFactory [collection1]  webapp=null path=null params={}{add=[163]} 0 0
   [junit4]   2> 1884401 INFO  (SUITE-TestRandomCollapseQParserPlugin-seed#[8EAEF3F3AD3A1333]-worker) [    ] o.a.s.u.p.LogUpdateProcessorFactory [collection1]  webapp=null path=null params={}{add=[164]} 0 0
   [junit4]   2> 1884402 INFO  (SUITE-TestRandomCollapseQParserPlugin-seed#[8EAEF3F3AD3A1333]-worker) [    ] o.a.s.u.p.LogUpdateProcessorFactory [collection1]  webapp=null path=null params={}{add=[165]} 0 0
   [junit4]   2> 1884402 INFO  (SUITE-TestRandomCollapseQParserPlugin-seed#[8EAEF3F3AD3A1333]-worker) [    ] o.a.s.u.p.LogUpdateProcessorFactory [collection1]  webapp=null path=null params={}{add=[166]} 0 0
   [junit4]   2> 1884403 INFO  (SUITE-TestRandomCollapseQParserPlugin-seed#[8EAEF3F3AD3A1333]-worker) [    ] o.a.s.u.p.LogUpdateProcessorFactory [collection1]  webapp=null path=null params={}{add=[167]} 0 0
   [junit4]   2> 1884403 INFO  (SUITE-TestRandomCollapseQParserPlugin-seed#[8EAEF3F3AD3A1333]-worker) [    ] o.a.s.u.p.LogUpdateProcessorFactory [collection1]  webapp=null path=null params={}{add=[168]} 0 0
   [junit4]   2> 1884404 INFO  (SUITE-TestRandomCollapseQParserPlugin-seed#[8EAEF3F3AD3A1333]-worker) [    ] o.a.s.u.p.LogUpdateProcessorFactory [collection1]  webapp=null path=null params={}{add=[169]} 0 0
   [junit4]   2> 1884404 INFO  (SUITE-TestRandomCollapseQParserPlugin-seed#[8EAEF3F3AD3A1333]-worker) [    ] o.a.s.u.p.LogUpdateProcessorFactory [collection1]  webapp=null path=null params={}{add=[170]} 0 0
   [junit4]   2> 1884405 INFO  (SUITE-TestRandomCollapseQParserPlugin-seed#[8EAEF3F3AD3A1333]-worker) [    ] o.a.s.u.p.LogUpdateProcessorFactory [collection1]  webapp=null path=null params={}{add=[171]} 0 0
   [junit4]   2> 1884405 INFO  (SUITE-TestRandomCollapseQParserPlugin-seed#[8EAEF3F3AD3A1333]-worker) [    ] o.a.s.u.p.LogUpdateProcessorFactory [collection1]  webapp=null path=null params={}{add=[172]} 0 0
   [junit4]   2> 1884406 INFO  (SUITE-TestRandomCollapseQParserPlugin-seed#[8EAEF3F3AD3A1333]-worker) [    ] o.a.s.u.p.LogUpdateProcessorFactory [collection1]  webapp=null path=null params={}{add=[173]} 0 0
   [junit4]   2> 1884407 INFO  (SUITE-TestRandomCollapseQParserPlugin-seed#[8EAEF3F3AD3A1333]-worker) [    ] o.a.s.u.p.LogUpdateProcessorFactory [collection1]  webapp=null path=null params={}{add=[174]} 0 0
   [junit4]   2> 1884407 INFO  (SUITE-TestRandomCollapseQParserPlugin-seed#[8EAEF3F3AD3A1333]-worker) [    ] o.a.s.u.p.LogUpdateProcessorFactory [collection1]  webapp=null path=null params={}{add=[175]} 0 0
   [junit4]   2> 1884408 INFO  (SUITE-TestRandomCollapseQParserPlugin-seed#[8EAEF3F3AD3A1333]-worker) [    ] o.a.s.u.p.LogUpdateProcessorFactory [collection1]  webapp=null path=null params={}{add=[176]} 0 0
   [junit4]   2> 1884409 INFO  (SUITE-TestRandomCollapseQParserPlugin-seed#[8EAEF3F3AD3A1333]-worker) [    ] o.a.s.u.p.LogUpdateProcessorFactory [collection1]  webapp=null path=null params={}{add=[177]} 0 0
   [junit4]   2> 1884409 INFO  (SUITE-TestRandomCollapseQParserPlugin-seed#[8EAEF3F3AD3A1333]-worker) [    ] o.a.s.u.p.LogUpdateProcessorFactory [collection1]  webapp=null path=null params={}{add=[178]} 0 0
   [junit4]   2> 1884410 INFO  (SUITE-TestRandomCollapseQParserPlugin-seed#[8EAEF3F3AD3A1333]-worker) [    ] o.a.s.u.p.LogUpdateProcessorFactory [collection1]  webapp=null path=null params={}{add=[179]} 0 0
   [junit4]   2> 1884410 INFO  (SUITE-TestRandomCollapseQParserPlugin-seed#[8EAEF3F3AD3A1333]-worker) [    ] o.a.s.u.p.LogUpdateProcessorFactory [collection1]  webapp=null path=null params={}{add=[180]} 0 0
   [junit4]   2> 1884411 INFO  (SUITE-TestRandomCollapseQParserPlugin-seed#[8EAEF3F3AD3A1333]-worker) [    ] o.a.s.u.p.LogUpdateProcessorFactory [collection1]  webapp=null path=null params={}{add=[181]} 0 0
   [junit4]   2> 1884412 INFO  (SUITE-TestRandomCollapseQParserPlugin-seed#[8EAEF3F3AD3A1333]-worker) [    ] o.a.s.u.p.LogUpdateProcessorFactory [collection1]  webapp=null path=null params={}{add=[182]} 0 0
   [junit4]   2> 1884412 INFO  (SUITE-TestRandomCollapseQParserPlugin-seed#[8EAEF3F3AD3A1333]-worker) [    ] o.a.s.u.p.LogUpdateProcessorFactory [collection1]  webapp=null path=null params={}{add=[183]} 0 0
   [junit4]   2> 1884413 INFO  (SUITE-TestRandomCollapseQParserPlugin-seed#[8EAEF3F3AD3A1333]-worker) [    ] o.a.s.u.p.LogUpdateProcessorFactory [collection1]  webapp=null path=null params={}{add=[184]} 0 0
   [junit4]   2> 1884413 INFO  (SUITE-TestRandomCollapseQParserPlugin-seed#[8EAEF3F3AD3A1333]-worker) [    ] o.a.s.u.p.LogUpdateProcessorFactory [collection1]  webapp=null path=null params={}{add=[185]} 0 0
   [junit4]   2> 1884414 INFO  (SUITE-TestRandomCollapseQParserPlugin-seed#[8EAEF3F3AD3A1333]-worker) [    ] o.a.s.u.p.LogUpdateProcessorFactory [collection1]  webapp=null path=null params={}{add=[186]} 0 0
   [junit4]   2> 1884414 INFO  (SUITE-TestRandomCollapseQParserPlugin-seed#[8EAEF3F3AD3A1333]-worker) [    ] o.a.s.u.p.LogUpdateProcessorFactory [collection1]  webapp=null path=null params={}{add=[187]} 0 0
   [junit4]   2> 1884415 INFO  (SUITE-TestRandomCollapseQParserPlugin-seed#[8EAEF3F3AD3A1333]-worker) [    ] o.a.s.u.p.LogUpdateProcessorFactory [collection1]  webapp=null path=null params={}{add=[188]} 0 0
   [junit4]   2> 1884415 INFO  (SUITE-TestRandomCollapseQParserPlugin-seed#[8EAEF3F3AD3A1333]-worker) [    ] o.a.s.u.p.LogUpdateProcessorFactory [collection1]  webapp=null path=null params={}{add=[189]} 0 0
   [junit4]   2> 1884416 INFO  (SUITE-TestRandomCollapseQParserPlugin-seed#[8EAEF3F3AD3A1333]-worker) [    ] o.a.s.u.p.LogUpdateProcessorFactory [collection1]  webapp=null path=null params={}{add=[190]} 0 0
   [junit4]   2> 1884416 INFO  (SUITE-TestRandomCollapseQParserPlugin-seed#[8EAEF3F3AD3A1333]-worker) [    ] o.a.s.u.p.LogUpdateProcessorFactory [collection1]  webapp=null path=null params={}{add=[191]} 0 0
   [junit4]   2> 1884416 INFO  (SUITE-TestRandomCollapseQParserPlugin-seed#[8EAEF3F3AD3A1333]-worker) [    ] o.a.s.u.p.LogUpdateProcessorFactory [collection1]  webapp=null path=null params={}{add=[192]} 0 0
   [junit4]   2> 1884417 INFO  (SUITE-TestRandomCollapseQParserPlugin-seed#[8EAEF3F3AD3A1333]-worker) [    ] o.a.s.u.p.LogUpdateProcessorFactory [collection1]  webapp=null path=null params={}{add=[193]} 0 0
   [junit4]   2> 1884417 INFO  (SUITE-TestRandomCollapseQParserPlugin-seed#[8EAEF3F3AD3A1333]-worker) [    ] o.a.s.u.p.LogUpdateProcessorFactory [collection1]  webapp=null path=null params={}{add=[194]} 0 0
   [junit4]   2> 1884418 INFO  (SUITE-TestRandomCollapseQParserPlugin-seed#[8EAEF3F3AD3A1333]-worker) [    ] o.a.s.u.p.LogUpdateProcessorFactory [collection1]  webapp=null path=null params={}{add=[195]} 0 0
   [junit4]   2> 1884418 INFO  (SUITE-TestRandomCollapseQParserPlugin-seed#[8EAEF3F3AD3A1333]-worker) [    ] o.a.s.u.p.LogUpdateProcessorFactory [collection1]  webapp=null path=null params={}{add=[196]} 0 0
   [junit4]   2> 1884419 INFO  (SUITE-TestRandomCollapseQParserPlugin-seed#[8EAEF3F3AD3A1333]-worker) [    ] o.a.s.u.p.LogUpdateProcessorFactory [collection1]  webapp=null path=null params={}{add=[197]} 0 0
   [junit4]   2> 1884419 INFO  (SUITE-TestRandomCollapseQParserPlugin-seed#[8EAEF3F3AD3A1333]-worker) [    ] o.a.s.u.p.LogUpdateProcessorFactory [collection1]  webapp=null path=null params={}{add=[198]} 0 0
   [junit4]   2> 1884420 INFO  (SUITE-TestRandomCollapseQParserPlugin-seed#[8EAEF3F3AD3A1333]-worker) [    ] o.a.s.u.p.LogUpdateProcessorFactory [collection1]  webapp=null path=null params={}{add=[199]} 0 0
   [junit4]   2> 1884420 INFO  (SUITE-TestRandomCollapseQParserPlugin-seed#[8EAEF3F3AD3A1333]-worker) [    ] o.a.s.u.p.LogUpdateProcessorFactory [collection1]  webapp=null path=null params={}{add=[200]} 0 0
   [junit4]   2> 1884420 INFO  (SUITE-TestRandomCollapseQParserPlugin-seed#[8EAEF3F3AD3A1333]-worker) [    ] o.a.s.u.p.LogUpdateProcessorFactory [collection1]  webapp=null path=null params={}{add=[201]} 0 0
   [junit4]   2> 1884421 INFO  (SUITE-TestRandomCollapseQParserPlugin-seed#[8EAEF3F3AD3A1333]-worker) [    ] o.a.s.u.p.LogUpdateProcessorFactory [collection1]  webapp=null path=null params={}{add=[202]} 0 0
   [junit4]   2> 1884422 INFO  (SUITE-TestRandomCollapseQParserPlugin-seed#[8EAEF3F3AD3A1333]-worker) [    ] o.a.s.u.p.LogUpdateProcessorFactory [collection1]  webapp=null path=null params={}{add=[203]} 0 0
   [junit4]   2> 1884423 INFO  (SUITE-TestRandomCollapseQParserPlugin-seed#[8EAEF3F3AD3A1333]-worker) [    ] o.a.s.u.p.LogUpdateProcessorFactory [collection1]  webapp=null path=null params={}{add=[204]} 0 0
   [junit4]   2> 1884423 INFO  (SUITE-TestRandomCollapseQParserPlugin-seed#[8EAEF3F3AD3A1333]-worker) [    ] o.a.s.u.p.LogUpdateProcessorFactory [collection1]  webapp=null path=null params={}{add=[205]} 0 0
   [junit4]   2> 1884427 INFO  (SUITE-TestRandomCollapseQParserPlugin-seed#[8EAEF3F3AD3A1333]-worker) [    ] o.a.s.u.p.LogUpdateProcessorFactory [collection1]  webapp=null path=null params={}{add=[206]} 0 0
   [junit4]   2> 1884427 INFO  (SUITE-TestRandomCollapseQParserPlugin-seed#[8EAEF3F3AD3A1333]-worker) [    ] o.a.s.u.p.LogUpdateProcessorFactory [collection1]  webapp=null path=null params={}{add=[207]} 0 0
   [junit4]   2> 1884428 INFO  (SUITE-TestRandomCollapseQParserPlugin-seed#[8EAEF3F3AD3A1333]-worker) [    ] o.a.s.u.p.LogUpdateProcessorFactory [collection1]  webapp=null path=null params={}{add=[208]} 0 0
   [junit4]   2> 1884428 INFO  (SUITE-TestRandomCollapseQParserPlugin-seed#[8EAEF3F3AD3A1333]-worker) [    ] o.a.s.u.p.LogUpdateProcessorFactory [collection1]  webapp=null path=null params={}{add=[209]} 0 0
   [junit4]   2> 1884429 INFO  (SUITE-TestRandomCollapseQParserPlugin-seed#[8EAEF3F3AD3A1333]-worker) [    ] o.a.s.u.p.LogUpdateProcessorFactory [collection1]  webapp=null path=null params={}{add=[210]} 0 0
   [junit4]   2> 1884429 INFO  (SUITE-TestRandomCollapseQParserPlugin-seed#[8EAEF3F3AD3A1333]-worker) [    ] o.a.s.u.p.LogUpdateProcessorFactory [collection1]  webapp=null path=null params={}{add=[211]} 0 0
   [junit4]   2> 1884430 INFO  (SUITE-TestRandomCollapseQParserPlugin-seed#[8EAEF3F3AD3A1333]-worker) [    ] o.a.s.u.p.LogUpdateProcessorFactory [collection1]  webapp=null path=null params={}{add=[212]} 0 0
   [junit4]   2> 1884430 INFO  (SUITE-TestRandomCollapseQParserPlugin-seed#[8EAEF3F3AD3A1333]-worker) [    ] o.a.s.u.p.LogUpdateProcessorFactory [collection1]  webapp=null path=null params={}{add=[213]} 0 0
   [junit4]   2> 1884431 INFO  (SUITE-TestRandomCollapseQParserPlugin-seed#[8EAEF3F3AD3A1333]-worker) [    ] o.a.s.u.p.LogUpdateProcessorFactory [collection1]  webapp=null path=null params={}{add=[214]} 0 0
   [junit4]   2> 1884431 INFO  (SUITE-TestRandomCollapseQParserPlugin-seed#[8EAEF3F3AD3A1333]-worker) [    ] o.a.s.u.p.LogUpdateProcessorFactory [collection1]  webapp=null path=null params={}{add=[215]} 0 0
   [junit4]   2> 1884432 INFO  (SUITE-TestRandomCollapseQParserPlugin-seed#[8EAEF3F3AD3A1333]-worker) [    ] o.a.s.u.p.LogUpdateProcessorFactory [collection1]  webapp=null path=null params={}{add=[216]} 0 0
   [junit4]   2> 1884432 INFO  (SUITE-TestRandomCollapseQParserPlugin-seed#[8EAEF3F3AD3A1333]-worker) [    ] o.a.s.u.p.LogUpdateProcessorFactory [collection1]  webapp=null path=null params={}{add=[217]} 0 0
   [junit4]   2> 1884433 INFO  (SUITE-TestRandomCollapseQParserPlugin-seed#[8EAEF3F3AD3A1333]-worker) [    ] o.a.s.u.p.LogUpdateProcessorFactory [collection1]  webapp=null path=null params={}{add=[218]} 0 0
   [junit4]   2> 1884433 INFO  (SUITE-TestRandomCollapseQParserPlugin-seed#[8EAEF3F3AD3A1333]-worker) [    ] o.a.s.u.p.LogUpdateProcessorFactory [collection1]  webapp=null path=null params={}{add=[219]} 0 0
   [junit4]   2> 1884434 INFO  (SUITE-TestRandomCollapseQParserPlugin-seed#[8EAEF3F3AD3A1333]-worker) [    ] o.a.s.u.p.LogUpdateProcessorFactory [collection1]  webapp=null path=null params={}{add=[220]} 0 0
   [junit4]   2> 1884434 INFO  (SUITE-TestRandomCollapseQParserPlugin-seed#[8EAEF3F3AD3A1333]-worker) [    ] o.a.s.u.p.LogUpdateProcessorFactory [collection1]  webapp=null path=null params={}{add=[221]} 0 0
   [junit4]   2> 1884434 INFO  (SUITE-TestRandomCollapseQParserPlugin-seed#[8EAEF3F3AD3A1333]-worker) [    ] o.a.s.u.p.LogUpdateProcessorFactory [collection1]  webapp=null path=null params={}{add=[222]} 0 0
   [junit4]   2> 1884435 INFO  (SUITE-TestRandomCollapseQParserPlugin-seed#[8EAEF3F3AD3A1333]-worker) [    ] o.a.s.u.p.LogUpdateProcessorFactory [collection1]  webapp=null path=null params={}{add=[223]} 0 0
   [junit4]   2> 1884435 INFO  (SUITE-TestRandomCollapseQParserPlugin-seed#[8EAEF3F3AD3A1333]-worker) [    ] o.a.s.u.p.LogUpdateProcessorFactory [collection1]  webapp=null path=null params={}{add=[224]} 0 0
   [junit4]   2> 1884436 INFO  (SUITE-TestRandomCollapseQParserPlugin-seed#[8EAEF3F3AD3A1333]-worker) [    ] o.a.s.u.p.LogUpdateProcessorFactory [collection1]  webapp=null path=null params={}{add=[225]} 0 0
   [junit4]   2> 1884436 INFO  (SUITE-TestRandomCollapseQParserPlugin-seed#[8EAEF3F3AD3A1333]-worker) [    ] o.a.s.u.p.LogUpdateProcessorFactory [collection1]  webapp=null path=null params={}{add=[226]} 0 0
   [junit4]   2> 1884437 INFO  (SUITE-TestRandomCollapseQParserPlugin-seed#[8EAEF3F3AD3A1333]-worker) [    ] o.a.s.u.p.LogUpdateProcessorFactory [collection1]  webapp=null path=null params={}{add=[227]} 0 0
   [junit4]   2> 1884437 INFO  (SUITE-TestRandomCollapseQParserPlugin-seed#[8EAEF3F3AD3A1333]-worker) [    ] o.a.s.u.p.LogUpdateProcessorFactory [collection1]  webapp=null path=null params={}{add=[228]} 0 0
   [junit4]   2> 1884438 INFO  (SUITE-TestRandomCollapseQParserPlugin-seed#[8EAEF3F3AD3A1333]-worker) [    ] o.a.s.u.p.LogUpdateProcessorFactory [collection1]  webapp=null path=null params={}{add=[229]} 0 0
   [junit4]   2> 1884439 INFO  (SUITE-TestRandomCollapseQParserPlugin-seed#[8EAEF3F3AD3A1333]-worker) [    ] o.a.s.u.p.LogUpdateProcessorFactory [collection1]  webapp=null path=null params={}{add=[230]} 0 0
   [junit4]   2> 1884439 INFO  (SUITE-TestRandomCollapseQParserPlugin-seed#[8EAEF3F3AD3A1333]-worker) [    ] o.a.s.u.p.LogUpdateProcessorFactory [collection1]  webapp=null path=null params={}{add=[231]} 0 0
   [junit4]   2> 1884440 INFO  (SUITE-TestRandomCollapseQParserPlugin-seed#[8EAEF3F3AD3A1333]-worker) [    ] o.a.s.u.p.LogUpdateProcessorFactory [collection1]  webapp=null path=null params={}{add=[232]} 0 0
   [junit4]   2> 1884440 INFO  (SUITE-TestRandomCollapseQParserPlugin-seed#[8EAEF3F3AD3A1333]-worker) [    ] o.a.s.u.p.LogUpdateProcessorFactory [collection1]  webapp=null path=null params={}{add=[233]} 0 0
   [junit4]   2> 1884440 INFO  (SUITE-TestRandomCollapseQParserPlugin-seed#[8EAEF3F3AD3A1333]-worker) [    ] o.a.s.u.p.LogUpdateProcessorFactory [collection1]  webapp=null path=null params={}{add=[234]} 0 0
   [junit4]   2> 1884441 INFO  (SUITE-TestRandomCollapseQParserPlugin-seed#[8EAEF3F3AD3A1333]-worker) [    ] o.a.s.u.p.LogUpdateProcessorFactory [collection1]  webapp=null path=null params={}{add=[235]} 0 0
   [junit4]   2> 1884441 INFO  (SUITE-TestRandomCollapseQParserPlugin-seed#[8EAEF3F3AD3A1333]-worker) [    ] o.a.s.u.p.LogUpdateProcessorFactory [collection1]  webapp=null path=null params={}{add=[236]} 0 0
   [junit4]   2> 1884442 INFO  (SUITE-TestRandomCollapseQParserPlugin-seed#[8EAEF3F3AD3A1333]-worker) [    ] o.a.s.u.p.LogUpdateProcessorFactory [collection1]  webapp=null path=null params={}{add=[237]} 0 0
   [junit4]   2> 1884442 INFO  (SUITE-TestRandomCollapseQParserPlugin-seed#[8EAEF3F3AD3A1333]-worker) [    ] o.a.s.u.p.LogUpdateProcessorFactory [collection1]  webapp=null path=null params={}{add=[238]} 0 0
   [junit4]   2> 1884443 INFO  (SUITE-TestRandomCollapseQParserPlugin-seed#[8EAEF3F3AD3A1333]-worker) [    ] o.a.s.u.p.LogUpdateProcessorFactory [collection1]  webapp=null path=null params={}{add=[239]} 0 0
   [junit4]   2> 1884443 INFO  (SUITE-TestRandomCollapseQParserPlugin-seed#[8EAEF3F3AD3A1333]-worker) [    ] o.a.s.u.p.LogUpdateProcessorFactory [collection1]  webapp=null path=null params={}{add=[240]} 0 0
   [junit4]   2> 1884443 INFO  (SUITE-TestRandomCollapseQParserPlugin-seed#[8EAEF3F3AD3A1333]-worker) [    ] o.a.s.u.p.LogUpdateProcessorFactory [collection1]  webapp=null path=null params={}{add=[241]} 0 0
   [junit4]   2> 1884444 INFO  (SUITE-TestRandomCollapseQParserPlugin-seed#[8EAEF3F3AD3A1333]-worker) [    ] o.a.s.u.p.LogUpdateProcessorFactory [collection1]  webapp=null path=null params={}{add=[242]} 0 0
   [junit4]   2> 1884445 INFO  (SUITE-TestRandomCollapseQParserPlugin-seed#[8EAEF3F3AD3A1333]-worker) [    ] o.a.s.u.p.LogUpdateProcessorFactory [collection1]  webapp=null path=null params={}{add=[243]} 0 0
   [junit4]   2> 1884445 INFO  (SUITE-TestRandomCollapseQParserPlugin-seed#[8EAEF3F3AD3A1333]-worker) [    ] o.a.s.u.p.LogUpdateProcessorFactory [collection1]  webapp=null path=null params={}{add=[244]} 0 0
   [junit4]   2> 1884446 INFO  (SUITE-TestRandomCollapseQParserPlugin-seed#[8EAEF3F3AD3A1333]-worker) [    ] o.a.s.u.p.LogUpdateProcessorFactory [collection1]  webapp=null path=null params={}{add=[245]} 0 0
   [junit4]   2> 1884446 INFO  (SUITE-TestRandomCollapseQParserPlugin-seed#[8EAEF3F3AD3A1333]-worker) [    ] o.a.s.u.p.LogUpdateProcessorFactory [collection1]  webapp=null path=null params={}{add=[246]} 0 0
   [junit4]   2> 1884446 INFO  (SUITE-TestRandomCollapseQParserPlugin-seed#[8EAEF3F3AD3A1333]-worker) [    ] o.a.s.u.p.LogUpdateProcessorFactory [collection1]  webapp=null path=null params={}{add=[247]} 0 0
   [junit4]   2> 1884447 INFO  (SUITE-TestRandomCollapseQParserPlugin-seed#[8EAEF3F3AD3A1333]-worker) [    ] o.a.s.u.p.LogUpdateProcessorFactory [collection1]  webapp=null path=null params={}{add=[248]} 0 0
   [junit4]   2> 1884447 INFO  (SUITE-TestRandomCollapseQParserPlugin-seed#[8EAEF3F3AD3A1333]-worker) [    ] o.a.s.u.p.LogUpdateProcessorFactory [collection1]  webapp=null path=null params={}{add=[249]} 0 0
   [junit4]   2> 1884448 INFO  (SUITE-TestRandomCollapseQParserPlugin-seed#[8EAEF3F3AD3A1333]-worker) [    ] o.a.s.u.p.LogUpdateProcessorFactory [collection1]  webapp=null path=null params={}{add=[250]} 0 0
   [junit4]   2> 1884448 INFO  (SUITE-TestRandomCollapseQParserPlugin-seed#[8EAEF3F3AD3A1333]-worker) [    ] o.a.s.u.p.LogUpdateProcessorFactory [collection1]  webapp=null path=null params={}{add=[251]} 0 0
   [junit4]   2> 1884448 INFO  (SUITE-TestRandomCollapseQParserPlugin-seed#[8EAEF3F3AD3A1333]-worker) [    ] o.a.s.u.p.LogUpdateProcessorFactory [collection1]  webapp=null path=null params={}{add=[252]} 0 0
   [junit4]   2> 1884449 INFO  (SUITE-TestRandomCollapseQParserPlugin-seed#[8EAEF3F3AD3A1333]-worker) [    ] o.a.s.u.p.LogUpdateProcessorFactory [collection1]  webapp=null path=null params={}{add=[253]} 0 0
   [junit4]   2> 1884449 INFO  (SUITE-TestRandomCollapseQParserPlugin-seed#[8EAEF3F3AD3A1333]-worker) [    ] o.a.s.u.p.LogUpdateProcessorFactory [collection1]  webapp=null path=null params={}{add=[254]} 0 0
   [junit4]   2> 1884450 INFO  (SUITE-TestRandomCollapseQParserPlugin-seed#[8EAEF3F3AD3A1333]-worker) [    ] o.a.s.u.p.LogUpdateProcessorFactory [collection1]  webapp=null path=null params={}{add=[255]} 0 0
   [junit4]   2> 1884451 INFO  (SUITE-TestRandomCollapseQParserPlugin-seed#[8EAEF3F3AD3A1333]-worker) [    ] o.a.s.u.p.LogUpdateProcessorFactory [collection1]  webapp=null path=null params={}{add=[256]} 0 0
   [junit4]   2> 1884451 INFO  (SUITE-TestRandomCollapseQParserPlugin-seed#[8EAEF3F3AD3A1333]-worker) [    ] o.a.s.u.p.LogUpdateProcessorFactory [collection1]  webapp=null path=null params={}{add=[257]} 0 0
   [junit4]   2> 1884452 INFO  (SUITE-TestRandomCollapseQParserPlugin-seed#[8EAEF3F3AD3A1333]-worker) [    ] o.a.s.u.p.LogUpdateProcessorFactory [collection1]  webapp=null path=null params={}{add=[258]} 0 0
   [junit4]   2> 1884452 INFO  (SUITE-TestRandomCollapseQParserPlugin-seed#[8EAEF3F3AD3A1333]-worker) [    ] o.a.s.u.p.LogUpdateProcessorFactory [collection1]  webapp=null path=null params={}{add=[259]} 0 0
   [junit4]   2> 1884453 INFO  (SUITE-TestRandomCollapseQParserPlugin-seed#[8EAEF3F3AD3A1333]-worker) [    ] o.a.s.u.p.LogUpdateProcessorFactory [collection1]  webapp=null path=null params={}{add=[260]} 0 0
   [junit4]   2> 1884453 INFO  (SUITE-TestRandomCollapseQParserPlugin-seed#[8EAEF3F3AD3A1333]-worker) [    ] o.a.s.u.p.LogUpdateProcessorFactory [collection1]  webapp=null path=null params={}{add=[261]} 0 0
   [junit4]   2> 1884453 INFO  (SUITE-TestRandomCollapseQParserPlugin-seed#[8EAEF3F3AD3A1333]-worker) [    ] o.a.s.u.p.LogUpdateProcessorFactory [collection1]  webapp=null path=null params={}{add=[262]} 0 0
   [junit4]   2> 1884454 INFO  (SUITE-TestRandomCollapseQParserPlugin-seed#[8EAEF3F3AD3A1333]-worker) [    ] o.a.s.u.p.LogUpdateProcessorFactory [collection1]  webapp=null path=null params={}{add=[263]} 0 0
   [junit4]   2> 1884454 INFO  (SUITE-TestRandomCollapseQParserPlugin-seed#[8EAEF3F3AD3A1333]-worker) [    ] o.a.s.u.p.LogUpdateProcessorFactory [collection1]  webapp=null path=null params={}{add=[264]} 0 0
   [junit4]   2> 1884455 INFO  (SUITE-TestRandomCollapseQParserPlugin-seed#[8EAEF3F3AD3A1333]-worker) [    ] o.a.s.u.p.LogUpdateProcessorFactory [collection1]  webapp=null path=null params={}{add=[265]} 0 0
   [junit4]   2> 1884455 INFO  (SUITE-TestRandomCollapseQParserPlugin-seed#[8EAEF3F3AD3A1333]-worker) [    ] o.a.s.u.p.LogUpdateProcessorFactory [collection1]  webapp=null path=null params={}{add=[266]} 0 0
   [junit4]   2> 1884456 INFO  (SUITE-TestRandomCollapseQParserPlugin-seed#[8EAEF3F3AD3A1333]-worker) [    ] o.a.s.u.p.LogUpdateProcessorFactory [collection1]  webapp=null path=null params={}{add=[267]} 0 0
   [junit4]   2> 1884456 INFO  (SUITE-TestRandomCollapseQParserPlugin-seed#[8EAEF3F3AD3A1333]-worker) [    ] o.a.s.u.p.LogUpdateProcessorFactory [collection1]  webapp=null path=null params={}{add=[268]} 0 0
   [junit4]   2> 1884461 INFO  (SUITE-TestRandomCollapseQParserPlugin-seed#[8EAEF3F3AD3A1333]-worker) [    ] o.a.s.u.p.LogUpdateProcessorFactory [collection1]  webapp=null path=null params={}{add=[269]} 0 0
   [junit4]   2> 1884461 INFO  (SUITE-TestRandomCollapseQParserPlugin-seed#[8EAEF3F3AD3A1333]-worker) [    ] o.a.s.u.p.LogUpdateProcessorFactory [collection1]  webapp=null path=null params={}{add=[270]} 0 0
   [junit4]   2> 1884462 INFO  (SUITE-TestRandomCollapseQParserPlugin-seed#[8EAEF3F3AD3A1333]-worker) [    ] o.a.s.u.p.LogUpdateProcessorFactory [collection1]  webapp=null path=null params={}{add=[271]} 0 0
   [junit4]   2> 1884462 INFO  (SUITE-TestRandomCollapseQParserPlugin-seed#[8EAEF3F3AD3A1333]-worker) [    ] o.a.s.u.p.LogUpdateProcessorFactory [collection1]  webapp=null path=null params={}{add=[272]} 0 0
   [junit4]   2> 1884463 INFO  (SUITE-TestRandomCollapseQParserPlugin-seed#[8EAEF3F3AD3A1333]-worker) [    ] o.a.s.u.p.LogUpdateProcessorFactory [collection1]  webapp=null path=null params={}{add=[273]} 0 0
   [junit4]   2> 1884463 INFO  (SUITE-TestRandomCollapseQParserPlugin-seed#[8EAEF3F3AD3A1333]-worker) [    ] o.a.s.u.p.LogUpdateProcessorFactory [collection1]  webapp=null path=null params={}{add=[274]} 0 0
   [junit4]   2> 1884463 INFO  (SUITE-TestRandomCollapseQParserPlugin-seed#[8EAEF3F3AD3A1333]-worker) [    ] o.a.s.u.p.LogUpdateProcessorFactory [collection1]  webapp=null path=null params={}{add=[275]} 0 0
   [junit4]   2> 1884464 INFO  (SUITE-TestRandomCollapseQParserPlugin-seed#[8EAEF3F3AD3A1333]-worker) [    ] o.a.s.u.p.LogUpdateProcessorFactory [collection1]  webapp=null path=null params={}{add=[276]} 0 0
   [junit4]   2> 1884464 INFO  (SUITE-TestRandomCollapseQParserPlugin-seed#[8EAEF3F3AD3A1333]-worker) [    ] o.a.s.u.p.LogUpdateProcessorFactory [collection1]  webapp=null path=null params={}{add=[277]} 0 0
   [junit4]   2> 1884464 INFO  (SUITE-TestRandomCollapseQParserPlugin-seed#[8EAEF3F3AD3A1333]-worker) [    ] o.a.s.u.p.LogUpdateProcessorFactory [collection1]  webapp=null path=null params={}{add=[278]} 0 0
   [junit4]   2> 1884465 INFO  (SUITE-TestRandomCollapseQParserPlugin-seed#[8EAEF3F3AD3A1333]-worker) [    ] o.a.s.u.p.LogUpdateProcessorFactory [collection1]  webapp=null path=null params={}{add=[279]} 0 0
   [junit4]   2> 1884465 INFO  (SUITE-TestRandomCollapseQParserPlugin-seed#[8EAEF3F3AD3A1333]-worker) [    ] o.a.s.u.p.LogUpdateProcessorFactory [collection1]  webapp=null path=null params={}{add=[280]} 0 0
   [junit4]   2> 1884466 INFO  (SUITE-TestRandomCollapseQParserPlugin-seed#[8EAEF3F3AD3A1333]-worker) [    ] o.a.s.u.p.LogUpdateProcessorFactory [collection1]  webapp=null path=null params={}{add=[281]} 0 0
   [junit4]   2> 1884467 INFO  (SUITE-TestRandomCollapseQParserPlugin-seed#[8EAEF3F3AD3A1333]-worker) [    ] o.a.s.u.p.LogUpdateProcessorFactory [collection1]  webapp=null path=null params={}{add=[282]} 0 0
   [junit4]   2> 1884467 INFO  (SUITE-TestRandomCollapseQParserPlugin-seed#[8EAEF3F3AD3A1333]-worker) [    ] o.a.s.u.p.LogUpdateProcessorFactory [collection1]  webapp=null path=null params={}{add=[283]} 0 0
   [junit4]   2> 1884468 INFO  (SUITE-TestRandomCollapseQParserPlugin-seed#[8EAEF3F3AD3A1333]-worker) [    ] o.a.s.u.p.LogUpdateProcessorFactory [collection1]  webapp=null path=null params={}{add=[284]} 0 0
   [junit4]   2> 1884468 INFO  (SUITE-TestRandomCollapseQParserPlugin-seed#[8EAEF3F3AD3A1333]-worker) [    ] o.a.s.u.p.LogUpdateProcessorFactory [collection1]  webapp=null path=null params={}{add=[285]} 0 0
   [junit4]   2> 1884469 INFO  (SUITE-TestRandomCollapseQParserPlugin-seed#[8EAEF3F3AD3A1333]-worker) [    ] o.a.s.u.p.LogUpdateProcessorFactory [collection1]  webapp=null path=null params={}{add=[286]} 0 0
   [junit4]   2> 1884469 INFO  (SUITE-TestRandomCollapseQParserPlugin-seed#[8EAEF3F3AD3A1333]-worker) [    ] o.a.s.u.p.LogUpdateProcessorFactory [collection1]  webapp=null path=null params={}{add=[287]} 0 0
 

[...truncated too long message...]

2> 	at com.lmax.disruptor.ProcessingSequenceBarrier.waitFor(ProcessingSequenceBarrier.java:56)
   [junit4]   2> 	at com.lmax.disruptor.BatchEventProcessor.run(BatchEventProcessor.java:128)
   [junit4]   2> 	at java.lang.Thread.run(Thread.java:748)
   [junit4]   2> AsyncLogger error handling event seq=4, value='null':
   [junit4]   2> java.lang.InterruptedException
   [junit4]   2> 	at java.util.concurrent.locks.AbstractQueuedSynchronizer$ConditionObject.reportInterruptAfterWait(AbstractQueuedSynchronizer.java:2014)
   [junit4]   2> 	at java.util.concurrent.locks.AbstractQueuedSynchronizer$ConditionObject.awaitNanos(AbstractQueuedSynchronizer.java:2088)
   [junit4]   2> 	at com.lmax.disruptor.TimeoutBlockingWaitStrategy.waitFor(TimeoutBlockingWaitStrategy.java:38)
   [junit4]   2> 	at com.lmax.disruptor.ProcessingSequenceBarrier.waitFor(ProcessingSequenceBarrier.java:56)
   [junit4]   2> 	at com.lmax.disruptor.BatchEventProcessor.run(BatchEventProcessor.java:128)
   [junit4]   2> 	at java.lang.Thread.run(Thread.java:748)
   [junit4]   2> AsyncLogger error handling event seq=5, value='null':
   [junit4]   2> java.lang.InterruptedException
   [junit4]   2> 	at java.util.concurrent.locks.AbstractQueuedSynchronizer$ConditionObject.reportInterruptAfterWait(AbstractQueuedSynchronizer.java:2014)
   [junit4]   2> 	at java.util.concurrent.locks.AbstractQueuedSynchronizer$ConditionObject.awaitNanos(AbstractQueuedSynchronizer.java:2088)
   [junit4]   2> 	at com.lmax.disruptor.TimeoutBlockingWaitStrategy.waitFor(TimeoutBlockingWaitStrategy.java:38)
   [junit4]   2> 	at com.lmax.disruptor.ProcessingSequenceBarrier.waitFor(ProcessingSequenceBarrier.java:56)
   [junit4]   2> 	at com.lmax.disruptor.BatchEventProcessor.run(BatchEventProcessor.java:128)
   [junit4]   2> 	at java.lang.Thread.run(Thread.java:748)
   [junit4]   2> Sep 04, 2018 5:36:24 PM com.carrotsearch.randomizedtesting.ThreadLeakControl tryToInterruptAll
   [junit4]   2> SEVERE: There are still zombie threads that couldn't be terminated:
   [junit4]   2>    1) Thread[id=13, name=Log4j2-TF-1-AsyncLoggerConfig--1, state=TIMED_WAITING, group=TGRP-TestConfigOverlay]
   [junit4]   2>         at sun.misc.Unsafe.park(Native Method)
   [junit4]   2>         at java.util.concurrent.locks.LockSupport.parkNanos(LockSupport.java:215)
   [junit4]   2>         at java.util.concurrent.locks.AbstractQueuedSynchronizer$ConditionObject.awaitNanos(AbstractQueuedSynchronizer.java:2078)
   [junit4]   2>         at com.lmax.disruptor.TimeoutBlockingWaitStrategy.waitFor(TimeoutBlockingWaitStrategy.java:38)
   [junit4]   2>         at com.lmax.disruptor.ProcessingSequenceBarrier.waitFor(ProcessingSequenceBarrier.java:56)
   [junit4]   2>         at com.lmax.disruptor.BatchEventProcessor.run(BatchEventProcessor.java:128)
   [junit4]   2>         at java.lang.Thread.run(Thread.java:748)
   [junit4]   2> NOTE: test params are: codec=Asserting(Lucene80): {}, docValues:{}, maxPointsInLeafNode=1093, maxMBSortInHeap=6.512445874673418, sim=Asserting(org.apache.lucene.search.similarities.AssertingSimilarity@443bf074), locale=da-DK, timezone=Asia/Bahrain
   [junit4]   2> NOTE: SunOS 5.11 amd64/Oracle Corporation 1.8.0_172 (64-bit)/cpus=3,threads=2,free=65680920,total=97320960
   [junit4]   2> NOTE: All tests run in this JVM: [TestConfigOverlay]
   [junit4]   2> NOTE: reproduce with: ant test  -Dtestcase=TestConfigOverlay -Dtests.seed=8EAEF3F3AD3A1333 -Dtests.slow=true -Dtests.badapples=true -Dtests.locale=da-DK -Dtests.timezone=Asia/Bahrain -Dtests.asserts=true -Dtests.file.encoding=US-ASCII
   [junit4] ERROR   0.00s J1 | TestConfigOverlay (suite) <<<
   [junit4]    > Throwable #1: com.carrotsearch.randomizedtesting.ThreadLeakError: 1 thread leaked from SUITE scope at org.apache.solr.core.TestConfigOverlay: 
   [junit4]    >    1) Thread[id=13, name=Log4j2-TF-1-AsyncLoggerConfig--1, state=TIMED_WAITING, group=TGRP-TestConfigOverlay]
   [junit4]    >         at sun.misc.Unsafe.park(Native Method)
   [junit4]    >         at java.util.concurrent.locks.LockSupport.parkNanos(LockSupport.java:215)
   [junit4]    >         at java.util.concurrent.locks.AbstractQueuedSynchronizer$ConditionObject.awaitNanos(AbstractQueuedSynchronizer.java:2078)
   [junit4]    >         at com.lmax.disruptor.TimeoutBlockingWaitStrategy.waitFor(TimeoutBlockingWaitStrategy.java:38)
   [junit4]    >         at com.lmax.disruptor.ProcessingSequenceBarrier.waitFor(ProcessingSequenceBarrier.java:56)
   [junit4]    >         at com.lmax.disruptor.BatchEventProcessor.run(BatchEventProcessor.java:128)
   [junit4]    >         at java.lang.Thread.run(Thread.java:748)
   [junit4]    > 	at __randomizedtesting.SeedInfo.seed([8EAEF3F3AD3A1333]:0)Throwable #2: com.carrotsearch.randomizedtesting.ThreadLeakError: There are still zombie threads that couldn't be terminated:
   [junit4]    >    1) Thread[id=13, name=Log4j2-TF-1-AsyncLoggerConfig--1, state=TIMED_WAITING, group=TGRP-TestConfigOverlay]
   [junit4]    >         at sun.misc.Unsafe.park(Native Method)
   [junit4]    >         at java.util.concurrent.locks.LockSupport.parkNanos(LockSupport.java:215)
   [junit4]    >         at java.util.concurrent.locks.AbstractQueuedSynchronizer$ConditionObject.awaitNanos(AbstractQueuedSynchronizer.java:2078)
   [junit4]    >         at com.lmax.disruptor.TimeoutBlockingWaitStrategy.waitFor(TimeoutBlockingWaitStrategy.java:38)
   [junit4]    >         at com.lmax.disruptor.ProcessingSequenceBarrier.waitFor(ProcessingSequenceBarrier.java:56)
   [junit4]    >         at com.lmax.disruptor.BatchEventProcessor.run(BatchEventProcessor.java:128)
   [junit4]    >         at java.lang.Thread.run(Thread.java:748)
   [junit4]    > 	at __randomizedtesting.SeedInfo.seed([8EAEF3F3AD3A1333]:0)
   [junit4] Completed [2/10 (2!)] on J1 in 25.87s, 2 tests, 2 errors <<< FAILURES!
   [junit4] 
   [junit4] Duplicate suite name used with XML reports: org.apache.solr.core.TestConfigOverlay. This may confuse tools that process XML reports. Set 'ignoreDuplicateSuites' to true to skip this message.
   [junit4] Suite: org.apache.solr.core.TestConfigOverlay
   [junit4] Completed [3/10 (2!)] on J0 in 0.02s, 2 tests, 2 skipped
   [junit4] 
   [junit4] Suite: org.apache.solr.search.TestRandomCollapseQParserPlugin
   [junit4] Completed [4/10 (2!)] on J1 in 0.02s, 2 tests, 2 skipped
   [junit4] 
   [junit4] Suite: org.apache.solr.core.TestConfigOverlay
   [junit4] Completed [5/10 (2!)] on J0 in 0.00s, 2 tests, 2 skipped
   [junit4] 
   [junit4] Suite: org.apache.solr.search.TestRandomCollapseQParserPlugin
   [junit4] Completed [6/10 (2!)] on J1 in 0.01s, 2 tests, 2 skipped
   [junit4] 
   [junit4] Duplicate suite name used with XML reports: org.apache.solr.search.TestRandomCollapseQParserPlugin. This may confuse tools that process XML reports. Set 'ignoreDuplicateSuites' to true to skip this message.
   [junit4] Suite: org.apache.solr.core.TestConfigOverlay
   [junit4] Completed [7/10 (2!)] on J1 in 0.00s, 2 tests, 2 skipped
   [junit4] 
   [junit4] Suite: org.apache.solr.search.TestRandomCollapseQParserPlugin
   [junit4] Completed [8/10 (2!)] on J0 in 0.03s, 2 tests, 2 skipped
   [junit4] 
   [junit4] Suite: org.apache.solr.search.TestRandomCollapseQParserPlugin
   [junit4] Completed [9/10 (2!)] on J1 in 0.01s, 2 tests, 2 skipped
   [junit4] 
   [junit4] Suite: org.apache.solr.search.TestRandomCollapseQParserPlugin
   [junit4] Completed [10/10 (2!)] on J0 in 0.01s, 2 tests, 2 skipped
   [junit4] 
   [junit4] 
   [junit4] Tests with failures [seed: 8EAEF3F3AD3A1333]:
   [junit4]   - org.apache.solr.core.TestConfigOverlay (suite)
   [junit4]   - org.apache.solr.core.TestConfigOverlay (suite)
   [junit4] 
   [junit4] 
   [junit4] JVM J0:     0.79 ..    28.65 =    27.85s
   [junit4] JVM J1:     0.75 ..    28.40 =    27.66s
   [junit4] Execution time total: 28 seconds
   [junit4] Tests summary: 10 suites, 20 tests, 4 suite-level errors, 16 ignored

BUILD FAILED
/export/home/jenkins/workspace/Lucene-Solr-master-Solaris/lucene/common-build.xml:1568: The following error occurred while executing this line:
/export/home/jenkins/workspace/Lucene-Solr-master-Solaris/lucene/common-build.xml:1092: There were test failures: 10 suites, 20 tests, 4 suite-level errors, 16 ignored [seed: 8EAEF3F3AD3A1333]

Total time: 31 seconds

[repro] Setting last failure code to 256

[repro] Failures:
[repro]   0/5 failed: org.apache.solr.search.TestRandomCollapseQParserPlugin
[repro]   2/5 failed: org.apache.solr.core.TestConfigOverlay
[repro] Exiting with code 256
+ mv lucene/build lucene/build.repro
+ mv solr/build solr/build.repro
+ mv lucene/build.orig lucene/build
+ mv solr/build.orig solr/build
Archiving artifacts
Setting ANT_1_8_2_HOME=/export/home/jenkins/tools/hudson.tasks.Ant_AntInstallation/ANT_1.8.2
[WARNINGS] Parsing warnings in console log with parser Java Compiler (javac)
Setting ANT_1_8_2_HOME=/export/home/jenkins/tools/hudson.tasks.Ant_AntInstallation/ANT_1.8.2
Setting ANT_1_8_2_HOME=/export/home/jenkins/tools/hudson.tasks.Ant_AntInstallation/ANT_1.8.2
<Git Blamer> Using GitBlamer to create author and commit information for all warnings.
<Git Blamer> GIT_COMMIT=e0eb7bac02a7e6d434bb159430c3fadfcfe3a564, workspace=/export/home/jenkins/workspace/Lucene-Solr-master-Solaris
[WARNINGS] Computing warning deltas based on reference build #2044
Recording test results
Setting ANT_1_8_2_HOME=/export/home/jenkins/tools/hudson.tasks.Ant_AntInstallation/ANT_1.8.2
Build step 'Publish JUnit test result report' changed build result to UNSTABLE
Email was triggered for: Unstable (Test Failures)
Sending email for trigger: Unstable (Test Failures)
Setting ANT_1_8_2_HOME=/export/home/jenkins/tools/hudson.tasks.Ant_AntInstallation/ANT_1.8.2
Setting ANT_1_8_2_HOME=/export/home/jenkins/tools/hudson.tasks.Ant_AntInstallation/ANT_1.8.2
Setting ANT_1_8_2_HOME=/export/home/jenkins/tools/hudson.tasks.Ant_AntInstallation/ANT_1.8.2
Setting ANT_1_8_2_HOME=/export/home/jenkins/tools/hudson.tasks.Ant_AntInstallation/ANT_1.8.2

Mime
View raw message