lucene-dev mailing list archives

Site index · List index
Message view « Date » · « Thread »
Top « Date » · « Thread »
From Apache Jenkins Server <jenk...@builds.apache.org>
Subject [JENKINS] Lucene-Solr-Tests-7.x - Build # 844 - Unstable
Date Mon, 03 Sep 2018 20:29:56 GMT
Build: https://builds.apache.org/job/Lucene-Solr-Tests-7.x/844/

1 tests failed.
FAILED:  org.apache.solr.cloud.api.collections.ShardSplitTest.testSplitMixedReplicaTypesLink

Error Message:
unexpected shard state expected:<inactive> but was:<active>

Stack Trace:
java.lang.AssertionError: unexpected shard state expected:<inactive> but was:<active>
	at __randomizedtesting.SeedInfo.seed([EB5D4C20932048AD:D733857936F8E334]:0)
	at org.junit.Assert.fail(Assert.java:93)
	at org.junit.Assert.failNotEquals(Assert.java:647)
	at org.junit.Assert.assertEquals(Assert.java:128)
	at org.apache.solr.cloud.api.collections.ShardSplitTest.verifyShard(ShardSplitTest.java:372)
	at org.apache.solr.cloud.api.collections.ShardSplitTest.doSplitMixedReplicaTypes(ShardSplitTest.java:364)
	at org.apache.solr.cloud.api.collections.ShardSplitTest.testSplitMixedReplicaTypesLink(ShardSplitTest.java:336)
	at sun.reflect.NativeMethodAccessorImpl.invoke0(Native Method)
	at sun.reflect.NativeMethodAccessorImpl.invoke(NativeMethodAccessorImpl.java:62)
	at sun.reflect.DelegatingMethodAccessorImpl.invoke(DelegatingMethodAccessorImpl.java:43)
	at java.lang.reflect.Method.invoke(Method.java:498)
	at com.carrotsearch.randomizedtesting.RandomizedRunner.invoke(RandomizedRunner.java:1737)
	at com.carrotsearch.randomizedtesting.RandomizedRunner$8.evaluate(RandomizedRunner.java:934)
	at com.carrotsearch.randomizedtesting.RandomizedRunner$9.evaluate(RandomizedRunner.java:970)
	at com.carrotsearch.randomizedtesting.RandomizedRunner$10.evaluate(RandomizedRunner.java:984)
	at org.apache.solr.BaseDistributedSearchTestCase$ShardsRepeatRule$ShardsFixedStatement.callStatement(BaseDistributedSearchTestCase.java:1008)
	at org.apache.solr.BaseDistributedSearchTestCase$ShardsRepeatRule$ShardsStatement.evaluate(BaseDistributedSearchTestCase.java:983)
	at com.carrotsearch.randomizedtesting.rules.SystemPropertiesRestoreRule$1.evaluate(SystemPropertiesRestoreRule.java:57)
	at org.apache.lucene.util.TestRuleSetupTeardownChained$1.evaluate(TestRuleSetupTeardownChained.java:49)
	at org.apache.lucene.util.AbstractBeforeAfterRule$1.evaluate(AbstractBeforeAfterRule.java:45)
	at org.apache.lucene.util.TestRuleThreadAndTestName$1.evaluate(TestRuleThreadAndTestName.java:48)
	at org.apache.lucene.util.TestRuleIgnoreAfterMaxFailures$1.evaluate(TestRuleIgnoreAfterMaxFailures.java:64)
	at org.apache.lucene.util.TestRuleMarkFailure$1.evaluate(TestRuleMarkFailure.java:47)
	at com.carrotsearch.randomizedtesting.rules.StatementAdapter.evaluate(StatementAdapter.java:36)
	at com.carrotsearch.randomizedtesting.ThreadLeakControl$StatementRunner.run(ThreadLeakControl.java:368)
	at com.carrotsearch.randomizedtesting.ThreadLeakControl.forkTimeoutingTask(ThreadLeakControl.java:817)
	at com.carrotsearch.randomizedtesting.ThreadLeakControl$3.evaluate(ThreadLeakControl.java:468)
	at com.carrotsearch.randomizedtesting.RandomizedRunner.runSingleTest(RandomizedRunner.java:943)
	at com.carrotsearch.randomizedtesting.RandomizedRunner$5.evaluate(RandomizedRunner.java:829)
	at com.carrotsearch.randomizedtesting.RandomizedRunner$6.evaluate(RandomizedRunner.java:879)
	at com.carrotsearch.randomizedtesting.RandomizedRunner$7.evaluate(RandomizedRunner.java:890)
	at com.carrotsearch.randomizedtesting.rules.StatementAdapter.evaluate(StatementAdapter.java:36)
	at com.carrotsearch.randomizedtesting.rules.SystemPropertiesRestoreRule$1.evaluate(SystemPropertiesRestoreRule.java:57)
	at org.apache.lucene.util.AbstractBeforeAfterRule$1.evaluate(AbstractBeforeAfterRule.java:45)
	at com.carrotsearch.randomizedtesting.rules.StatementAdapter.evaluate(StatementAdapter.java:36)
	at org.apache.lucene.util.TestRuleStoreClassName$1.evaluate(TestRuleStoreClassName.java:41)
	at com.carrotsearch.randomizedtesting.rules.NoShadowingOrOverridesOnMethodsRule$1.evaluate(NoShadowingOrOverridesOnMethodsRule.java:40)
	at com.carrotsearch.randomizedtesting.rules.NoShadowingOrOverridesOnMethodsRule$1.evaluate(NoShadowingOrOverridesOnMethodsRule.java:40)
	at com.carrotsearch.randomizedtesting.rules.StatementAdapter.evaluate(StatementAdapter.java:36)
	at com.carrotsearch.randomizedtesting.rules.StatementAdapter.evaluate(StatementAdapter.java:36)
	at com.carrotsearch.randomizedtesting.rules.StatementAdapter.evaluate(StatementAdapter.java:36)
	at org.apache.lucene.util.TestRuleAssertionsRequired$1.evaluate(TestRuleAssertionsRequired.java:53)
	at org.apache.lucene.util.TestRuleMarkFailure$1.evaluate(TestRuleMarkFailure.java:47)
	at org.apache.lucene.util.TestRuleIgnoreAfterMaxFailures$1.evaluate(TestRuleIgnoreAfterMaxFailures.java:64)
	at org.apache.lucene.util.TestRuleIgnoreTestSuites$1.evaluate(TestRuleIgnoreTestSuites.java:54)
	at com.carrotsearch.randomizedtesting.rules.StatementAdapter.evaluate(StatementAdapter.java:36)
	at com.carrotsearch.randomizedtesting.ThreadLeakControl$StatementRunner.run(ThreadLeakControl.java:368)
	at java.lang.Thread.run(Thread.java:748)




Build Log:
[...truncated 14261 lines...]
   [junit4] Suite: org.apache.solr.cloud.api.collections.ShardSplitTest
   [junit4]   2> Creating dataDir: /x1/jenkins/jenkins-slave/workspace/Lucene-Solr-Tests-7.x/solr/build/solr-core/test/J0/temp/solr.cloud.api.collections.ShardSplitTest_EB5D4C20932048AD-001/init-core-data-001
   [junit4]   2> 1962707 INFO  (SUITE-ShardSplitTest-seed#[EB5D4C20932048AD]-worker) [    ] o.a.s.BaseDistributedSearchTestCase Setting hostContext system property: /
   [junit4]   2> 1962709 INFO  (TEST-ShardSplitTest.test-seed#[EB5D4C20932048AD]) [    ] o.a.s.c.ZkTestServer STARTING ZK TEST SERVER
   [junit4]   2> 1962709 INFO  (Thread-4806) [    ] o.a.s.c.ZkTestServer client port:0.0.0.0/0.0.0.0:0
   [junit4]   2> 1962709 INFO  (Thread-4806) [    ] o.a.s.c.ZkTestServer Starting server
   [junit4]   2> 1962711 ERROR (Thread-4806) [    ] o.a.z.s.ZooKeeperServer ZKShutdownHandler is not registered, so ZooKeeper server won't take any action on ERROR or SHUTDOWN server state changes
   [junit4]   2> 1962809 INFO  (TEST-ShardSplitTest.test-seed#[EB5D4C20932048AD]) [    ] o.a.s.c.ZkTestServer start zk server on port:43226
   [junit4]   2> 1962813 INFO  (zkConnectionManagerCallback-10144-thread-1) [    ] o.a.s.c.c.ConnectionManager zkClient has connected
   [junit4]   2> 1962818 INFO  (zkConnectionManagerCallback-10146-thread-1) [    ] o.a.s.c.c.ConnectionManager zkClient has connected
   [junit4]   2> 1962822 INFO  (TEST-ShardSplitTest.test-seed#[EB5D4C20932048AD]) [    ] o.a.s.c.AbstractZkTestCase put /x1/jenkins/jenkins-slave/workspace/Lucene-Solr-Tests-7.x/solr/core/src/test-files/solr/collection1/conf/solrconfig-tlog.xml to /configs/conf1/solrconfig.xml
   [junit4]   2> 1962823 INFO  (TEST-ShardSplitTest.test-seed#[EB5D4C20932048AD]) [    ] o.a.s.c.AbstractZkTestCase put /x1/jenkins/jenkins-slave/workspace/Lucene-Solr-Tests-7.x/solr/core/src/test-files/solr/collection1/conf/schema15.xml to /configs/conf1/schema.xml
   [junit4]   2> 1962825 INFO  (TEST-ShardSplitTest.test-seed#[EB5D4C20932048AD]) [    ] o.a.s.c.AbstractZkTestCase put /x1/jenkins/jenkins-slave/workspace/Lucene-Solr-Tests-7.x/solr/core/src/test-files/solr/collection1/conf/solrconfig.snippet.randomindexconfig.xml to /configs/conf1/solrconfig.snippet.randomindexconfig.xml
   [junit4]   2> 1962826 INFO  (TEST-ShardSplitTest.test-seed#[EB5D4C20932048AD]) [    ] o.a.s.c.AbstractZkTestCase put /x1/jenkins/jenkins-slave/workspace/Lucene-Solr-Tests-7.x/solr/core/src/test-files/solr/collection1/conf/stopwords.txt to /configs/conf1/stopwords.txt
   [junit4]   2> 1962827 INFO  (TEST-ShardSplitTest.test-seed#[EB5D4C20932048AD]) [    ] o.a.s.c.AbstractZkTestCase put /x1/jenkins/jenkins-slave/workspace/Lucene-Solr-Tests-7.x/solr/core/src/test-files/solr/collection1/conf/protwords.txt to /configs/conf1/protwords.txt
   [junit4]   2> 1962828 INFO  (TEST-ShardSplitTest.test-seed#[EB5D4C20932048AD]) [    ] o.a.s.c.AbstractZkTestCase put /x1/jenkins/jenkins-slave/workspace/Lucene-Solr-Tests-7.x/solr/core/src/test-files/solr/collection1/conf/currency.xml to /configs/conf1/currency.xml
   [junit4]   2> 1962829 INFO  (TEST-ShardSplitTest.test-seed#[EB5D4C20932048AD]) [    ] o.a.s.c.AbstractZkTestCase put /x1/jenkins/jenkins-slave/workspace/Lucene-Solr-Tests-7.x/solr/core/src/test-files/solr/collection1/conf/enumsConfig.xml to /configs/conf1/enumsConfig.xml
   [junit4]   2> 1962829 INFO  (TEST-ShardSplitTest.test-seed#[EB5D4C20932048AD]) [    ] o.a.s.c.AbstractZkTestCase put /x1/jenkins/jenkins-slave/workspace/Lucene-Solr-Tests-7.x/solr/core/src/test-files/solr/collection1/conf/open-exchange-rates.json to /configs/conf1/open-exchange-rates.json
   [junit4]   2> 1962830 INFO  (TEST-ShardSplitTest.test-seed#[EB5D4C20932048AD]) [    ] o.a.s.c.AbstractZkTestCase put /x1/jenkins/jenkins-slave/workspace/Lucene-Solr-Tests-7.x/solr/core/src/test-files/solr/collection1/conf/mapping-ISOLatin1Accent.txt to /configs/conf1/mapping-ISOLatin1Accent.txt
   [junit4]   2> 1962831 INFO  (TEST-ShardSplitTest.test-seed#[EB5D4C20932048AD]) [    ] o.a.s.c.AbstractZkTestCase put /x1/jenkins/jenkins-slave/workspace/Lucene-Solr-Tests-7.x/solr/core/src/test-files/solr/collection1/conf/old_synonyms.txt to /configs/conf1/old_synonyms.txt
   [junit4]   2> 1962833 INFO  (TEST-ShardSplitTest.test-seed#[EB5D4C20932048AD]) [    ] o.a.s.c.AbstractZkTestCase put /x1/jenkins/jenkins-slave/workspace/Lucene-Solr-Tests-7.x/solr/core/src/test-files/solr/collection1/conf/synonyms.txt to /configs/conf1/synonyms.txt
   [junit4]   2> 1962834 INFO  (TEST-ShardSplitTest.test-seed#[EB5D4C20932048AD]) [    ] o.a.s.c.AbstractFullDistribZkTestBase Will use NRT replicas unless explicitly asked otherwise
   [junit4]   2> 1962834 WARN  (NIOServerCxn.Factory:0.0.0.0/0.0.0.0:0) [    ] o.a.z.s.NIOServerCnxn Unable to read additional data from client sessionid 0x100c44e9ffb0001, likely client has closed socket
   [junit4]   2> 1962935 INFO  (TEST-ShardSplitTest.test-seed#[EB5D4C20932048AD]) [    ] o.e.j.s.Server jetty-9.4.11.v20180605; built: 2018-06-05T18:24:03.829Z; git: d5fc0523cfa96bfebfbda19606cad384d772f04c; jvm 1.8.0_172-b11
   [junit4]   2> 1962935 INFO  (TEST-ShardSplitTest.test-seed#[EB5D4C20932048AD]) [    ] o.e.j.s.session DefaultSessionIdManager workerName=node0
   [junit4]   2> 1962935 INFO  (TEST-ShardSplitTest.test-seed#[EB5D4C20932048AD]) [    ] o.e.j.s.session No SessionScavenger set, using defaults
   [junit4]   2> 1962935 INFO  (TEST-ShardSplitTest.test-seed#[EB5D4C20932048AD]) [    ] o.e.j.s.session node0 Scavenging every 660000ms
   [junit4]   2> 1962936 INFO  (TEST-ShardSplitTest.test-seed#[EB5D4C20932048AD]) [    ] o.e.j.s.h.ContextHandler Started o.e.j.s.ServletContextHandler@1b5ca3de{/,null,AVAILABLE}
   [junit4]   2> 1962937 INFO  (TEST-ShardSplitTest.test-seed#[EB5D4C20932048AD]) [    ] o.e.j.s.AbstractConnector Started ServerConnector@43b7b235{HTTP/1.1,[http/1.1]}{127.0.0.1:46194}
   [junit4]   2> 1962937 INFO  (TEST-ShardSplitTest.test-seed#[EB5D4C20932048AD]) [    ] o.e.j.s.Server Started @1962980ms
   [junit4]   2> 1962937 INFO  (TEST-ShardSplitTest.test-seed#[EB5D4C20932048AD]) [    ] o.a.s.c.s.e.JettySolrRunner Jetty properties: {solr.data.dir=/x1/jenkins/jenkins-slave/workspace/Lucene-Solr-Tests-7.x/solr/build/solr-core/test/J0/temp/solr.cloud.api.collections.ShardSplitTest_EB5D4C20932048AD-001/tempDir-001/control/data, hostContext=/, hostPort=46194, coreRootDirectory=/x1/jenkins/jenkins-slave/workspace/Lucene-Solr-Tests-7.x/solr/build/solr-core/test/J0/../../../../../../../../../../x1/jenkins/jenkins-slave/workspace/Lucene-Solr-Tests-7.x/solr/build/solr-core/test/J0/temp/solr.cloud.api.collections.ShardSplitTest_EB5D4C20932048AD-001/control-001/cores}
   [junit4]   2> 1962937 ERROR (TEST-ShardSplitTest.test-seed#[EB5D4C20932048AD]) [    ] o.a.s.u.StartupLoggingUtils Missing Java Option solr.log.dir. Logging may be missing or incomplete.
   [junit4]   2> 1962937 INFO  (TEST-ShardSplitTest.test-seed#[EB5D4C20932048AD]) [    ] o.a.s.s.SolrDispatchFilter Using logger factory org.apache.logging.slf4j.Log4jLoggerFactory
   [junit4]   2> 1962937 INFO  (TEST-ShardSplitTest.test-seed#[EB5D4C20932048AD]) [    ] o.a.s.s.SolrDispatchFilter  ___      _       Welcome to Apache Solr? version 7.5.0
   [junit4]   2> 1962937 INFO  (TEST-ShardSplitTest.test-seed#[EB5D4C20932048AD]) [    ] o.a.s.s.SolrDispatchFilter / __| ___| |_ _   Starting in cloud mode on port null
   [junit4]   2> 1962937 INFO  (TEST-ShardSplitTest.test-seed#[EB5D4C20932048AD]) [    ] o.a.s.s.SolrDispatchFilter \__ \/ _ \ | '_|  Install dir: null
   [junit4]   2> 1962937 INFO  (TEST-ShardSplitTest.test-seed#[EB5D4C20932048AD]) [    ] o.a.s.s.SolrDispatchFilter |___/\___/_|_|    Start time: 2018-09-03T19:58:49.254Z
   [junit4]   2> 1962939 INFO  (zkConnectionManagerCallback-10148-thread-1) [    ] o.a.s.c.c.ConnectionManager zkClient has connected
   [junit4]   2> 1962940 INFO  (TEST-ShardSplitTest.test-seed#[EB5D4C20932048AD]) [    ] o.a.s.s.SolrDispatchFilter Loading solr.xml from SolrHome (not found in ZooKeeper)
   [junit4]   2> 1962940 INFO  (TEST-ShardSplitTest.test-seed#[EB5D4C20932048AD]) [    ] o.a.s.c.SolrXmlConfig Loading container configuration from /x1/jenkins/jenkins-slave/workspace/Lucene-Solr-Tests-7.x/solr/build/solr-core/test/J0/temp/solr.cloud.api.collections.ShardSplitTest_EB5D4C20932048AD-001/control-001/solr.xml
   [junit4]   2> 1962940 WARN  (NIOServerCxn.Factory:0.0.0.0/0.0.0.0:0) [    ] o.a.z.s.NIOServerCnxn Unable to read additional data from client sessionid 0x100c44e9ffb0002, likely client has closed socket
   [junit4]   2> 1962944 INFO  (TEST-ShardSplitTest.test-seed#[EB5D4C20932048AD]) [    ] o.a.s.c.SolrXmlConfig Configuration parameter autoReplicaFailoverWorkLoopDelay is ignored
   [junit4]   2> 1962944 INFO  (TEST-ShardSplitTest.test-seed#[EB5D4C20932048AD]) [    ] o.a.s.c.SolrXmlConfig Configuration parameter autoReplicaFailoverBadNodeExpiration is ignored
   [junit4]   2> 1962945 INFO  (TEST-ShardSplitTest.test-seed#[EB5D4C20932048AD]) [    ] o.a.s.c.SolrXmlConfig MBean server found: com.sun.jmx.mbeanserver.JmxMBeanServer@3d3a6d1c, but no JMX reporters were configured - adding default JMX reporter.
   [junit4]   2> 1963039 INFO  (TEST-ShardSplitTest.test-seed#[EB5D4C20932048AD]) [    ] o.a.s.c.ZkContainer Zookeeper client=127.0.0.1:43226/solr
   [junit4]   2> 1963040 INFO  (zkConnectionManagerCallback-10152-thread-1) [    ] o.a.s.c.c.ConnectionManager zkClient has connected
   [junit4]   2> 1963042 INFO  (zkConnectionManagerCallback-10154-thread-1) [    ] o.a.s.c.c.ConnectionManager zkClient has connected
   [junit4]   2> 1963126 INFO  (TEST-ShardSplitTest.test-seed#[EB5D4C20932048AD]) [n:127.0.0.1:46194_    ] o.a.s.c.OverseerElectionContext I am going to be the leader 127.0.0.1:46194_
   [junit4]   2> 1963127 INFO  (TEST-ShardSplitTest.test-seed#[EB5D4C20932048AD]) [n:127.0.0.1:46194_    ] o.a.s.c.Overseer Overseer (id=72273436008448004-127.0.0.1:46194_-n_0000000000) starting
   [junit4]   2> 1963134 INFO  (zkConnectionManagerCallback-10161-thread-1) [    ] o.a.s.c.c.ConnectionManager zkClient has connected
   [junit4]   2> 1963136 INFO  (TEST-ShardSplitTest.test-seed#[EB5D4C20932048AD]) [n:127.0.0.1:46194_    ] o.a.s.c.s.i.ZkClientClusterStateProvider Cluster at 127.0.0.1:43226/solr ready
   [junit4]   2> 1963137 DEBUG (OverseerCollectionConfigSetProcessor-72273436008448004-127.0.0.1:46194_-n_0000000000) [n:127.0.0.1:46194_    ] o.a.s.c.OverseerTaskProcessor Process current queue of overseer operations
   [junit4]   2> 1963137 INFO  (OverseerStateUpdate-72273436008448004-127.0.0.1:46194_-n_0000000000) [n:127.0.0.1:46194_    ] o.a.s.c.Overseer Starting to work on the main queue : 127.0.0.1:46194_
   [junit4]   2> 1963137 INFO  (TEST-ShardSplitTest.test-seed#[EB5D4C20932048AD]) [n:127.0.0.1:46194_    ] o.a.s.c.ZkController Register node as live in ZooKeeper:/live_nodes/127.0.0.1:46194_
   [junit4]   2> 1963150 INFO  (OverseerStateUpdate-72273436008448004-127.0.0.1:46194_-n_0000000000) [n:127.0.0.1:46194_    ] o.a.s.c.c.ZkStateReader Updated live nodes from ZooKeeper... (0) -> (1)
   [junit4]   2> 1963151 DEBUG (OverseerCollectionConfigSetProcessor-72273436008448004-127.0.0.1:46194_-n_0000000000) [n:127.0.0.1:46194_    ] o.a.s.c.OverseerTaskProcessor Cleaning up work-queue. #Running tasks: 0
   [junit4]   2> 1963151 DEBUG (OverseerCollectionConfigSetProcessor-72273436008448004-127.0.0.1:46194_-n_0000000000) [n:127.0.0.1:46194_    ] o.a.s.c.OverseerTaskProcessor RunningTasks: []
   [junit4]   2> 1963151 DEBUG (OverseerCollectionConfigSetProcessor-72273436008448004-127.0.0.1:46194_-n_0000000000) [n:127.0.0.1:46194_    ] o.a.s.c.OverseerTaskProcessor BlockedTasks: []
   [junit4]   2> 1963151 DEBUG (OverseerCollectionConfigSetProcessor-72273436008448004-127.0.0.1:46194_-n_0000000000) [n:127.0.0.1:46194_    ] o.a.s.c.OverseerTaskProcessor CompletedTasks: []
   [junit4]   2> 1963151 DEBUG (OverseerCollectionConfigSetProcessor-72273436008448004-127.0.0.1:46194_-n_0000000000) [n:127.0.0.1:46194_    ] o.a.s.c.OverseerTaskProcessor RunningZKTasks: []
   [junit4]   2> 1963157 INFO  (zkCallback-10160-thread-1) [    ] o.a.s.c.c.ZkStateReader Updated live nodes from ZooKeeper... (0) -> (1)
   [junit4]   2> 1963169 INFO  (TEST-ShardSplitTest.test-seed#[EB5D4C20932048AD]) [n:127.0.0.1:46194_    ] o.a.s.h.a.MetricsHistoryHandler No .system collection, keeping metrics history in memory.
   [junit4]   2> 1963187 INFO  (TEST-ShardSplitTest.test-seed#[EB5D4C20932048AD]) [n:127.0.0.1:46194_    ] o.a.s.m.r.SolrJmxReporter JMX monitoring for 'solr.node' (registry 'solr.node') enabled at server: com.sun.jmx.mbeanserver.JmxMBeanServer@3d3a6d1c
   [junit4]   2> 1963196 INFO  (TEST-ShardSplitTest.test-seed#[EB5D4C20932048AD]) [n:127.0.0.1:46194_    ] o.a.s.m.r.SolrJmxReporter JMX monitoring for 'solr.jvm' (registry 'solr.jvm') enabled at server: com.sun.jmx.mbeanserver.JmxMBeanServer@3d3a6d1c
   [junit4]   2> 1963196 INFO  (TEST-ShardSplitTest.test-seed#[EB5D4C20932048AD]) [n:127.0.0.1:46194_    ] o.a.s.m.r.SolrJmxReporter JMX monitoring for 'solr.jetty' (registry 'solr.jetty') enabled at server: com.sun.jmx.mbeanserver.JmxMBeanServer@3d3a6d1c
   [junit4]   2> 1963198 INFO  (TEST-ShardSplitTest.test-seed#[EB5D4C20932048AD]) [n:127.0.0.1:46194_    ] o.a.s.c.CorePropertiesLocator Found 0 core definitions underneath /x1/jenkins/jenkins-slave/workspace/Lucene-Solr-Tests-7.x/solr/build/solr-core/test/J0/../../../../../../../../../../x1/jenkins/jenkins-slave/workspace/Lucene-Solr-Tests-7.x/solr/build/solr-core/test/J0/temp/solr.cloud.api.collections.ShardSplitTest_EB5D4C20932048AD-001/control-001/cores
   [junit4]   2> 1963219 INFO  (zkConnectionManagerCallback-10167-thread-1) [    ] o.a.s.c.c.ConnectionManager zkClient has connected
   [junit4]   2> 1963220 INFO  (TEST-ShardSplitTest.test-seed#[EB5D4C20932048AD]) [    ] o.a.s.c.c.ZkStateReader Updated live nodes from ZooKeeper... (0) -> (1)
   [junit4]   2> 1963239 INFO  (TEST-ShardSplitTest.test-seed#[EB5D4C20932048AD]) [    ] o.a.s.c.s.i.ZkClientClusterStateProvider Cluster at 127.0.0.1:43226/solr ready
   [junit4]   2> 1963241 INFO  (qtp1059663210-24813) [n:127.0.0.1:46194_    ] o.a.s.h.a.CollectionsHandler Invoked Collection Action :create with params collection.configName=conf1&name=control_collection&nrtReplicas=1&action=CREATE&numShards=1&createNodeSet=127.0.0.1:46194_&wt=javabin&version=2 and sendToOCPQueue=true
   [junit4]   2> 1963243 DEBUG (OverseerCollectionConfigSetProcessor-72273436008448004-127.0.0.1:46194_-n_0000000000) [n:127.0.0.1:46194_    ] o.a.s.c.OverseerTaskProcessor Got 1 tasks from work-queue : [[org.apache.solr.cloud.OverseerTaskQueue$QueueEvent@2e684ecf]]
   [junit4]   2> 1963243 DEBUG (OverseerCollectionConfigSetProcessor-72273436008448004-127.0.0.1:46194_-n_0000000000) [n:127.0.0.1:46194_    ] o.a.s.c.OverseerTaskProcessor Marked task [/overseer/collection-queue-work/qn-0000000000] as running
   [junit4]   2> 1963243 DEBUG (OverseerCollectionConfigSetProcessor-72273436008448004-127.0.0.1:46194_-n_0000000000) [n:127.0.0.1:46194_    ] o.a.s.c.OverseerTaskProcessor Overseer Collection Message Handler: Get the message id:/overseer/collection-queue-work/qn-0000000000 message:{
   [junit4]   2>   "name":"control_collection",
   [junit4]   2>   "fromApi":"true",
   [junit4]   2>   "collection.configName":"conf1",
   [junit4]   2>   "numShards":"1",
   [junit4]   2>   "createNodeSet":"127.0.0.1:46194_",
   [junit4]   2>   "nrtReplicas":"1",
   [junit4]   2>   "stateFormat":"2",
   [junit4]   2>   "replicationFactor":"1",
   [junit4]   2>   "operation":"create"}
   [junit4]   2> 1963243 DEBUG (OverseerCollectionConfigSetProcessor-72273436008448004-127.0.0.1:46194_-n_0000000000) [n:127.0.0.1:46194_    ] o.a.s.c.OverseerTaskProcessor Cleaning up work-queue. #Running tasks: 1
   [junit4]   2> 1963243 DEBUG (OverseerCollectionConfigSetProcessor-72273436008448004-127.0.0.1:46194_-n_0000000000) [n:127.0.0.1:46194_    ] o.a.s.c.OverseerTaskProcessor RunningTasks: [/overseer/collection-queue-work/qn-0000000000]
   [junit4]   2> 1963243 DEBUG (OverseerCollectionConfigSetProcessor-72273436008448004-127.0.0.1:46194_-n_0000000000) [n:127.0.0.1:46194_    ] o.a.s.c.OverseerTaskProcessor BlockedTasks: []
   [junit4]   2> 1963243 DEBUG (OverseerCollectionConfigSetProcessor-72273436008448004-127.0.0.1:46194_-n_0000000000) [n:127.0.0.1:46194_    ] o.a.s.c.OverseerTaskProcessor CompletedTasks: []
   [junit4]   2> 1963243 DEBUG (OverseerCollectionConfigSetProcessor-72273436008448004-127.0.0.1:46194_-n_0000000000) [n:127.0.0.1:46194_    ] o.a.s.c.OverseerTaskProcessor RunningZKTasks: [/overseer/collection-queue-work/qn-0000000000]
   [junit4]   2> 1963243 DEBUG (OverseerThreadFactory-7916-thread-1-processing-n:127.0.0.1:46194_) [n:127.0.0.1:46194_    ] o.a.s.c.OverseerTaskProcessor Runner processing /overseer/collection-queue-work/qn-0000000000
   [junit4]   2> 1963243 DEBUG (OverseerThreadFactory-7916-thread-1-processing-n:127.0.0.1:46194_) [n:127.0.0.1:46194_    ] o.a.s.c.a.c.OverseerCollectionMessageHandler OverseerCollectionMessageHandler.processMessage : create , {
   [junit4]   2>   "name":"control_collection",
   [junit4]   2>   "fromApi":"true",
   [junit4]   2>   "collection.configName":"conf1",
   [junit4]   2>   "numShards":"1",
   [junit4]   2>   "createNodeSet":"127.0.0.1:46194_",
   [junit4]   2>   "nrtReplicas":"1",
   [junit4]   2>   "stateFormat":"2",
   [junit4]   2>   "replicationFactor":"1",
   [junit4]   2>   "operation":"create"}
   [junit4]   2> 1963243 INFO  (OverseerThreadFactory-7916-thread-1-processing-n:127.0.0.1:46194_) [n:127.0.0.1:46194_    ] o.a.s.c.a.c.CreateCollectionCmd Create collection control_collection
   [junit4]   2> 1963244 DEBUG (OverseerThreadFactory-7916-thread-1-processing-n:127.0.0.1:46194_) [n:127.0.0.1:46194_    ] o.a.s.c.a.c.OverseerCollectionMessageHandler creating collections conf node /collections/control_collection 
   [junit4]   2> 1963244 DEBUG (OverseerThreadFactory-7916-thread-1-processing-n:127.0.0.1:46194_) [n:127.0.0.1:46194_    ] o.a.s.c.a.c.CreateCollectionCmd Check for collection zkNode:control_collection
   [junit4]   2> 1963245 DEBUG (OverseerThreadFactory-7916-thread-1-processing-n:127.0.0.1:46194_) [n:127.0.0.1:46194_    ] o.a.s.c.a.c.CreateCollectionCmd Collection zkNode exists
   [junit4]   2> 1963246 DEBUG (OverseerStateUpdate-72273436008448004-127.0.0.1:46194_-n_0000000000) [n:127.0.0.1:46194_    ] o.a.s.c.Overseer processMessage: queueSize: 1, message = {
   [junit4]   2>   "name":"control_collection",
   [junit4]   2>   "fromApi":"true",
   [junit4]   2>   "collection.configName":"conf1",
   [junit4]   2>   "numShards":"1",
   [junit4]   2>   "createNodeSet":"127.0.0.1:46194_",
   [junit4]   2>   "nrtReplicas":"1",
   [junit4]   2>   "stateFormat":"2",
   [junit4]   2>   "replicationFactor":"1",
   [junit4]   2>   "operation":"create"} current state version: 0
   [junit4]   2> 1963246 DEBUG (OverseerStateUpdate-72273436008448004-127.0.0.1:46194_-n_0000000000) [n:127.0.0.1:46194_    ] o.a.s.c.o.ClusterStateMutator building a new cName: control_collection
   [junit4]   2> 1963247 DEBUG (OverseerStateUpdate-72273436008448004-127.0.0.1:46194_-n_0000000000) [n:127.0.0.1:46194_    ] o.a.s.c.o.ZkStateWriter going to create_collection /collections/control_collection/state.json
   [junit4]   2> 1963347 DEBUG (OverseerThreadFactory-7916-thread-1-processing-n:127.0.0.1:46194_) [n:127.0.0.1:46194_    ] o.a.s.c.a.c.Assign Identify nodes using default
   [junit4]   2> 1963347 DEBUG (OverseerThreadFactory-7916-thread-1-processing-n:127.0.0.1:46194_) [n:127.0.0.1:46194_    ] o.a.s.c.a.c.CreateCollectionCmd Creating SolrCores for new collection control_collection, shardNames [shard1] , message : {
   [junit4]   2>   "name":"control_collection",
   [junit4]   2>   "fromApi":"true",
   [junit4]   2>   "collection.configName":"conf1",
   [junit4]   2>   "numShards":"1",
   [junit4]   2>   "createNodeSet":"127.0.0.1:46194_",
   [junit4]   2>   "nrtReplicas":"1",
   [junit4]   2>   "stateFormat":"2",
   [junit4]   2>   "replicationFactor":"1",
   [junit4]   2>   "operation":"create"}
   [junit4]   2> 1963348 DEBUG (OverseerThreadFactory-7916-thread-1-processing-n:127.0.0.1:46194_) [n:127.0.0.1:46194_    ] o.a.s.c.a.c.CreateCollectionCmd Creating core control_collection_shard1_replica_n1 as part of shard shard1 of collection control_collection on 127.0.0.1:46194_
   [junit4]   2> 1963350 INFO  (qtp1059663210-24808) [n:127.0.0.1:46194_    x:control_collection_shard1_replica_n1] o.a.s.h.a.CoreAdminOperation core create command qt=/admin/cores&collection.configName=conf1&newCollection=true&name=control_collection_shard1_replica_n1&action=CREATE&numShards=1&collection=control_collection&shard=shard1&wt=javabin&version=2&replicaType=NRT
   [junit4]   2> 1963350 INFO  (qtp1059663210-24808) [n:127.0.0.1:46194_    x:control_collection_shard1_replica_n1] o.a.s.c.TransientSolrCoreCacheDefault Allocating transient cache for 4 transient cores
   [junit4]   2> 1963352 DEBUG (OverseerStateUpdate-72273436008448004-127.0.0.1:46194_-n_0000000000) [n:127.0.0.1:46194_    ] o.a.s.c.Overseer processMessage: queueSize: 1, message = {
   [junit4]   2>   "core":"control_collection_shard1_replica_n1",
   [junit4]   2>   "roles":null,
   [junit4]   2>   "base_url":"http://127.0.0.1:46194",
   [junit4]   2>   "node_name":"127.0.0.1:46194_",
   [junit4]   2>   "numShards":"1",
   [junit4]   2>   "state":"down",
   [junit4]   2>   "shard":"shard1",
   [junit4]   2>   "collection":"control_collection",
   [junit4]   2>   "type":"NRT",
   [junit4]   2>   "operation":"state"} current state version: 0
   [junit4]   2> 1963352 DEBUG (OverseerStateUpdate-72273436008448004-127.0.0.1:46194_-n_0000000000) [n:127.0.0.1:46194_    ] o.a.s.c.o.ReplicaMutator Update state numShards=1 message={
   [junit4]   2>   "core":"control_collection_shard1_replica_n1",
   [junit4]   2>   "roles":null,
   [junit4]   2>   "base_url":"http://127.0.0.1:46194",
   [junit4]   2>   "node_name":"127.0.0.1:46194_",
   [junit4]   2>   "numShards":"1",
   [junit4]   2>   "state":"down",
   [junit4]   2>   "shard":"shard1",
   [junit4]   2>   "collection":"control_collection",
   [junit4]   2>   "type":"NRT",
   [junit4]   2>   "operation":"state"}
   [junit4]   2> 1963353 DEBUG (OverseerStateUpdate-72273436008448004-127.0.0.1:46194_-n_0000000000) [n:127.0.0.1:46194_    ] o.a.s.c.o.ReplicaMutator Will update state for replica: core_node2:{"core":"control_collection_shard1_replica_n1","base_url":"http://127.0.0.1:46194","node_name":"127.0.0.1:46194_","state":"down","type":"NRT"}
   [junit4]   2> 1963353 DEBUG (OverseerStateUpdate-72273436008448004-127.0.0.1:46194_-n_0000000000) [n:127.0.0.1:46194_    ] o.a.s.c.o.ReplicaMutator Collection is now: DocCollection(control_collection//collections/control_collection/state.json/0)={
   [junit4]   2>   "pullReplicas":"0",
   [junit4]   2>   "replicationFactor":"1",
   [junit4]   2>   "router":{"name":"compositeId"},
   [junit4]   2>   "maxShardsPerNode":"1",
   [junit4]   2>   "autoAddReplicas":"false",
   [junit4]   2>   "nrtReplicas":"1",
   [junit4]   2>   "tlogReplicas":"0",
   [junit4]   2>   "shards":{"shard1":{
   [junit4]   2>       "range":"80000000-7fffffff",
   [junit4]   2>       "state":"active",
   [junit4]   2>       "replicas":{"core_node2":{
   [junit4]   2>           "core":"control_collection_shard1_replica_n1",
   [junit4]   2>           "base_url":"http://127.0.0.1:46194",
   [junit4]   2>           "node_name":"127.0.0.1:46194_",
   [junit4]   2>           "state":"down",
   [junit4]   2>           "type":"NRT"}}}}}
   [junit4]   2> 1963453 DEBUG (OverseerStateUpdate-72273436008448004-127.0.0.1:46194_-n_0000000000) [n:127.0.0.1:46194_    ] o.a.s.c.o.ZkStateWriter going to update_collection /collections/control_collection/state.json version: 0
   [junit4]   2> 1964367 INFO  (qtp1059663210-24808) [n:127.0.0.1:46194_ c:control_collection s:shard1  x:control_collection_shard1_replica_n1] o.a.s.c.SolrConfig Using Lucene MatchVersion: 7.5.0
   [junit4]   2> 1964377 INFO  (qtp1059663210-24808) [n:127.0.0.1:46194_ c:control_collection s:shard1  x:control_collection_shard1_replica_n1] o.a.s.s.IndexSchema [control_collection_shard1_replica_n1] Schema name=test
   [junit4]   2> 1964451 INFO  (qtp1059663210-24808) [n:127.0.0.1:46194_ c:control_collection s:shard1  x:control_collection_shard1_replica_n1] o.a.s.s.IndexSchema Loaded schema test/1.6 with uniqueid field id
   [junit4]   2> 1964464 INFO  (qtp1059663210-24808) [n:127.0.0.1:46194_ c:control_collection s:shard1  x:control_collection_shard1_replica_n1] o.a.s.c.CoreContainer Creating SolrCore 'control_collection_shard1_replica_n1' using configuration from collection control_collection, trusted=true
   [junit4]   2> 1964465 INFO  (qtp1059663210-24808) [n:127.0.0.1:46194_ c:control_collection s:shard1  x:control_collection_shard1_replica_n1] o.a.s.m.r.SolrJmxReporter JMX monitoring for 'solr.core.control_collection.shard1.replica_n1' (registry 'solr.core.control_collection.shard1.replica_n1') enabled at server: com.sun.jmx.mbeanserver.JmxMBeanServer@3d3a6d1c
   [junit4]   2> 1964465 INFO  (qtp1059663210-24808) [n:127.0.0.1:46194_ c:control_collection s:shard1  x:control_collection_shard1_replica_n1] o.a.s.c.SolrCore solr.RecoveryStrategy.Builder
   [junit4]   2> 1964465 INFO  (qtp1059663210-24808) [n:127.0.0.1:46194_ c:control_collection s:shard1  x:control_collection_shard1_replica_n1] o.a.s.c.SolrCore [[control_collection_shard1_replica_n1] ] Opening new SolrCore at [/x1/jenkins/jenkins-slave/workspace/Lucene-Solr-Tests-7.x/solr/build/solr-core/test/J0/temp/solr.cloud.api.collections.ShardSplitTest_EB5D4C20932048AD-001/control-001/cores/control_collection_shard1_replica_n1], dataDir=[/x1/jenkins/jenkins-slave/workspace/Lucene-Solr-Tests-7.x/solr/build/solr-core/test/J0/../../../../../../../../../../x1/jenkins/jenkins-slave/workspace/Lucene-Solr-Tests-7.x/solr/build/solr-core/test/J0/temp/solr.cloud.api.collections.ShardSplitTest_EB5D4C20932048AD-001/control-001/cores/control_collection_shard1_replica_n1/data/]
   [junit4]   2> 1964468 INFO  (qtp1059663210-24808) [n:127.0.0.1:46194_ c:control_collection s:shard1  x:control_collection_shard1_replica_n1] o.a.s.u.RandomMergePolicy RandomMergePolicy wrapping class org.apache.lucene.index.TieredMergePolicy: [TieredMergePolicy: maxMergeAtOnce=10, maxMergeAtOnceExplicit=44, maxMergedSegmentMB=5.8671875, floorSegmentMB=0.6455078125, forceMergeDeletesPctAllowed=3.156596477546907, segmentsPerTier=33.0, maxCFSSegmentSizeMB=8.796093022207999E12, noCFSRatio=0.12391314470352227, deletesPctAllowed=23.64230807239812
   [junit4]   2> 1964474 WARN  (qtp1059663210-24808) [n:127.0.0.1:46194_ c:control_collection s:shard1  x:control_collection_shard1_replica_n1] o.a.s.c.RequestHandlers INVALID paramSet a in requestHandler {type = requestHandler,name = /dump,class = DumpRequestHandler,attributes = {initParams=a, name=/dump, class=DumpRequestHandler},args = {defaults={a=A,b=B}}}
   [junit4]   2> 1964514 INFO  (qtp1059663210-24808) [n:127.0.0.1:46194_ c:control_collection s:shard1  x:control_collection_shard1_replica_n1] o.a.s.u.UpdateHandler Using UpdateLog implementation: org.apache.solr.update.UpdateLog
   [junit4]   2> 1964514 INFO  (qtp1059663210-24808) [n:127.0.0.1:46194_ c:control_collection s:shard1  x:control_collection_shard1_replica_n1] o.a.s.u.UpdateLog Initializing UpdateLog: dataDir= defaultSyncLevel=FLUSH numRecordsToKeep=100 maxNumLogsToKeep=10 numVersionBuckets=65536
   [junit4]   2> 1964515 INFO  (qtp1059663210-24808) [n:127.0.0.1:46194_ c:control_collection s:shard1  x:control_collection_shard1_replica_n1] o.a.s.u.CommitTracker Hard AutoCommit: disabled
   [junit4]   2> 1964515 INFO  (qtp1059663210-24808) [n:127.0.0.1:46194_ c:control_collection s:shard1  x:control_collection_shard1_replica_n1] o.a.s.u.CommitTracker Soft AutoCommit: disabled
   [junit4]   2> 1964516 INFO  (qtp1059663210-24808) [n:127.0.0.1:46194_ c:control_collection s:shard1  x:control_collection_shard1_replica_n1] o.a.s.u.RandomMergePolicy RandomMergePolicy wrapping class org.apache.lucene.index.TieredMergePolicy: [TieredMergePolicy: maxMergeAtOnce=42, maxMergeAtOnceExplicit=39, maxMergedSegmentMB=53.74609375, floorSegmentMB=1.0400390625, forceMergeDeletesPctAllowed=19.273842001038982, segmentsPerTier=50.0, maxCFSSegmentSizeMB=8.796093022207999E12, noCFSRatio=0.0, deletesPctAllowed=20.197418099478142
   [junit4]   2> 1964517 INFO  (qtp1059663210-24808) [n:127.0.0.1:46194_ c:control_collection s:shard1  x:control_collection_shard1_replica_n1] o.a.s.s.SolrIndexSearcher Opening [Searcher@356c6d69[control_collection_shard1_replica_n1] main]
   [junit4]   2> 1964518 INFO  (qtp1059663210-24808) [n:127.0.0.1:46194_ c:control_collection s:shard1  x:control_collection_shard1_replica_n1] o.a.s.r.ManagedResourceStorage Configured ZooKeeperStorageIO with znodeBase: /configs/conf1
   [junit4]   2> 1964518 INFO  (qtp1059663210-24808) [n:127.0.0.1:46194_ c:control_collection s:shard1  x:control_collection_shard1_replica_n1] o.a.s.r.ManagedResourceStorage Loaded null at path _rest_managed.json using ZooKeeperStorageIO:path=/configs/conf1
   [junit4]   2> 1964519 INFO  (qtp1059663210-24808) [n:127.0.0.1:46194_ c:control_collection s:shard1  x:control_collection_shard1_replica_n1] o.a.s.h.ReplicationHandler Commits will be reserved for 10000ms.
   [junit4]   2> 1964520 INFO  (searcherExecutor-7921-thread-1-processing-n:127.0.0.1:46194_ x:control_collection_shard1_replica_n1 c:control_collection s:shard1) [n:127.0.0.1:46194_ c:control_collection s:shard1  x:control_collection_shard1_replica_n1] o.a.s.c.SolrCore [control_collection_shard1_replica_n1] Registered new searcher Searcher@356c6d69[control_collection_shard1_replica_n1] main{ExitableDirectoryReader(UninvertingDirectoryReader())}
   [junit4]   2> 1964520 INFO  (qtp1059663210-24808) [n:127.0.0.1:46194_ c:control_collection s:shard1  x:control_collection_shard1_replica_n1] o.a.s.u.UpdateLog Could not find max version in index or recent updates, using new clock 1610617696642138112
   [junit4]   2> 1964525 INFO  (qtp1059663210-24808) [n:127.0.0.1:46194_ c:control_collection s:shard1  x:control_collection_shard1_replica_n1] o.a.s.c.ZkShardTerms Successful update of terms at /collections/control_collection/terms/shard1 to Terms{values={core_node2=0}, version=0}
   [junit4]   2> 1964528 INFO  (qtp1059663210-24808) [n:127.0.0.1:46194_ c:control_collection s:shard1  x:control_collection_shard1_replica_n1] o.a.s.c.ShardLeaderElectionContext Enough replicas found to continue.
   [junit4]   2> 1964528 INFO  (qtp1059663210-24808) [n:127.0.0.1:46194_ c:control_collection s:shard1  x:control_collection_shard1_replica_n1] o.a.s.c.ShardLeaderElectionContext I may be the new leader - try and sync
   [junit4]   2> 1964528 INFO  (qtp1059663210-24808) [n:127.0.0.1:46194_ c:control_collection s:shard1  x:control_collection_shard1_replica_n1] o.a.s.c.SyncStrategy Sync replicas to http://127.0.0.1:46194/control_collection_shard1_replica_n1/
   [junit4]   2> 1964528 INFO  (qtp1059663210-24808) [n:127.0.0.1:46194_ c:control_collection s:shard1  x:control_collection_shard1_replica_n1] o.a.s.c.SyncStrategy Sync Success - now sync replicas to me
   [junit4]   2> 1964528 INFO  (qtp1059663210-24808) [n:127.0.0.1:46194_ c:control_collection s:shard1  x:control_collection_shard1_replica_n1] o.a.s.c.SyncStrategy http://127.0.0.1:46194/control_collection_shard1_replica_n1/ has no replicas
   [junit4]   2> 1964528 INFO  (qtp1059663210-24808) [n:127.0.0.1:46194_ c:control_collection s:shard1  x:control_collection_shard1_replica_n1] o.a.s.c.ShardLeaderElectionContext Found all replicas participating in election, clear LIR
   [junit4]   2> 1964532 INFO  (qtp1059663210-24808) [n:127.0.0.1:46194_ c:control_collection s:shard1  x:control_collection_shard1_replica_n1] o.a.s.c.ShardLeaderElectionContext I am the new leader: http://127.0.0.1:46194/control_collection_shard1_replica_n1/ shard1
   [junit4]   2> 1964532 DEBUG (OverseerStateUpdate-72273436008448004-127.0.0.1:46194_-n_0000000000) [n:127.0.0.1:46194_    ] o.a.s.c.Overseer processMessage: queueSize: 1, message = {
   [junit4]   2>   "operation":"leader",
   [junit4]   2>   "shard":"shard1",
   [junit4]   2>   "collection":"control_collection",
   [junit4]   2>   "base_url":"http://127.0.0.1:46194",
   [junit4]   2>   "core":"control_collection_shard1_replica_n1",
   [junit4]   2>   "state":"active"} current state version: 0
   [junit4]   2> 1964633 DEBUG (OverseerStateUpdate-72273436008448004-127.0.0.1:46194_-n_0000000000) [n:127.0.0.1:46194_    ] o.a.s.c.o.ZkStateWriter going to update_collection /collections/control_collection/state.json version: 1
   [junit4]   2> 1964634 INFO  (qtp1059663210-24808) [n:127.0.0.1:46194_ c:control_collection s:shard1  x:control_collection_shard1_replica_n1] o.a.s.c.ZkController I am the leader, no recovery necessary
   [junit4]   2> 1964635 DEBUG (OverseerStateUpdate-72273436008448004-127.0.0.1:46194_-n_0000000000) [n:127.0.0.1:46194_    ] o.a.s.c.Overseer processMessage: queueSize: 1, message = {
   [junit4]   2>   "core":"control_collection_shard1_replica_n1",
   [junit4]   2>   "core_node_name":"core_node2",
   [junit4]   2>   "roles":null,
   [junit4]   2>   "base_url":"http://127.0.0.1:46194",
   [junit4]   2>   "node_name":"127.0.0.1:46194_",
   [junit4]   2>   "numShards":"1",
   [junit4]   2>   "state":"active",
   [junit4]   2>   "shard":"shard1",
   [junit4]   2>   "collection":"control_collection",
   [junit4]   2>   "type":"NRT",
   [junit4]   2>   "operation":"state"} current state version: 0
   [junit4]   2> 1964635 DEBUG (OverseerStateUpdate-72273436008448004-127.0.0.1:46194_-n_0000000000) [n:127.0.0.1:46194_    ] o.a.s.c.o.ReplicaMutator Update state numShards=1 message={
   [junit4]   2>   "core":"control_collection_shard1_replica_n1",
   [junit4]   2>   "core_node_name":"core_node2",
   [junit4]   2>   "roles":null,
   [junit4]   2>   "base_url":"http://127.0.0.1:46194",
   [junit4]   2>   "node_name":"127.0.0.1:46194_",
   [junit4]   2>   "numShards":"1",
   [junit4]   2>   "state":"active",
   [junit4]   2>   "shard":"shard1",
   [junit4]   2>   "collection":"control_collection",
   [junit4]   2>   "type":"NRT",
   [junit4]   2>   "operation":"state"}
   [junit4]   2> 1964635 DEBUG (OverseerStateUpdate-72273436008448004-127.0.0.1:46194_-n_0000000000) [n:127.0.0.1:46194_    ] o.a.s.c.o.ReplicaMutator Will update state for replica: core_node2:{"core":"control_collection_shard1_replica_n1","base_url":"http://127.0.0.1:46194","node_name":"127.0.0.1:46194_","state":"active","type":"NRT","leader":"true"}
   [junit4]   2> 1964635 DEBUG (OverseerStateUpdate-72273436008448004-127.0.0.1:46194_-n_0000000000) [n:127.0.0.1:46194_    ] o.a.s.c.o.ReplicaMutator Collection is now: DocCollection(control_collection//collections/control_collection/state.json/2)={
   [junit4]   2>   "pullReplicas":"0",
   [junit4]   2>   "replicationFactor":"1",
   [junit4]   2>   "router":{"name":"compositeId"},
   [junit4]   2>   "maxShardsPerNode":"1",
   [junit4]   2>   "autoAddReplicas":"false",
   [junit4]   2>   "nrtReplicas":"1",
   [junit4]   2>   "tlogReplicas":"0",
   [junit4]   2>   "shards":{"shard1":{
   [junit4]   2>       "range":"80000000-7fffffff",
   [junit4]   2>       "state":"active",
   [junit4]   2>       "replicas":{"core_node2":{
   [junit4]   2>           "core":"control_collection_shard1_replica_n1",
   [junit4]   2>           "base_url":"http://127.0.0.1:46194",
   [junit4]   2>           "node_name":"127.0.0.1:46194_",
   [junit4]   2>           "state":"active",
   [junit4]   2>           "type":"NRT",
   [junit4]   2>           "leader":"true"}}}}}
   [junit4]   2> 1964636 INFO  (qtp1059663210-24808) [n:127.0.0.1:46194_ c:control_collection s:shard1  x:control_collection_shard1_replica_n1] o.a.s.s.HttpSolrCall [admin] webapp=null path=/admin/cores params={qt=/admin/cores&collection.configName=conf1&newCollection=true&name=control_collection_shard1_replica_n1&action=CREATE&numShards=1&collection=control_collection&shard=shard1&wt=javabin&version=2&replicaType=NRT} status=0 QTime=1286
   [junit4]   2> 1964636 DEBUG (OverseerThreadFactory-7916-thread-1-processing-n:127.0.0.1:46194_) [n:127.0.0.1:46194_    ] o.a.s.c.a.c.CreateCollectionCmd Finished create command on all shards for collection: control_collection
   [junit4]   2> 1964636 DEBUG (OverseerThreadFactory-7916-thread-1-processing-n:127.0.0.1:46194_) [n:127.0.0.1:46194_    ] o.a.s.c.OverseerTaskProcessor Completed task:[/overseer/collection-queue-work/qn-0000000000]
   [junit4]   2> 1964637 DEBUG (OverseerThreadFactory-7916-thread-1-processing-n:127.0.0.1:46194_) [n:127.0.0.1:46194_    ] o.a.s.c.OverseerTaskProcessor Marked task [/overseer/collection-queue-work/qn-0000000000] as completed.
   [junit4]   2> 1964637 DEBUG (OverseerThreadFactory-7916-thread-1-processing-n:127.0.0.1:46194_) [n:127.0.0.1:46194_    ] o.a.s.c.OverseerTaskProcessor RunningTasks: []
   [junit4]   2> 1964637 DEBUG (OverseerThreadFactory-7916-thread-1-processing-n:127.0.0.1:46194_) [n:127.0.0.1:46194_    ] o.a.s.c.OverseerTaskProcessor BlockedTasks: []
   [junit4]   2> 1964637 DEBUG (OverseerThreadFactory-7916-thread-1-processing-n:127.0.0.1:46194_) [n:127.0.0.1:46194_    ] o.a.s.c.OverseerTaskProcessor CompletedTasks: [/overseer/collection-queue-work/qn-0000000000]
   [junit4]   2> 1964637 DEBUG (OverseerThreadFactory-7916-thread-1-processing-n:127.0.0.1:46194_) [n:127.0.0.1:46194_    ] o.a.s.c.OverseerTaskProcessor RunningZKTasks: [/overseer/collection-queue-work/qn-0000000000]
   [junit4]   2> 1964637 DEBUG (OverseerThreadFactory-7916-thread-1-processing-n:127.0.0.1:46194_) [n:127.0.0.1:46194_    ] o.a.s.c.OverseerTaskProcessor Overseer Collection Message Handler: Message id:/overseer/collection-queue-work/qn-0000000000 complete, response:{success={127.0.0.1:46194_={responseHeader={status=0,QTime=1286},core=control_collection_shard1_replica_n1}}}
   [junit4]   2> 1964638 INFO  (qtp1059663210-24813) [n:127.0.0.1:46194_    ] o.a.s.h.a.CollectionsHandler Wait for new collection to be active for at most 30 seconds. Check all shard replicas
   [junit4]   2> 1964736 DEBUG (OverseerStateUpdate-72273436008448004-127.0.0.1:46194_-n_0000000000) [n:127.0.0.1:46194_    ] o.a.s.c.o.ZkStateWriter going to update_collection /collections/control_collection/state.json version: 2
   [junit4]   2> 1964736 INFO  (zkCallback-10153-thread-1) [    ] o.a.s.c.c.ZkStateReader A cluster state change: [WatchedEvent state:SyncConnected type:NodeDataChanged path:/collections/control_collection/state.json] for collection [control_collection] has occurred - updating... (live nodes size: [1])
   [junit4]   2> 1965244 DEBUG (OverseerCollectionConfigSetProcessor-72273436008448004-127.0.0.1:46194_-n_0000000000) [n:127.0.0.1:46194_    ] o.a.s.c.OverseerTaskProcessor Got 0 tasks from work-queue : [[]]
   [junit4]   2> 1965245 DEBUG (OverseerCollectionConfigSetProcessor-72273436008448004-127.0.0.1:46194_-n_0000000000) [n:127.0.0.1:46194_    ] o.a.s.c.OverseerTaskProcessor Cleaning up work-queue. #Running tasks: 0
   [junit4]   2> 1965245 INFO  (OverseerCollectionConfigSetProcessor-72273436008448004-127.0.0.1:46194_-n_0000000000) [n:127.0.0.1:46194_    ] o.a.s.c.OverseerTaskQueue Response ZK path: /overseer/collection-queue-work/qnr-0000000000 doesn't exist.  Requestor may have disconnected from ZooKeeper
   [junit4]   2> 1965245 DEBUG (OverseerCollectionConfigSetProcessor-72273436008448004-127.0.0.1:46194_-n_0000000000) [n:127.0.0.1:46194_    ] o.a.s.c.OverseerTaskProcessor RunningTasks: []
   [junit4]   2> 1965245 DEBUG (OverseerCollectionConfigSetProcessor-72273436008448004-127.0.0.1:46194_-n_0000000000) [n:127.0.0.1:46194_    ] o.a.s.c.OverseerTaskProcessor BlockedTasks: []
   [junit4]   2> 1965245 DEBUG (OverseerCollectionConfigSetProcessor-72273436008448004-127.0.0.1:46194_-n_0000000000) [n:127.0.0.1:46194_    ] o.a.s.c.OverseerTaskProcessor CompletedTasks: []
   [junit4]   2> 1965245 DEBUG (OverseerCollectionConfigSetProcessor-72273436008448004-127.0.0.1:46194_-n_0000000000) [n:127.0.0.1:46194_    ] o.a.s.c.OverseerTaskProcessor RunningZKTasks: []
   [junit4]   2> 1965639 INFO  (qtp1059663210-24813) [n:127.0.0.1:46194_    ] o.a.s.s.HttpSolrCall [admin] webapp=null path=/admin/collections params={collection.configName=conf1&name=control_collection&nrtReplicas=1&action=CREATE&numShards=1&createNodeSet=127.0.0.1:46194_&wt=javabin&version=2} status=0 QTime=2397
   [junit4]   2> 1965643 INFO  (zkConnectionManagerCallback-10172-thread-1) [    ] o.a.s.c.c.ConnectionManager zkClient has connected
   [junit4]   2> 1965643 INFO  (TEST-ShardSplitTest.test-seed#[EB5D4C20932048AD]) [    ] o.a.s.c.c.ZkStateReader Updated live nodes from ZooKeeper... (0) -> (1)
   [junit4]   2> 1965644 INFO  (TEST-ShardSplitTest.test-seed#[EB5D4C20932048AD]) [    ] o.a.s.c.s.i.ZkClientClusterStateProvider Cluster at 127.0.0.1:43226/solr ready
   [junit4]   2> 1965644 INFO  (TEST-ShardSplitTest.test-seed#[EB5D4C20932048AD]) [    ] o.a.s.c.ChaosMonkey monkey: init - expire sessions:false cause connection loss:false
   [junit4]   2> 1965647 INFO  (qtp1059663210-24815) [n:127.0.0.1:46194_    ] o.a.s.h.a.CollectionsHandler Invoked Collection Action :create with params collection.configName=conf1&name=collection1&nrtReplicas=1&action=CREATE&numShards=2&createNodeSet=&stateFormat=2&wt=javabin&version=2 and sendToOCPQueue=true
   [junit4]   2> 1965648 DEBUG (OverseerCollectionConfigSetProcessor-72273436008448004-127.0.0.1:46194_-n_0000000000) [n:127.0.0.1:46194_    ] o.a.s.c.OverseerTaskProcessor Got 1 tasks from work-queue : [[org.apache.solr.cloud.OverseerTaskQueue$QueueEvent@2e684ed1]]
   [junit4]   2> 1965648 DEBUG (OverseerCollectionConfigSetProcessor-72273436008448004-127.0.0.1:46194_-n_0000000000) [n:127.0.0.1:46194_    ] o.a.s.c.OverseerTaskProcessor Marked task [/overseer/collection-queue-work/qn-0000000002] as running
   [junit4]   2> 1965648 DEBUG (OverseerCollectionConfigSetProcessor-72273436008448004-127.0.0.1:46194_-n_0000000000) [n:127.0.0.1:46194_    ] o.a.s.c.OverseerTaskProcessor Overseer Collection Message Handler: Get the message id:/overseer/collection-queue-work/qn-0000000002 message:{
   [junit4]   2>   "name":"collection1",
   [junit4]   2>   "fromApi":"true",
   [junit4]   2>   "collection.configName":"conf1",
   [junit4]   2>   "numShards":"2",
   [junit4]   2>   "createNodeSet":"",
   [junit4]   2>   "stateFormat":"2",
   [junit4]   2>   "nrtReplicas":"1",
   [junit4]   2>   "replicationFactor":"1",
   [junit4]   2>   "operation":"create"}
   [junit4]   2> 1965649 DEBUG (OverseerThreadFactory-7916-thread-2-processing-n:127.0.0.1:46194_) [n:127.0.0.1:46194_    ] o.a.s.c.OverseerTaskProcessor Runner processing /overseer/collection-queue-work/qn-0000000002
   [junit4]   2> 1965649 DEBUG (OverseerThreadFactory-7916-thread-2-processing-n:127.0.0.1:46194_) [n:127.0.0.1:46194_    ] o.a.s.c.a.c.OverseerCollectionMessageHandler OverseerCollectionMessageHandler.processMessage : create , {
   [junit4]   2>   "name":"collection1",
   [junit4]   2>   "fromApi":"true",
   [junit4]   2>   "collection.configName":"conf1",
   [junit4]   2>   "numShards":"2",
   [junit4]   2>   "createNodeSet":"",
   [junit4]   2>   "stateFormat":"2",
   [junit4]   2>   "nrtReplicas":"1",
   [junit4]   2>   "replicationFactor":"1",
   [junit4]   2>   "operation":"create"}
   [junit4]   2> 1965649 INFO  (OverseerThreadFactory-7916-thread-2-processing-n:127.0.0.1:46194_) [n:127.0.0.1:46194_    ] o.a.s.c.a.c.CreateCollectionCmd Create collection collection1
   [junit4]   2> 1965649 DEBUG (OverseerCollectionConfigSetProcessor-72273436008448004-127.0.0.1:46194_-n_0000000000) [n:127.0.0.1:46194_    ] o.a.s.c.OverseerTaskProcessor Cleaning up work-queue. #Running tasks: 1
   [junit4]   2> 1965649 DEBUG (OverseerCollectionConfigSetProcessor-72273436008448004-127.0.0.1:46194_-n_0000000000) [n:127.0.0.1:46194_    ] o.a.s.c.OverseerTaskProcessor RunningTasks: [/overseer/collection-queue-work/qn-0000000002]
   [junit4]   2> 1965649 DEBUG (OverseerCollectionConfigSetProcessor-72273436008448004-127.0.0.1:46194_-n_0000000000) [n:127.0.0.1:46194_    ] o.a.s.c.OverseerTaskProcessor BlockedTasks: []
   [junit4]   2> 1965649 DEBUG (OverseerCollectionConfigSetProcessor-72273436008448004-127.0.0.1:46194_-n_0000000000) [n:127.0.0.1:46194_    ] o.a.s.c.OverseerTaskProcessor CompletedTasks: []
   [junit4]   2> 1965649 DEBUG (OverseerCollectionConfigSetProcessor-72273436008448004-127.0.0.1:46194_-n_0000000000) [n:127.0.0.1:46194_    ] o.a.s.c.OverseerTaskProcessor RunningZKTasks: [/overseer/collection-queue-work/qn-0000000002]
   [junit4]   2> 1965649 DEBUG (OverseerThreadFactory-7916-thread-2-processing-n:127.0.0.1:46194_) [n:127.0.0.1:46194_    ] o.a.s.c.a.c.OverseerCollectionMessageHandler creating collections conf node /collections/collection1 
   [junit4]   2> 1965650 DEBUG (OverseerThreadFactory-7916-thread-2-processing-n:127.0.0.1:46194_) [n:127.0.0.1:46194_    ] o.a.s.c.a.c.CreateCollectionCmd Check for collection zkNode:collection1
   [junit4]   2> 1965650 DEBUG (OverseerThreadFactory-7916-thread-2-processing-n:127.0.0.1:46194_) [n:127.0.0.1:46194_    ] o.a.s.c.a.c.CreateCollectionCmd Collection zkNode exists
   [junit4]   2> 1965651 DEBUG (OverseerStateUpdate-72273436008448004-127.0.0.1:46194_-n_0000000000) [n:127.0.0.1:46194_    ] o.a.s.c.Overseer processMessage: queueSize: 1, message = {
   [junit4]   2>   "name":"collection1",
   [junit4]   2>   "fromApi":"true",
   [junit4]   2>   "collection.configName":"conf1",
   [junit4]   2>   "numShards":"2",
   [junit4]   2>   "createNodeSet":"",
   [junit4]   2>   "stateFormat":"2",
   [junit4]   2>   "nrtReplicas":"1",
   [junit4]   2>   "replicationFactor":"1",
   [junit4]   2>   "operation":"create"} current state version: 0
   [junit4]   2> 1965651 DEBUG (OverseerStateUpdate-72273436008448004-127.0.0.1:46194_-n_0000000000) [n:127.0.0.1:46194_    ] o.a.s.c.o.ClusterStateMutator building a new cName: collection1
   [junit4]   2> 1965751 DEBUG (OverseerStateUpdate-72273436008448004-127.0.0.1:46194_-n_0000000000) [n:127.0.0.1:46194_    ] o.a.s.c.o.ZkStateWriter going to create_collection /collections/collection1/state.json
   [junit4]   2> 1965852 WARN  (OverseerThreadFactory-7916-thread-2-processing-n:127.0.0.1:46194_) [n:127.0.0.1:46194_    ] o.a.s.c.a.c.CreateCollectionCmd It is unusual to create a collection (collection1) without cores.
   [junit4]   2> 1965852 DEBUG (OverseerThreadFactory-7916-thread-2-processing-n:127.0.0.1:46194_) [n:127.0.0.1:46194_    ] o.a.s.c.a.c.CreateCollectionCmd Finished create command for collection: collection1
   [junit4]   2> 1965852 DEBUG (OverseerThreadFactory-7916-thread-2-processing-n:127.0.0.1:46194_) [n:127.0.0.1:46194_    ] o.a.s.c.OverseerTaskProcessor Completed task:[/overseer/collection-queue-work/qn-0000000002]
   [junit4]   2> 1965853 DEBUG (OverseerThreadFactory-7916-thread-2-processing-n:127.0.0.1:46194_) [n:127.0.0.1:46194_    ] o.a.s.c.OverseerTaskProcessor Marked task [/overseer/collection-queue-work/qn-0000000002] as completed.
   [junit4]   2> 1965853 DEBUG (OverseerThreadFactory-7916-thread-2-processing-n:127.0.0.1:46194_) [n:127.0.0.1:46194_    ] o.a.s.c.OverseerTaskProcessor RunningTasks: []
   [junit4]   2> 1965853 DEBUG (OverseerThreadFactory-7916-thread-2-processing-n:127.0.0.1:46194_) [n:127.0.0.1:46194_    ] o.a.s.c.OverseerTaskProcessor BlockedTasks: []
   [junit4]   2> 1965853 DEBUG (OverseerThreadFactory-7916-thread-2-processing-n:127.0.0.1:46194_) [n:127.0.0.1:46194_    ] o.a.s.c.OverseerTaskProcessor CompletedTasks: [/overseer/collection-queue-work/qn-0000000002]
   [junit4]   2> 1965853 DEBUG (OverseerThreadFactory-7916-thread-2-processing-n:127.0.0.1:46194_) [n:127.0.0.1:46194_    ] o.a.s.c.OverseerTaskProcessor RunningZKTasks: [/overseer/collection-queue-work/qn-0000000002]
   [junit4]   2> 1965853 DEBUG (OverseerThreadFactory-7916-thread-2-processing-n:127.0.0.1:46194_) [n:127.0.0.1:46194_    ] o.a.s.c.OverseerTaskProcessor Overseer Collection Message Handler: Message id:/overseer/collection-queue-work/qn-0000000002 complete, response:{}
   [junit4]   2> 1965853 INFO  (qtp1059663210-24815) [n:127.0.0.1:46194_    ] o.a.s.h.a.CollectionsHandler Wait for new collection to be active for at most 30 seconds. Check all shard replicas
   [junit4]   2> 1965853 INFO  (qtp1059663210-24815) [n:127.0.0.1:46194_    ] o.a.s.s.HttpSolrCall [admin] webapp=null path=/admin/collections params={collection.configName=conf1&name=collection1&nrtReplicas=1&action=CREATE&numShards=2&createNodeSet=&stateFormat=2&wt=javabin&version=2} status=0 QTime=206
   [junit4]   2> 1965959 INFO  (TEST-ShardSplitTest.test-seed#[EB5D4C20932048AD]) [    ] o.a.s.c.AbstractFullDistribZkTestBase create jetty 1 in directory /x1/jenkins/jenkins-slave/workspace/Lucene-Solr-Tests-7.x/solr/build/solr-core/test/J0/temp/solr.cloud.api.collections.ShardSplitTest_EB5D4C20932048AD-001/shard-1-001 of type NRT
   [junit4]   2> 1965960 INFO  (TEST-ShardSplitTest.test-seed#[EB5D4C20932048AD]) [    ] o.e.j.s.Server jetty-9.4.11.v20180605; built: 2018-06-05T18:24:03.829Z; git: d5fc0523cfa96bfebfbda19606cad384d772f04c; jvm 1.8.0_172-b11
   [junit4]   2> 1965960 INFO  (TEST-ShardSplitTest.test-seed#[EB5D4C20932048AD]) [    ] o.e.j.s.session DefaultSessionIdManager workerName=node0
   [junit4]   2> 1965960 INFO  (TEST-ShardSplitTest.test-seed#[EB5D4C20932048AD]) [    ] o.e.j.s.session No SessionScavenger set, using defaults
   [junit4]   2> 1965960 INFO  (TEST-ShardSplitTest.test-seed#[EB5D4C20932048AD]) [    ] o.e.j.s.session node0 Scavenging every 600000ms
   [junit4]   2> 1965961 INFO  (TEST-ShardSplitTest.test-seed#[EB5D4C20932048AD]) [    ] o.e.j.s.h.ContextHandler Started o.e.j.s.ServletContextHandler@1f7aa2cb{/,null,AVAILABLE}
   [junit4]   2> 1965961 INFO  (TEST-ShardSplitTest.test-seed#[EB5D4C20932048AD]) [    ] o.e.j.s.AbstractConnector Started ServerConnector@7ad17774{HTTP/1.1,[http/1.1]}{127.0.0.1:32936}
   [junit4]   2> 1965961 INFO  (TEST-ShardSplitTest.test-seed#[EB5D4C20932048AD]) [    ] o.e.j.s.Server Started @1966004ms
   [junit4]   2> 1965962 INFO  (TEST-ShardSplitTest.test-seed#[EB5D4C20932048AD]) [    ] o.a.s.c.s.e.JettySolrRunner Jetty properties: {solr.data.dir=/x1/jenkins/jenkins-slave/workspace/Lucene-Solr-Tests-7.x/solr/build/solr-core/test/J0/temp/solr.cloud.api.collections.ShardSplitTest_EB5D4C20932048AD-001/tempDir-001/jetty1, solrconfig=solrconfig.xml, hostContext=/, hostPort=32936, coreRootDirectory=/x1/jenkins/jenkins-slave/workspace/Lucene-Solr-Tests-7.x/solr/build/solr-core/test/J0/temp/solr.cloud.api.collections.ShardSplitTest_EB5D4C20932048AD-001/shard-1-001/cores}
   [junit4]   2> 1965962 ERROR (TEST-ShardSplitTest.test-seed#[EB5D4C20932048AD]) [    ] o.a.s.u.StartupLoggingUtils Missing Java Option solr.log.dir. Logging may be missing or incomplete.
   [junit4]   2> 1965962 INFO  (TEST-ShardSplitTest.test-seed#[EB5D4C20932048AD]) [    ] o.a.s.s.SolrDispatchFilter Using logger factory org.apache.logging.slf4j.Log4jLoggerFactory
   [junit4]   2> 1965962 INFO  (TEST-ShardSplitTest.test-seed#[EB5D4C20932048AD]) [    ] o.a.s.s.SolrDispatchFilter  ___      _       Welcome to Apache Solr? version 7.5.0
   [junit4]   2> 1965962 INFO  (TEST-ShardSplitTest.test-seed#[EB5D4C20932048AD]) [    ] o.a.s.s.SolrDispatchFilter / __| ___| |_ _   Starting in cloud mode on port null
   [junit4]   2> 1965962 INFO  (TEST-ShardSplitTest.test-seed#[EB5D4C20932048AD]) [    ] o.a.s.s.SolrDispatchFilter \__ \/ _ \ | '_|  Install dir: null
   [junit4]   2> 1965962 INFO  (TEST-ShardSplitTest.test-seed#[EB5D4C20932048AD]) [    ] o.a.s.s.SolrDispatchFilter |___/\___/_|_|    Start time: 2018-09-03T19:58:52.279Z
   [junit4]   2> 1965963 INFO  (zkConnectionManagerCallback-10174-thread-1) [    ] o.a.s.c.c.ConnectionManager zkClient has connected
   [junit4]   2> 1965964 INFO  (TEST-ShardSplitTest.test-seed#[EB5D4C20932048AD]) [    ] o.a.s.s.SolrDispatchFilter Loading solr.xml from SolrHome (not found in ZooKeeper)
   [junit4]   2> 1965964 INFO  (TEST-ShardSplitTest.test-seed#[EB5D4C20932048AD]) [    ] o.a.s.c.SolrXmlConfig Loading container configuration from /x1/jenkins/jenkins-slave/workspace/Lucene-Solr-Tests-7.x/solr/build/solr-core/test/J0/temp/solr.cloud.api.collections.ShardSplitTest_EB5D4C20932048AD-001/shard-1-001/solr.xml
   [junit4]   2> 1965967 INFO  (TEST-ShardSplitTest.test-seed#[EB5D4C20932048AD]) [    ] o.a.s.c.SolrXmlConfig Configuration parameter autoReplicaFailoverWorkLoopDelay is ignored
   [junit4]   2> 1965967 INFO  (TEST-ShardSplitTest.test-seed#[EB5D4C20932048AD]) [    ] o.a.s.c.SolrXmlConfig Configuration parameter autoReplicaFailoverBadNodeExpiration is ignored
   [junit4]   2> 1965968 INFO  (TEST-ShardSplitTest.test-seed#[EB5D4C20932048AD]) [    ] o.a.s.c.SolrXmlConfig MBean server found: com.sun.jmx.mbeanserver.JmxMBeanServer@3d3a6d1c, but no JMX reporters were configured - adding default JMX reporter.
   [junit4]   2> 1966152 INFO  (TEST-ShardSplitTest.test-seed#[EB5D4C20932048AD]) [    ] o.a.s.c.ZkContainer Zookeeper client=127.0.0.1:43226/solr
   [junit4]   2> 1966153 INFO  (zkConnectionManagerCallback-10178-thread-1) [    ] o.a.s.c.c.ConnectionManager zkClient has connected
   [junit4]   2> 1966155 INFO  (zkConnectionManagerCallback-10180-thread-1) [    ] o.a.s.c.c.ConnectionManager zkClient has connected
   [junit4]   2> 1966160 INFO  (TEST-ShardSplitTest.test-seed#[EB5D4C20932048AD]) [    ] o.a.s.c.c.ZkStateReader Updated live nodes from ZooKeeper... (0) -> (1)
   [junit4]   2> 1966163 INFO  (TEST-ShardSplitTest.test-seed#[EB5D4C20932048AD]) [    ] o.a.s.c.TransientSolrCoreCacheDefault Allocating transient cache for 4 transient cores
   [junit4]   2> 1966163 INFO  (TEST-ShardSplitTest.test-seed#[EB5D4C20932048AD]) [    ] o.a.s.c.ZkController Register node as live in ZooKeeper:/live_nodes/127.0.0.1:32936_
   [junit4]   2> 1966164 DEBUG (OverseerStateUpdate-72273436008448004-127.0.0.1:46194_-n_0000000000) [n:127.0.0.1:46194_    ] o.a.s.c.Overseer processMessage: queueSize: 1, message = {
   [junit4]   2>   "operation":"downnode",
   [junit4]   2>   "node_name":"127.0.0.1:32936_"} current state version: 0
   [junit4]   2> 1966164 DEBUG (OverseerStateUpdate-72273436008448004-127.0.0.1:46194_-n_0000000000) [n:127.0.0.1:46194_    ] o.a.s.c.o.NodeMutator DownNode state invoked for node: 127.0.0.1:32936_
   [junit4]   2> 1966164 INFO  (zkCallback-10160-thread-1) [    ] o.a.s.c.c.ZkStateReader Updated live nodes from ZooKeeper... (1) -> (2)
   [junit4]   2> 1966164 INFO  (zkCallback-10153-thread-1) [    ] o.a.s.c.c.ZkStateReader Updated live nodes from ZooKeeper... (1) -> (2)
   [junit4]   2> 1966165 INFO  (zkCallback-10171-thread-1) [    ] o.a.s.c.c.ZkStateReader Updated live nodes from ZooKeeper... (1) -> (2)
   [junit4]   2> 1966165 INFO  (zkCallback-10179-thread-1) [    ] o.a.s.c.c.ZkStateReader Updated live nodes from ZooKeeper... (1) -> (2)
   [junit4]   2> 1966182 INFO  (zkConnectionManagerCallback-10187-thread-1) [    ] o.a.s.c.c.ConnectionManager zkClient has connected
   [junit4]   2> 1966183 INFO  (TEST-ShardSplitTest.test-seed#[EB5D4C20932048AD]) [    ] o.a.s.c.c.ZkStateReader Updated live nodes from ZooKeeper... (0) -> (2)
   [junit4]   2> 1966184 INFO  (TEST-ShardSplitTest.test-seed#[EB5D4C20932048AD]) [    ] o.a.s.c.s.i.ZkClientClusterStateProvider Cluster at 127.0.0.1:43226/solr ready
   [junit4]   2> 1966184 INFO  (TEST-ShardSplitTest.test-seed#[EB5D4C20932048AD]) [    ] o.a.s.h.a.MetricsHistoryHandler No .system collection, keeping metrics history in memory.
   [junit4]   2> 1966213 INFO  (TEST-ShardSplitTest.test-seed#[EB5D4C20932048AD]) [    ] o.a.s.m.r.SolrJmxReporter JMX monitoring for 'solr.node' (registry 'solr.node') enabled at server: com.sun.jmx.mbeanserver.JmxMBeanServer@3d3a6d1c
   [junit4]   2> 1966221 INFO  (TEST-ShardSplitTest.test-seed#[EB5D4C20932048AD]) [    ] o.a.s.m.r.SolrJmxReporter JMX monitoring for 'solr.jvm' (registry 'solr.jvm') enabled at server: com.sun.jmx.mbeanserver.JmxMBeanServer@3d3a6d1c
   [junit4]   2> 1966222 INFO  (TEST-ShardSplitTest.test-seed#[EB5D4C20932048AD]) [    ] o.a.s.m.r.SolrJmxReporter JMX monitoring for 'solr.jetty' (registry 'solr.jetty') enabled at server: com.sun.jmx.mbeanserver.JmxMBeanServer@3d3a6d1c
   [junit4]   2> 1966223 INFO  (TEST-ShardSplitTest.test-seed#[EB5D4C20932048AD]) [    ] o.a.s.c.CorePropertiesLocator Found 0 core definitions underneath /x1/jenkins/jenkins-slave/workspace/Lucene-Solr-Tests-7.x/solr/build/solr-core/test/J0/temp/solr.cloud.api.collections.ShardSplitTest_EB5D4C20932048AD-001/shard-1-001/cores
   [junit4]   2> 1966249 INFO  (qtp921922689-24867) [n:127.0.0.1:32936_    ] o.a.s.h.a.CollectionsHandler Invoked Collection Action :addreplica with params node=127.0.0.1:32936_&action=ADDREPLICA&collection=collection1&shard=shard2&type=NRT&wt=javabin&version=2 and sendToOCPQueue=true
   [junit4]   2> 1966250 DEBUG (OverseerCollectionConfigSetProcessor-72273436008448004-127.0.0.1:46194_-n_0000000000) [n:127.0.0.1:46194_    ] o.a.s.c.OverseerTaskProcessor Got 1 tasks from work-queue : [[org.apache.solr.cloud.OverseerTaskQueue$QueueEvent@2e684ed3]]
   [junit4]   2> 1966250 DEBUG (OverseerCollectionConfigSetProcessor-72273436008448004-127.0.0.1:46194_-n_0000000000) [n:127.0.0.1:46194_    ] o.a.s.c.OverseerTaskProcessor Marked task [/overseer/collection-queue-work/qn-0000000004] as running
   [junit4]   2> 1966250 DEBUG (OverseerCollectionConfigSetProcessor-72273436008448004-127.0.0.1:46194_-n_0000000000) [n:127.0.0.1:46194_    ] o.a.s.c.OverseerTaskProcessor Overseer Collection Message Handler: Get the message id:/overseer/collection-queue-work/qn-0000000004 message:{
   [junit4]   2>   "collection":"collection1",
   [junit4]   2>   "node":"127.0.0.1:32936_",
   [junit4]   2>   "shard":"shard2",
   [junit4]   2>   "type":"NRT",
   [junit4]   2>   "operation":"addreplica"}
   [junit4]   2> 1966250 DEBUG (OverseerThreadFactory-7916-thread-3-processing-n:127.0.0.1:46194_) [n:127.0.0.1:46194_    ] o.a.s.c.OverseerTaskProcessor Runner processing /overseer/collection-queue-work/qn-0000000004
   [junit4]   2> 1966250 DEBUG (OverseerThreadFactory-7916-thread-3-processing-n:127.0.0.1:46194_) [n:127.0.0.1:46194_ c:collection1 s:shard2  ] o.a.s.c.a.c.OverseerCollectionMessageHandler OverseerCollectionMessageHandler.processMessage : addreplica , {
   [junit4]   2>   "collection":"collection1",
   [junit4]   2>   "node":"127.0.0.1:32936_",
   [junit4]   2>   "shard":"shard2",
   [junit4]   2>   "type":"NRT",
   [junit4]   2>   "operation":"addreplica"}
   [junit4]   2> 1966250 DEBUG (OverseerCollectionConfigSetProcessor-72273436008448004-127.0.0.1:46194_-n_0000000000) [n:127.0.0.1:46194_    ] o.a.s.c.OverseerTaskProcessor Cleaning up work-queue. #Running tasks: 1
   [junit4]   2> 1966250 DEBUG (OverseerThreadFactory-7916-thread-3-processing-n:127.0.0.1:46194_) [n:127.0.0.1:46194_ c:collection1 s:shard2  ] o.a.s.c.a.c.AddReplicaCmd addReplica() : {
   [junit4]   2>   "collection":"collection1",
   [junit4]   2>   "node":"127.0.0.1:32936_",
   [junit4]   2>   "shard":"shard2",
   [junit4]   2>   "type":"NRT",
   [junit4]   2>   "operation":"addreplica"}
   [junit4]   2> 1966251 INFO  (OverseerCollectionConfigSetProcessor-72273436008448004-127.0.0.1:46194_-n_0000000000) [n:127.0.0.1:46194_    ] o.a.s.c.OverseerTaskQueue Response ZK path: /overseer/collection-queue-work/qnr-0000000002 doesn't exist.  Requestor may have disconnected from ZooKeeper
   [junit4]   2> 1966251 DEBUG (OverseerCollectionConfigSetProcessor-72273436008448004-127.0.0.1:46194_-n_0000000000) [n:127.0.0.1:46194_    ] o.a.s.c.OverseerTaskProcessor RunningTasks: [/overseer/collection-queue-work/qn-0000000004]
   [junit4]   2> 1966251 DEBUG (OverseerCollectionConfigSetProcessor-72273436008448004-127.0.0.1:46194_-n_0000000000) [n:127.0.0.1:46194_    ] o.a.s.c.OverseerTaskProcessor BlockedTasks: []
   [junit4]   2> 1966251 DEBUG (OverseerCollectionConfigSetProcessor-72273436008448004-127.0.0.1:46194_-n_0000000000) [n:127.0.0.1:46194_    ] o.a.s.c.OverseerTaskProcessor CompletedTasks: []
   [junit4]   2> 1966251 DEBUG (OverseerCollectionConfigSetProcessor-72273436008448004-127.0.0.1:46194_-n_0000000000) [n:127.0.0.1:46194_    ] o.a.s.c.OverseerTaskProcessor RunningZKTasks: [/overseer/collection-queue-work/qn-0000000004]
   [junit4]   2> 1966251 DEBUG (OverseerThreadFactory-7916-thread-3-processing-n:127.0.0.1:46194_) [n:127.0.0.1:46194_ c:collection1 s:shard2  ] o.a.s.c.a.c.Assign getNodesForNewReplicas() shard: shard2 , replicas : 1 , createNodeSet 127.0.0.1:32936_
   [junit4]   2> 1966252 INFO  (OverseerThreadFactory-7916-thread-3-processing-n:127.0.0.1:46194_) [n:127.0.0.1:46194_ c:collection1 s:shard2  ] o.a.s.c.a.c.AddReplicaCmd Node Identified 127.0.0.1:32936_ for creating new replica of shard shard2
   [junit4]   2> 1966255 INFO  (qtp921922689-24862) [n:127.0.0.1:32936_    x:collection1_shard2_replica_n41] o.a.s.h.a.CoreAdminOperation core create command qt=/admin/cores&collection.configName=conf1&name=collection1_shard2_replica_n41&action=CREATE&collection=collection1&shard=shard2&wt=javabin&version=2&replicaType=NRT
   [junit4]   2> 1966257 DEBUG (OverseerStateUpdate-72273436008448004-127.0.0.1:46194_-n_0000000000) [n:127.0.0.1:46194_    ] o.a.s.c.Overseer processMessage: queueSize: 2, message = {
   [junit4]   2>   "core":"collection1_shard2_replica_n41",
   [junit4]   2>   "roles":null,
   [junit4]   2>   "base_url":"http://127.0.0.1:32936",
   [junit4]   2>   "node_name":"127.0.0.1:32936_",
   [junit4]   2>   "numShards":"2",
   [junit4]   2>   "state":"down",
   [junit4]   2>   "shard":"shard2",
   [junit4]   2>   "collection":"collection1",
   [junit4]   2>   "type":"NRT",
   [junit4]   2>   "operation":"state"} current state version: 0
   [junit4]   2> 1966257 DEBUG (OverseerStateUpdate-72273436008448004-127.0.0.1:46194_-n_0000000000) [n:127.0.0.1:46194_    ] o.a.s.c.o.ReplicaMutator Update state numShards=2 message={
   [junit4]   2>   "core":"collection1_shard2_replica_n41",
   [junit4]   2>   "roles":null,
   [junit4]   2>   "base_url":"http://127.0.0.1:32936",
   [junit4]   2>   "node_name":"127.0.0.1:32936_",
   [junit4]   2>   "numShards":"2",
   [junit4]   2>   "state":"down",
   [junit4]   2>   "shard":"shard2",
   [junit4]   2>   "collection":"collection1",
   [junit4]   2>   "type":"NRT",
   [junit4]   2>   "operation":"state"}
   [junit4]   2> 1966257 DEBUG (OverseerStateUpdate-72273436008448004-127.0.0.1:46194_-n_0000000000) [n:127.0.0.1:46194_    ] o.a.s.c.o.ReplicaMutator Will update state for replica: core_node42:{"core":"collection1_shard2_replica_n41","base_url":"http://127.0.0.1:32936","node_name":"127.0.0.1:32936_","state":"down","type":"NRT"}
   [junit4]   2> 1966257 DEBUG (OverseerStateUpdate-72273436008448004-127.0.0.1:46194_-n_0000000000) [n:127.0.0.1:46194_    ] o.a.s.c.o.ReplicaMutator Collection is now: DocCollection(collection1//collections/collection1/state.json/0)={
   [junit4]   2>   "pullReplicas":"0",
   [junit4]   2>   "replicationFactor":"1",
   [junit4]   2>   "router":{"name":"compositeId"},
   [junit4]   2>   "maxShardsPerNode":"1",
   [junit4]   2>   "autoAddReplicas":"false",
   [junit4]   2>   "nrtReplicas":"1",
   [junit4]   2>   "tlogReplicas":"0",
   [junit4]   2>   "shards":{
   [junit4]   2>     "shard1":{
   [junit4]   2>       "range":"80000000-ffffffff",
   [junit4]   2>       "state":"active",
   [junit4]   2>       "replicas":{}},
   [junit4]   2>     "shard2":{
   [junit4]   2>       "range":"0-7fffffff",
   [junit4]   2>       "state":"active",
   [junit4]   2>       "replicas":{"core_node42":{
   [junit4]   2>           "core":"collection1_shard2_replica_n41",
   [junit4]   2>           "base_url":"http://127.0.0.1:32936",
   [junit4]   2>           "node_name":"127.0.0.1:32936_",
   [junit4]   2>           "state":"down",
   [junit4]   2>           "type":"NRT"}}}}}
   [junit4]   2> 1966358 DEBUG (OverseerStateUpdate-72273436008448004-127.0.0.1:46194_-n_0000000000) [n:127.0.0.1:46194_    ] o.a.s.c.o.ZkStateWriter going to update_collection /collections/collection1/state.json version: 0
   [junit4]   2> 1967268 INFO  (qtp921922689-24862) [n:127.0.0.1:32936_ c:collection1 s:shard2  x:collection1_shard2_replica_n41] o.a.s.c.SolrConfig Using Lucene MatchVersion: 7.5.0
   [junit4]   2> 1967295 INFO  (qtp921922689-24862) [n:127.0.0.1:32936_ c:collection1 s:shard2  x:collection1_shard2_replica_n41] o.a.s.s.IndexSchema [collection1_shard2_replica_n41] Schema name=test
   [junit4]   2> 1967361 INFO  (qtp921922689-24862) [n:127.0.0.1:32936_ c:collection1 s:shard2  x:collection1_shard2_replica_n41] o.a.s.s.IndexSchema Loaded schema test/1.6 with uniqueid field id
   [junit4]   2> 1967378 INFO  (qtp921922689-24862) [n:127.0.0.1:32936_ c:collection1 s:shard2  x:collection1_shard2_replica_n41] o.a.s.c.CoreContainer Creating SolrCore 'collection1_shard2_replica_n41' using configuration from collection collection1, trusted=true
   [junit4]   2> 1967379 INFO  (qtp921922689-24862) [n:127.0.0.1:32936_ c:collection1 s:shard2  x:collection1_shard2_replica_n41] o.a.s.m.r.SolrJmxReporter JMX monitoring for 'solr.core.collection1.shard2.replica_n41' (registry 'solr.core.collection1.shard2.replica_n41') enabled at server: com.sun.jmx.mbeanserver.JmxMBeanServer@3d3a6d1c
   [junit4]   2> 1967379 INFO  (qtp921922689-24862) [n:127.0.0.1:32936_ c:collection1 s:shard2  x:collection1_shard2_replica_n41] o.a.s.c.SolrCore solr.RecoveryStrategy.Builder
   [junit4]   2> 1967379 INFO  (qtp921922689-24862) [n:127.0.0.1:32936_ c:collection1 s:shard2  x:collection1_shard2_replica_n41] o.a.s.c.SolrCore [[collection1_shard2_replica_n41] ] Opening new SolrCore at [/x1/jenkins/jenkins-slave/workspace/Lucene-Solr-Tests-7.x/solr/build/solr-core/test/J0/temp/solr.cloud.api.collections.ShardSplitTest_EB5D4C20932048AD-001/shard-1-001/cores/collection1_shard2_replica_n41], dataDir=[/x1/jenkins/jenkins-slave/workspace/Lucene-Solr-Tests-7.x/solr/build/solr-core/test/J0/temp/solr.cloud.api.collections.ShardSplitTest_EB5D4C20932048AD-001/shard-1-001/cores/collection1_shard2_replica_n41/data/]
   [junit4]   2> 1967381 INFO  (qtp921922689-24862) [n:127.0.0.1:32936_ c:collection1 s:shard2  x:collection1_shard2_replica_n41] o.a.s.u.RandomMergePolicy RandomMergePolicy wrapping class org.apache.lucene.index.TieredMergePolicy: [TieredMergePolicy: maxMergeAtOnce=10, maxMergeAtOnceExplicit=44, maxMergedSegmentMB=5.8671875, floorSegmentMB=0.6455078125, forceMergeDeletesPctAllowed=3.156596477546907, segmentsPerTier=33.0, maxCFSSegmentSizeMB=8.796093022207999E12, noCFSRatio=0.12391314470352227, deletesPctAllowed=23.64230807239812
   [junit4]   2> 1967387 WARN  (qtp921922689-24862) [n:127.0.0.1:32936_ c:collection1 s:shard2  x:collection1_shard2_replica_n41] o.a.s.c.RequestHandlers INVALID paramSet a in requestHandler {type = requestHandler,name = /dump,class = DumpRequestHandler,attributes = {initParams=a, name=/dump, class=DumpRequestHandler},args = {defaults={a=A,b=B}}}
   [junit4]   2> 1967426 INFO  (qtp921922689-24862) [n:127.0.0.1:32936_ c:collection1 s:shard2  x:collection1_shard2_replica_n41] o.a.s.u.UpdateHandler Using UpdateLog implementation: org.apache.solr.update.UpdateLog
   [junit4]   2> 1967426 INFO  (qtp921922689-24862) [n:127.0.0.1:32936_ c:collection1 s:shard2  x:collection1_shard2_replica_n41] o.a.s.u.UpdateLog Initializing UpdateLog: dataDir= defaultSyncLevel=FLUSH numRecordsToKeep=100 maxNumLogsToKeep=10 numVersionBuckets=65536
   [junit4]   2> 1967427 INFO  (qtp921922689-24862) [n:127.0.0.1:32936_ c:collection1 s:shard2  x:collection1_shard2_replica_n41] o.a.s.u.CommitTracker Hard AutoCommit: disabled
   [junit4]   2> 1967427 INFO  (qtp921922689-24862) [n:127.0.0.1:32936_ c:collection1 s:shard2  x:collection1_shard2_replica_n41] o.a.s.u.CommitTracker Soft AutoCommit: disabled
   [junit4]   2> 1967428 INFO  (qtp921922689-24862) [n:127.0.0.1:32936_ c:collection1 s:shard2  x:collection1_shard2_replica_n41] o.a.s.u.RandomMergePolicy RandomMergePolicy wrapping class org.apache.lucene.index.TieredMergePolicy: [TieredMergePolicy: maxMergeAtOnce=42, maxMergeAtOnceExplicit=39, maxMergedSegmentMB=53.74609375, floorSegmentMB=1.0400390625, forceMergeDeletesPctAllowed=19.273842001038982, segmentsPerTier=50.0, maxCFSSegmentSizeMB=8.796093022207999E12, noCFSRatio=0.0, deletesPctAllowed=20.197418099478142
   [junit4]   2> 1967429 INFO  (qtp921922689-24862) [n:127.0.0.1:32936_ c:collection1 s:shard2  x:collection1_shard2_replica_n41] o.a.s.s.SolrIndexSearcher Opening [Searcher@3f50e0c4[collection1_shard2_replica_n41] main]
   [junit4]   2> 1967430 INFO  (qtp921922689-24862) [n:127.0.0.1:32936_ c:collection1 s:shard2  x:collection1_shard2_replica_n41] o.a.s.r.ManagedResourceStorage Configured ZooKeeperStorageIO with znodeBase: /configs/conf1
   [junit4]   2> 1967430 INFO  (qtp921922689-24862) [n:127.0.0.1:32936_ c:collection1 s:shard2  x:collection1_shard2_replica_n41] o.a.s.r.ManagedResourceStorage Loaded null at path _rest_managed.json using ZooKeeperStorageIO:path=/configs/conf1
   [junit4]   2> 1967430 INFO  (qtp921922689-24862) [n:127.0.0.1:32936_ c:collection1 s:shard2  x:collection1_shard2_replica_n41] o.a.s.h.ReplicationHandler Commits will be reserved for 10000ms.
   [junit4]   2> 1967430 INFO  (qtp921922689-24862) [n:127.0.0.1:32936_ c:collection1 s:shard2  x:collection1_shard2_replica_n41] o.a.s.u.UpdateLog Could not find max version in index or recent updates, using new clock 1610617699693494272
   [junit4]   2> 1967431 INFO  (searcherExecutor-7935-thread-1-processing-n:127.0.0.1:32936_ x:collection1_shard2_replica_n41 c:collection1 s:shard2) [n:127.0.0.1:32936_ c:collection1 s:shard2  x:collection1_shard2_replica_n41] o.a.s.c.SolrCore [collection1_shard2_replica_n41] Registered new searcher Searcher@3f50e0c4[collection1_shard2_replica_n41] main{ExitableDirectoryReader(UninvertingDirectoryReader())}
   [junit4]   2> 1967435 INFO  (qtp921922689-24862) [n:127.0.0.1:32936_ c:collection1 s:shard2  x:collection1_shard2_replica_n41] o.a.s.c.ZkShardTerms Successful update of terms at /collections/collection1/terms/shard2 to Terms{values={core_node42=0}, version=0}
   [junit4]   2> 1967438 INFO  (qtp921922689-24862) [n:127.0.0.1:32936_ c:collection1 s:shard2  x:collection1_shard2_replica_n41] o.a.s.c.ShardLeaderElectionContext Enough replicas found to continue.
   [junit4]   2> 1967438 INFO  (qtp921922689-24862) [n:127.0.0.1:32936_ c:collection1 s:shard2  x:collection1_shard2_replica_n41] o.a.s.c.ShardLeaderElectionContext I may be the new leader - try and sync
   [junit4]   2> 1967438 INFO  (qtp921922689-24862) [n:127.0.0.1:32936_ c:collection1 s:shard2  x:collection1_shard2_replica_n41] o.a.s.c.SyncStrategy Sync replicas to http://127.0.0.1:32936/collection1_shard2_replica_n41/
   [junit4]   2> 1967438 INFO  (qtp921922689-24862) [n:127.0.0.1:32936_ c:collection1 s:shard2  x:collection1_shard2_replica_n41] o.a.s.c.SyncStrategy Sync Success - now sync replicas to me
   [junit4]   2> 1967438 INFO  (qtp921922689-24862) [n:127.0.0.1:32936_ c:collection1 s:shard2  x:collection1_shard2_replica_n41] o.a.s.c.SyncStrategy http://127.0.0.1:32936/collection1_shard2_replica_n41/ has no replicas
   [junit4]   2> 1967438 INFO  (qtp921922689-24862) [n:127.0.0.1:32936_ c:collection1 s:shard2  x:collection1_shard2_replica_n41] o.a.s.c.ShardLeaderElectionContext Found all replicas participating in election, clear LIR
   [junit4]   2> 1967441 INFO  (qtp921922689-24862) [n:127.0.0.1:32936_ c:collection1 s:shard2  x:collection1_shard2_replica_n41] o.a.s.c.ShardLeaderElectionContext I am the new leader: http://127.0.0.1:32936/collection1_shard2_replica_n41/ shard2
   [junit4]   2> 1967442 DEBUG (OverseerStateUpdate-72273436008448004-127.0.0.1:46194_-n_0000000000) [n:127.0.0.1:46194_    ] o.a.s.c.Overseer processMessage: queueSize: 1, message = {
   [junit4]   2>   "operation":"leader",
   [junit4]   2>   "shard":"shard2",
   [junit4]   2>   "collection":"collection1",
   [junit4]   2>   "base_url":"http://127.0.0.1:32936",
   [junit4]   2>   "core":"collection1_shard2_replica_n41",
   [junit4]   2>   "state":"active"} current state version: 0
   [junit4]   2> 1967542 DEBUG (OverseerStateUpdate-72273436008448004-127.0.0.1:46194_-n_0000000000) [n:127.0.0.1:46194_    ] o.a.s.c.o.ZkStateWriter going to update_collection /collections/collection1/state.json version: 1
   [junit4]   2> 1967543 INFO  (qtp921922689-24862) [n:127.0.0.1:32936_ c:collection1 s:shard2  x:collection1_shard2_replica_n41] o.a.s.c.ZkController I am the leader, no recovery necessary
   [junit4]   2> 1967544 DEBUG (OverseerStateUpdate-72273436008448004-127.0.0.1:46194_-n_0000000000) [n:127.0.0.1:46194_    ] o.a.s.c.Overseer processMessage: queueSize: 1, message = {
   [junit4]   2>   "core":"collection1_shard2_replica_n41",
   [junit4]   2>   "core_node_name":"core_node42",
   [junit4]   2>   "roles":null,
   [junit4]   2>   "base_url":"http://127.0.0.1:32936",
   [junit4]   2>   "node_name":"127.0.0.1:32936_",
   [junit4]   2>   "numShards":"2",
   [junit4]   2>   "state":"active",
   [junit4]   2>   "shard":"shard2",
   [junit4]   2>   "collection":"collection1",
   [junit4]   2>   "type":"NRT",
   [junit4]   2>   "operation":"state"} current state version: 0
   [junit4]   2> 1967544 DEBUG (OverseerStateUpdate-72273436008448004-127.0.0.1:46194_-n_0000000000) [n:127.0.0.1:46194_    ] o.a.s.c.o.ReplicaMutator Update state numShards=2 message={
   [junit4]   2>   "core":"collection1_shard2_replica_n41",
   [junit4]   2>   "core_node_name":"core_node42",
   [junit4]   2>   "roles":null,
   [junit4]   2>   "base_url":"http://127.0.0.1:32936",
   [junit4]   2>   "node_name":"127.0.0.1:32936_",
   [junit4]   2>   "numShards":"2",
   [junit4]   2>   "state":"active",
   [junit4]   2>   "shard":"shard2",
   [junit4]   2>   "collection":"collection1",
   [junit4]   2>   "type":"NRT",
   [junit4]   2>   "operation":"state"}
   [junit4]   2> 1967544 DEBUG (OverseerStateUpdate-72273436008448004-127.0.0.1:46194_-n_0000000000) [n:127.0.0.1:46194_    ] o.a.s.c.o.ReplicaMutator Will update state for replica: core_node42:{"core":"collection1_shard2_replica_n41","base_url":"http://127.0.0.1:32936","node_name":"127.0.0.1:32936_","state":"active","type":"NRT","leader":"true"}
   [junit4]   2> 1967544 DEBUG (OverseerStateUpdate-72273436008448004-127.0.0.1:46194_-n_0000000000) [n:127.0.0.1:46194_    ] o.a.s.c.o.ReplicaMutator Collection is now: DocCollection(collection1//collections/collection1/state.json/2)={
   [junit4]   2>   "pullReplicas":"0",
   [junit4]   2>   "replicationFactor":"1",
   [junit4]   2>   "router":{"name":"compositeId"},
   [junit4]   2>   "maxShardsPerNode":"1",
   [junit4]   2>   "autoAddReplicas":"false",
   [junit4]   2>   "nrtReplicas":"1",
   [junit4]   2>   "tlogReplicas":"0",
   [junit4]   2>   "shards":{
   [junit4]   2>     "shard1":{
   [junit4]   2>       "range":"80000000-ffffffff",
   [junit4]   2>       "state":"active",
   [junit4]   2>       "replicas":{}},
   [junit4]   2>     "shard2":{
   [junit4]   2>       "range":"0-7fffffff",
   [junit4]   2>       "state":"active",
   [junit4]   2>       "replicas":{"core_node42":{
   [junit4]   2>           "core":"collection1_shard2_replica_n41",
   [junit4]   2>           "base_url":"http://127.0.0.1:32936",
   [junit4]   2>           "node_name":"127.0.0.1:32936_",
   [junit4]   2>           "state":"active",
   [junit4]   2>           "type":"NRT",
   [junit4]   2>           "leader":"true"}}}}}
   [junit4]   2> 1967545 INFO  (qtp921922689-24862) [n:127.0.0.1:32936_ c:collection1 s:shard2  x:collection1_shard2_replica_n41] o.a.s.s.HttpSolrCall [admin] webapp=null path=/admin/cores params={qt=/admin/cores&collection.configName=conf1&name=collection1_shard2_replica_n41&action=CREATE&collection=collection1&shard=shard2&wt=javabin&version=2&replicaType=NRT} status=0 QTime=1290
   [junit4]   2> 1967546 DEBUG (OverseerThreadFactory-7916-thread-3-processing-n:127.0.0.1:46194_) [n:127.0.0.1:46194_ c:collection1 s:shard2  ] o.a.s.c.OverseerTaskProcessor Completed task:[/overseer/collection-queue-work/qn-0000000004]
   [junit4]   2> 1967547 DEBUG (OverseerThreadFactory-7916-thread-3-processing-n:127.0.0.1:46194_) [n:127.0.0.1:46194_ c:collection1 s:shard2  ] o.a.s.c.OverseerTaskProcessor Marked task [/overseer/collection-queue-work/qn-0000000004] as completed.
   [junit4]   2> 1967547 DEBUG (OverseerThreadFactory-7916-thread-3-processing-n:127.0.0.1:46194_) [n:127.0.0.1:46194_ c:collection1 s:shard2  ] o.a.s.c.OverseerTaskProcessor RunningTasks: []
   [junit4]   2> 1967547 DEBUG (OverseerThreadFactory-7916-thread-3-processing-n:127.0.0.1:46194_) [n:127.0.0.1:46194_ c:collection1 s:shard2  ] o.a.s.c.OverseerTaskProcessor BlockedTasks: []
   [junit4]   2> 1967547 DEBUG (OverseerThreadFactory-7916-thread-3-processing-n:127.0.0.1:46194_) [n:127.0.0.1:46194_ c:collection1 s:shard2  ] o.a.s.c.OverseerTaskProcessor CompletedTasks: [/overseer/collection-queue-work/qn-0000000004]
   [junit4]   2> 1967547 DEBUG (OverseerThreadFactory-7916-thread-3-processing-n:127.0.0.1:46194_) [n:127.0.0.1:46194_ c:collection1 s:shard2  ] o.a.s.c.OverseerTaskProcessor RunningZKTasks: [/overseer/collection-queue-work/qn-0000000004]
   [junit4]   2> 1967547 DEBUG (OverseerThreadFactory-7916-thread-3-processing-n:127.0.0.1:46194_) [n:127.0.0.1:46194_ c:collection1 s:shard2  ] o.a.s.c.OverseerTaskProcessor Overseer Collection Message Handler: Message id:/overseer/collection-queue-work/qn-0000000004 complete, response:{success={127.0.0.1:32936_={responseHeader={status=0,QTime=1290},core=collection1_shard2_replica_n41}}}
   [junit4]   2> 1967547 INFO  (qtp921922689-24867) [n:127.0.0.1:32936_ c:collection1   ] o.a.s.s.HttpSolrCall [admin] webapp=null path=/admin/collections params={node=127.0.0.1:32936_&action=ADDREPLICA&collection=collection1&shard=shard2&type=NRT&wt=javabin&version=2} status=0 QTime=1298
   [junit4]   2> 1967645 DEBUG (OverseerStateUpdate-72273436008448004-127.0.0.1:46194_-n_0000000000) [n:127.0.0.1:46194_    ] o.a.s.c.o.ZkStateWriter going to update_collection /collections/collection1/state.json version: 2
   [junit4]   2> 1967645 INFO  (zkCallback-10179-thread-1) [    ] o.a.s.c.c.ZkStateReader A cluster state change: [WatchedEvent state:SyncConnected type:NodeDataChanged path:/collections/collection1/state.json] for collection [collection1] has occurred - updating... (live nodes size: [2])
   [junit4]   2> 1967654 INFO  (TEST-ShardSplitTest.test-seed#[EB5D4C20932048AD]) [    ] o.a.s.c.AbstractFullDistribZkTestBase create jetty 2 in directory /x1/jenkins/jenkins-slave/workspace/Lucene-Solr-Tests-7.x/solr/build/solr-core/test/J0/temp/solr.cloud.api.collections.ShardSplitTest_EB5D4C20932048AD-001/shard-2-001 of type NRT
   [junit4]   2> 1967654 INFO  (TEST-ShardSplitTest.test-seed#[EB5D4C20932048AD]) [    ] o.e.j.s.Server jetty-9.4.11.v20180605; built: 2018-06-05T18:24:03.829Z; git: d5fc0523cfa96bfebfbda19606cad384d772f04c; jvm 1.8.0_172-b11
   [junit4]   2> 1967655 INFO  (TEST-ShardSplitTest.test-seed#[EB5D4C20932048AD]) [    ] o.e.j.s.session DefaultSessionIdManager workerName=node0
   [junit4]   2> 1967655 INFO  (TEST-ShardSplitTest.test-seed#[EB5D4C20932048AD]) [    ] o.e.j.s.session No SessionScavenger set, using defaults
   [junit4]   2> 1967655 INFO  (TEST-ShardSplitTest.test-seed#[EB5D4C20932048AD]) [    ] o.e.j.s.session node0 Scavenging every 660000ms
   [junit4]   2> 1967656 INFO  (TEST-ShardSplitTest.test-seed#[EB5D4C20932048AD]) [    ] o.e.j.s.h.ContextHandler Started o.e.j.s.ServletContextHandler@7acffbdd{/,null,AVAILABLE}
   [junit4]   2> 1967656 INFO  (TEST-ShardSplitTest.test-seed#[EB5D4C20932048AD]) [    ] o.e.j.s.AbstractConnector Started ServerConnector@66aa1bbb{HTTP/1.1,[http/1.1]}{127.0.0.1:39394}
   [junit4]   2> 1967657 INFO  (TEST-ShardSplitTest.test-seed#[EB5D4C20932048AD]) [    ] o.e.j.s.Server Started @1967700ms
   [junit4]   2> 1967657 INFO  (TEST-ShardSplitTest.test-seed#[EB5D4C20932048AD]) [    ] o.a.s.c.s.e.JettySolrRunner Jetty properties: {solr.data.dir=/x1/jenkins/jenkins-slave/workspace/Lucene-Solr-Tests-7.x/solr/build/solr-core/test/J0/temp/solr.cloud.api.collections.ShardSplitTest_EB5D4C20932048AD-001/tempDir-001/jetty2, replicaType=NRT, solrconfig=solrconfig.xml, hostContext=/, hostPort=39394, coreRootDirectory=/x1/jenkins/jenkins-slave/workspace/Lucene-Solr-Tests-7.x/solr/build/solr-core/test/J0/../../../../../../../../../../x1/jenkins/jenkins-slave/workspace/Lucene-Solr-Tests-7.x/solr/build/solr-core/test/J0/temp/solr.cloud.api.collections.ShardSplitTest_EB5D4C20932048AD-001/shard-2-001/cores}
   [junit4]   2> 1967658 ERROR (TEST-ShardSplitTest.test-seed#[EB5D4C20932048AD]) [    ] o.a.s.u.StartupLoggingUtils Missing Java Option solr.log.dir. Logging may be missing or incomplete.
   [junit4]   2> 1967658 INFO  (TEST-ShardSplitTest.test-seed#[EB5D4C20932048AD]) [    ] o.a.s.s.SolrDispatchFilter Using logger factory org.apache.logging.slf4j.Log4jLoggerFactory
   [junit4]   2> 1967658 INFO  (TEST-ShardSplitTest.test-seed#[EB5D4C20932048AD]) [    ] o.a.s.s.SolrDispatchFilter  ___      _       Welcome to Apache Solr? version 7.5.0
   [junit4]   2> 1967658 INFO  (TEST-ShardSplitTest.test-seed#[EB5D4C20932048AD]) [    ] o.a.s.s.SolrDispatchFilter / __| ___| |_ _   Starting in cloud mode on port null
   [junit4]   2> 1967658 INFO  (TEST-ShardSplitTest.test-seed#[EB5D4C20932048AD]) [    ] o.a.s.s.SolrDispatchFilter \__ \/ _ \ | '_|  Install dir: null
   [junit4]   2> 1967658 INFO  (TEST-ShardSplitTest.test-seed#[EB5D4C20932048AD]) [    ] o.a.s.s.SolrDispatchFilter |___/\___/_|_|    Start time: 2018-09-03T19:58:53.975Z
   [junit4]   2> 1967660 INFO  (zkConnectionManagerCallback-10190-thread-1) [    ] o.a.s.c.c.ConnectionManager zkClient has connected
   [junit4]   2> 1967660 INFO  (TEST-ShardSplitTest.test-seed#[EB5D4C20932048AD]) [    ] o.a.s.s.SolrDispatchFilter Loading solr.xml from SolrHome (not found in ZooKeeper)
   [junit4]   2> 1967660 INFO  (TEST-ShardSplitTest.test-seed#[EB5D4C20932048AD]) [    ] o.a.s.c.SolrXmlConfig Loading container configuration from /x1/jenkins/jenkins-slave/workspace/Lucene-Solr-Tests-7.x/solr/build/solr-core/test/J0/temp/solr.cloud.api.collections.ShardSplitTest_EB5D4C20932048AD-001/shard-2-001/solr.xml
   [junit4]   2> 1967664 INFO  (TEST-ShardSplitTest.test-seed#[EB5D4C20932048AD]) [    ] o.a.s.c.SolrXmlConfig Configuration parameter autoReplicaFailoverWorkLoopDelay is ignored
   [junit4]   2> 1967664 INFO  (TEST-ShardSplitTest.test-seed#[EB5D4C20932048AD]) [    ] o.a.s.c.SolrXmlConfig Configuration parameter autoReplicaFailoverBadNodeExpiration is ignored
   [junit4]   2> 1967665 INFO  (TEST-ShardSplitTest.test-seed#[EB5D4C20932048AD]) [    ] o.a.s.c.SolrXmlConfig MBean server found: com.sun.jmx.mbeanserver.JmxMBeanServer@3d3a6d1c, but no JMX reporters were configured - adding default JMX reporter.
   [junit4]   2> 1967924 INFO  (TEST-ShardSplitTest.test-seed#[EB5D4C20932048AD]) [    ] o.a.s.c.ZkContainer Zookeeper client=127.0.0.1:43226/solr
   [junit4]   2> 1967926 INFO  (zkConnectionManagerCallback-10194-thread-1) [    ] o.a.s.c.c.ConnectionManager zkClient has connected
   [junit4]   2> 1967927 INFO  (zkConnectionManagerCallback-10196-thread-1) [    ] o.a.s.c.c.ConnectionManager zkClient has connected
   [junit4]   2> 1967936 INFO  (TEST-ShardSplitTest.test-seed#[EB5D4C20932048AD]) [    ] o.a.s.c.c.ZkStateReader Updated live nodes from ZooKeeper... (0) -> (2)
   [junit4]   2> 1967940 INFO  (TEST-ShardSplitTest.test-seed#[EB5D4C20932048AD]) [    ] o.a.s.c.TransientSolrCoreCacheDefault Allocating transient cache for 4 transient cores
   [junit4]   2> 1967940 INFO  (TEST-ShardSplitTest.test-seed#[EB5D4C20932048AD]) [    ] o.a.s.c.ZkController Register node as live in ZooKeeper:/live_nodes/127.0.0.1:39394_
   [junit4]   2> 1967941 DEBUG (OverseerStateUpdate-72273436008448004-127.0.0.1:46194_-n_0000000000) [n:127.0.0.1:46194_    ] o.a.s.c.Overseer processMessage: queueSize: 1, message = {
   [junit4]   2>   "operation":"downnode",
   [junit4]   2>   "node_name":"127.0.0.1:39394_"} current state version: 0
   [junit4]   2> 1967941 DEBUG (OverseerStateUpdate-72273436008448004-127.0.0.1:46194_-n_0000000000) [n:127.0.0.1:46194_    ] o.a.s.c.o.NodeMutator DownNode state invoked for node: 127.0.0.1:39394_
   [junit4]   2> 1967941 INFO  (zkCallback-10179-thread-1) [    ] o.a.s.c.c.ZkStateReader Updated live nodes from ZooKeeper... (2) -> (3)
   [junit4]   2> 1967942 INFO  (zkCallback-10160-thread-1) [    ] o.a.s.c.c.ZkStateReader Updated live nodes from ZooKeeper... (2) -> (3)
   [junit4]   2> 1967947 INFO  (zkCallback-10171-thread-1) [    ] o.a.s.c.c.ZkStateReader Updated live nodes from ZooKeeper... (2) -> (3)
   [junit4]   2> 1967948 INFO  (zkCallback-10153-thread-1) [    ] o.a.s.c.c.ZkStateReader Updated live nodes from ZooKeeper... (2) -> (3)
   [junit4]   2> 196

[...truncated too long message...]

eck:
[loadresource] Do not set property disallowed.ivy.jars.list as its length is 0.

-ivy-fail-disallowed-ivy-version:

ivy-fail:

ivy-fail:

ivy-configure:
[ivy:configure] :: loading settings :: file = /x1/jenkins/jenkins-slave/workspace/Lucene-Solr-Tests-7.x/lucene/top-level-ivy-settings.xml

resolve:

ivy-availability-check:
[loadresource] Do not set property disallowed.ivy.jars.list as its length is 0.

-ivy-fail-disallowed-ivy-version:

ivy-fail:

ivy-configure:
[ivy:configure] :: loading settings :: file = /x1/jenkins/jenkins-slave/workspace/Lucene-Solr-Tests-7.x/lucene/top-level-ivy-settings.xml

resolve:

ivy-availability-check:
[loadresource] Do not set property disallowed.ivy.jars.list as its length is 0.

-ivy-fail-disallowed-ivy-version:

ivy-fail:

ivy-fail:

ivy-configure:
[ivy:configure] :: loading settings :: file = /x1/jenkins/jenkins-slave/workspace/Lucene-Solr-Tests-7.x/lucene/top-level-ivy-settings.xml

resolve:

ivy-availability-check:
[loadresource] Do not set property disallowed.ivy.jars.list as its length is 0.

-ivy-fail-disallowed-ivy-version:

ivy-fail:

ivy-configure:
[ivy:configure] :: loading settings :: file = /x1/jenkins/jenkins-slave/workspace/Lucene-Solr-Tests-7.x/lucene/top-level-ivy-settings.xml

resolve:

ivy-availability-check:
[loadresource] Do not set property disallowed.ivy.jars.list as its length is 0.

-ivy-fail-disallowed-ivy-version:

ivy-fail:

ivy-fail:

ivy-configure:
[ivy:configure] :: loading settings :: file = /x1/jenkins/jenkins-slave/workspace/Lucene-Solr-Tests-7.x/lucene/top-level-ivy-settings.xml

resolve:

ivy-availability-check:
[loadresource] Do not set property disallowed.ivy.jars.list as its length is 0.

-ivy-fail-disallowed-ivy-version:

ivy-fail:

ivy-fail:

ivy-configure:
[ivy:configure] :: loading settings :: file = /x1/jenkins/jenkins-slave/workspace/Lucene-Solr-Tests-7.x/lucene/top-level-ivy-settings.xml

resolve:

ivy-availability-check:
[loadresource] Do not set property disallowed.ivy.jars.list as its length is 0.

-ivy-fail-disallowed-ivy-version:

ivy-fail:

ivy-fail:

ivy-configure:
[ivy:configure] :: loading settings :: file = /x1/jenkins/jenkins-slave/workspace/Lucene-Solr-Tests-7.x/lucene/top-level-ivy-settings.xml

resolve:

ivy-availability-check:
[loadresource] Do not set property disallowed.ivy.jars.list as its length is 0.

-ivy-fail-disallowed-ivy-version:

ivy-fail:

ivy-fail:

ivy-configure:
[ivy:configure] :: loading settings :: file = /x1/jenkins/jenkins-slave/workspace/Lucene-Solr-Tests-7.x/lucene/top-level-ivy-settings.xml

resolve:

ivy-availability-check:
[loadresource] Do not set property disallowed.ivy.jars.list as its length is 0.

-ivy-fail-disallowed-ivy-version:

ivy-fail:

ivy-fail:

ivy-configure:
[ivy:configure] :: loading settings :: file = /x1/jenkins/jenkins-slave/workspace/Lucene-Solr-Tests-7.x/lucene/top-level-ivy-settings.xml

resolve:

ivy-availability-check:
[loadresource] Do not set property disallowed.ivy.jars.list as its length is 0.

-ivy-fail-disallowed-ivy-version:

ivy-fail:

ivy-fail:

ivy-configure:
[ivy:configure] :: loading settings :: file = /x1/jenkins/jenkins-slave/workspace/Lucene-Solr-Tests-7.x/lucene/top-level-ivy-settings.xml

resolve:

ivy-availability-check:
[loadresource] Do not set property disallowed.ivy.jars.list as its length is 0.

-ivy-fail-disallowed-ivy-version:

ivy-fail:

ivy-fail:

ivy-configure:
[ivy:configure] :: loading settings :: file = /x1/jenkins/jenkins-slave/workspace/Lucene-Solr-Tests-7.x/lucene/top-level-ivy-settings.xml

resolve:

ivy-availability-check:
[loadresource] Do not set property disallowed.ivy.jars.list as its length is 0.

-ivy-fail-disallowed-ivy-version:

ivy-fail:

ivy-fail:

ivy-configure:
[ivy:configure] :: loading settings :: file = /x1/jenkins/jenkins-slave/workspace/Lucene-Solr-Tests-7.x/lucene/top-level-ivy-settings.xml

resolve:

ivy-availability-check:
[loadresource] Do not set property disallowed.ivy.jars.list as its length is 0.

-ivy-fail-disallowed-ivy-version:

ivy-fail:

ivy-fail:

ivy-configure:
[ivy:configure] :: loading settings :: file = /x1/jenkins/jenkins-slave/workspace/Lucene-Solr-Tests-7.x/lucene/top-level-ivy-settings.xml

resolve:

ivy-availability-check:
[loadresource] Do not set property disallowed.ivy.jars.list as its length is 0.

-ivy-fail-disallowed-ivy-version:

ivy-fail:

ivy-fail:

ivy-configure:
[ivy:configure] :: loading settings :: file = /x1/jenkins/jenkins-slave/workspace/Lucene-Solr-Tests-7.x/lucene/top-level-ivy-settings.xml

resolve:

jar-checksums:
    [mkdir] Created dir: /x1/jenkins/jenkins-slave/workspace/Lucene-Solr-Tests-7.x/solr/null1610383409
     [copy] Copying 239 files to /x1/jenkins/jenkins-slave/workspace/Lucene-Solr-Tests-7.x/solr/null1610383409
   [delete] Deleting directory /x1/jenkins/jenkins-slave/workspace/Lucene-Solr-Tests-7.x/solr/null1610383409

check-working-copy:
[ivy:cachepath] :: resolving dependencies :: org.eclipse.jgit#org.eclipse.jgit-caller;working
[ivy:cachepath] 	confs: [default]
[ivy:cachepath] 	found org.eclipse.jgit#org.eclipse.jgit;4.6.0.201612231935-r in public
[ivy:cachepath] 	found com.jcraft#jsch;0.1.53 in public
[ivy:cachepath] 	found com.googlecode.javaewah#JavaEWAH;1.1.6 in public
[ivy:cachepath] 	found org.apache.httpcomponents#httpclient;4.3.6 in public
[ivy:cachepath] 	found org.apache.httpcomponents#httpcore;4.3.3 in public
[ivy:cachepath] 	found commons-logging#commons-logging;1.1.3 in public
[ivy:cachepath] 	found commons-codec#commons-codec;1.6 in public
[ivy:cachepath] 	found org.slf4j#slf4j-api;1.7.2 in public
[ivy:cachepath] :: resolution report :: resolve 20ms :: artifacts dl 1ms
	---------------------------------------------------------------------
	|                  |            modules            ||   artifacts   |
	|       conf       | number| search|dwnlded|evicted|| number|dwnlded|
	---------------------------------------------------------------------
	|      default     |   8   |   0   |   0   |   0   ||   8   |   0   |
	---------------------------------------------------------------------
[wc-checker] Initializing working copy...
[wc-checker] SLF4J: Failed to load class "org.slf4j.impl.StaticLoggerBinder".
[wc-checker] SLF4J: Defaulting to no-operation (NOP) logger implementation
[wc-checker] SLF4J: See http://www.slf4j.org/codes.html#StaticLoggerBinder for further details.
[wc-checker] Checking working copy status...

-jenkins-base:

BUILD SUCCESSFUL
Total time: 92 minutes 38 seconds
Archiving artifacts
java.lang.InterruptedException: no matches found within 10000
	at hudson.FilePath$34.hasMatch(FilePath.java:2678)
	at hudson.FilePath$34.invoke(FilePath.java:2557)
	at hudson.FilePath$34.invoke(FilePath.java:2547)
	at hudson.FilePath$FileCallableWrapper.call(FilePath.java:2918)
Also:   hudson.remoting.Channel$CallSiteStackTrace: Remote call to lucene
		at hudson.remoting.Channel.attachCallSiteStackTrace(Channel.java:1741)
		at hudson.remoting.UserRequest$ExceptionResponse.retrieve(UserRequest.java:357)
		at hudson.remoting.Channel.call(Channel.java:955)
		at hudson.FilePath.act(FilePath.java:1036)
		at hudson.FilePath.act(FilePath.java:1025)
		at hudson.FilePath.validateAntFileMask(FilePath.java:2547)
		at hudson.tasks.ArtifactArchiver.perform(ArtifactArchiver.java:243)
		at hudson.tasks.BuildStepCompatibilityLayer.perform(BuildStepCompatibilityLayer.java:81)
		at hudson.tasks.BuildStepMonitor$1.perform(BuildStepMonitor.java:20)
		at hudson.model.AbstractBuild$AbstractBuildExecution.perform(AbstractBuild.java:744)
		at hudson.model.AbstractBuild$AbstractBuildExecution.performAllBuildSteps(AbstractBuild.java:690)
		at hudson.model.Build$BuildExecution.post2(Build.java:186)
		at hudson.model.AbstractBuild$AbstractBuildExecution.post(AbstractBuild.java:635)
		at hudson.model.Run.execute(Run.java:1819)
		at hudson.model.FreeStyleBuild.run(FreeStyleBuild.java:43)
		at hudson.model.ResourceController.execute(ResourceController.java:97)
		at hudson.model.Executor.run(Executor.java:429)
Caused: hudson.FilePath$TunneledInterruptedException
	at hudson.FilePath$FileCallableWrapper.call(FilePath.java:2920)
	at hudson.remoting.UserRequest.perform(UserRequest.java:212)
	at hudson.remoting.UserRequest.perform(UserRequest.java:54)
	at hudson.remoting.Request$2.run(Request.java:369)
	at hudson.remoting.InterceptingExecutorService$1.call(InterceptingExecutorService.java:72)
	at java.util.concurrent.FutureTask.run(FutureTask.java:266)
	at java.util.concurrent.ThreadPoolExecutor.runWorker(ThreadPoolExecutor.java:1142)
	at java.util.concurrent.ThreadPoolExecutor$Worker.run(ThreadPoolExecutor.java:617)
	at java.lang.Thread.run(Thread.java:748)
Caused: java.lang.InterruptedException: java.lang.InterruptedException: no matches found within 10000
	at hudson.FilePath.act(FilePath.java:1038)
	at hudson.FilePath.act(FilePath.java:1025)
	at hudson.FilePath.validateAntFileMask(FilePath.java:2547)
	at hudson.tasks.ArtifactArchiver.perform(ArtifactArchiver.java:243)
	at hudson.tasks.BuildStepCompatibilityLayer.perform(BuildStepCompatibilityLayer.java:81)
	at hudson.tasks.BuildStepMonitor$1.perform(BuildStepMonitor.java:20)
	at hudson.model.AbstractBuild$AbstractBuildExecution.perform(AbstractBuild.java:744)
	at hudson.model.AbstractBuild$AbstractBuildExecution.performAllBuildSteps(AbstractBuild.java:690)
	at hudson.model.Build$BuildExecution.post2(Build.java:186)
	at hudson.model.AbstractBuild$AbstractBuildExecution.post(AbstractBuild.java:635)
	at hudson.model.Run.execute(Run.java:1819)
	at hudson.model.FreeStyleBuild.run(FreeStyleBuild.java:43)
	at hudson.model.ResourceController.execute(ResourceController.java:97)
	at hudson.model.Executor.run(Executor.java:429)
No artifacts found that match the file pattern "**/*.events,heapdumps/**,**/hs_err_pid*". Configuration error?
Recording test results
Build step 'Publish JUnit test result report' changed build result to UNSTABLE
Email was triggered for: Unstable (Test Failures)
Sending email for trigger: Unstable (Test Failures)

Mime
View raw message