lucene-dev mailing list archives

Site index · List index
Message view « Date » · « Thread »
Top « Date » · « Thread »
From Policeman Jenkins Server <jenk...@thetaphi.de>
Subject [JENKINS] Lucene-Solr-master-Linux (64bit/jdk-10.0.1) - Build # 22780 - Unstable!
Date Sat, 01 Sep 2018 03:10:59 GMT
Build: https://jenkins.thetaphi.de/job/Lucene-Solr-master-Linux/22780/
Java: 64bit/jdk-10.0.1 -XX:+UseCompressedOops -XX:+UseParallelGC

2 tests failed.
FAILED:  org.apache.solr.cloud.autoscaling.IndexSizeTriggerTest.testMixedBounds

Error Message:
expected:<MERGESHARDS> but was:<SPLITSHARD>

Stack Trace:
java.lang.AssertionError: expected:<MERGESHARDS> but was:<SPLITSHARD>
	at __randomizedtesting.SeedInfo.seed([35E32909679F42CC:3F6096A42A244996]:0)
	at org.junit.Assert.fail(Assert.java:93)
	at org.junit.Assert.failNotEquals(Assert.java:647)
	at org.junit.Assert.assertEquals(Assert.java:128)
	at org.junit.Assert.assertEquals(Assert.java:147)
	at org.apache.solr.cloud.autoscaling.IndexSizeTriggerTest.testMixedBounds(IndexSizeTriggerTest.java:669)
	at java.base/jdk.internal.reflect.NativeMethodAccessorImpl.invoke0(Native Method)
	at java.base/jdk.internal.reflect.NativeMethodAccessorImpl.invoke(NativeMethodAccessorImpl.java:62)
	at java.base/jdk.internal.reflect.DelegatingMethodAccessorImpl.invoke(DelegatingMethodAccessorImpl.java:43)
	at java.base/java.lang.reflect.Method.invoke(Method.java:564)
	at com.carrotsearch.randomizedtesting.RandomizedRunner.invoke(RandomizedRunner.java:1737)
	at com.carrotsearch.randomizedtesting.RandomizedRunner$8.evaluate(RandomizedRunner.java:934)
	at com.carrotsearch.randomizedtesting.RandomizedRunner$9.evaluate(RandomizedRunner.java:970)
	at com.carrotsearch.randomizedtesting.RandomizedRunner$10.evaluate(RandomizedRunner.java:984)
	at com.carrotsearch.randomizedtesting.rules.SystemPropertiesRestoreRule$1.evaluate(SystemPropertiesRestoreRule.java:57)
	at org.apache.lucene.util.TestRuleSetupTeardownChained$1.evaluate(TestRuleSetupTeardownChained.java:49)
	at org.apache.lucene.util.AbstractBeforeAfterRule$1.evaluate(AbstractBeforeAfterRule.java:45)
	at org.apache.lucene.util.TestRuleThreadAndTestName$1.evaluate(TestRuleThreadAndTestName.java:48)
	at org.apache.lucene.util.TestRuleIgnoreAfterMaxFailures$1.evaluate(TestRuleIgnoreAfterMaxFailures.java:64)
	at org.apache.lucene.util.TestRuleMarkFailure$1.evaluate(TestRuleMarkFailure.java:47)
	at com.carrotsearch.randomizedtesting.rules.StatementAdapter.evaluate(StatementAdapter.java:36)
	at com.carrotsearch.randomizedtesting.ThreadLeakControl$StatementRunner.run(ThreadLeakControl.java:368)
	at com.carrotsearch.randomizedtesting.ThreadLeakControl.forkTimeoutingTask(ThreadLeakControl.java:817)
	at com.carrotsearch.randomizedtesting.ThreadLeakControl$3.evaluate(ThreadLeakControl.java:468)
	at com.carrotsearch.randomizedtesting.RandomizedRunner.runSingleTest(RandomizedRunner.java:943)
	at com.carrotsearch.randomizedtesting.RandomizedRunner$5.evaluate(RandomizedRunner.java:829)
	at com.carrotsearch.randomizedtesting.RandomizedRunner$6.evaluate(RandomizedRunner.java:879)
	at com.carrotsearch.randomizedtesting.RandomizedRunner$7.evaluate(RandomizedRunner.java:890)
	at com.carrotsearch.randomizedtesting.rules.StatementAdapter.evaluate(StatementAdapter.java:36)
	at com.carrotsearch.randomizedtesting.rules.SystemPropertiesRestoreRule$1.evaluate(SystemPropertiesRestoreRule.java:57)
	at org.apache.lucene.util.AbstractBeforeAfterRule$1.evaluate(AbstractBeforeAfterRule.java:45)
	at com.carrotsearch.randomizedtesting.rules.StatementAdapter.evaluate(StatementAdapter.java:36)
	at org.apache.lucene.util.TestRuleStoreClassName$1.evaluate(TestRuleStoreClassName.java:41)
	at com.carrotsearch.randomizedtesting.rules.NoShadowingOrOverridesOnMethodsRule$1.evaluate(NoShadowingOrOverridesOnMethodsRule.java:40)
	at com.carrotsearch.randomizedtesting.rules.NoShadowingOrOverridesOnMethodsRule$1.evaluate(NoShadowingOrOverridesOnMethodsRule.java:40)
	at com.carrotsearch.randomizedtesting.rules.StatementAdapter.evaluate(StatementAdapter.java:36)
	at com.carrotsearch.randomizedtesting.rules.StatementAdapter.evaluate(StatementAdapter.java:36)
	at org.apache.lucene.util.TestRuleAssertionsRequired$1.evaluate(TestRuleAssertionsRequired.java:53)
	at org.apache.lucene.util.TestRuleMarkFailure$1.evaluate(TestRuleMarkFailure.java:47)
	at org.apache.lucene.util.TestRuleIgnoreAfterMaxFailures$1.evaluate(TestRuleIgnoreAfterMaxFailures.java:64)
	at org.apache.lucene.util.TestRuleIgnoreTestSuites$1.evaluate(TestRuleIgnoreTestSuites.java:54)
	at com.carrotsearch.randomizedtesting.rules.StatementAdapter.evaluate(StatementAdapter.java:36)
	at com.carrotsearch.randomizedtesting.ThreadLeakControl$StatementRunner.run(ThreadLeakControl.java:368)
	at java.base/java.lang.Thread.run(Thread.java:844)


FAILED:  org.apache.solr.cloud.autoscaling.IndexSizeTriggerTest.testMixedBounds

Error Message:
expected:<MERGESHARDS> but was:<SPLITSHARD>

Stack Trace:
java.lang.AssertionError: expected:<MERGESHARDS> but was:<SPLITSHARD>
	at __randomizedtesting.SeedInfo.seed([35E32909679F42CC:3F6096A42A244996]:0)
	at org.junit.Assert.fail(Assert.java:93)
	at org.junit.Assert.failNotEquals(Assert.java:647)
	at org.junit.Assert.assertEquals(Assert.java:128)
	at org.junit.Assert.assertEquals(Assert.java:147)
	at org.apache.solr.cloud.autoscaling.IndexSizeTriggerTest.testMixedBounds(IndexSizeTriggerTest.java:669)
	at java.base/jdk.internal.reflect.NativeMethodAccessorImpl.invoke0(Native Method)
	at java.base/jdk.internal.reflect.NativeMethodAccessorImpl.invoke(NativeMethodAccessorImpl.java:62)
	at java.base/jdk.internal.reflect.DelegatingMethodAccessorImpl.invoke(DelegatingMethodAccessorImpl.java:43)
	at java.base/java.lang.reflect.Method.invoke(Method.java:564)
	at com.carrotsearch.randomizedtesting.RandomizedRunner.invoke(RandomizedRunner.java:1737)
	at com.carrotsearch.randomizedtesting.RandomizedRunner$8.evaluate(RandomizedRunner.java:934)
	at com.carrotsearch.randomizedtesting.RandomizedRunner$9.evaluate(RandomizedRunner.java:970)
	at com.carrotsearch.randomizedtesting.RandomizedRunner$10.evaluate(RandomizedRunner.java:984)
	at com.carrotsearch.randomizedtesting.rules.SystemPropertiesRestoreRule$1.evaluate(SystemPropertiesRestoreRule.java:57)
	at org.apache.lucene.util.TestRuleSetupTeardownChained$1.evaluate(TestRuleSetupTeardownChained.java:49)
	at org.apache.lucene.util.AbstractBeforeAfterRule$1.evaluate(AbstractBeforeAfterRule.java:45)
	at org.apache.lucene.util.TestRuleThreadAndTestName$1.evaluate(TestRuleThreadAndTestName.java:48)
	at org.apache.lucene.util.TestRuleIgnoreAfterMaxFailures$1.evaluate(TestRuleIgnoreAfterMaxFailures.java:64)
	at org.apache.lucene.util.TestRuleMarkFailure$1.evaluate(TestRuleMarkFailure.java:47)
	at com.carrotsearch.randomizedtesting.rules.StatementAdapter.evaluate(StatementAdapter.java:36)
	at com.carrotsearch.randomizedtesting.ThreadLeakControl$StatementRunner.run(ThreadLeakControl.java:368)
	at com.carrotsearch.randomizedtesting.ThreadLeakControl.forkTimeoutingTask(ThreadLeakControl.java:817)
	at com.carrotsearch.randomizedtesting.ThreadLeakControl$3.evaluate(ThreadLeakControl.java:468)
	at com.carrotsearch.randomizedtesting.RandomizedRunner.runSingleTest(RandomizedRunner.java:943)
	at com.carrotsearch.randomizedtesting.RandomizedRunner$5.evaluate(RandomizedRunner.java:829)
	at com.carrotsearch.randomizedtesting.RandomizedRunner$6.evaluate(RandomizedRunner.java:879)
	at com.carrotsearch.randomizedtesting.RandomizedRunner$7.evaluate(RandomizedRunner.java:890)
	at com.carrotsearch.randomizedtesting.rules.StatementAdapter.evaluate(StatementAdapter.java:36)
	at com.carrotsearch.randomizedtesting.rules.SystemPropertiesRestoreRule$1.evaluate(SystemPropertiesRestoreRule.java:57)
	at org.apache.lucene.util.AbstractBeforeAfterRule$1.evaluate(AbstractBeforeAfterRule.java:45)
	at com.carrotsearch.randomizedtesting.rules.StatementAdapter.evaluate(StatementAdapter.java:36)
	at org.apache.lucene.util.TestRuleStoreClassName$1.evaluate(TestRuleStoreClassName.java:41)
	at com.carrotsearch.randomizedtesting.rules.NoShadowingOrOverridesOnMethodsRule$1.evaluate(NoShadowingOrOverridesOnMethodsRule.java:40)
	at com.carrotsearch.randomizedtesting.rules.NoShadowingOrOverridesOnMethodsRule$1.evaluate(NoShadowingOrOverridesOnMethodsRule.java:40)
	at com.carrotsearch.randomizedtesting.rules.StatementAdapter.evaluate(StatementAdapter.java:36)
	at com.carrotsearch.randomizedtesting.rules.StatementAdapter.evaluate(StatementAdapter.java:36)
	at org.apache.lucene.util.TestRuleAssertionsRequired$1.evaluate(TestRuleAssertionsRequired.java:53)
	at org.apache.lucene.util.TestRuleMarkFailure$1.evaluate(TestRuleMarkFailure.java:47)
	at org.apache.lucene.util.TestRuleIgnoreAfterMaxFailures$1.evaluate(TestRuleIgnoreAfterMaxFailures.java:64)
	at org.apache.lucene.util.TestRuleIgnoreTestSuites$1.evaluate(TestRuleIgnoreTestSuites.java:54)
	at com.carrotsearch.randomizedtesting.rules.StatementAdapter.evaluate(StatementAdapter.java:36)
	at com.carrotsearch.randomizedtesting.ThreadLeakControl$StatementRunner.run(ThreadLeakControl.java:368)
	at java.base/java.lang.Thread.run(Thread.java:844)




Build Log:
[...truncated 13954 lines...]
   [junit4] Suite: org.apache.solr.cloud.autoscaling.IndexSizeTriggerTest
   [junit4]   2> 1263335 INFO  (SUITE-IndexSizeTriggerTest-seed#[35E32909679F42CC]-worker) [    ] o.a.s.SolrTestCaseJ4 SecureRandom sanity checks: test.solr.allowed.securerandom=null & java.security.egd=file:/dev/./urandom
   [junit4]   2> Creating dataDir: /home/jenkins/workspace/Lucene-Solr-master-Linux/solr/build/solr-core/test/J2/temp/solr.cloud.autoscaling.IndexSizeTriggerTest_35E32909679F42CC-001/init-core-data-001
   [junit4]   2> 1263336 WARN  (SUITE-IndexSizeTriggerTest-seed#[35E32909679F42CC]-worker) [    ] o.a.s.SolrTestCaseJ4 startTrackingSearchers: numOpens=1 numCloses=1
   [junit4]   2> 1263336 INFO  (SUITE-IndexSizeTriggerTest-seed#[35E32909679F42CC]-worker) [    ] o.a.s.SolrTestCaseJ4 Using PointFields (NUMERIC_POINTS_SYSPROP=true) w/NUMERIC_DOCVALUES_SYSPROP=true
   [junit4]   2> 1263337 INFO  (SUITE-IndexSizeTriggerTest-seed#[35E32909679F42CC]-worker) [    ] o.a.s.SolrTestCaseJ4 Randomized ssl (true) and clientAuth (false) via: @org.apache.solr.util.RandomizeSSL(reason="", ssl=0.0/0.0, value=0.0/0.0, clientAuth=0.0/0.0)
   [junit4]   2> 1263337 INFO  (SUITE-IndexSizeTriggerTest-seed#[35E32909679F42CC]-worker) [    ] o.a.s.c.MiniSolrCloudCluster Starting cluster of 2 servers in /home/jenkins/workspace/Lucene-Solr-master-Linux/solr/build/solr-core/test/J2/temp/solr.cloud.autoscaling.IndexSizeTriggerTest_35E32909679F42CC-001/tempDir-001
   [junit4]   2> 1263338 INFO  (SUITE-IndexSizeTriggerTest-seed#[35E32909679F42CC]-worker) [    ] o.a.s.c.ZkTestServer STARTING ZK TEST SERVER
   [junit4]   2> 1263338 INFO  (Thread-3541) [    ] o.a.s.c.ZkTestServer client port:0.0.0.0/0.0.0.0:0
   [junit4]   2> 1263338 INFO  (Thread-3541) [    ] o.a.s.c.ZkTestServer Starting server
   [junit4]   2> 1263341 ERROR (Thread-3541) [    ] o.a.z.s.ZooKeeperServer ZKShutdownHandler is not registered, so ZooKeeper server won't take any action on ERROR or SHUTDOWN server state changes
   [junit4]   2> 1263438 INFO  (SUITE-IndexSizeTriggerTest-seed#[35E32909679F42CC]-worker) [    ] o.a.s.c.ZkTestServer start zk server on port:33505
   [junit4]   2> 1263439 INFO  (zkConnectionManagerCallback-5849-thread-1) [    ] o.a.s.c.c.ConnectionManager zkClient has connected
   [junit4]   2> 1263448 INFO  (jetty-launcher-5846-thread-2) [    ] o.e.j.s.Server jetty-9.4.11.v20180605; built: 2018-06-05T18:24:03.829Z; git: d5fc0523cfa96bfebfbda19606cad384d772f04c; jvm 10.0.1+10
   [junit4]   2> 1263448 INFO  (jetty-launcher-5846-thread-1) [    ] o.e.j.s.Server jetty-9.4.11.v20180605; built: 2018-06-05T18:24:03.829Z; git: d5fc0523cfa96bfebfbda19606cad384d772f04c; jvm 10.0.1+10
   [junit4]   2> 1263455 INFO  (jetty-launcher-5846-thread-1) [    ] o.e.j.s.session DefaultSessionIdManager workerName=node0
   [junit4]   2> 1263455 INFO  (jetty-launcher-5846-thread-2) [    ] o.e.j.s.session DefaultSessionIdManager workerName=node0
   [junit4]   2> 1263455 INFO  (jetty-launcher-5846-thread-2) [    ] o.e.j.s.session No SessionScavenger set, using defaults
   [junit4]   2> 1263455 INFO  (jetty-launcher-5846-thread-1) [    ] o.e.j.s.session No SessionScavenger set, using defaults
   [junit4]   2> 1263455 INFO  (jetty-launcher-5846-thread-2) [    ] o.e.j.s.session node0 Scavenging every 660000ms
   [junit4]   2> 1263455 INFO  (jetty-launcher-5846-thread-1) [    ] o.e.j.s.session node0 Scavenging every 660000ms
   [junit4]   2> 1263455 INFO  (jetty-launcher-5846-thread-1) [    ] o.e.j.s.h.ContextHandler Started o.e.j.s.ServletContextHandler@636ed042{/solr,null,AVAILABLE}
   [junit4]   2> 1263455 INFO  (jetty-launcher-5846-thread-2) [    ] o.e.j.s.h.ContextHandler Started o.e.j.s.ServletContextHandler@26eeb654{/solr,null,AVAILABLE}
   [junit4]   2> 1263456 INFO  (jetty-launcher-5846-thread-1) [    ] o.e.j.s.AbstractConnector Started ServerConnector@4cd8b6f5{SSL,[ssl, http/1.1]}{127.0.0.1:37923}
   [junit4]   2> 1263456 INFO  (jetty-launcher-5846-thread-2) [    ] o.e.j.s.AbstractConnector Started ServerConnector@236d7e29{SSL,[ssl, http/1.1]}{127.0.0.1:34809}
   [junit4]   2> 1263456 INFO  (jetty-launcher-5846-thread-1) [    ] o.e.j.s.Server Started @1263488ms
   [junit4]   2> 1263456 INFO  (jetty-launcher-5846-thread-2) [    ] o.e.j.s.Server Started @1263488ms
   [junit4]   2> 1263456 INFO  (jetty-launcher-5846-thread-1) [    ] o.a.s.c.s.e.JettySolrRunner Jetty properties: {hostContext=/solr, hostPort=37923}
   [junit4]   2> 1263456 INFO  (jetty-launcher-5846-thread-2) [    ] o.a.s.c.s.e.JettySolrRunner Jetty properties: {hostContext=/solr, hostPort=34809}
   [junit4]   2> 1263456 ERROR (jetty-launcher-5846-thread-2) [    ] o.a.s.u.StartupLoggingUtils Missing Java Option solr.log.dir. Logging may be missing or incomplete.
   [junit4]   2> 1263456 ERROR (jetty-launcher-5846-thread-1) [    ] o.a.s.u.StartupLoggingUtils Missing Java Option solr.log.dir. Logging may be missing or incomplete.
   [junit4]   2> 1263456 INFO  (jetty-launcher-5846-thread-2) [    ] o.a.s.s.SolrDispatchFilter Using logger factory org.apache.logging.slf4j.Log4jLoggerFactory
   [junit4]   2> 1263456 INFO  (jetty-launcher-5846-thread-1) [    ] o.a.s.s.SolrDispatchFilter Using logger factory org.apache.logging.slf4j.Log4jLoggerFactory
   [junit4]   2> 1263456 INFO  (jetty-launcher-5846-thread-2) [    ] o.a.s.s.SolrDispatchFilter  ___      _       Welcome to Apache Solr™ version 8.0.0
   [junit4]   2> 1263456 INFO  (jetty-launcher-5846-thread-1) [    ] o.a.s.s.SolrDispatchFilter  ___      _       Welcome to Apache Solr™ version 8.0.0
   [junit4]   2> 1263456 INFO  (jetty-launcher-5846-thread-2) [    ] o.a.s.s.SolrDispatchFilter / __| ___| |_ _   Starting in cloud mode on port null
   [junit4]   2> 1263456 INFO  (jetty-launcher-5846-thread-1) [    ] o.a.s.s.SolrDispatchFilter / __| ___| |_ _   Starting in cloud mode on port null
   [junit4]   2> 1263456 INFO  (jetty-launcher-5846-thread-2) [    ] o.a.s.s.SolrDispatchFilter \__ \/ _ \ | '_|  Install dir: null
   [junit4]   2> 1263456 INFO  (jetty-launcher-5846-thread-1) [    ] o.a.s.s.SolrDispatchFilter \__ \/ _ \ | '_|  Install dir: null
   [junit4]   2> 1263456 INFO  (jetty-launcher-5846-thread-2) [    ] o.a.s.s.SolrDispatchFilter |___/\___/_|_|    Start time: 2018-09-01T02:17:17.305756Z
   [junit4]   2> 1263456 INFO  (jetty-launcher-5846-thread-1) [    ] o.a.s.s.SolrDispatchFilter |___/\___/_|_|    Start time: 2018-09-01T02:17:17.305765Z
   [junit4]   2> 1263457 INFO  (zkConnectionManagerCallback-5852-thread-1) [    ] o.a.s.c.c.ConnectionManager zkClient has connected
   [junit4]   2> 1263457 INFO  (zkConnectionManagerCallback-5853-thread-1) [    ] o.a.s.c.c.ConnectionManager zkClient has connected
   [junit4]   2> 1263457 INFO  (jetty-launcher-5846-thread-2) [    ] o.a.s.s.SolrDispatchFilter solr.xml found in ZooKeeper. Loading...
   [junit4]   2> 1263457 INFO  (jetty-launcher-5846-thread-1) [    ] o.a.s.s.SolrDispatchFilter solr.xml found in ZooKeeper. Loading...
   [junit4]   2> 1263571 INFO  (jetty-launcher-5846-thread-1) [    ] o.a.s.c.ZkContainer Zookeeper client=127.0.0.1:33505/solr
   [junit4]   2> 1263571 INFO  (zkConnectionManagerCallback-5857-thread-1) [    ] o.a.s.c.c.ConnectionManager zkClient has connected
   [junit4]   2> 1263574 INFO  (zkConnectionManagerCallback-5859-thread-1) [    ] o.a.s.c.c.ConnectionManager zkClient has connected
   [junit4]   2> 1263635 INFO  (jetty-launcher-5846-thread-1) [n:127.0.0.1:37923_solr    ] o.a.s.c.OverseerElectionContext I am going to be the leader 127.0.0.1:37923_solr
   [junit4]   2> 1263636 INFO  (jetty-launcher-5846-thread-1) [n:127.0.0.1:37923_solr    ] o.a.s.c.Overseer Overseer (id=72146979559309316-127.0.0.1:37923_solr-n_0000000000) starting
   [junit4]   2> 1263639 INFO  (zkConnectionManagerCallback-5866-thread-1) [    ] o.a.s.c.c.ConnectionManager zkClient has connected
   [junit4]   2> 1263641 INFO  (jetty-launcher-5846-thread-1) [n:127.0.0.1:37923_solr    ] o.a.s.c.s.i.ZkClientClusterStateProvider Cluster at 127.0.0.1:33505/solr ready
   [junit4]   2> 1263641 INFO  (OverseerStateUpdate-72146979559309316-127.0.0.1:37923_solr-n_0000000000) [n:127.0.0.1:37923_solr    ] o.a.s.c.Overseer Starting to work on the main queue : 127.0.0.1:37923_solr
   [junit4]   2> 1263642 INFO  (jetty-launcher-5846-thread-1) [n:127.0.0.1:37923_solr    ] o.a.s.c.ZkController Register node as live in ZooKeeper:/live_nodes/127.0.0.1:37923_solr
   [junit4]   2> 1263642 DEBUG (OverseerAutoScalingTriggerThread-72146979559309316-127.0.0.1:37923_solr-n_0000000000) [    ] o.a.s.c.a.OverseerTriggerThread Adding .auto_add_replicas and .scheduled_maintenance triggers
   [junit4]   2> 1263647 DEBUG (OverseerAutoScalingTriggerThread-72146979559309316-127.0.0.1:37923_solr-n_0000000000) [    ] o.a.s.c.a.OverseerTriggerThread Refreshing /autoscaling.json with znode version 1
   [junit4]   2> 1263647 DEBUG (OverseerAutoScalingTriggerThread-72146979559309316-127.0.0.1:37923_solr-n_0000000000) [    ] o.a.s.c.a.OverseerTriggerThread Current znodeVersion 1, lastZnodeVersion -1
   [junit4]   2> 1263647 DEBUG (OverseerAutoScalingTriggerThread-72146979559309316-127.0.0.1:37923_solr-n_0000000000) [    ] o.a.s.c.a.OverseerTriggerThread Processed trigger updates upto znodeVersion 1
   [junit4]   2> 1263650 INFO  (zkCallback-5865-thread-1) [    ] o.a.s.c.c.ZkStateReader Updated live nodes from ZooKeeper... (0) -> (1)
   [junit4]   2> 1263650 INFO  (zkCallback-5858-thread-1) [    ] o.a.s.c.c.ZkStateReader Updated live nodes from ZooKeeper... (0) -> (1)
   [junit4]   2> 1263651 DEBUG (OverseerAutoScalingTriggerThread-72146979559309316-127.0.0.1:37923_solr-n_0000000000) [    ] o.a.s.c.a.NodeLostTrigger NodeLostTrigger .auto_add_replicas - Initial livenodes: [127.0.0.1:37923_solr]
   [junit4]   2> 1263652 DEBUG (OverseerAutoScalingTriggerThread-72146979559309316-127.0.0.1:37923_solr-n_0000000000) [    ] o.a.s.c.a.OverseerTriggerThread -- clean old nodeAdded markers
   [junit4]   2> 1263652 DEBUG (OverseerAutoScalingTriggerThread-72146979559309316-127.0.0.1:37923_solr-n_0000000000) [    ] o.a.s.c.a.OverseerTriggerThread Current znodeVersion 1, lastZnodeVersion 1
   [junit4]   2> 1263652 DEBUG (ScheduledTrigger-5501-thread-1) [    ] o.a.s.c.a.NodeLostTrigger Running NodeLostTrigger: .auto_add_replicas with currently live nodes: 1
   [junit4]   2> 1263653 INFO  (jetty-launcher-5846-thread-2) [    ] o.a.s.c.ZkContainer Zookeeper client=127.0.0.1:33505/solr
   [junit4]   2> 1263654 INFO  (zkConnectionManagerCallback-5870-thread-1) [    ] o.a.s.c.c.ConnectionManager zkClient has connected
   [junit4]   2> 1263654 INFO  (jetty-launcher-5846-thread-1) [n:127.0.0.1:37923_solr    ] o.a.s.h.a.MetricsHistoryHandler No .system collection, keeping metrics history in memory.
   [junit4]   2> 1263657 INFO  (zkConnectionManagerCallback-5873-thread-1) [    ] o.a.s.c.c.ConnectionManager zkClient has connected
   [junit4]   2> 1263659 INFO  (jetty-launcher-5846-thread-2) [n:127.0.0.1:34809_solr    ] o.a.s.c.c.ZkStateReader Updated live nodes from ZooKeeper... (0) -> (1)
   [junit4]   2> 1263661 INFO  (jetty-launcher-5846-thread-2) [n:127.0.0.1:34809_solr    ] o.a.s.c.TransientSolrCoreCacheDefault Allocating transient cache for 2147483647 transient cores
   [junit4]   2> 1263661 INFO  (jetty-launcher-5846-thread-2) [n:127.0.0.1:34809_solr    ] o.a.s.c.ZkController Register node as live in ZooKeeper:/live_nodes/127.0.0.1:34809_solr
   [junit4]   2> 1263662 INFO  (zkCallback-5858-thread-1) [    ] o.a.s.c.c.ZkStateReader Updated live nodes from ZooKeeper... (1) -> (2)
   [junit4]   2> 1263662 INFO  (zkCallback-5865-thread-1) [    ] o.a.s.c.c.ZkStateReader Updated live nodes from ZooKeeper... (1) -> (2)
   [junit4]   2> 1263662 INFO  (zkCallback-5872-thread-1) [    ] o.a.s.c.c.ZkStateReader Updated live nodes from ZooKeeper... (1) -> (2)
   [junit4]   2> 1263670 INFO  (jetty-launcher-5846-thread-1) [n:127.0.0.1:37923_solr    ] o.a.s.m.r.SolrJmxReporter JMX monitoring for 'solr_37923.solr.node' (registry 'solr.node') enabled at server: com.sun.jmx.mbeanserver.JmxMBeanServer@721ec179
   [junit4]   2> 1263670 INFO  (zkConnectionManagerCallback-5880-thread-1) [    ] o.a.s.c.c.ConnectionManager zkClient has connected
   [junit4]   2> 1263671 INFO  (jetty-launcher-5846-thread-2) [n:127.0.0.1:34809_solr    ] o.a.s.c.c.ZkStateReader Updated live nodes from ZooKeeper... (0) -> (2)
   [junit4]   2> 1263671 INFO  (jetty-launcher-5846-thread-2) [n:127.0.0.1:34809_solr    ] o.a.s.c.s.i.ZkClientClusterStateProvider Cluster at 127.0.0.1:33505/solr ready
   [junit4]   2> 1263672 INFO  (jetty-launcher-5846-thread-2) [n:127.0.0.1:34809_solr    ] o.a.s.h.a.MetricsHistoryHandler No .system collection, keeping metrics history in memory.
   [junit4]   2> 1263677 INFO  (jetty-launcher-5846-thread-1) [n:127.0.0.1:37923_solr    ] o.a.s.m.r.SolrJmxReporter JMX monitoring for 'solr_37923.solr.jvm' (registry 'solr.jvm') enabled at server: com.sun.jmx.mbeanserver.JmxMBeanServer@721ec179
   [junit4]   2> 1263677 INFO  (jetty-launcher-5846-thread-1) [n:127.0.0.1:37923_solr    ] o.a.s.m.r.SolrJmxReporter JMX monitoring for 'solr_37923.solr.jetty' (registry 'solr.jetty') enabled at server: com.sun.jmx.mbeanserver.JmxMBeanServer@721ec179
   [junit4]   2> 1263678 INFO  (jetty-launcher-5846-thread-1) [n:127.0.0.1:37923_solr    ] o.a.s.c.CorePropertiesLocator Found 0 core definitions underneath /home/jenkins/workspace/Lucene-Solr-master-Linux/solr/build/solr-core/test/J2/temp/solr.cloud.autoscaling.IndexSizeTriggerTest_35E32909679F42CC-001/tempDir-001/node1/.
   [junit4]   2> 1263685 INFO  (jetty-launcher-5846-thread-2) [n:127.0.0.1:34809_solr    ] o.a.s.m.r.SolrJmxReporter JMX monitoring for 'solr_34809.solr.node' (registry 'solr.node') enabled at server: com.sun.jmx.mbeanserver.JmxMBeanServer@721ec179
   [junit4]   2> 1263693 INFO  (jetty-launcher-5846-thread-2) [n:127.0.0.1:34809_solr    ] o.a.s.m.r.SolrJmxReporter JMX monitoring for 'solr_34809.solr.jvm' (registry 'solr.jvm') enabled at server: com.sun.jmx.mbeanserver.JmxMBeanServer@721ec179
   [junit4]   2> 1263693 INFO  (jetty-launcher-5846-thread-2) [n:127.0.0.1:34809_solr    ] o.a.s.m.r.SolrJmxReporter JMX monitoring for 'solr_34809.solr.jetty' (registry 'solr.jetty') enabled at server: com.sun.jmx.mbeanserver.JmxMBeanServer@721ec179
   [junit4]   2> 1263694 INFO  (jetty-launcher-5846-thread-2) [n:127.0.0.1:34809_solr    ] o.a.s.c.CorePropertiesLocator Found 0 core definitions underneath /home/jenkins/workspace/Lucene-Solr-master-Linux/solr/build/solr-core/test/J2/temp/solr.cloud.autoscaling.IndexSizeTriggerTest_35E32909679F42CC-001/tempDir-001/node2/.
   [junit4]   2> 1263713 INFO  (zkConnectionManagerCallback-5883-thread-1) [    ] o.a.s.c.c.ConnectionManager zkClient has connected
   [junit4]   2> 1263716 INFO  (zkConnectionManagerCallback-5888-thread-1) [    ] o.a.s.c.c.ConnectionManager zkClient has connected
   [junit4]   2> 1263716 INFO  (SUITE-IndexSizeTriggerTest-seed#[35E32909679F42CC]-worker) [    ] o.a.s.c.c.ZkStateReader Updated live nodes from ZooKeeper... (0) -> (2)
   [junit4]   2> 1263717 INFO  (SUITE-IndexSizeTriggerTest-seed#[35E32909679F42CC]-worker) [    ] o.a.s.c.s.i.ZkClientClusterStateProvider Cluster at 127.0.0.1:33505/solr ready
   [junit4]   2> 1263727 INFO  (TEST-IndexSizeTriggerTest.testMergeIntegration-seed#[35E32909679F42CC]) [    ] o.a.s.SolrTestCaseJ4 ###Starting testMergeIntegration
   [junit4]   2> 1263737 INFO  (qtp498269459-16157) [n:127.0.0.1:34809_solr    ] o.a.s.h.a.CollectionsHandler Invoked Collection Action :create with params collection.configName=conf&maxShardsPerNode=2&name=testMergeIntegration_collection&nrtReplicas=2&action=CREATE&numShards=2&wt=javabin&version=2 and sendToOCPQueue=true
   [junit4]   2> 1263739 INFO  (OverseerThreadFactory-5503-thread-1-processing-n:127.0.0.1:37923_solr) [n:127.0.0.1:37923_solr    ] o.a.s.c.a.c.CreateCollectionCmd Create collection testMergeIntegration_collection
   [junit4]   2> 1263843 INFO  (OverseerStateUpdate-72146979559309316-127.0.0.1:37923_solr-n_0000000000) [n:127.0.0.1:37923_solr    ] o.a.s.c.o.SliceMutator createReplica() {
   [junit4]   2>   "operation":"ADDREPLICA",
   [junit4]   2>   "collection":"testMergeIntegration_collection",
   [junit4]   2>   "shard":"shard1",
   [junit4]   2>   "core":"testMergeIntegration_collection_shard1_replica_n1",
   [junit4]   2>   "state":"down",
   [junit4]   2>   "base_url":"https://127.0.0.1:34809/solr",
   [junit4]   2>   "type":"NRT",
   [junit4]   2>   "waitForFinalState":"false"} 
   [junit4]   2> 1263844 INFO  (OverseerStateUpdate-72146979559309316-127.0.0.1:37923_solr-n_0000000000) [n:127.0.0.1:37923_solr    ] o.a.s.c.o.SliceMutator createReplica() {
   [junit4]   2>   "operation":"ADDREPLICA",
   [junit4]   2>   "collection":"testMergeIntegration_collection",
   [junit4]   2>   "shard":"shard1",
   [junit4]   2>   "core":"testMergeIntegration_collection_shard1_replica_n2",
   [junit4]   2>   "state":"down",
   [junit4]   2>   "base_url":"https://127.0.0.1:37923/solr",
   [junit4]   2>   "type":"NRT",
   [junit4]   2>   "waitForFinalState":"false"} 
   [junit4]   2> 1263844 INFO  (OverseerStateUpdate-72146979559309316-127.0.0.1:37923_solr-n_0000000000) [n:127.0.0.1:37923_solr    ] o.a.s.c.o.SliceMutator createReplica() {
   [junit4]   2>   "operation":"ADDREPLICA",
   [junit4]   2>   "collection":"testMergeIntegration_collection",
   [junit4]   2>   "shard":"shard2",
   [junit4]   2>   "core":"testMergeIntegration_collection_shard2_replica_n4",
   [junit4]   2>   "state":"down",
   [junit4]   2>   "base_url":"https://127.0.0.1:34809/solr",
   [junit4]   2>   "type":"NRT",
   [junit4]   2>   "waitForFinalState":"false"} 
   [junit4]   2> 1263845 INFO  (OverseerStateUpdate-72146979559309316-127.0.0.1:37923_solr-n_0000000000) [n:127.0.0.1:37923_solr    ] o.a.s.c.o.SliceMutator createReplica() {
   [junit4]   2>   "operation":"ADDREPLICA",
   [junit4]   2>   "collection":"testMergeIntegration_collection",
   [junit4]   2>   "shard":"shard2",
   [junit4]   2>   "core":"testMergeIntegration_collection_shard2_replica_n6",
   [junit4]   2>   "state":"down",
   [junit4]   2>   "base_url":"https://127.0.0.1:37923/solr",
   [junit4]   2>   "type":"NRT",
   [junit4]   2>   "waitForFinalState":"false"} 
   [junit4]   2> 1264050 INFO  (qtp498269459-16226) [n:127.0.0.1:34809_solr    x:testMergeIntegration_collection_shard1_replica_n1] o.a.s.h.a.CoreAdminOperation core create command qt=/admin/cores&coreNodeName=core_node3&collection.configName=conf&newCollection=true&name=testMergeIntegration_collection_shard1_replica_n1&action=CREATE&numShards=2&collection=testMergeIntegration_collection&shard=shard1&wt=javabin&version=2&replicaType=NRT
   [junit4]   2> 1264052 INFO  (qtp498269459-16151) [n:127.0.0.1:34809_solr    x:testMergeIntegration_collection_shard2_replica_n4] o.a.s.h.a.CoreAdminOperation core create command qt=/admin/cores&coreNodeName=core_node7&collection.configName=conf&newCollection=true&name=testMergeIntegration_collection_shard2_replica_n4&action=CREATE&numShards=2&collection=testMergeIntegration_collection&shard=shard2&wt=javabin&version=2&replicaType=NRT
   [junit4]   2> 1264057 INFO  (qtp695588923-16158) [n:127.0.0.1:37923_solr    x:testMergeIntegration_collection_shard1_replica_n2] o.a.s.h.a.CoreAdminOperation core create command qt=/admin/cores&coreNodeName=core_node5&collection.configName=conf&newCollection=true&name=testMergeIntegration_collection_shard1_replica_n2&action=CREATE&numShards=2&collection=testMergeIntegration_collection&shard=shard1&wt=javabin&version=2&replicaType=NRT
   [junit4]   2> 1264058 INFO  (qtp695588923-16158) [n:127.0.0.1:37923_solr    x:testMergeIntegration_collection_shard1_replica_n2] o.a.s.c.TransientSolrCoreCacheDefault Allocating transient cache for 2147483647 transient cores
   [junit4]   2> 1264060 INFO  (qtp695588923-16160) [n:127.0.0.1:37923_solr    x:testMergeIntegration_collection_shard2_replica_n6] o.a.s.h.a.CoreAdminOperation core create command qt=/admin/cores&coreNodeName=core_node8&collection.configName=conf&newCollection=true&name=testMergeIntegration_collection_shard2_replica_n6&action=CREATE&numShards=2&collection=testMergeIntegration_collection&shard=shard2&wt=javabin&version=2&replicaType=NRT
   [junit4]   2> 1264654 DEBUG (ScheduledTrigger-5501-thread-3) [    ] o.a.s.c.a.NodeLostTrigger Running NodeLostTrigger: .auto_add_replicas with currently live nodes: 2
   [junit4]   2> 1265058 INFO  (qtp498269459-16226) [n:127.0.0.1:34809_solr c:testMergeIntegration_collection s:shard1 r:core_node3 x:testMergeIntegration_collection_shard1_replica_n1] o.a.s.c.SolrConfig Using Lucene MatchVersion: 8.0.0
   [junit4]   2> 1265058 INFO  (qtp498269459-16151) [n:127.0.0.1:34809_solr c:testMergeIntegration_collection s:shard2 r:core_node7 x:testMergeIntegration_collection_shard2_replica_n4] o.a.s.c.SolrConfig Using Lucene MatchVersion: 8.0.0
   [junit4]   2> 1265063 INFO  (qtp498269459-16151) [n:127.0.0.1:34809_solr c:testMergeIntegration_collection s:shard2 r:core_node7 x:testMergeIntegration_collection_shard2_replica_n4] o.a.s.s.IndexSchema [testMergeIntegration_collection_shard2_replica_n4] Schema name=minimal
   [junit4]   2> 1265063 INFO  (qtp498269459-16226) [n:127.0.0.1:34809_solr c:testMergeIntegration_collection s:shard1 r:core_node3 x:testMergeIntegration_collection_shard1_replica_n1] o.a.s.s.IndexSchema [testMergeIntegration_collection_shard1_replica_n1] Schema name=minimal
   [junit4]   2> 1265070 INFO  (qtp498269459-16151) [n:127.0.0.1:34809_solr c:testMergeIntegration_collection s:shard2 r:core_node7 x:testMergeIntegration_collection_shard2_replica_n4] o.a.s.s.IndexSchema Loaded schema minimal/1.1 with uniqueid field id
   [junit4]   2> 1265070 INFO  (qtp498269459-16151) [n:127.0.0.1:34809_solr c:testMergeIntegration_collection s:shard2 r:core_node7 x:testMergeIntegration_collection_shard2_replica_n4] o.a.s.c.CoreContainer Creating SolrCore 'testMergeIntegration_collection_shard2_replica_n4' using configuration from collection testMergeIntegration_collection, trusted=true
   [junit4]   2> 1265070 INFO  (qtp498269459-16226) [n:127.0.0.1:34809_solr c:testMergeIntegration_collection s:shard1 r:core_node3 x:testMergeIntegration_collection_shard1_replica_n1] o.a.s.s.IndexSchema Loaded schema minimal/1.1 with uniqueid field id
   [junit4]   2> 1265071 INFO  (qtp695588923-16160) [n:127.0.0.1:37923_solr c:testMergeIntegration_collection s:shard2 r:core_node8 x:testMergeIntegration_collection_shard2_replica_n6] o.a.s.c.SolrConfig Using Lucene MatchVersion: 8.0.0
   [junit4]   2> 1265071 INFO  (qtp498269459-16226) [n:127.0.0.1:34809_solr c:testMergeIntegration_collection s:shard1 r:core_node3 x:testMergeIntegration_collection_shard1_replica_n1] o.a.s.c.CoreContainer Creating SolrCore 'testMergeIntegration_collection_shard1_replica_n1' using configuration from collection testMergeIntegration_collection, trusted=true
   [junit4]   2> 1265071 INFO  (qtp695588923-16158) [n:127.0.0.1:37923_solr c:testMergeIntegration_collection s:shard1 r:core_node5 x:testMergeIntegration_collection_shard1_replica_n2] o.a.s.c.SolrConfig Using Lucene MatchVersion: 8.0.0
   [junit4]   2> 1265071 INFO  (qtp498269459-16151) [n:127.0.0.1:34809_solr c:testMergeIntegration_collection s:shard2 r:core_node7 x:testMergeIntegration_collection_shard2_replica_n4] o.a.s.m.r.SolrJmxReporter JMX monitoring for 'solr_34809.solr.core.testMergeIntegration_collection.shard2.replica_n4' (registry 'solr.core.testMergeIntegration_collection.shard2.replica_n4') enabled at server: com.sun.jmx.mbeanserver.JmxMBeanServer@721ec179
   [junit4]   2> 1265071 INFO  (qtp498269459-16226) [n:127.0.0.1:34809_solr c:testMergeIntegration_collection s:shard1 r:core_node3 x:testMergeIntegration_collection_shard1_replica_n1] o.a.s.m.r.SolrJmxReporter JMX monitoring for 'solr_34809.solr.core.testMergeIntegration_collection.shard1.replica_n1' (registry 'solr.core.testMergeIntegration_collection.shard1.replica_n1') enabled at server: com.sun.jmx.mbeanserver.JmxMBeanServer@721ec179
   [junit4]   2> 1265071 INFO  (qtp498269459-16151) [n:127.0.0.1:34809_solr c:testMergeIntegration_collection s:shard2 r:core_node7 x:testMergeIntegration_collection_shard2_replica_n4] o.a.s.c.SolrCore solr.RecoveryStrategy.Builder
   [junit4]   2> 1265071 INFO  (qtp498269459-16226) [n:127.0.0.1:34809_solr c:testMergeIntegration_collection s:shard1 r:core_node3 x:testMergeIntegration_collection_shard1_replica_n1] o.a.s.c.SolrCore solr.RecoveryStrategy.Builder
   [junit4]   2> 1265071 INFO  (qtp498269459-16151) [n:127.0.0.1:34809_solr c:testMergeIntegration_collection s:shard2 r:core_node7 x:testMergeIntegration_collection_shard2_replica_n4] o.a.s.c.SolrCore [[testMergeIntegration_collection_shard2_replica_n4] ] Opening new SolrCore at [/home/jenkins/workspace/Lucene-Solr-master-Linux/solr/build/solr-core/test/J2/temp/solr.cloud.autoscaling.IndexSizeTriggerTest_35E32909679F42CC-001/tempDir-001/node2/testMergeIntegration_collection_shard2_replica_n4], dataDir=[/home/jenkins/workspace/Lucene-Solr-master-Linux/solr/build/solr-core/test/J2/temp/solr.cloud.autoscaling.IndexSizeTriggerTest_35E32909679F42CC-001/tempDir-001/node2/./testMergeIntegration_collection_shard2_replica_n4/data/]
   [junit4]   2> 1265071 INFO  (qtp498269459-16226) [n:127.0.0.1:34809_solr c:testMergeIntegration_collection s:shard1 r:core_node3 x:testMergeIntegration_collection_shard1_replica_n1] o.a.s.c.SolrCore [[testMergeIntegration_collection_shard1_replica_n1] ] Opening new SolrCore at [/home/jenkins/workspace/Lucene-Solr-master-Linux/solr/build/solr-core/test/J2/temp/solr.cloud.autoscaling.IndexSizeTriggerTest_35E32909679F42CC-001/tempDir-001/node2/testMergeIntegration_collection_shard1_replica_n1], dataDir=[/home/jenkins/workspace/Lucene-Solr-master-Linux/solr/build/solr-core/test/J2/temp/solr.cloud.autoscaling.IndexSizeTriggerTest_35E32909679F42CC-001/tempDir-001/node2/./testMergeIntegration_collection_shard1_replica_n1/data/]
   [junit4]   2> 1265075 INFO  (qtp695588923-16160) [n:127.0.0.1:37923_solr c:testMergeIntegration_collection s:shard2 r:core_node8 x:testMergeIntegration_collection_shard2_replica_n6] o.a.s.s.IndexSchema [testMergeIntegration_collection_shard2_replica_n6] Schema name=minimal
   [junit4]   2> 1265075 INFO  (qtp695588923-16158) [n:127.0.0.1:37923_solr c:testMergeIntegration_collection s:shard1 r:core_node5 x:testMergeIntegration_collection_shard1_replica_n2] o.a.s.s.IndexSchema [testMergeIntegration_collection_shard1_replica_n2] Schema name=minimal
   [junit4]   2> 1265076 INFO  (qtp695588923-16160) [n:127.0.0.1:37923_solr c:testMergeIntegration_collection s:shard2 r:core_node8 x:testMergeIntegration_collection_shard2_replica_n6] o.a.s.s.IndexSchema Loaded schema minimal/1.1 with uniqueid field id
   [junit4]   2> 1265076 INFO  (qtp695588923-16160) [n:127.0.0.1:37923_solr c:testMergeIntegration_collection s:shard2 r:core_node8 x:testMergeIntegration_collection_shard2_replica_n6] o.a.s.c.CoreContainer Creating SolrCore 'testMergeIntegration_collection_shard2_replica_n6' using configuration from collection testMergeIntegration_collection, trusted=true
   [junit4]   2> 1265076 INFO  (qtp695588923-16158) [n:127.0.0.1:37923_solr c:testMergeIntegration_collection s:shard1 r:core_node5 x:testMergeIntegration_collection_shard1_replica_n2] o.a.s.s.IndexSchema Loaded schema minimal/1.1 with uniqueid field id
   [junit4]   2> 1265076 INFO  (qtp695588923-16158) [n:127.0.0.1:37923_solr c:testMergeIntegration_collection s:shard1 r:core_node5 x:testMergeIntegration_collection_shard1_replica_n2] o.a.s.c.CoreContainer Creating SolrCore 'testMergeIntegration_collection_shard1_replica_n2' using configuration from collection testMergeIntegration_collection, trusted=true
   [junit4]   2> 1265076 INFO  (qtp695588923-16160) [n:127.0.0.1:37923_solr c:testMergeIntegration_collection s:shard2 r:core_node8 x:testMergeIntegration_collection_shard2_replica_n6] o.a.s.m.r.SolrJmxReporter JMX monitoring for 'solr_37923.solr.core.testMergeIntegration_collection.shard2.replica_n6' (registry 'solr.core.testMergeIntegration_collection.shard2.replica_n6') enabled at server: com.sun.jmx.mbeanserver.JmxMBeanServer@721ec179
   [junit4]   2> 1265077 INFO  (qtp695588923-16158) [n:127.0.0.1:37923_solr c:testMergeIntegration_collection s:shard1 r:core_node5 x:testMergeIntegration_collection_shard1_replica_n2] o.a.s.m.r.SolrJmxReporter JMX monitoring for 'solr_37923.solr.core.testMergeIntegration_collection.shard1.replica_n2' (registry 'solr.core.testMergeIntegration_collection.shard1.replica_n2') enabled at server: com.sun.jmx.mbeanserver.JmxMBeanServer@721ec179
   [junit4]   2> 1265077 INFO  (qtp695588923-16160) [n:127.0.0.1:37923_solr c:testMergeIntegration_collection s:shard2 r:core_node8 x:testMergeIntegration_collection_shard2_replica_n6] o.a.s.c.SolrCore solr.RecoveryStrategy.Builder
   [junit4]   2> 1265077 INFO  (qtp695588923-16158) [n:127.0.0.1:37923_solr c:testMergeIntegration_collection s:shard1 r:core_node5 x:testMergeIntegration_collection_shard1_replica_n2] o.a.s.c.SolrCore solr.RecoveryStrategy.Builder
   [junit4]   2> 1265077 INFO  (qtp695588923-16160) [n:127.0.0.1:37923_solr c:testMergeIntegration_collection s:shard2 r:core_node8 x:testMergeIntegration_collection_shard2_replica_n6] o.a.s.c.SolrCore [[testMergeIntegration_collection_shard2_replica_n6] ] Opening new SolrCore at [/home/jenkins/workspace/Lucene-Solr-master-Linux/solr/build/solr-core/test/J2/temp/solr.cloud.autoscaling.IndexSizeTriggerTest_35E32909679F42CC-001/tempDir-001/node1/testMergeIntegration_collection_shard2_replica_n6], dataDir=[/home/jenkins/workspace/Lucene-Solr-master-Linux/solr/build/solr-core/test/J2/temp/solr.cloud.autoscaling.IndexSizeTriggerTest_35E32909679F42CC-001/tempDir-001/node1/./testMergeIntegration_collection_shard2_replica_n6/data/]
   [junit4]   2> 1265077 INFO  (qtp695588923-16158) [n:127.0.0.1:37923_solr c:testMergeIntegration_collection s:shard1 r:core_node5 x:testMergeIntegration_collection_shard1_replica_n2] o.a.s.c.SolrCore [[testMergeIntegration_collection_shard1_replica_n2] ] Opening new SolrCore at [/home/jenkins/workspace/Lucene-Solr-master-Linux/solr/build/solr-core/test/J2/temp/solr.cloud.autoscaling.IndexSizeTriggerTest_35E32909679F42CC-001/tempDir-001/node1/testMergeIntegration_collection_shard1_replica_n2], dataDir=[/home/jenkins/workspace/Lucene-Solr-master-Linux/solr/build/solr-core/test/J2/temp/solr.cloud.autoscaling.IndexSizeTriggerTest_35E32909679F42CC-001/tempDir-001/node1/./testMergeIntegration_collection_shard1_replica_n2/data/]
   [junit4]   2> 1265127 INFO  (qtp498269459-16226) [n:127.0.0.1:34809_solr c:testMergeIntegration_collection s:shard1 r:core_node3 x:testMergeIntegration_collection_shard1_replica_n1] o.a.s.u.UpdateHandler Using UpdateLog implementation: org.apache.solr.update.UpdateLog
   [junit4]   2> 1265127 INFO  (qtp498269459-16226) [n:127.0.0.1:34809_solr c:testMergeIntegration_collection s:shard1 r:core_node3 x:testMergeIntegration_collection_shard1_replica_n1] o.a.s.u.UpdateLog Initializing UpdateLog: dataDir=null defaultSyncLevel=FLUSH numRecordsToKeep=100 maxNumLogsToKeep=10 numVersionBuckets=65536
   [junit4]   2> 1265127 INFO  (qtp498269459-16151) [n:127.0.0.1:34809_solr c:testMergeIntegration_collection s:shard2 r:core_node7 x:testMergeIntegration_collection_shard2_replica_n4] o.a.s.u.UpdateHandler Using UpdateLog implementation: org.apache.solr.update.UpdateLog
   [junit4]   2> 1265127 INFO  (qtp498269459-16151) [n:127.0.0.1:34809_solr c:testMergeIntegration_collection s:shard2 r:core_node7 x:testMergeIntegration_collection_shard2_replica_n4] o.a.s.u.UpdateLog Initializing UpdateLog: dataDir=null defaultSyncLevel=FLUSH numRecordsToKeep=100 maxNumLogsToKeep=10 numVersionBuckets=65536
   [junit4]   2> 1265128 INFO  (qtp498269459-16226) [n:127.0.0.1:34809_solr c:testMergeIntegration_collection s:shard1 r:core_node3 x:testMergeIntegration_collection_shard1_replica_n1] o.a.s.u.CommitTracker Hard AutoCommit: disabled
   [junit4]   2> 1265128 INFO  (qtp498269459-16226) [n:127.0.0.1:34809_solr c:testMergeIntegration_collection s:shard1 r:core_node3 x:testMergeIntegration_collection_shard1_replica_n1] o.a.s.u.CommitTracker Soft AutoCommit: disabled
   [junit4]   2> 1265128 INFO  (qtp498269459-16151) [n:127.0.0.1:34809_solr c:testMergeIntegration_collection s:shard2 r:core_node7 x:testMergeIntegration_collection_shard2_replica_n4] o.a.s.u.CommitTracker Hard AutoCommit: disabled
   [junit4]   2> 1265128 INFO  (qtp498269459-16151) [n:127.0.0.1:34809_solr c:testMergeIntegration_collection s:shard2 r:core_node7 x:testMergeIntegration_collection_shard2_replica_n4] o.a.s.u.CommitTracker Soft AutoCommit: disabled
   [junit4]   2> 1265129 INFO  (qtp498269459-16151) [n:127.0.0.1:34809_solr c:testMergeIntegration_collection s:shard2 r:core_node7 x:testMergeIntegration_collection_shard2_replica_n4] o.a.s.s.SolrIndexSearcher Opening [Searcher@6bb50aa0[testMergeIntegration_collection_shard2_replica_n4] main]
   [junit4]   2> 1265129 INFO  (qtp498269459-16226) [n:127.0.0.1:34809_solr c:testMergeIntegration_collection s:shard1 r:core_node3 x:testMergeIntegration_collection_shard1_replica_n1] o.a.s.s.SolrIndexSearcher Opening [Searcher@6de7a12e[testMergeIntegration_collection_shard1_replica_n1] main]
   [junit4]   2> 1265130 INFO  (qtp498269459-16226) [n:127.0.0.1:34809_solr c:testMergeIntegration_collection s:shard1 r:core_node3 x:testMergeIntegration_collection_shard1_replica_n1] o.a.s.r.ManagedResourceStorage Configured ZooKeeperStorageIO with znodeBase: /configs/conf
   [junit4]   2> 1265130 INFO  (qtp498269459-16151) [n:127.0.0.1:34809_solr c:testMergeIntegration_collection s:shard2 r:core_node7 x:testMergeIntegration_collection_shard2_replica_n4] o.a.s.r.ManagedResourceStorage Configured ZooKeeperStorageIO with znodeBase: /configs/conf
   [junit4]   2> 1265130 INFO  (qtp498269459-16226) [n:127.0.0.1:34809_solr c:testMergeIntegration_collection s:shard1 r:core_node3 x:testMergeIntegration_collection_shard1_replica_n1] o.a.s.r.ManagedResourceStorage Loaded null at path _rest_managed.json using ZooKeeperStorageIO:path=/configs/conf
   [junit4]   2> 1265130 INFO  (qtp498269459-16151) [n:127.0.0.1:34809_solr c:testMergeIntegration_collection s:shard2 r:core_node7 x:testMergeIntegration_collection_shard2_replica_n4] o.a.s.r.ManagedResourceStorage Loaded null at path _rest_managed.json using ZooKeeperStorageIO:path=/configs/conf
   [junit4]   2> 1265131 INFO  (qtp498269459-16226) [n:127.0.0.1:34809_solr c:testMergeIntegration_collection s:shard1 r:core_node3 x:testMergeIntegration_collection_shard1_replica_n1] o.a.s.h.ReplicationHandler Commits will be reserved for 10000ms.
   [junit4]   2> 1265131 INFO  (qtp498269459-16226) [n:127.0.0.1:34809_solr c:testMergeIntegration_collection s:shard1 r:core_node3 x:testMergeIntegration_collection_shard1_replica_n1] o.a.s.u.UpdateLog Could not find max version in index or recent updates, using new clock 1610369716956692480
   [junit4]   2> 1265131 INFO  (qtp498269459-16151) [n:127.0.0.1:34809_solr c:testMergeIntegration_collection s:shard2 r:core_node7 x:testMergeIntegration_collection_shard2_replica_n4] o.a.s.h.ReplicationHandler Commits will be reserved for 10000ms.
   [junit4]   2> 1265131 INFO  (qtp498269459-16151) [n:127.0.0.1:34809_solr c:testMergeIntegration_collection s:shard2 r:core_node7 x:testMergeIntegration_collection_shard2_replica_n4] o.a.s.u.UpdateLog Could not find max version in index or recent updates, using new clock 1610369716956692480
   [junit4]   2> 1265131 INFO  (searcherExecutor-5516-thread-1-processing-n:127.0.0.1:34809_solr x:testMergeIntegration_collection_shard1_replica_n1 c:testMergeIntegration_collection s:shard1 r:core_node3) [n:127.0.0.1:34809_solr c:testMergeIntegration_collection s:shard1 r:core_node3 x:testMergeIntegration_collection_shard1_replica_n1] o.a.s.c.SolrCore [testMergeIntegration_collection_shard1_replica_n1] Registered new searcher Searcher@6de7a12e[testMergeIntegration_collection_shard1_replica_n1] main{ExitableDirectoryReader(UninvertingDirectoryReader())}
   [junit4]   2> 1265133 INFO  (searcherExecutor-5515-thread-1-processing-n:127.0.0.1:34809_solr x:testMergeIntegration_collection_shard2_replica_n4 c:testMergeIntegration_collection s:shard2 r:core_node7) [n:127.0.0.1:34809_solr c:testMergeIntegration_collection s:shard2 r:core_node7 x:testMergeIntegration_collection_shard2_replica_n4] o.a.s.c.SolrCore [testMergeIntegration_collection_shard2_replica_n4] Registered new searcher Searcher@6bb50aa0[testMergeIntegration_collection_shard2_replica_n4] main{ExitableDirectoryReader(UninvertingDirectoryReader())}
   [junit4]   2> 1265134 INFO  (qtp498269459-16226) [n:127.0.0.1:34809_solr c:testMergeIntegration_collection s:shard1 r:core_node3 x:testMergeIntegration_collection_shard1_replica_n1] o.a.s.c.ZkShardTerms Successful update of terms at /collections/testMergeIntegration_collection/terms/shard1 to Terms{values={core_node3=0}, version=0}
   [junit4]   2> 1265135 INFO  (qtp498269459-16151) [n:127.0.0.1:34809_solr c:testMergeIntegration_collection s:shard2 r:core_node7 x:testMergeIntegration_collection_shard2_replica_n4] o.a.s.c.ZkShardTerms Successful update of terms at /collections/testMergeIntegration_collection/terms/shard2 to Terms{values={core_node7=0}, version=0}
   [junit4]   2> 1265137 INFO  (qtp695588923-16158) [n:127.0.0.1:37923_solr c:testMergeIntegration_collection s:shard1 r:core_node5 x:testMergeIntegration_collection_shard1_replica_n2] o.a.s.u.UpdateHandler Using UpdateLog implementation: org.apache.solr.update.UpdateLog
   [junit4]   2> 1265137 INFO  (qtp695588923-16158) [n:127.0.0.1:37923_solr c:testMergeIntegration_collection s:shard1 r:core_node5 x:testMergeIntegration_collection_shard1_replica_n2] o.a.s.u.UpdateLog Initializing UpdateLog: dataDir=null defaultSyncLevel=FLUSH numRecordsToKeep=100 maxNumLogsToKeep=10 numVersionBuckets=65536
   [junit4]   2> 1265138 INFO  (qtp695588923-16158) [n:127.0.0.1:37923_solr c:testMergeIntegration_collection s:shard1 r:core_node5 x:testMergeIntegration_collection_shard1_replica_n2] o.a.s.u.CommitTracker Hard AutoCommit: disabled
   [junit4]   2> 1265138 INFO  (qtp695588923-16158) [n:127.0.0.1:37923_solr c:testMergeIntegration_collection s:shard1 r:core_node5 x:testMergeIntegration_collection_shard1_replica_n2] o.a.s.u.CommitTracker Soft AutoCommit: disabled
   [junit4]   2> 1265138 INFO  (qtp498269459-16226) [n:127.0.0.1:34809_solr c:testMergeIntegration_collection s:shard1 r:core_node3 x:testMergeIntegration_collection_shard1_replica_n1] o.a.s.c.ShardLeaderElectionContext Waiting until we see more replicas up for shard shard1: total=2 found=1 timeoutin=9999ms
   [junit4]   2> 1265139 INFO  (qtp498269459-16151) [n:127.0.0.1:34809_solr c:testMergeIntegration_collection s:shard2 r:core_node7 x:testMergeIntegration_collection_shard2_replica_n4] o.a.s.c.ShardLeaderElectionContext Waiting until we see more replicas up for shard shard2: total=2 found=1 timeoutin=9999ms
   [junit4]   2> 1265139 INFO  (qtp695588923-16158) [n:127.0.0.1:37923_solr c:testMergeIntegration_collection s:shard1 r:core_node5 x:testMergeIntegration_collection_shard1_replica_n2] o.a.s.s.SolrIndexSearcher Opening [Searcher@7106cd6b[testMergeIntegration_collection_shard1_replica_n2] main]
   [junit4]   2> 1265139 INFO  (qtp695588923-16160) [n:127.0.0.1:37923_solr c:testMergeIntegration_collection s:shard2 r:core_node8 x:testMergeIntegration_collection_shard2_replica_n6] o.a.s.u.UpdateHandler Using UpdateLog implementation: org.apache.solr.update.UpdateLog
   [junit4]   2> 1265139 INFO  (qtp695588923-16160) [n:127.0.0.1:37923_solr c:testMergeIntegration_collection s:shard2 r:core_node8 x:testMergeIntegration_collection_shard2_replica_n6] o.a.s.u.UpdateLog Initializing UpdateLog: dataDir=null defaultSyncLevel=FLUSH numRecordsToKeep=100 maxNumLogsToKeep=10 numVersionBuckets=65536
   [junit4]   2> 1265140 INFO  (qtp695588923-16158) [n:127.0.0.1:37923_solr c:testMergeIntegration_collection s:shard1 r:core_node5 x:testMergeIntegration_collection_shard1_replica_n2] o.a.s.r.ManagedResourceStorage Configured ZooKeeperStorageIO with znodeBase: /configs/conf
   [junit4]   2> 1265140 INFO  (qtp695588923-16158) [n:127.0.0.1:37923_solr c:testMergeIntegration_collection s:shard1 r:core_node5 x:testMergeIntegration_collection_shard1_replica_n2] o.a.s.r.ManagedResourceStorage Loaded null at path _rest_managed.json using ZooKeeperStorageIO:path=/configs/conf
   [junit4]   2> 1265140 INFO  (qtp695588923-16158) [n:127.0.0.1:37923_solr c:testMergeIntegration_collection s:shard1 r:core_node5 x:testMergeIntegration_collection_shard1_replica_n2] o.a.s.h.ReplicationHandler Commits will be reserved for 10000ms.
   [junit4]   2> 1265140 INFO  (qtp695588923-16158) [n:127.0.0.1:37923_solr c:testMergeIntegration_collection s:shard1 r:core_node5 x:testMergeIntegration_collection_shard1_replica_n2] o.a.s.u.UpdateLog Could not find max version in index or recent updates, using new clock 1610369716966129664
   [junit4]   2> 1265140 INFO  (qtp695588923-16160) [n:127.0.0.1:37923_solr c:testMergeIntegration_collection s:shard2 r:core_node8 x:testMergeIntegration_collection_shard2_replica_n6] o.a.s.u.CommitTracker Hard AutoCommit: disabled
   [junit4]   2> 1265140 INFO  (qtp695588923-16160) [n:127.0.0.1:37923_solr c:testMergeIntegration_collection s:shard2 r:core_node8 x:testMergeIntegration_collection_shard2_replica_n6] o.a.s.u.CommitTracker Soft AutoCommit: disabled
   [junit4]   2> 1265141 INFO  (searcherExecutor-5518-thread-1-processing-n:127.0.0.1:37923_solr x:testMergeIntegration_collection_shard1_replica_n2 c:testMergeIntegration_collection s:shard1 r:core_node5) [n:127.0.0.1:37923_solr c:testMergeIntegration_collection s:shard1 r:core_node5 x:testMergeIntegration_collection_shard1_replica_n2] o.a.s.c.SolrCore [testMergeIntegration_collection_shard1_replica_n2] Registered new searcher Searcher@7106cd6b[testMergeIntegration_collection_shard1_replica_n2] main{ExitableDirectoryReader(UninvertingDirectoryReader())}
   [junit4]   2> 1265141 INFO  (qtp695588923-16160) [n:127.0.0.1:37923_solr c:testMergeIntegration_collection s:shard2 r:core_node8 x:testMergeIntegration_collection_shard2_replica_n6] o.a.s.s.SolrIndexSearcher Opening [Searcher@2038dd26[testMergeIntegration_collection_shard2_replica_n6] main]
   [junit4]   2> 1265142 INFO  (qtp695588923-16160) [n:127.0.0.1:37923_solr c:testMergeIntegration_collection s:shard2 r:core_node8 x:testMergeIntegration_collection_shard2_replica_n6] o.a.s.r.ManagedResourceStorage Configured ZooKeeperStorageIO with znodeBase: /configs/conf
   [junit4]   2> 1265142 INFO  (qtp695588923-16160) [n:127.0.0.1:37923_solr c:testMergeIntegration_collection s:shard2 r:core_node8 x:testMergeIntegration_collection_shard2_replica_n6] o.a.s.r.ManagedResourceStorage Loaded null at path _rest_managed.json using ZooKeeperStorageIO:path=/configs/conf
   [junit4]   2> 1265142 INFO  (qtp695588923-16160) [n:127.0.0.1:37923_solr c:testMergeIntegration_collection s:shard2 r:core_node8 x:testMergeIntegration_collection_shard2_replica_n6] o.a.s.h.ReplicationHandler Commits will be reserved for 10000ms.
   [junit4]   2> 1265143 INFO  (searcherExecutor-5517-thread-1-processing-n:127.0.0.1:37923_solr x:testMergeIntegration_collection_shard2_replica_n6 c:testMergeIntegration_collection s:shard2 r:core_node8) [n:127.0.0.1:37923_solr c:testMergeIntegration_collection s:shard2 r:core_node8 x:testMergeIntegration_collection_shard2_replica_n6] o.a.s.c.SolrCore [testMergeIntegration_collection_shard2_replica_n6] Registered new searcher Searcher@2038dd26[testMergeIntegration_collection_shard2_replica_n6] main{ExitableDirectoryReader(UninvertingDirectoryReader())}
   [junit4]   2> 1265143 INFO  (qtp695588923-16160) [n:127.0.0.1:37923_solr c:testMergeIntegration_collection s:shard2 r:core_node8 x:testMergeIntegration_collection_shard2_replica_n6] o.a.s.u.UpdateLog Could not find max version in index or recent updates, using new clock 1610369716969275392
   [junit4]   2> 1265144 INFO  (qtp695588923-16158) [n:127.0.0.1:37923_solr c:testMergeIntegration_collection s:shard1 r:core_node5 x:testMergeIntegration_collection_shard1_replica_n2] o.a.s.c.ZkShardTerms Successful update of terms at /collections/testMergeIntegration_collection/terms/shard1 to Terms{values={core_node3=0, core_node5=0}, version=1}
   [junit4]   2> 1265146 INFO  (qtp695588923-16160) [n:127.0.0.1:37923_solr c:testMergeIntegration_collection s:shard2 r:core_node8 x:testMergeIntegration_collection_shard2_replica_n6] o.a.s.c.ZkShardTerms Successful update of terms at /collections/testMergeIntegration_collection/terms/shard2 to Terms{values={core_node7=0, core_node8=0}, version=1}
   [junit4]   2> 1265639 INFO  (qtp498269459-16226) [n:127.0.0.1:34809_solr c:testMergeIntegration_collection s:shard1 r:core_node3 x:testMergeIntegration_collection_shard1_replica_n1] o.a.s.c.ShardLeaderElectionContext Enough replicas found to continue.
   [junit4]   2> 1265639 INFO  (qtp498269459-16226) [n:127.0.0.1:34809_solr c:testMergeIntegration_collection s:shard1 r:core_node3 x:testMergeIntegration_collection_shard1_replica_n1] o.a.s.c.ShardLeaderElectionContext I may be the new leader - try and sync
   [junit4]   2> 1265639 INFO  (qtp498269459-16226) [n:127.0.0.1:34809_solr c:testMergeIntegration_collection s:shard1 r:core_node3 x:testMergeIntegration_collection_shard1_replica_n1] o.a.s.c.SyncStrategy Sync replicas to https://127.0.0.1:34809/solr/testMergeIntegration_collection_shard1_replica_n1/
   [junit4]   2> 1265639 INFO  (qtp498269459-16151) [n:127.0.0.1:34809_solr c:testMergeIntegration_collection s:shard2 r:core_node7 x:testMergeIntegration_collection_shard2_replica_n4] o.a.s.c.ShardLeaderElectionContext Enough replicas found to continue.
   [junit4]   2> 1265639 INFO  (qtp498269459-16151) [n:127.0.0.1:34809_solr c:testMergeIntegration_collection s:shard2 r:core_node7 x:testMergeIntegration_collection_shard2_replica_n4] o.a.s.c.ShardLeaderElectionContext I may be the new leader - try and sync
   [junit4]   2> 1265639 INFO  (qtp498269459-16151) [n:127.0.0.1:34809_solr c:testMergeIntegration_collection s:shard2 r:core_node7 x:testMergeIntegration_collection_shard2_replica_n4] o.a.s.c.SyncStrategy Sync replicas to https://127.0.0.1:34809/solr/testMergeIntegration_collection_shard2_replica_n4/
   [junit4]   2> 1265639 INFO  (qtp498269459-16226) [n:127.0.0.1:34809_solr c:testMergeIntegration_collection s:shard1 r:core_node3 x:testMergeIntegration_collection_shard1_replica_n1] o.a.s.u.PeerSync PeerSync: core=testMergeIntegration_collection_shard1_replica_n1 url=https://127.0.0.1:34809/solr START replicas=[https://127.0.0.1:37923/solr/testMergeIntegration_collection_shard1_replica_n2/] nUpdates=100
   [junit4]   2> 1265640 INFO  (qtp498269459-16151) [n:127.0.0.1:34809_solr c:testMergeIntegration_collection s:shard2 r:core_node7 x:testMergeIntegration_collection_shard2_replica_n4] o.a.s.u.PeerSync PeerSync: core=testMergeIntegration_collection_shard2_replica_n4 url=https://127.0.0.1:34809/solr START replicas=[https://127.0.0.1:37923/solr/testMergeIntegration_collection_shard2_replica_n6/] nUpdates=100
   [junit4]   2> 1265640 INFO  (qtp498269459-16226) [n:127.0.0.1:34809_solr c:testMergeIntegration_collection s:shard1 r:core_node3 x:testMergeIntegration_collection_shard1_replica_n1] o.a.s.u.PeerSync PeerSync: core=testMergeIntegration_collection_shard1_replica_n1 url=https://127.0.0.1:34809/solr DONE.  We have no versions.  sync failed.
   [junit4]   2> 1265640 INFO  (qtp498269459-16151) [n:127.0.0.1:34809_solr c:testMergeIntegration_collection s:shard2 r:core_node7 x:testMergeIntegration_collection_shard2_replica_n4] o.a.s.u.PeerSync PeerSync: core=testMergeIntegration_collection_shard2_replica_n4 url=https://127.0.0.1:34809/solr DONE.  We have no versions.  sync failed.
   [junit4]   2> 1265642 INFO  (qtp695588923-16145) [n:127.0.0.1:37923_solr c:testMergeIntegration_collection s:shard2 r:core_node8 x:testMergeIntegration_collection_shard2_replica_n6] o.a.s.c.S.Request [testMergeIntegration_collection_shard2_replica_n6]  webapp=/solr path=/get params={distrib=false&qt=/get&fingerprint=false&getVersions=100&wt=javabin&version=2} status=0 QTime=0
   [junit4]   2> 1265642 INFO  (qtp695588923-16149) [n:127.0.0.1:37923_solr c:testMergeIntegration_collection s:shard1 r:core_node5 x:testMergeIntegration_collection_shard1_replica_n2] o.a.s.c.S.Request [testMergeIntegration_collection_shard1_replica_n2]  webapp=/solr path=/get params={distrib=false&qt=/get&fingerprint=false&getVersions=100&wt=javabin&version=2} status=0 QTime=0
   [junit4]   2> 1265642 INFO  (qtp498269459-16226) [n:127.0.0.1:34809_solr c:testMergeIntegration_collection s:shard1 r:core_node3 x:testMergeIntegration_collection_shard1_replica_n1] o.a.s.c.SyncStrategy Leader's attempt to sync with shard failed, moving to the next candidate
   [junit4]   2> 1265642 INFO  (qtp498269459-16151) [n:127.0.0.1:34809_solr c:testMergeIntegration_collection s:shard2 r:core_node7 x:testMergeIntegration_collection_shard2_replica_n4] o.a.s.c.SyncStrategy Leader's attempt to sync with shard failed, moving to the next candidate
   [junit4]   2> 1265642 INFO  (qtp498269459-16226) [n:127.0.0.1:34809_solr c:testMergeIntegration_collection s:shard1 r:core_node3 x:testMergeIntegration_collection_shard1_replica_n1] o.a.s.c.ShardLeaderElectionContext We failed sync, but we have no versions - we can't sync in that case - we were active before, so become leader anyway
   [junit4]   2> 1265643 INFO  (qtp498269459-16151) [n:127.0.0.1:34809_solr c:testMergeIntegration_collection s:shard2 r:core_node7 x:testMergeIntegration_collection_shard2_replica_n4] o.a.s.c.ShardLeaderElectionContext We failed sync, but we have no versions - we can't sync in that case - we were active before, so become leader anyway
   [junit4]   2> 1265643 INFO  (qtp498269459-16226) [n:127.0.0.1:34809_solr c:testMergeIntegration_collection s:shard1 r:core_node3 x:testMergeIntegration_collection_shard1_replica_n1] o.a.s.c.ShardLeaderElectionContext Found all replicas participating in election, clear LIR
   [junit4]   2> 1265643 INFO  (qtp498269459-16151) [n:127.0.0.1:34809_solr c:testMergeIntegration_collection s:shard2 r:core_node7 x:testMergeIntegration_collection_shard2_replica_n4] o.a.s.c.ShardLeaderElectionContext Found all replicas participating in election, clear LIR
   [junit4]   2> 1265644 INFO  (qtp498269459-16226) [n:127.0.0.1:34809_solr c:testMergeIntegration_collection s:shard1 r:core_node3 x:testMergeIntegration_collection_shard1_replica_n1] o.a.s.c.ShardLeaderElectionContext I am the new leader: https://127.0.0.1:34809/solr/testMergeIntegration_collection_shard1_replica_n1/ shard1
   [junit4]   2> 1265644 INFO  (qtp498269459-16151) [n:127.0.0.1:34809_solr c:testMergeIntegration_collection s:shard2 r:core_node7 x:testMergeIntegration_collection_shard2_replica_n4] o.a.s.c.ShardLeaderElectionContext I am the new leader: https://127.0.0.1:34809/solr/testMergeIntegration_collection_shard2_replica_n4/ shard2
   [junit4]   2> 1265654 DEBUG (ScheduledTrigger-5501-thread-4) [    ] o.a.s.c.a.NodeLostTrigger Running NodeLostTrigger: .auto_add_replicas with currently live nodes: 2
   [junit4]   2> 1265746 INFO  (qtp498269459-16151) [n:127.0.0.1:34809_solr c:testMergeIntegration_collection s:shard2 r:core_node7 x:testMergeIntegration_collection_shard2_replica_n4] o.a.s.c.ZkController I am the leader, no recovery necessary
   [junit4]   2> 1265747 INFO  (qtp498269459-16151) [n:127.0.0.1:34809_solr c:testMergeIntegration_collection s:shard2 r:core_node7 x:testMergeIntegration_collection_shard2_replica_n4] o.a.s.s.HttpSolrCall [admin] webapp=null path=/admin/cores params={qt=/admin/cores&coreNodeName=core_node7&collection.configName=conf&newCollection=true&name=testMergeIntegration_collection_shard2_replica_n4&action=CREATE&numShards=2&collection=testMergeIntegration_collection&shard=shard2&wt=javabin&version=2&replicaType=NRT} status=0 QTime=1695
   [junit4]   2> 1265795 INFO  (qtp498269459-16226) [n:127.0.0.1:34809_solr c:testMergeIntegration_collection s:shard1 r:core_node3 x:testMergeIntegration_collection_shard1_replica_n1] o.a.s.c.ZkController I am the leader, no recovery necessary
   [junit4]   2> 1265797 INFO  (qtp498269459-16226) [n:127.0.0.1:34809_solr c:testMergeIntegration_collection s:shard1 r:core_node3 x:testMergeIntegration_collection_shard1_replica_n1] o.a.s.s.HttpSolrCall [admin] webapp=null path=/admin/cores params={qt=/admin/cores&coreNodeName=core_node3&collection.configName=conf&newCollection=true&name=testMergeIntegration_collection_shard1_replica_n1&action=CREATE&numShards=2&collection=testMergeIntegration_collection&shard=shard1&wt=javabin&version=2&replicaType=NRT} status=0 QTime=1746
   [junit4]   2> 1265897 INFO  (zkCallback-5872-thread-1) [    ] o.a.s.c.c.ZkStateReader A cluster state change: [WatchedEvent state:SyncConnected type:NodeDataChanged path:/collections/testMergeIntegration_collection/state.json] for collection [testMergeIntegration_collection] has occurred - updating... (live nodes size: [2])
   [junit4]   2> 1266147 INFO  (qtp695588923-16158) [n:127.0.0.1:37923_solr c:testMergeIntegration_collection s:shard1 r:core_node5 x:testMergeIntegration_collection_shard1_replica_n2] o.a.s.s.HttpSolrCall [admin] webapp=null path=/admin/cores params={qt=/admin/cores&coreNodeName=core_node5&collection.configName=conf&newCollection=true&name=testMergeIntegration_collection_shard1_replica_n2&action=CREATE&numShards=2&collection=testMergeIntegration_collection&shard=shard1&wt=javabin&version=2&replicaType=NRT} status=0 QTime=2090
   [junit4]   2> 1266148 INFO  (qtp695588923-16160) [n:127.0.0.1:37923_solr c:testMergeIntegration_collection s:shard2 r:core_node8 x:testMergeIntegration_collection_shard2_replica_n6] o.a.s.s.HttpSolrCall [admin] webapp=null path=/admin/cores params={qt=/admin/cores&coreNodeName=core_node8&collection.configName=conf&newCollection=true&name=testMergeIntegration_collection_shard2_replica_n6&action=CREATE&numShards=2&collection=testMergeIntegration_collection&shard=shard2&wt=javabin&version=2&replicaType=NRT} status=0 QTime=2088
   [junit4]   2> 1266149 INFO  (qtp498269459-16157) [n:127.0.0.1:34809_solr    ] o.a.s.h.a.CollectionsHandler Wait for new collection to be active for at most 30 seconds. Check all shard replicas
   [junit4]   2> 1266249 INFO  (zkCallback-5858-thread-1) [    ] o.a.s.c.c.ZkStateReader A cluster state change: [WatchedEvent state:SyncConnected type:NodeDataChanged path:/collections/testMergeIntegration_collection/state.json] for collection [testMergeIntegration_collection] has occurred - updating... (live nodes size: [2])
   [junit4]   2> 1266249 INFO  (zkCallback-5872-thread-1) [    ] o.a.s.c.c.ZkStateReader A cluster state change: [WatchedEvent state:SyncConnected type:NodeDataChanged path:/collections/testMergeIntegration_collection/state.json] for collection [testMergeIntegration_collection] has occurred - updating... (live nodes size: [2])
   [junit4]   2> 1266654 DEBUG (ScheduledTrigger-5501-thread-3) [    ] o.a.s.c.a.NodeLostTrigger Running NodeLostTrigger: .auto_add_replicas with currently live nodes: 2
   [junit4]   2> 1267150 INFO  (qtp498269459-16157) [n:127.0.0.1:34809_solr    ] o.a.s.s.HttpSolrCall [admin] webapp=null path=/admin/collections params={collection.configName=conf&maxShardsPerNode=2&name=testMergeIntegration_collection&nrtReplicas=2&action=CREATE&numShards=2&wt=javabin&version=2} status=0 QTime=3412
   [junit4]   2> 1267156 INFO  (qtp498269459-16155) [n:127.0.0.1:34809_solr c:testMergeIntegration_collection s:shard1 r:core_node3 x:testMergeIntegration_collection_shard1_replica_n1] o.a.s.c.ZkShardTerms Successful update of terms at /collections/testMergeIntegration_collection/terms/shard1 to Terms{values={core_node3=1, core_node5=1}, version=2}
   [junit4]   2> 1267159 INFO  (qtp695588923-16160) [n:127.0.0.1:37923_solr c:testMergeIntegration_collection s:shard1 r:core_node5 x:testMergeIntegration_collection_shard1_replica_n2] o.a.s.u.p.LogUpdateProcessorFactory [testMergeIntegration_collection_shard1_replica_n2]  webapp=/solr path=/update params={update.distrib=FROMLEADER&distrib.from=https://127.0.0.1:34809/solr/testMergeIntegration_collection_shard1_replica_n1/&wt=javabin&version=2}{add=[id-0 (1610369719076913152)]} 0 1
   [junit4]   2> 1267159 INFO  (qtp498269459-16155) [n:127.0.0.1:34809_solr c:testMergeIntegration_collection s:shard1 r:core_node3 x:testMergeIntegration_collection_shard1_replica_n1] o.a.s.u.p.LogUpdateProcessorFactory [testMergeIntegration_collection_shard1_replica_n1]  webapp=/solr path=/update params={wt=javabin&version=2}{add=[id-0 (1610369719076913152)]} 0 6
   [junit4]   2> 1267160 INFO  (qtp695588923-16156) [n:127.0.0.1:37923_solr c:testMergeIntegration_collection s:shard1 r:core_node5 x:testMergeIntegration_collection_shard1_replica_n2] o.a.s.u.p.LogUpdateProcessorFactory [testMergeIntegration_collection_shard1_replica_n2]  webapp=/solr path=/update params={update.distrib=FROMLEADER&distrib.from=https://127.0.0.1:34809/solr/testMergeIntegration_collection_shard1_replica_n1/&wt=javabin&version=2}{add=[id-100 (1610369719084253184)]} 0 0
   [junit4]   2> 1267161 INFO  (qtp498269459-16157) [n:127.0.0.1:34809_solr c:testMergeIntegration_collection s:shard1 r:core_node3 x:testMergeIntegration_collection_shard1_replica_n1] o.a.s.u.p.LogUpdateProcessorFactory [testMergeIntegration_collection_shard1_replica_n1]  webapp=/solr path=/update params={wt=javabin&version=2}{add=[id-100 (1610369719084253184)]} 0 0
   [junit4]   2> 1267162 INFO  (qtp695588923-16160) [n:127.0.0.1:37923_solr c:testMergeIntegration_collection s:shard1 r:core_node5 x:testMergeIntegration_collection_shard1_replica_n2] o.a.s.u.p.LogUpdateProcessorFactory [testMergeIntegration_collection_shard1_replica_n2]  webapp=/solr path=/update params={update.distrib=FROMLEADER&distrib.from=https://127.0.0.1:34809/solr/testMergeIntegration_collection_shard1_replica_n1/&wt=javabin&version=2}{add=[id-200 (1610369719085301760)]} 0 0
   [junit4]   2> 1267162 INFO  (qtp498269459-16155) [n:127.0.0.1:34809_solr c:testMergeIntegration_collection s:shard1 r:core_node3 x:testMergeIntegration_collection_shard1_replica_n1] o.a.s.u.p.LogUpdateProcessorFactory [testMergeIntegration_collection_shard1_replica_n1]  webapp=/solr path=/update params={wt=javabin&version=2}{add=[id-200 (1610369719085301760)]} 0 0
   [junit4]   2> 1267163 INFO  (qtp695588923-16156) [n:127.0.0.1:37923_solr c:testMergeIntegration_collection s:shard1 r:core_node5 x:testMergeIntegration_collection_shard1_replica_n2] o.a.s.u.p.LogUpdateProcessorFactory [testMergeIntegration_collection_shard1_replica_n2]  webapp=/solr path=/update params={update.distrib=FROMLEADER&distrib.from=https://127.0.0.1:34809/solr/testMergeIntegration_collection_shard1_replica_n1/&wt=javabin&version=2}{add=[id-300 (1610369719087398912)]} 0 0
   [junit4]   2> 1267163 INFO  (qtp498269459-16157) [n:127.0.0.1:34809_solr c:testMergeIntegration_collection s:shard1 r:core_node3 x:testMergeIntegration_collection_shard1_replica_n1] o.a.s.u.p.LogUpdateProcessorFactory [testMergeIntegration_collection_shard1_replica_n1]  webapp=/solr path=/update params={wt=javabin&version=2}{add=[id-300 (1610369719087398912)]} 0 0
   [junit4]   2> 1267165 INFO  (qtp695588923-16160) [n:127.0.0.1:37923_solr c:testMergeIntegration_collection s:shard1 r:core_node5 x:testMergeIntegration_collection_shard1_replica_n2] o.a.s.u.p.LogUpdateProcessorFactory [testMergeIntegration_collection_shard1_replica_n2]  webapp=/solr path=/update params={update.distrib=FROMLEADER&distrib.from=https://127.0.0.1:34809/solr/testMergeIntegration_collection_shard1_replica_n1/&wt=javabin&version=2}{add=[id-400 (1610369719088447488)]} 0 0
   [junit4]   2> 1267165 INFO  (qtp498269459-16155) [n:127.0.0.1:34809_solr c:testMergeIntegration_collection s:shard1 r:core_node3 x:testMergeIntegration_collection_shard1_replica_n1] o.a.s.u.p.LogUpdateProcessorFactory [testMergeIntegration_collection_shard1_replica_n1]  webapp=/solr path=/update params={wt=javabin&version=2}{add=[id-400 (1610369719088447488)]} 0 1
   [junit4]   2> 1267174 INFO  (qtp498269459-16157) [n:127.0.0.1:34809_solr c:testMergeIntegration_collection s:shard2 r:core_node7 x:testMergeIntegration_collection_shard2_replica_n4] o.a.s.c.ZkShardTerms Successful update of terms at /collections/testMergeIntegration_collection/terms/shard2 to Terms{values={core_node7=1, core_node8=1}, version=2}
   [junit4]   2> 1267175 INFO  (qtp695588923-16160) [n:127.0.0.1:37923_solr c:testMergeIntegration_collection s:shard2 r:core_node8 x:testMergeIntegration_collection_shard2_replica_n6] o.a.s.u.p.LogUpdateProcessorFactory [testMergeIntegration_collection_shard2_replica_n6]  webapp=/solr path=/update params={update.distrib=FROMLEADER&distrib.from=https://127.0.0.1:34809/solr/testMergeIntegration_collection_shard2_replica_n4/&wt=javabin&version=2}{add=[id-500 (1610369719090544640)]} 0 6
   [junit4]   2> 1267175 INFO  (qtp498269459-16157) [n:127.0.0.1:34809_solr c:testMergeIntegration_collection s:shard2 r:core_node7 x:testMergeIntegration_collection_shard2_replica_n4] o.a.s.u.p.LogUpdateProcessorFactory [testMergeIntegration_collection_shard2_replica_n4]  webapp=/solr path=/update params={wt=javabin&version=2}{add=[id-500 (1610369719090544640)]} 0 9
   [junit4]   2> 1267178 INFO  (qtp695588923-16156) [n:127.0.0.1:37923_solr c:testMergeIntegration_collection s:shard2 r:core_node8 x:testMergeIntegration_collection_shard2_replica_n6] o.a.s.u.p.LogUpdateProcessorFactory [testMergeIntegration_collection_shard2_replica_n6]  webapp=/solr path=/update params={update.distrib=FROMLEADER&distrib.from=https://127.0.0.1:34809/solr/testMergeIntegration_collection_shard2_replica_n4/&wt=javabin&version=2}{add=[id-600 (1610369719101030400)]} 0 1
   [junit4]   2> 1267178 INFO  (qtp498269459-16155) [n:127.0.0.1:34809_solr c:testMergeIntegration_collection s:shard2 r:core_node7 x:testMergeIntegration_collection_shard2_replica_n4] o.a.s.u.p.LogUpdateProcessorFactory [testMergeIntegration_collection_shard2_replica_n4]  webapp=/solr path=/update params={wt=javabin&version=2}{add=[id-600 (1610369719101030400)]} 0 2
   [junit4]   2> 1267179 INFO  (qtp695588923-16160) [n:127.0.0.1:37923_solr c:testMergeIntegration_collection s:shard2 r:core_node8 x:testMergeIntegration_collection_shard2_replica_n6] o.a.s.u.p.LogUpdateProcessorFactory [testMergeIntegration_collection_shard2_replica_n6]  webapp=/solr path=/update params={update.distrib=FROMLEADER&distrib.from=https://127.0.0.1:34809/solr/testMergeIntegration_collection_shard2_replica_n4/&wt=javabin&version=2}{add=[id-700 (1610369719104176128)]} 0 0
   [junit4]   2> 1267180 INFO  (qtp498269459-16157) [n:127.0.0.1:34809_solr c:testMergeIntegration_collection s:shard2 r:core_node7 x:testMergeIntegration_collection_shard2_replica_n4] o.a.s.u.p.LogUpdateProcessorFactory [testMergeIntegration_collection_shard2_replica_n4]  webapp=/solr path=/update params={wt=javabin&version=2}{add=[id-700 (1610369719104176128)]} 0 0
   [junit4]   2> 1267181 INFO  (qtp695588923-16156) [n:127.0.0.1:37923_solr c:testMergeIntegration_collection s:shard1 r:core_node5 x:testMergeIntegration_collection_shard1_replica_n2] o.a.s.u.p.LogUpdateProcessorFactory [testMergeIntegration_collection_shard1_replica_n2]  webapp=/solr path=/update params={update.distrib=FROMLEADER&distrib.from=https://127.0.0.1:34809/solr/testMergeIntegration_collection_shard1_replica_n1/&wt=javabin&version=2}{add=[id-800 (1610369719105224704)]} 0 0
   [junit4]   2> 1267181 INFO  (qtp498269459-16155) [n:127.0.0.1:34809_solr c:testMergeIntegration_collection s:shard1 r:core_node3 x:testMergeIntegration_collection_shard1_replica_n1] o.a.s.u.p.LogUpdateProcessorFactory [testMergeIntegration_collection_shard1_replica_n1]  webapp=/solr path=/update params={wt=javabin&version=2}{add=[id-800 (1610369719105224704)]} 0 0
   [junit4]   2> 1267182 INFO  (qtp695588923-16156) [n:127.0.0.1:37923_solr c:testMergeIntegration_collection s:shard1 r:core_node5 x:testMergeIntegration_collection_shard1_replica_n2] o.a.s.u.p.LogUpdateProcessorFactory [testMergeIntegration_collection_shard1_replica_n2]  webapp=/solr path=/update params={update.distrib=FROMLEADER&distrib.from=https://127.0.0.1:34809/solr/testMergeIntegration_collection_shard1_replica_n1/&wt=javabin&version=2}{add=[id-900 (1610369719107321856)]} 0 0
   [junit4]   2> 1267182 INFO  (qtp498269459-16157) [n:127.0.0.1:34809_solr c:testMergeIntegration_collection s:shard1 r:core_node3 x:testMergeIntegration_collection_shard1_replica_n1] o.a.s.u.p.LogUpdateProcessorFactory [testMergeIntegration_collection_shard1_replica_n1]  webapp=/solr path=/update params={wt=javabin&version=2}{add=[id-900 (1610369719107321856)]} 0 0
   [junit4]   2> 1267185 INFO  (qtp498269459-16226) [n:127.0.0.1:34809_solr c:testMergeIntegration_collection s:shard1 r:core_node3 x:testMergeIntegration_collection_shard1_replica_n1] o.a.s.u.DirectUpdateHandler2 start commit{_version_=1610369719110467584,optimize=false,openSearcher=true,waitSearcher=true,expungeDeletes=false,softCommit=false,prepareCommit=false}
   [junit4]   2> 1267185 INFO  (qtp498269459-16226) [n:127.0.0.1:34809_solr c:testMergeIntegration_collection s:shard1 r:core_node3 x:testMergeIntegration_collection_shard1_replica_n1] o.a.s.u.SolrIndexWriter Calling setCommitData with IW:org.apache.solr.update.SolrIndexWriter@696a915f commitCommandVersion:1610369719110467584
   [junit4]   2> 1267187 INFO  (qtp498269459-16226) [n:127.0.0.1:34809_solr c:testMergeIntegration_collection s:shard1 r:core_node3 x:testMergeIntegration_collection_shard1_replica_n1] o.a.s.s.SolrIndexSearcher Opening [Searcher@5a3b6065[testMergeIntegration_collection_shard1_replica_n1] main]
   [junit4]   2> 1267188 INFO  (qtp498269459-16226) [n:127.0.0.1:34809_solr c:testMergeIntegration_collection s:shard1 r:core_node3 x:testMergeIntegration_collection_shard1_replica_n1] o.a.s.u.DirectUpdateHandler2 end_commit_flush
   [junit4]   2> 1267189 INFO  (searcherExecutor-5516-thread-1-processing-n:127.0.0.1:34809_solr x:testMergeIntegration_collection_shard1_replica_n1 c:testMergeIntegration_collection s:shard1 r:core_node3) [n:127.0.0.1:34809_solr c:testMergeIntegration_collection s:shard1 r:core_node3 x:testMergeIntegration_collection_shard1_replica_n1] o.a.s.c.SolrCore [testMergeIntegration_collection_shard1_replica_n1] Registered new searcher Searcher@5a3b6065[testMergeIntegration_collection_shard1_replica_n1] main{ExitableDirectoryReader(UninvertingDirectoryReader(Uninverting(_0(8.0.0):C7)))}
   [junit4]   2> 1267202 INFO  (qtp498269459-16226) [n:127.0.0.1:34809_solr c:testMergeIntegration_collection s:shard1 r:core_node3 x:testMergeIntegration_collection_shard1_replica_n1] o.a.s.u.p.LogUpdateProcessorFactory [testMergeIntegration_collection_shard1_replica_n1]  webapp=/solr path=/update params={update.distrib=FROMLEADER&waitSearcher=true&openSearcher=true&commit=true&softCommit=false&distrib.from=https://127.0.0.1:34809/solr/testMergeIntegration_collection_shard2_replica_n4/&commit_end_point=true&wt=javabin&version=2&expungeDeletes=false}{commit=} 0 17
   [junit4]   2> 1267207 INFO  (qtp695588923-16160) [n:127.0.0.1:37923_solr c:testMergeIntegration_collection s:shard1 r:core_node5 x:testMergeIntegration_collection_shard1_replica_n2] o.a.s.u.DirectUpdateHandler2 start commit{_version_=1610369719133536256,optimize=false,openSearcher=true,waitSearcher=true,expungeDeletes=false,softCommit=false,prepareCommit=false}
   [junit4]   2> 1267207 INFO  (qtp695588923-16160) [n:127.0.0.1:37923_solr c:testMergeIntegration_collection s:shard1 r:core_node5 x:testMergeIntegration_collection_shard1_replica_n2] o.a.s.u.SolrIndexWriter Calling setCommitData with IW:org.apache.solr.update.SolrIndexWriter@370a2c25 commitCommandVersion:1610369719133536256
   [junit4]   2> 1267214 INFO  (qtp695588923-16160) [n:127.0.0.1:37923_solr c:testMergeIntegration_collection s:shard1 r:core_node5 x:testMergeIntegration_collection_shard1_replica_n2] o.a.s.s.SolrIndexSearcher Opening [Searcher@50a2fbe4[testMergeIntegration_collection_shard1_replica_n2] main]
   [junit4]   2> 1267214 INFO  (qtp695588923-16160) [n:127.0.0.1:37923_solr c:testMergeIntegration_collection s:shard1 r:core_node5 x:testMergeIntegration_collection_shard1_replica_n2] o.a.s.u.DirectUpdateHandler2 end_commit_flush
   [junit4]   2> 1267215 INFO  (qtp498269459-16226) [n:127.0.0.1:34809_solr c:testMergeIntegration_collection s:shard2 r:core_node7 x:testMergeIntegration_collection_shard2_replica_n4] o.a.s.u.DirectUpdateHandler2 start commit{_version_=1610369719141924864,optimize=false,openSearcher=true,waitSearcher=true,expungeDeletes=false,softCommit=false,prepareCommit=false}
   [junit4]   2> 1267215 INFO  (qtp498269459-16226) [n:127.0.0.1:34809_solr c:testMergeIntegration_collection s:shard2 r:core_node7 x:testMergeIntegration_collection_shard2_replica_n4] o.a.s.u.SolrIndexWriter Calling setCommitData with IW:org.apache.solr.update.SolrIndexWriter@3c0a9d1f commitCommandVersion:1610369719141924864
   [junit4]   2> 1267215 INFO  (searcherExecutor-5518-thread-1-processing-n:127.0.0.1:37923_solr x:testMergeIntegration_collection_shard1_replica_n2 c:testMergeIntegration_collection s:shard1 r:core_node5) [n:127.0.0.1:37923_solr c:testMergeIntegration_collection s:shard1 r:core_node5 x:testMergeIntegration_collection_shard1_replica_n2] o.a.s.c.SolrCore [testMergeIntegration_collection_shard1_replica_n2] Registered new searcher Searcher@50a2fbe4[testMergeIntegration_collection_shard1_replica_n2] main{ExitableDirectoryReader(UninvertingDirectoryReader(Uninverting(_0(8.0.0):C7)))}
   [junit4]   2> 1267215 INFO  (qtp695588923-16160) [n:127.0.0.1:37923_solr c:testMergeIntegration_collection s:shard1 r:core_node5 x:testMergeIntegration_collection_shard1_replica_n2] o.a.s.u.p.LogUpdateProcessorFactory [testMergeIntegration_collection_shard1_replica_n2]  webapp=/solr path=/update params={update.distrib=FROMLEADER&waitSearcher=true&openSearcher=true&commit=true&softCommit=false&distrib.from=https://127.0.0.1:34809/solr/testMergeIntegration_collection_shard2_replica_n4/&commit_end_point=true&wt=javabin&version=2&expungeDeletes=false}{commit=} 0 8
   [junit4]   2> 1267216 INFO  (qtp695588923-16230) [n:127.0.0.1:37923_solr c:testMergeIntegration_collection s:shard2 r:core_node8 x:testMergeIntegration_collection_shard2_replica_n6] o.a.s.u.DirectUpdateHandler2 start commit{_version_=1610369719142973440,optimize=false,openSearcher=true,waitSearcher=true,expungeDeletes=false,softCommit=false,prepareCommit=false}
   [junit4]   2> 1267216 INFO  (qtp695588923-16230) [n:127.0.0.1:37923_solr c:testMergeIntegration_collection s:shard2 r:core_node8 x:testMergeIntegration_collection_shard2_replica_n6] o.a.s.u.SolrIndexWriter Calling setCommitData with IW:org.apache.solr.update.SolrIndexWriter@79dcf12d commitCommandVersion:1610369719142973440
   [junit4]   2> 1267222 INFO  (qtp695588923-16230) [n:127.0.0.1:37923_solr c:testMergeIntegration_collection s:shard2 r:core_node8 x:testMergeIntegration_collection_shard2_replica_n6] o.a.s.s.SolrIndexSearcher Opening [Searcher@ce51ba6[testMergeIntegration_collection_shard2_replica_n6] main]
   [junit4]   2> 1267222 INFO  (qtp695588923-16230) [n:127.0.0.1:37923_solr c:testMergeIntegration_collection s:shard2 r:core_node8 x:testMergeIntegration_collection_shard2_replica_n6] o.a.s.u.DirectUpdateHandler2 end_commit_flush
   [junit4]   2> 1267222 INFO  (qtp498269459-16226) [n:127.0.0.1:34809_solr c:testMergeIntegration_collection s:shard2 r:core_node7 x:testMergeIntegration_collection_shard2_replica_n4] o.a.s.s.SolrIndexSearcher Opening [Searcher@42debb43[testMergeIntegration_collection_shard2_replica_n4] main]
   [junit4]   2> 1267223 INFO  (qtp498269459-16226) [n:127.0.0.1:34809_solr c:testMergeIntegration_collection s:shard2 r:core_node7 x:testMergeIntegration_collection_shard2_replica_n4] o.a.s.u.DirectUpdateHandler2 end_commit_flush
   [junit4]   2> 1267223 INFO  (searcherExecutor-5517-thread-1-processing-n:127.0.0.1:37923_solr x:testMergeIntegration_collection_shard2_replica_n6 c:testMergeIntegration_collection s:shard2 r:core_node8) [n:127.0.0.1:37923_solr c:testMergeIntegration_collection s:shard2 r:core_node8 x:testMergeIntegration_collection_shard2_replica_n6] o.a.s.c.SolrCore [testMergeIntegration_collection_shard2_replica_n6] Registered new searcher Searcher@ce51ba6[testMergeIntegration_collection_shard2_replica_n6] main{ExitableDirectoryReader(UninvertingDirectoryReader(Uninverting(_0(8.0.0):C3)))}
   [junit4]   2> 1267223 INFO  (qtp695588923-16230) [n:127.0.0.1:37923_solr c:testMergeIntegration_collection s:shard2 r:core_node8 x:testMergeIntegration_collection_shard2_replica_n6] o.a.s.u.p.LogUpdateProcessorFactory [testMergeIntegration_collection_shard2_replica_n6]  webapp=/solr path=/update params={update.distrib=FROMLEADER&waitSearcher=true&openSearcher=true&commit=true&softCommit=false&distrib.from=https://127.0.0.1:34809/solr/testMergeIntegration_collection_shard2_replica_n4/&commit_end_point=true&wt=javabin&version=2&expungeDeletes=false}{commit=} 0 7
   [junit4]   2> 1267223 INFO  (searcherExecutor-5515-thread-1-processing-n:127.0.0.1:34809_solr x:testMergeIntegration_collection_shard2_replica_n4 c:testMergeIntegration_collection s:shard2 r:core_node7) [n:127.0.0.1:34809_solr c:testMergeIntegration_collection s:shard2 r:core_node7 x:testMergeIntegration_collection_shard2_replica_n4] o.a.s.c.SolrCore [testMergeIntegration_collection_shard2_replica_n4] Registered new searcher Searcher@42debb43[testMergeIntegration_collection_shard2_replica_n4] main{ExitableDirectoryReader(UninvertingDirectoryReader(Uninverting(_0(8.0.0):C3)))}
   [junit4]   2> 1267224 INFO  (qtp498269459-16226) [n:127.0.0.1:34809_solr c:testMergeIntegration_collection s:shard2 r:core_node7 x:testMergeIntegration_collection_shard2_replica_n4] o.a.s.u.p.LogUpdateProcessorFactory [testMergeIntegration_collection_shard2_replica_n4]  webapp=/solr path=/update params={update.distrib=FROMLEADER&waitSearcher=true&openSearcher=true&commit=true&softCommit=false&distrib.from=https://127.0.0.1:34809/solr/testMergeIntegration_collection_shard2_replica_n4/&commit_end_point=true&wt=javabin&version=2&expungeDeletes=false}{commit=} 0 9
   [junit4]   2> 1267224 INFO  (qtp498269459-16155) [n:127.0.0.1:34809_solr c:testMergeIntegration_collection s:shard2 r:core_node7 x:testMergeIntegration_collection_shard2_replica_n4] o.a.s.u.p.LogUpdateProcessorFactory [testMergeIntegration_collection_shard2_replica_n4]  webapp=/solr path=/update params={_stateVer_=testMergeIntegration_collection:6&waitSearcher=true&commit=true&softCommit=false&wt=javabin&version=2}{commit=} 0 40
   [junit4]   2> 1267229 INFO  (qtp498269459-16226) [n:127.0.0.1:34809_solr    ] o.a.s.s.HttpSolrCall [admin] webapp=null path=/admin/metrics params={wt=javabin&version=2&key=solr.core.testMergeIntegration_collection.shard1.replica_n1:INDEX.sizeInBytes&key=solr.core.testMergeIntegration_collection.shard2.replica_n4:INDEX.sizeInBytes} status=0 QTime=0
   [junit4]   2> 1267230 INFO  (qtp498269459-16148) [n:127.0.0.1:34809_solr    ] o.a.s.s.HttpSolrCall [admin] webapp=null path=/admin/metrics params={prefix=CONTAINER.fs.usableSpace,CONTAINER.fs.totalSpace,CORE.coreName&wt=javabin&version=2&group=solr.node,solr.core} status=0 QTime=1
   [junit4]   2> 1267232 INFO  (qtp695588923-16230) [n:127.0.0.1:37923_solr    ] o.a.s.s.HttpSolrCall [admin] webapp=null path=/admin/metrics params={wt=javabin&version=2&key=solr.core.testMergeIntegration_collection.shard2.replica_n6:INDEX.sizeInBytes&key=solr.core.testMergeIntegration_collection.shard1.replica_n2:INDEX.sizeInBytes} status=0 QTime=0
   [junit4]   2> 1267233 INFO  (qtp695588923-16147) [n:127.0.0.1:37923_solr    ] o.a.s.s.HttpSolrCall [admin] webapp=null path=/admin/metrics params={prefix=CONTAINER.fs.usableSpace,CONTAINER.fs.totalSpace,CORE.coreName&wt=javabin&version=2&group=solr.node,solr.core} status=0 QTime=0
   [junit4]   2> 1267234 DEBUG (qtp498269459-16157) [n:127.0.0.1:34809_solr    ] o.a.s.c.a.AutoScalingHandler Verified autoscaling configuration
   [junit4]   2> 1267234 INFO  (qtp498269459-16157) [n:127.0.0.1:34809_solr    ] o.a.s.s.HttpSolrCall [admin] webapp=null path=/admin/autoscaling params={wt=javabin&version=2} status=0 QTime=9
   [junit4]   2> 1267234 DEBUG (zkCallback-5865-thread-1) [    ] o.a.s.c.a.OverseerTriggerThread Refreshing /autoscaling.json with znode version 2
   [junit4]   2> 1267235 DEBUG (OverseerAutoScalingTriggerThread-72146979559309316-127.0.0.1:37923_solr-n_0000000000) [    ] o.a.s.c.a.OverseerTriggerThread Processed trigger updates upto znodeVersion 2
   [junit4]   2> 1267236 DEBUG (OverseerAutoScalingTriggerThread-72146979559309316-127.0.0.1:37923_solr-n_0000000000) [    ] o.a.s.c.a.OverseerTriggerThread -- clean old nodeAdded markers
   [junit4]   2> 1267236 DEBUG (OverseerAutoScalingTriggerThread-72146979559309316-127.0.0.1:37923_solr-n_0000000000) [    ] o.a.s.c.a.OverseerTriggerThread Current znodeVersion 2, lastZnodeVersion 2
   [junit4]   2> 1267238 INFO  (qtp498269459-16226) [n:127.0.0.1:34809_solr    ] o.a.s.s.HttpSolrCall [admin] webapp=null path=/admin/metrics params={wt=javabin&version=2&key=solr.core.testMergeIntegration_collection.shard1.replica_n1:INDEX.sizeInBytes&key=solr.core.testMergeIntegration_collection.shard2.replica_n4:INDEX.sizeInBytes} status=0 QTime=0
   [junit4]   2> 1267239 INFO  (qtp498269459-16148) [n:127.0.0.1:34809_solr    ] o.a.s.s.HttpSolrCall [admin] webapp=null path=/admin/metrics params={prefix=CONTAINER.fs.usableSpace,CONTAINER.fs.totalSpace,CORE.coreName&wt=javabin&version=2&group=solr.node,solr.core} status=0 QTime=0
   [junit4]   2> 1267240 INFO  (qtp695588923-16230) [n:127.0.0.1:37923_solr    ] o.a.s.s.HttpSolrCall [admin] webapp=null path=/admin/metrics params={wt=javabin&version=2&key=solr.core.testMergeIntegration_collection.shard2.replica_n6:INDEX.sizeInBytes&key=solr.core.testMergeIntegration_collection.shard1.replica_n2:INDEX.sizeInBytes} status=0 QTime=0
   [junit4]   2> 1267241 INFO  (qtp695588923-16147) [n:127.0.0.1:37923_solr    ] o.a.s.s.HttpSolrCall [admin] webapp=null path=/admin/metrics params={prefix=CONTAINER.fs.usableSpace,CONTAINER.fs.totalSpace,CORE.coreName&wt=javabin&version=2&group=solr.node,solr.core} status=0 QTime=0
   [junit4]   2> 1267241 DEBUG (qtp498269459-16157) [n:127.0.0.1:34809_solr    ] o.a.s.c.a.AutoScalingHandler Verified autoscaling configuration
   [junit4]   2> 1267241 INFO  (qtp498269459-16157) [n:127.0.0.1:34809_solr    ] o.a.s.s.HttpSolrCall [admin] webapp=null path=/admin/autoscaling params={wt=javabin&version=2} status=0 QTime=5
   [junit4]   2> 1267242 DEBUG (zkCallback-5865-thread-1) [    ] o.a.s.c.a.OverseerTriggerThread Refreshing /autoscaling.json with znode version 3
   [junit4]   2> 1267242 DEBUG (OverseerAutoScalingTriggerThread-72146979559309316-127.0.0.1:37923_solr-n_0000000000) [    ] o.a.s.c.a.OverseerTriggerThread Processed trigger updates upto znodeVersion 3
   [junit4]   2> 1267242 DEBUG (OverseerAutoScalingTriggerThread-72146979559309316-127.0.0.1:37923_solr-n_0000000000) [    ] o.a.s.c.a.OverseerTriggerThread -- clean old nodeAdded markers
   [junit4]   2> 1267242 DEBUG (OverseerAutoScalingTriggerThread-72146979559309316-127.0.0.1:37923_solr-n_0000000000) [    ] o.a.s.c.a.OverseerTriggerThread Current znodeVersion 3, lastZnodeVersion 3
   [junit4]   2> 1267243 INFO  (qtp498269459-16148) [n:127.0.0.1:34809_solr    ] o.a.s.s.HttpSolrCall [admin] webapp=null path=/admin/metrics params={wt=javabin&version=2&key=solr.core.testMergeIntegration_collection.shard1.replica_n1:INDEX.sizeInBytes&key=solr.core.testMergeIntegration_collection.shard2.replica_n4:INDEX.sizeInBytes} status=0 QTime=0
   [junit4]   2> 1267245 INFO  (qtp498269459-16226) [n:127.0.0.1:34809_solr    ] o.a.s.s.HttpSolrCall [admin] webapp=null path=/admin/metrics params={prefix=CONTAINER.fs.usableSpace,CONTAINER.fs.totalSpace,CORE.coreName&wt=javabin&version=2&group=solr.node,solr.core} status=0 QTime=0
   [junit4]   2> 1267245 INFO  (qtp695588923-16230) [n:127.0.0.1:37923_solr    ] o.a.s.s.HttpSolrCall [admin] webapp=null path=/admin/metrics params={wt=javabin&version=2&key=solr.core.testMergeIntegration_collection.shard2.replica_n6:INDEX.sizeInBytes&key=solr.core.testMergeIntegration_collection.shard1.replica_n2:INDEX.sizeInBytes} status=0 QTime=0
   [junit4]   2> 1267246 INFO  (qtp695588923-16147) [n:127.0.0.1:37923_solr    ] o.a.s.s.HttpSolrCall [admin] webapp=null path=/admin/metrics params={prefix=CONTAINER.fs.usableSpace,CONTAINER.fs.totalSpace,CORE.coreName&wt=javabin&version=2&group=solr.node,solr.core} status=0 QTime=0
   [junit4]   2> 1267247 DEBUG (qtp498269459-16157) [n:127.0.0.1:34809_solr    ] o.a.s.c.a.AutoScalingHandler Verified autoscaling configuration
   [junit4]   2> 1267247 INFO  (qtp498269459-16157) [n:127.0.0.1:34809_solr    ] o.a.s.s.HttpSolrCall [admin] webapp=null path=/admin/autoscaling params={wt=javabin&version=2} status=0 QTime=5
   [junit4]   2> 1267247 DEBUG (zkCallback-5865-thr

[...truncated too long message...]

.c.c.ZkStateReader Updated live nodes from ZooKeeper... (2) -> (1)
   [junit4]   2> 230684 INFO  (zkCallback-80-thread-4) [    ] o.a.s.c.c.ZkStateReader Updated live nodes from ZooKeeper... (2) -> (1)
   [junit4]   2> 230684 INFO  (zkCallback-87-thread-1) [    ] o.a.s.c.c.ZkStateReader Updated live nodes from ZooKeeper... (2) -> (1)
   [junit4]   2> 230684 INFO  (jetty-closer-61-thread-2) [    ] o.a.s.m.SolrMetricManager Closing metric reporters for registry=solr.cluster, tag=null
   [junit4]   2> 230685 INFO  (zkCallback-72-thread-2) [    ] o.a.s.c.c.ZkStateReader Updated live nodes from ZooKeeper... (2) -> (1)
   [junit4]   2> 230686 INFO  (jetty-closer-61-thread-1) [    ] o.a.s.m.SolrMetricManager Closing metric reporters for registry=solr.jetty, tag=null
   [junit4]   2> 230686 INFO  (jetty-closer-61-thread-1) [    ] o.a.s.m.r.SolrJmxReporter Closing reporter [org.apache.solr.metrics.reporters.SolrJmxReporter@6fdee20: rootName = solr_34967, domain = solr.jetty, service url = null, agent id = null] for registry solr.jetty / com.codahale.metrics.MetricRegistry@9f3bcd2
   [junit4]   2> 230687 INFO  (jetty-closer-61-thread-1) [    ] o.a.s.c.ZkController Remove node as live in ZooKeeper:/live_nodes/127.0.0.1:34967_solr
   [junit4]   2> 230687 INFO  (jetty-closer-61-thread-1) [    ] o.a.s.m.SolrMetricManager Closing metric reporters for registry=solr.cluster, tag=null
   [junit4]   2> 230695 INFO  (zkCallback-87-thread-1) [    ] o.a.s.c.c.ZkStateReader Updated live nodes from ZooKeeper... (1) -> (0)
   [junit4]   2> 230695 INFO  (zkCallback-93-thread-1) [    ] o.a.s.c.c.ZkStateReader Updated live nodes from ZooKeeper... (1) -> (0)
   [junit4]   2> 230695 INFO  (zkCallback-72-thread-2) [    ] o.a.s.c.c.ZkStateReader Updated live nodes from ZooKeeper... (1) -> (0)
   [junit4]   2> 230695 INFO  (zkCallback-80-thread-1) [    ] o.a.s.c.c.ZkStateReader Updated live nodes from ZooKeeper... (1) -> (0)
   [junit4]   2> 230699 INFO  (jetty-closer-61-thread-1) [    ] o.a.s.c.Overseer Overseer (id=72147159610294278-127.0.0.1:34967_solr-n_0000000000) closing
   [junit4]   2> 230699 INFO  (OverseerStateUpdate-72147159610294278-127.0.0.1:34967_solr-n_0000000000) [n:127.0.0.1:34967_solr    ] o.a.s.c.Overseer Overseer Loop exiting : 127.0.0.1:34967_solr
   [junit4]   2> 230699 DEBUG (jetty-closer-61-thread-1) [    ] o.a.s.c.a.ScheduledTriggers Shutting down scheduled thread pool executor now
   [junit4]   2> 230699 WARN  (OverseerAutoScalingTriggerThread-72147159610294278-127.0.0.1:34967_solr-n_0000000000) [    ] o.a.s.c.a.OverseerTriggerThread OverseerTriggerThread woken up but we are closed, exiting.
   [junit4]   2> 230699 DEBUG (jetty-closer-61-thread-1) [    ] o.a.s.c.a.ScheduledTriggers Shutting down action executor now
   [junit4]   2> 230699 DEBUG (jetty-closer-61-thread-1) [    ] o.a.s.c.a.ScheduledTriggers Awaiting termination for action executor
   [junit4]   2> 230699 DEBUG (jetty-closer-61-thread-1) [    ] o.a.s.c.a.ScheduledTriggers Awaiting termination for scheduled thread pool executor
   [junit4]   2> 230702 INFO  (jetty-closer-61-thread-2) [    ] o.e.j.s.h.ContextHandler Stopped o.e.j.s.ServletContextHandler@6d0e2afa{/solr,null,UNAVAILABLE}
   [junit4]   2> 230702 INFO  (jetty-closer-61-thread-2) [    ] o.e.j.s.session node0 Stopped scavenging
   [junit4]   2> 230703 DEBUG (jetty-closer-61-thread-1) [    ] o.a.s.c.a.ScheduledTriggers ScheduledTriggers closed completely
   [junit4]   2> 230703 DEBUG (jetty-closer-61-thread-1) [    ] o.a.s.c.a.OverseerTriggerThread OverseerTriggerThread has been closed explicitly
   [junit4]   2> 230707 INFO  (jetty-closer-61-thread-1) [    ] o.e.j.s.h.ContextHandler Stopped o.e.j.s.ServletContextHandler@52ddad7b{/solr,null,UNAVAILABLE}
   [junit4]   2> 230708 INFO  (jetty-closer-61-thread-1) [    ] o.e.j.s.session node0 Stopped scavenging
   [junit4]   2> 230708 ERROR (SUITE-IndexSizeTriggerTest-seed#[35E32909679F42CC]-worker) [    ] o.a.z.s.ZooKeeperServer ZKShutdownHandler is not registered, so ZooKeeper server won't take any action on ERROR or SHUTDOWN server state changes
   [junit4]   2> 230708 INFO  (SUITE-IndexSizeTriggerTest-seed#[35E32909679F42CC]-worker) [    ] o.a.s.c.ZkTestServer connecting to 127.0.0.1:40017 40017
   [junit4]   2> 230814 INFO  (Thread-45) [    ] o.a.s.c.ZkTestServer connecting to 127.0.0.1:40017 40017
   [junit4]   2> 230815 WARN  (Thread-45) [    ] o.a.s.c.ZkTestServer Watch limit violations: 
   [junit4]   2> Maximum concurrent create/delete watches above limit:
   [junit4]   2> 
   [junit4]   2> 	13	/solr/collections/testSplitIntegration_collection/terms/shard2_1
   [junit4]   2> 	13	/solr/collections/testSplitIntegration_collection/terms/shard1_0
   [junit4]   2> 	13	/solr/collections/testMixedBounds_collection/terms/shard1_1
   [junit4]   2> 	12	/solr/collections/testMixedBounds_collection/terms/shard2_1
   [junit4]   2> 	12	/solr/collections/testMixedBounds_collection/terms/shard2_0_1
   [junit4]   2> 	10	/solr/collections/testTrigger_collection/terms/shard1
   [junit4]   2> 	10	/solr/collections/testMergeIntegration_collection/terms/shard2
   [junit4]   2> 	10	/solr/collections/testMixedBounds_collection/terms/shard1
   [junit4]   2> 	10	/solr/collections/testMergeIntegration_collection/terms/shard1
   [junit4]   2> 	10	/solr/collections/testMixedBounds_collection/terms/shard2
   [junit4]   2> 	10	/solr/collections/testSplitIntegration_collection/terms/shard2
   [junit4]   2> 	10	/solr/collections/testSplitIntegration_collection/terms/shard1
   [junit4]   2> 	9	/solr/collections/testSplitIntegration_collection/terms/shard1_1
   [junit4]   2> 	9	/solr/collections/testSplitIntegration_collection/terms/shard2_0
   [junit4]   2> 	9	/solr/collections/testTrigger_collection/terms/shard2
   [junit4]   2> 	9	/solr/collections/testMixedBounds_collection/terms/shard2_0
   [junit4]   2> 	9	/solr/aliases.json
   [junit4]   2> 	9	/solr/collections/testMixedBounds_collection/terms/shard1_0
   [junit4]   2> 	8	/solr/collections/testMixedBounds_collection/terms/shard2_0_0
   [junit4]   2> 	8	/solr/configs/conf
   [junit4]   2> 	2	/solr/security.json
   [junit4]   2> 
   [junit4]   2> Maximum concurrent data watches above limit:
   [junit4]   2> 
   [junit4]   2> 	10	/solr/aliases.json
   [junit4]   2> 	9	/solr/clusterprops.json
   [junit4]   2> 	9	/solr/clusterstate.json
   [junit4]   2> 	6	/solr/collections/testSplitIntegration_collection/state.json
   [junit4]   2> 	5	/solr/collections/testMergeIntegration_collection/state.json
   [junit4]   2> 	4	/solr/collections/testTrigger_collection/state.json
   [junit4]   2> 	3	/solr/collections/testMixedBounds_collection/state.json
   [junit4]   2> 
   [junit4]   2> Maximum concurrent children watches above limit:
   [junit4]   2> 
   [junit4]   2> 	25	/solr/collections
   [junit4]   2> 	9	/solr/live_nodes
   [junit4]   2> 
   [junit4]   2> NOTE: leaving temporary files on disk at: /home/jenkins/workspace/Lucene-Solr-master-Linux/solr/build/solr-core/test/J1/temp/solr.cloud.autoscaling.IndexSizeTriggerTest_35E32909679F42CC-001
   [junit4]   2> Sep 01, 2018 3:04:57 AM com.carrotsearch.randomizedtesting.ThreadLeakControl checkThreadLeaks
   [junit4]   2> WARNING: Will linger awaiting termination of 1 leaked thread(s).
   [junit4]   2> NOTE: test params are: codec=Asserting(Lucene80): {foo=PostingsFormat(name=MockRandom), id=PostingsFormat(name=LuceneVarGapDocFreqInterval)}, docValues:{_version_=DocValuesFormat(name=Direct), foo=DocValuesFormat(name=Asserting), id=DocValuesFormat(name=Lucene70)}, maxPointsInLeafNode=656, maxMBSortInHeap=6.638491463638616, sim=Asserting(org.apache.lucene.search.similarities.AssertingSimilarity@96df2a5), locale=fr-SC, timezone=Antarctica/Syowa
   [junit4]   2> NOTE: Linux 4.15.0-32-generic amd64/Oracle Corporation 10.0.1 (64-bit)/cpus=8,threads=1,free=255096736,total=490733568
   [junit4]   2> NOTE: All tests run in this JVM: [IndexSizeTriggerTest, IndexSizeTriggerTest]
   [junit4] Completed [5/5 (1!)] on J1 in 113.96s, 4 tests, 1 failure <<< FAILURES!

[...truncated 11 lines...]
BUILD FAILED
/home/jenkins/workspace/Lucene-Solr-master-Linux/lucene/common-build.xml:1568: The following error occurred while executing this line:
/home/jenkins/workspace/Lucene-Solr-master-Linux/lucene/common-build.xml:1092: There were test failures: 5 suites, 20 tests, 1 failure [seed: 35E32909679F42CC]

Total time: 3 minutes 54 seconds

[repro] Setting last failure code to 256

[repro] Failures:
[repro]   1/5 failed: org.apache.solr.cloud.autoscaling.IndexSizeTriggerTest
[repro] Exiting with code 256
+ mv lucene/build lucene/build.repro
+ mv solr/build solr/build.repro
+ mv lucene/build.orig lucene/build
+ mv solr/build.orig solr/build
Archiving artifacts
Setting ANT_1_8_2_HOME=/var/lib/jenkins/tools/hudson.tasks.Ant_AntInstallation/ANT_1.8.2
[WARNINGS] Parsing warnings in console log with parser Java Compiler (javac)
Setting ANT_1_8_2_HOME=/var/lib/jenkins/tools/hudson.tasks.Ant_AntInstallation/ANT_1.8.2
Setting ANT_1_8_2_HOME=/var/lib/jenkins/tools/hudson.tasks.Ant_AntInstallation/ANT_1.8.2
<Git Blamer> Using GitBlamer to create author and commit information for all warnings.
<Git Blamer> GIT_COMMIT=4d78db26be21727fa29b0c055f24e0bac625e017, workspace=/var/lib/jenkins/workspace/Lucene-Solr-master-Linux
[WARNINGS] Computing warning deltas based on reference build #22779
Recording test results
Setting ANT_1_8_2_HOME=/var/lib/jenkins/tools/hudson.tasks.Ant_AntInstallation/ANT_1.8.2
Build step 'Publish JUnit test result report' changed build result to UNSTABLE
Email was triggered for: Unstable (Test Failures)
Sending email for trigger: Unstable (Test Failures)
Setting ANT_1_8_2_HOME=/var/lib/jenkins/tools/hudson.tasks.Ant_AntInstallation/ANT_1.8.2
Setting ANT_1_8_2_HOME=/var/lib/jenkins/tools/hudson.tasks.Ant_AntInstallation/ANT_1.8.2
Setting ANT_1_8_2_HOME=/var/lib/jenkins/tools/hudson.tasks.Ant_AntInstallation/ANT_1.8.2
Setting ANT_1_8_2_HOME=/var/lib/jenkins/tools/hudson.tasks.Ant_AntInstallation/ANT_1.8.2

Mime
View raw message