lucene-dev mailing list archives

Site index · List index
Message view « Date » · « Thread »
Top « Date » · « Thread »
From Apache Jenkins Server <jenk...@builds.apache.org>
Subject [JENKINS] Lucene-Solr-NightlyTests-master - Build # 1651 - Failure
Date Fri, 28 Sep 2018 12:07:45 GMT
Build: https://builds.apache.org/job/Lucene-Solr-NightlyTests-master/1651/

5 tests failed.
FAILED:  org.apache.lucene.index.TestIndexWriterDelete.testUpdatesOnDiskFull

Error Message:
Test abandoned because suite timeout was reached.

Stack Trace:
java.lang.Exception: Test abandoned because suite timeout was reached.
	at __randomizedtesting.SeedInfo.seed([9F8B417443135BE6]:0)


FAILED:  junit.framework.TestSuite.org.apache.lucene.index.TestIndexWriterDelete

Error Message:
Suite timeout exceeded (>= 7200000 msec).

Stack Trace:
java.lang.Exception: Suite timeout exceeded (>= 7200000 msec).
	at __randomizedtesting.SeedInfo.seed([9F8B417443135BE6]:0)


FAILED:  org.apache.lucene.document.TestLatLonLineShapeQueries.testRandomBig

Error Message:
Java heap space

Stack Trace:
java.lang.OutOfMemoryError: Java heap space
	at __randomizedtesting.SeedInfo.seed([9EFA06E36489750C:19AD7B6CF5D0098C]:0)
	at java.util.Arrays.copyOf(Arrays.java:3332)
	at java.lang.AbstractStringBuilder.ensureCapacityInternal(AbstractStringBuilder.java:124)
	at java.lang.AbstractStringBuilder.append(AbstractStringBuilder.java:448)
	at java.lang.StringBuilder.append(StringBuilder.java:136)
	at org.apache.lucene.index.CorruptIndexException.<init>(CorruptIndexException.java:62)
	at org.apache.lucene.index.CorruptIndexException.<init>(CorruptIndexException.java:47)
	at org.apache.lucene.codecs.CodecUtil.checkFooter(CodecUtil.java:471)
	at org.apache.lucene.util.bkd.BKDWriter.verifyChecksum(BKDWriter.java:1412)
	at org.apache.lucene.util.bkd.BKDWriter.build(BKDWriter.java:1835)
	at org.apache.lucene.util.bkd.BKDWriter.build(BKDWriter.java:1854)
	at org.apache.lucene.util.bkd.BKDWriter.finish(BKDWriter.java:1007)
	at org.apache.lucene.index.RandomCodec$1$1.writeField(RandomCodec.java:139)
	at org.apache.lucene.codecs.PointsWriter.mergeOneField(PointsWriter.java:62)
	at org.apache.lucene.codecs.PointsWriter.merge(PointsWriter.java:186)
	at org.apache.lucene.codecs.lucene60.Lucene60PointsWriter.merge(Lucene60PointsWriter.java:144)
	at org.apache.lucene.codecs.asserting.AssertingPointsFormat$AssertingPointsWriter.merge(AssertingPointsFormat.java:142)
	at org.apache.lucene.index.SegmentMerger.mergePoints(SegmentMerger.java:201)
	at org.apache.lucene.index.SegmentMerger.merge(SegmentMerger.java:161)
	at org.apache.lucene.index.IndexWriter.mergeMiddle(IndexWriter.java:4453)
	at org.apache.lucene.index.IndexWriter.merge(IndexWriter.java:4075)
	at org.apache.lucene.index.SerialMergeScheduler.merge(SerialMergeScheduler.java:40)
	at org.apache.lucene.index.IndexWriter.maybeMerge(IndexWriter.java:2178)
	at org.apache.lucene.index.IndexWriter.forceMerge(IndexWriter.java:2011)
	at org.apache.lucene.index.IndexWriter.forceMerge(IndexWriter.java:1962)
	at org.apache.lucene.document.BaseLatLonShapeTestCase.indexRandomShapes(BaseLatLonShapeTestCase.java:226)
	at org.apache.lucene.document.BaseLatLonShapeTestCase.verify(BaseLatLonShapeTestCase.java:192)
	at org.apache.lucene.document.BaseLatLonShapeTestCase.doTestRandom(BaseLatLonShapeTestCase.java:173)
	at org.apache.lucene.document.BaseLatLonShapeTestCase.testRandomBig(BaseLatLonShapeTestCase.java:149)
	at sun.reflect.NativeMethodAccessorImpl.invoke0(Native Method)
	at sun.reflect.NativeMethodAccessorImpl.invoke(NativeMethodAccessorImpl.java:62)
	at sun.reflect.DelegatingMethodAccessorImpl.invoke(DelegatingMethodAccessorImpl.java:43)
	at java.lang.reflect.Method.invoke(Method.java:498)


FAILED:  org.apache.solr.cloud.autoscaling.sim.TestSimExtremeIndexing.testScaleUp

Error Message:
{numFound=900725000,start=0,docs=[]} expected:<1000000000> but was:<900725000>

Stack Trace:
java.lang.AssertionError: {numFound=900725000,start=0,docs=[]} expected:<1000000000> but was:<900725000>
	at __randomizedtesting.SeedInfo.seed([A588F677BD53BB3B:84D6B0D5B17D659A]:0)
	at org.junit.Assert.fail(Assert.java:93)
	at org.junit.Assert.failNotEquals(Assert.java:647)
	at org.junit.Assert.assertEquals(Assert.java:128)
	at org.junit.Assert.assertEquals(Assert.java:472)
	at org.apache.solr.cloud.autoscaling.sim.TestSimExtremeIndexing.testScaleUp(TestSimExtremeIndexing.java:121)
	at sun.reflect.NativeMethodAccessorImpl.invoke0(Native Method)
	at sun.reflect.NativeMethodAccessorImpl.invoke(NativeMethodAccessorImpl.java:62)
	at sun.reflect.DelegatingMethodAccessorImpl.invoke(DelegatingMethodAccessorImpl.java:43)
	at java.lang.reflect.Method.invoke(Method.java:498)
	at com.carrotsearch.randomizedtesting.RandomizedRunner.invoke(RandomizedRunner.java:1742)
	at com.carrotsearch.randomizedtesting.RandomizedRunner$8.evaluate(RandomizedRunner.java:935)
	at com.carrotsearch.randomizedtesting.RandomizedRunner$9.evaluate(RandomizedRunner.java:971)
	at com.carrotsearch.randomizedtesting.RandomizedRunner$10.evaluate(RandomizedRunner.java:985)
	at com.carrotsearch.randomizedtesting.rules.SystemPropertiesRestoreRule$1.evaluate(SystemPropertiesRestoreRule.java:57)
	at org.apache.lucene.util.TestRuleSetupTeardownChained$1.evaluate(TestRuleSetupTeardownChained.java:49)
	at org.apache.lucene.util.AbstractBeforeAfterRule$1.evaluate(AbstractBeforeAfterRule.java:45)
	at org.apache.lucene.util.TestRuleThreadAndTestName$1.evaluate(TestRuleThreadAndTestName.java:48)
	at org.apache.lucene.util.TestRuleIgnoreAfterMaxFailures$1.evaluate(TestRuleIgnoreAfterMaxFailures.java:64)
	at org.apache.lucene.util.TestRuleMarkFailure$1.evaluate(TestRuleMarkFailure.java:47)
	at com.carrotsearch.randomizedtesting.rules.StatementAdapter.evaluate(StatementAdapter.java:36)
	at com.carrotsearch.randomizedtesting.ThreadLeakControl$StatementRunner.run(ThreadLeakControl.java:368)
	at com.carrotsearch.randomizedtesting.ThreadLeakControl.forkTimeoutingTask(ThreadLeakControl.java:817)
	at com.carrotsearch.randomizedtesting.ThreadLeakControl$3.evaluate(ThreadLeakControl.java:468)
	at com.carrotsearch.randomizedtesting.RandomizedRunner.runSingleTest(RandomizedRunner.java:944)
	at com.carrotsearch.randomizedtesting.RandomizedRunner$5.evaluate(RandomizedRunner.java:830)
	at com.carrotsearch.randomizedtesting.RandomizedRunner$6.evaluate(RandomizedRunner.java:880)
	at com.carrotsearch.randomizedtesting.RandomizedRunner$7.evaluate(RandomizedRunner.java:891)
	at com.carrotsearch.randomizedtesting.rules.StatementAdapter.evaluate(StatementAdapter.java:36)
	at com.carrotsearch.randomizedtesting.rules.SystemPropertiesRestoreRule$1.evaluate(SystemPropertiesRestoreRule.java:57)
	at org.apache.lucene.util.AbstractBeforeAfterRule$1.evaluate(AbstractBeforeAfterRule.java:45)
	at com.carrotsearch.randomizedtesting.rules.StatementAdapter.evaluate(StatementAdapter.java:36)
	at org.apache.lucene.util.TestRuleStoreClassName$1.evaluate(TestRuleStoreClassName.java:41)
	at com.carrotsearch.randomizedtesting.rules.NoShadowingOrOverridesOnMethodsRule$1.evaluate(NoShadowingOrOverridesOnMethodsRule.java:40)
	at com.carrotsearch.randomizedtesting.rules.NoShadowingOrOverridesOnMethodsRule$1.evaluate(NoShadowingOrOverridesOnMethodsRule.java:40)
	at com.carrotsearch.randomizedtesting.rules.StatementAdapter.evaluate(StatementAdapter.java:36)
	at com.carrotsearch.randomizedtesting.rules.StatementAdapter.evaluate(StatementAdapter.java:36)
	at com.carrotsearch.randomizedtesting.rules.StatementAdapter.evaluate(StatementAdapter.java:36)
	at org.apache.lucene.util.TestRuleAssertionsRequired$1.evaluate(TestRuleAssertionsRequired.java:53)
	at org.apache.lucene.util.TestRuleMarkFailure$1.evaluate(TestRuleMarkFailure.java:47)
	at org.apache.lucene.util.TestRuleIgnoreAfterMaxFailures$1.evaluate(TestRuleIgnoreAfterMaxFailures.java:64)
	at org.apache.lucene.util.TestRuleIgnoreTestSuites$1.evaluate(TestRuleIgnoreTestSuites.java:54)
	at com.carrotsearch.randomizedtesting.rules.StatementAdapter.evaluate(StatementAdapter.java:36)
	at com.carrotsearch.randomizedtesting.ThreadLeakControl$StatementRunner.run(ThreadLeakControl.java:368)
	at java.lang.Thread.run(Thread.java:748)


FAILED:  org.apache.solr.uninverting.TestDocTermOrdsUninvertLimit.testTriggerUnInvertLimit

Error Message:
GC overhead limit exceeded

Stack Trace:
java.lang.OutOfMemoryError: GC overhead limit exceeded
	at __randomizedtesting.SeedInfo.seed([A588F677BD53BB3B:963ADEB3B0E4618C]:0)
	at org.apache.lucene.codecs.memory.DirectPostingsFormat$DirectField.<init>(DirectPostingsFormat.java:460)
	at org.apache.lucene.codecs.memory.DirectPostingsFormat$DirectFields.<init>(DirectPostingsFormat.java:131)
	at org.apache.lucene.codecs.memory.DirectPostingsFormat.fieldsProducer(DirectPostingsFormat.java:115)
	at org.apache.lucene.codecs.perfield.PerFieldPostingsFormat$FieldsReader.<init>(PerFieldPostingsFormat.java:293)
	at org.apache.lucene.codecs.perfield.PerFieldPostingsFormat.fieldsProducer(PerFieldPostingsFormat.java:373)
	at org.apache.lucene.index.SegmentCoreReaders.<init>(SegmentCoreReaders.java:113)
	at org.apache.lucene.index.SegmentReader.<init>(SegmentReader.java:83)
	at org.apache.lucene.index.ReadersAndUpdates.getReader(ReadersAndUpdates.java:172)
	at org.apache.lucene.index.IndexWriter.mergeMiddle(IndexWriter.java:4598)
	at org.apache.lucene.index.IndexWriter.merge(IndexWriter.java:4075)
	at org.apache.lucene.index.SerialMergeScheduler.merge(SerialMergeScheduler.java:40)
	at org.apache.lucene.index.IndexWriter.maybeMerge(IndexWriter.java:2178)
	at org.apache.lucene.index.IndexWriter.processEvents(IndexWriter.java:5110)
	at org.apache.lucene.index.IndexWriter.updateDocument(IndexWriter.java:1620)
	at org.apache.lucene.index.IndexWriter.addDocument(IndexWriter.java:1236)
	at org.apache.lucene.index.RandomIndexWriter.addDocument(RandomIndexWriter.java:189)
	at org.apache.solr.uninverting.TestDocTermOrdsUninvertLimit.testTriggerUnInvertLimit(TestDocTermOrdsUninvertLimit.java:64)
	at sun.reflect.NativeMethodAccessorImpl.invoke0(Native Method)
	at sun.reflect.NativeMethodAccessorImpl.invoke(NativeMethodAccessorImpl.java:62)
	at sun.reflect.DelegatingMethodAccessorImpl.invoke(DelegatingMethodAccessorImpl.java:43)
	at java.lang.reflect.Method.invoke(Method.java:498)
	at com.carrotsearch.randomizedtesting.RandomizedRunner.invoke(RandomizedRunner.java:1742)
	at com.carrotsearch.randomizedtesting.RandomizedRunner$8.evaluate(RandomizedRunner.java:935)
	at com.carrotsearch.randomizedtesting.RandomizedRunner$9.evaluate(RandomizedRunner.java:971)
	at com.carrotsearch.randomizedtesting.RandomizedRunner$10.evaluate(RandomizedRunner.java:985)
	at org.apache.lucene.util.TestRuleSetupTeardownChained$1.evaluate(TestRuleSetupTeardownChained.java:49)
	at org.apache.lucene.util.AbstractBeforeAfterRule$1.evaluate(AbstractBeforeAfterRule.java:45)
	at org.apache.lucene.util.TestRuleThreadAndTestName$1.evaluate(TestRuleThreadAndTestName.java:48)
	at org.apache.lucene.util.TestRuleIgnoreAfterMaxFailures$1.evaluate(TestRuleIgnoreAfterMaxFailures.java:64)
	at org.apache.lucene.util.TestRuleMarkFailure$1.evaluate(TestRuleMarkFailure.java:47)
	at com.carrotsearch.randomizedtesting.rules.StatementAdapter.evaluate(StatementAdapter.java:36)
	at com.carrotsearch.randomizedtesting.ThreadLeakControl$StatementRunner.run(ThreadLeakControl.java:368)




Build Log:
[...truncated 2167 lines...]
   [junit4] Suite: org.apache.lucene.index.TestIndexWriterDelete
   [junit4] IGNOR/A 0.00s J1 | TestIndexWriterDelete.testIndexingThenDeleting
   [junit4]    > Assumption #1: This test cannot run with Direct codec
   [junit4]   1> TEST: now get reader
   [junit4]   2> sept. 27, 2018 10:43:25 PM com.carrotsearch.randomizedtesting.ThreadLeakControl$2 evaluate
   [junit4]   2> AVERTISSEMENT: Suite execution timed out: org.apache.lucene.index.TestIndexWriterDelete
   [junit4]   2>    1) Thread[id=14224, name=SUITE-TestIndexWriterDelete-seed#[9F8B417443135BE6], state=RUNNABLE, group=TGRP-TestIndexWriterDelete]
   [junit4]   2>         at java.lang.Thread.getStackTrace(Thread.java:1559)
   [junit4]   2>         at com.carrotsearch.randomizedtesting.ThreadLeakControl$4.run(ThreadLeakControl.java:696)
   [junit4]   2>         at com.carrotsearch.randomizedtesting.ThreadLeakControl$4.run(ThreadLeakControl.java:693)
   [junit4]   2>         at java.security.AccessController.doPrivileged(Native Method)
   [junit4]   2>         at com.carrotsearch.randomizedtesting.ThreadLeakControl.getStackTrace(ThreadLeakControl.java:693)
   [junit4]   2>         at com.carrotsearch.randomizedtesting.ThreadLeakControl.getThreadsWithTraces(ThreadLeakControl.java:709)
   [junit4]   2>         at com.carrotsearch.randomizedtesting.ThreadLeakControl.formatThreadStacksFull(ThreadLeakControl.java:689)
   [junit4]   2>         at com.carrotsearch.randomizedtesting.ThreadLeakControl.access$1000(ThreadLeakControl.java:65)
   [junit4]   2>         at com.carrotsearch.randomizedtesting.ThreadLeakControl$2.evaluate(ThreadLeakControl.java:415)
   [junit4]   2>         at com.carrotsearch.randomizedtesting.RandomizedRunner.runSuite(RandomizedRunner.java:706)
   [junit4]   2>         at com.carrotsearch.randomizedtesting.RandomizedRunner.access$200(RandomizedRunner.java:140)
   [junit4]   2>         at com.carrotsearch.randomizedtesting.RandomizedRunner$2.run(RandomizedRunner.java:627)
   [junit4]   2>    2) Thread[id=1, name=main, state=WAITING, group=main]
   [junit4]   2>         at java.lang.Object.wait(Native Method)
   [junit4]   2>         at java.lang.Thread.join(Thread.java:1252)
   [junit4]   2>         at java.lang.Thread.join(Thread.java:1326)
   [junit4]   2>         at com.carrotsearch.randomizedtesting.RandomizedRunner.runSuite(RandomizedRunner.java:637)
   [junit4]   2>         at com.carrotsearch.randomizedtesting.RandomizedRunner.run(RandomizedRunner.java:494)
   [junit4]   2>         at com.carrotsearch.ant.tasks.junit4.slave.SlaveMain.execute(SlaveMain.java:269)
   [junit4]   2>         at com.carrotsearch.ant.tasks.junit4.slave.SlaveMain.main(SlaveMain.java:394)
   [junit4]   2>         at com.carrotsearch.ant.tasks.junit4.slave.SlaveMainSafe.main(SlaveMainSafe.java:13)
   [junit4]   2>    3) Thread[id=14225, name=TEST-TestIndexWriterDelete.testUpdatesOnDiskFull-seed#[9F8B417443135BE6], state=TIMED_WAITING, group=TGRP-TestIndexWriterDelete]
   [junit4]   2>         at java.lang.Thread.sleep(Native Method)
   [junit4]   2>         at org.apache.lucene.store.SlowOpeningMockIndexInputWrapper.<init>(SlowOpeningMockIndexInputWrapper.java:33)
   [junit4]   2>         at org.apache.lucene.store.MockDirectoryWrapper.openInput(MockDirectoryWrapper.java:769)
   [junit4]   2>         at org.apache.lucene.codecs.lucene50.Lucene50PostingsReader.<init>(Lucene50PostingsReader.java:84)
   [junit4]   2>         at org.apache.lucene.codecs.mockrandom.MockRandomPostingsFormat.fieldsProducer(MockRandomPostingsFormat.java:286)
   [junit4]   2>         at org.apache.lucene.codecs.perfield.PerFieldPostingsFormat$FieldsReader.<init>(PerFieldPostingsFormat.java:293)
   [junit4]   2>         at org.apache.lucene.codecs.perfield.PerFieldPostingsFormat.fieldsProducer(PerFieldPostingsFormat.java:373)
   [junit4]   2>         at org.apache.lucene.index.SegmentCoreReaders.<init>(SegmentCoreReaders.java:113)
   [junit4]   2>         at org.apache.lucene.index.SegmentReader.<init>(SegmentReader.java:83)
   [junit4]   2>         at org.apache.lucene.index.CheckIndex.checkIndex(CheckIndex.java:676)
   [junit4]   2>         at org.apache.lucene.util.TestUtil.checkIndex(TestUtil.java:301)
   [junit4]   2>         at org.apache.lucene.util.TestUtil.checkIndex(TestUtil.java:286)
   [junit4]   2>         at org.apache.lucene.util.TestUtil.checkIndex(TestUtil.java:282)
   [junit4]   2>         at org.apache.lucene.index.TestIndexWriterDelete.doTestOperationsOnDiskFull(TestIndexWriterDelete.java:638)
   [junit4]   2>         at org.apache.lucene.index.TestIndexWriterDelete.testUpdatesOnDiskFull(TestIndexWriterDelete.java:490)
   [junit4]   2>         at sun.reflect.NativeMethodAccessorImpl.invoke0(Native Method)
   [junit4]   2>         at sun.reflect.NativeMethodAccessorImpl.invoke(NativeMethodAccessorImpl.java:62)
   [junit4]   2>         at sun.reflect.DelegatingMethodAccessorImpl.invoke(DelegatingMethodAccessorImpl.java:43)
   [junit4]   2>         at java.lang.reflect.Method.invoke(Method.java:498)
   [junit4]   2>         at com.carrotsearch.randomizedtesting.RandomizedRunner.invoke(RandomizedRunner.java:1742)
   [junit4]   2>         at com.carrotsearch.randomizedtesting.RandomizedRunner$8.evaluate(RandomizedRunner.java:935)
   [junit4]   2>         at com.carrotsearch.randomizedtesting.RandomizedRunner$9.evaluate(RandomizedRunner.java:971)
   [junit4]   2>         at com.carrotsearch.randomizedtesting.RandomizedRunner$10.evaluate(RandomizedRunner.java:985)
   [junit4]   2>         at org.apache.lucene.util.TestRuleSetupTeardownChained$1.evaluate(TestRuleSetupTeardownChained.java:49)
   [junit4]   2>         at org.apache.lucene.util.AbstractBeforeAfterRule$1.evaluate(AbstractBeforeAfterRule.java:45)
   [junit4]   2>         at org.apache.lucene.util.TestRuleThreadAndTestName$1.evaluate(TestRuleThreadAndTestName.java:48)
   [junit4]   2>         at org.apache.lucene.util.TestRuleIgnoreAfterMaxFailures$1.evaluate(TestRuleIgnoreAfterMaxFailures.java:64)
   [junit4]   2>         at org.apache.lucene.util.TestRuleMarkFailure$1.evaluate(TestRuleMarkFailure.java:47)
   [junit4]   2>         at com.carrotsearch.randomizedtesting.rules.StatementAdapter.evaluate(StatementAdapter.java:36)
   [junit4]   2>         at com.carrotsearch.randomizedtesting.ThreadLeakControl$StatementRunner.run(ThreadLeakControl.java:368)
   [junit4]   2>         at com.carrotsearch.randomizedtesting.ThreadLeakControl.forkTimeoutingTask(ThreadLeakControl.java:817)
   [junit4]   2>         at com.carrotsearch.randomizedtesting.ThreadLeakControl$3.evaluate(ThreadLeakControl.java:468)
   [junit4]   2>         at com.carrotsearch.randomizedtesting.RandomizedRunner.runSingleTest(RandomizedRunner.java:944)
   [junit4]   2>         at com.carrotsearch.randomizedtesting.RandomizedRunner$5.evaluate(RandomizedRunner.java:830)
   [junit4]   2>         at com.carrotsearch.randomizedtesting.RandomizedRunner$6.evaluate(RandomizedRunner.java:880)
   [junit4]   2>         at com.carrotsearch.randomizedtesting.RandomizedRunner$7.evaluate(RandomizedRunner.java:891)
   [junit4]   2>         at org.apache.lucene.util.AbstractBeforeAfterRule$1.evaluate(AbstractBeforeAfterRule.java:45)
   [junit4]   2>         at com.carrotsearch.randomizedtesting.rules.StatementAdapter.evaluate(StatementAdapter.java:36)
   [junit4]   2>         at org.apache.lucene.util.TestRuleStoreClassName$1.evaluate(TestRuleStoreClassName.java:41)
   [junit4]   2>         at com.carrotsearch.randomizedtesting.rules.NoShadowingOrOverridesOnMethodsRule$1.evaluate(NoShadowingOrOverridesOnMethodsRule.java:40)
   [junit4]   2>         at com.carrotsearch.randomizedtesting.rules.NoShadowingOrOverridesOnMethodsRule$1.evaluate(NoShadowingOrOverridesOnMethodsRule.java:40)
   [junit4]   2>         at com.carrotsearch.randomizedtesting.rules.StatementAdapter.evaluate(StatementAdapter.java:36)
   [junit4]   2>         at com.carrotsearch.randomizedtesting.rules.StatementAdapter.evaluate(StatementAdapter.java:36)
   [junit4]   2>         at com.carrotsearch.randomizedtesting.rules.StatementAdapter.evaluate(StatementAdapter.java:36)
   [junit4]   2>         at org.apache.lucene.util.TestRuleAssertionsRequired$1.evaluate(TestRuleAssertionsRequired.java:53)
   [junit4]   2>         at org.apache.lucene.util.TestRuleMarkFailure$1.evaluate(TestRuleMarkFailure.java:47)
   [junit4]   2>         at org.apache.lucene.util.TestRuleIgnoreAfterMaxFailures$1.evaluate(TestRuleIgnoreAfterMaxFailures.java:64)
   [junit4]   2>         at org.apache.lucene.util.TestRuleIgnoreTestSuites$1.evaluate(TestRuleIgnoreTestSuites.java:54)
   [junit4]   2>         at com.carrotsearch.randomizedtesting.rules.StatementAdapter.evaluate(StatementAdapter.java:36)
   [junit4]   2>         at com.carrotsearch.randomizedtesting.ThreadLeakControl$StatementRunner.run(ThreadLeakControl.java:368)
   [junit4]   2>         at java.lang.Thread.run(Thread.java:748)
   [junit4]   2>    4) Thread[id=9, name=JUnit4-serializer-daemon, state=TIMED_WAITING, group=main]
   [junit4]   2>         at java.lang.Thread.sleep(Native Method)
   [junit4]   2>         at com.carrotsearch.ant.tasks.junit4.events.Serializer$1.run(Serializer.java:50)
   [junit4]   2> NOTE: download the large Jenkins line-docs file by running 'ant get-jenkins-line-docs' in the lucene directory.
   [junit4]   2> NOTE: reproduce with: ant test  -Dtestcase=TestIndexWriterDelete -Dtests.method=testUpdatesOnDiskFull -Dtests.seed=9F8B417443135BE6 -Dtests.multiplier=2 -Dtests.nightly=true -Dtests.slow=true -Dtests.linedocsfile=/home/jenkins/jenkins-slave/workspace/Lucene-Solr-NightlyTests-master/test-data/enwiki.random.lines.txt -Dtests.locale=fr-LU -Dtests.timezone=HST -Dtests.asserts=true -Dtests.file.encoding=UTF-8
   [junit4] ERROR   7194s J1 | TestIndexWriterDelete.testUpdatesOnDiskFull <<<
   [junit4]    > Throwable #1: java.lang.Exception: Test abandoned because suite timeout was reached.
   [junit4]    > 	at __randomizedtesting.SeedInfo.seed([9F8B417443135BE6]:0)
   [junit4]   2> sept. 27, 2018 10:43:25 PM com.carrotsearch.randomizedtesting.ThreadLeakControl checkThreadLeaks
   [junit4]   2> AVERTISSEMENT: Will linger awaiting termination of 1 leaked thread(s).
   [junit4]   2> sept. 27, 2018 10:43:45 PM com.carrotsearch.randomizedtesting.ThreadLeakControl checkThreadLeaks
   [junit4]   2> GRAVE: 1 thread leaked from SUITE scope at org.apache.lucene.index.TestIndexWriterDelete: 
   [junit4]   2>    1) Thread[id=14225, name=TEST-TestIndexWriterDelete.testUpdatesOnDiskFull-seed#[9F8B417443135BE6], state=TIMED_WAITING, group=TGRP-TestIndexWriterDelete]
   [junit4]   2>         at java.lang.Thread.sleep(Native Method)
   [junit4]   2>         at org.apache.lucene.store.SlowOpeningMockIndexInputWrapper.<init>(SlowOpeningMockIndexInputWrapper.java:33)
   [junit4]   2>         at org.apache.lucene.store.MockDirectoryWrapper.openInput(MockDirectoryWrapper.java:769)
   [junit4]   2>         at org.apache.lucene.store.Directory.copyFrom(Directory.java:182)
   [junit4]   2>         at org.apache.lucene.util.TestUtil.ramCopyOf(TestUtil.java:1306)
   [junit4]   2>         at org.apache.lucene.index.TestIndexWriterDelete.doTestOperationsOnDiskFull(TestIndexWriterDelete.java:528)
   [junit4]   2>         at org.apache.lucene.index.TestIndexWriterDelete.testUpdatesOnDiskFull(TestIndexWriterDelete.java:490)
   [junit4]   2>         at sun.reflect.NativeMethodAccessorImpl.invoke0(Native Method)
   [junit4]   2>         at sun.reflect.NativeMethodAccessorImpl.invoke(NativeMethodAccessorImpl.java:62)
   [junit4]   2>         at sun.reflect.DelegatingMethodAccessorImpl.invoke(DelegatingMethodAccessorImpl.java:43)
   [junit4]   2>         at java.lang.reflect.Method.invoke(Method.java:498)
   [junit4]   2>         at com.carrotsearch.randomizedtesting.RandomizedRunner.invoke(RandomizedRunner.java:1742)
   [junit4]   2>         at com.carrotsearch.randomizedtesting.RandomizedRunner$8.evaluate(RandomizedRunner.java:935)
   [junit4]   2>         at com.carrotsearch.randomizedtesting.RandomizedRunner$9.evaluate(RandomizedRunner.java:971)
   [junit4]   2>         at com.carrotsearch.randomizedtesting.RandomizedRunner$10.evaluate(RandomizedRunner.java:985)
   [junit4]   2>         at org.apache.lucene.util.TestRuleSetupTeardownChained$1.evaluate(TestRuleSetupTeardownChained.java:49)
   [junit4]   2>         at org.apache.lucene.util.AbstractBeforeAfterRule$1.evaluate(AbstractBeforeAfterRule.java:45)
   [junit4]   2>         at org.apache.lucene.util.TestRuleThreadAndTestName$1.evaluate(TestRuleThreadAndTestName.java:48)
   [junit4]   2>         at org.apache.lucene.util.TestRuleIgnoreAfterMaxFailures$1.evaluate(TestRuleIgnoreAfterMaxFailures.java:64)
   [junit4]   2>         at org.apache.lucene.util.TestRuleMarkFailure$1.evaluate(TestRuleMarkFailure.java:47)
   [junit4]   2>         at com.carrotsearch.randomizedtesting.rules.StatementAdapter.evaluate(StatementAdapter.java:36)
   [junit4]   2>         at com.carrotsearch.randomizedtesting.ThreadLeakControl$StatementRunner.run(ThreadLeakControl.java:368)
   [junit4]   2>         at com.carrotsearch.randomizedtesting.ThreadLeakControl.forkTimeoutingTask(ThreadLeakControl.java:817)
   [junit4]   2>         at com.carrotsearch.randomizedtesting.ThreadLeakControl$3.evaluate(ThreadLeakControl.java:468)
   [junit4]   2>         at com.carrotsearch.randomizedtesting.RandomizedRunner.runSingleTest(RandomizedRunner.java:944)
   [junit4]   2>         at com.carrotsearch.randomizedtesting.RandomizedRunner$5.evaluate(RandomizedRunner.java:830)
   [junit4]   2>         at com.carrotsearch.randomizedtesting.RandomizedRunner$6.evaluate(RandomizedRunner.java:880)
   [junit4]   2>         at com.carrotsearch.randomizedtesting.RandomizedRunner$7.evaluate(RandomizedRunner.java:891)
   [junit4]   2>         at org.apache.lucene.util.AbstractBeforeAfterRule$1.evaluate(AbstractBeforeAfterRule.java:45)
   [junit4]   2>         at com.carrotsearch.randomizedtesting.rules.StatementAdapter.evaluate(StatementAdapter.java:36)
   [junit4]   2>         at org.apache.lucene.util.TestRuleStoreClassName$1.evaluate(TestRuleStoreClassName.java:41)
   [junit4]   2>         at com.carrotsearch.randomizedtesting.rules.NoShadowingOrOverridesOnMethodsRule$1.evaluate(NoShadowingOrOverridesOnMethodsRule.java:40)
   [junit4]   2>         at com.carrotsearch.randomizedtesting.rules.NoShadowingOrOverridesOnMethodsRule$1.evaluate(NoShadowingOrOverridesOnMethodsRule.java:40)
   [junit4]   2>         at com.carrotsearch.randomizedtesting.rules.StatementAdapter.evaluate(StatementAdapter.java:36)
   [junit4]   2>         at com.carrotsearch.randomizedtesting.rules.StatementAdapter.evaluate(StatementAdapter.java:36)
   [junit4]   2>         at com.carrotsearch.randomizedtesting.rules.StatementAdapter.evaluate(StatementAdapter.java:36)
   [junit4]   2>         at org.apache.lucene.util.TestRuleAssertionsRequired$1.evaluate(TestRuleAssertionsRequired.java:53)
   [junit4]   2>         at org.apache.lucene.util.TestRuleMarkFailure$1.evaluate(TestRuleMarkFailure.java:47)
   [junit4]   2>         at org.apache.lucene.util.TestRuleIgnoreAfterMaxFailures$1.evaluate(TestRuleIgnoreAfterMaxFailures.java:64)
   [junit4]   2>         at org.apache.lucene.util.TestRuleIgnoreTestSuites$1.evaluate(TestRuleIgnoreTestSuites.java:54)
   [junit4]   2>         at com.carrotsearch.randomizedtesting.rules.StatementAdapter.evaluate(StatementAdapter.java:36)
   [junit4]   2>         at com.carrotsearch.randomizedtesting.ThreadLeakControl$StatementRunner.run(ThreadLeakControl.java:368)
   [junit4]   2>         at java.lang.Thread.run(Thread.java:748)
   [junit4]   2> sept. 27, 2018 10:43:45 PM com.carrotsearch.randomizedtesting.ThreadLeakControl tryToInterruptAll
   [junit4]   2> INFOS: Starting to interrupt leaked threads:
   [junit4]   2>    1) Thread[id=14225, name=TEST-TestIndexWriterDelete.testUpdatesOnDiskFull-seed#[9F8B417443135BE6], state=TIMED_WAITING, group=TGRP-TestIndexWriterDelete]
   [junit4]   2> NOTE: leaving temporary files on disk at: /x1/jenkins/jenkins-slave/workspace/Lucene-Solr-NightlyTests-master/checkout/lucene/build/core/test/J1/temp/lucene.index.TestIndexWriterDelete_9F8B417443135BE6-001
   [junit4]   2> Sep 28, 2018 8:43:45 AM com.carrotsearch.randomizedtesting.ThreadLeakControl tryToInterruptAll
   [junit4]   2> INFO: All leaked threads terminated.
   [junit4]   2> NOTE: test params are: codec=Asserting(Lucene80): {field=PostingsFormat(name=Direct), city=FSTOrd50, contents=PostingsFormat(name=Direct), id=FSTOrd50, body=PostingsFormat(name=Direct), value=PostingsFormat(name=MockRandom), content=PostingsFormat(name=MockRandom)}, docValues:{dv=DocValuesFormat(name=Lucene70), id=DocValuesFormat(name=Direct), value=DocValuesFormat(name=Lucene70), content=DocValuesFormat(name=Lucene70)}, maxPointsInLeafNode=1558, maxMBSortInHeap=6.25402817800901, sim=Asserting(org.apache.lucene.search.similarities.AssertingSimilarity@76f5a25d), locale=fr-LU, timezone=HST
   [junit4]   2> NOTE: Linux 4.4.0-130-generic amd64/Oracle Corporation 1.8.0_172 (64-bit)/cpus=4,threads=1,free=291666288,total=491257856
   [junit4]   2> NOTE: All tests run in this JVM: [TestPointValues, TestWildcardRandom, TestMaxTermFrequency, TestNearSpansOrdered, TestBlendedTermQuery, TestDocsWithFieldSet, TestNumericUtils, TestCloseableThreadLocal, TestCachingTokenFilter, TestCustomSearcherSort, TestNewestSegment, TestIndexWriterExceptions, TestIntArrayDocIdSet, TestDocument, TestTwoPhaseCommitTool, TestMergedIterator, TestTransactionRollback, TestSearchAfter, LimitedFiniteStringsIteratorTest, TestFieldInvertState, TestSegmentCacheables, TestAllFilesDetectTruncation, TestTerms, TestStressNRT, TestDirectory, TestMmapDirectory, FuzzyTermOnShortTermsTest, TestFixedLengthBytesRefArray, TestMixedDocValuesUpdates, TestThreadedForceMerge, TestTermQuery, TestNRTReaderWithThreads, TestGraphTokenStreamFiniteStrings, TestSloppyPhraseQuery2, TestBoolean2ScorerSupplier, TestTopFieldCollector, TestStringHelper, TestLMJelinekMercerSimilarity, TestFilterWeight, TestSpanFirstQuery, TestVirtualMethod, TestReaderWrapperDVTypeCheck, TestMatchAllDocsQuery, TestDemo, TestIsCurrent, TestCheckIndex, TestTimeLimitingCollector, TestSameTokenSamePosition, TestSortRescorer, TestMultiPhraseEnum, TestDirectPacked, TestSameScoresWithThreads, TestSoftDeletesRetentionMergePolicy, TestQueryRescorer, TestPriorityQueue, TestDistributionLL, TestIndexingSequenceNumbers, TestIndexOptions, TestToken, TestSpanNotQuery, TestPolygon, TestIndependenceSaturated, TestApproximationSearchEquivalence, TestNoMergeScheduler, TestDeletionPolicy, TestAxiomaticF2EXP, TestRegExp, TestSmallFloat, TestSentinelIntSet, TestDocIDMerger, TestBytesRefAttImpl, TestFilterCodecReader, TestBasicModelIne, TestField, TestPayloads, TestOmitNorms, TestMaxScoreSumPropagator, TestIntRange, TestIntsRef, TestUsageTrackingFilterCachingPolicy, TestTimSorterWorstCase, TestIndexOrDocValuesQuery, TestNRTCachingDirectory, TestBufferedChecksum, TestMergeSchedulerExternal, TestSearch, TestSearchForDuplicates, TestCharArraySet, TestCharFilter, TestCharacterUtils, TestDelegatingAnalyzerWrapper, TestGraphTokenizers, TestReusableStringReader, TestPackedTokenAttributeImpl, TestSimpleAttributeImpl, TestCodecUtil, TestCompetitiveFreqNormAccumulator, TestFastCompressionMode, TestFastDecompressionMode, TestHighCompressionMode, TestBlockPostingsFormat, TestBlockPostingsFormat2, TestBlockPostingsFormat3, TestForUtil, TestLucene50CompoundFormat, TestLucene50LiveDocsFormat, TestLucene50StoredFieldsFormat, TestLucene50StoredFieldsFormatHighCompression, TestLucene50TermVectorsFormat, TestLucene60FieldInfoFormat, TestLucene60PointsFormat, TestIndexedDISI, TestLucene70DocValuesFormat, TestAddIndexes, TestAllFilesHaveCodecHeader, TestAtomicUpdate, TestBagOfPositions, TestBagOfPostings, TestBinaryDocValuesUpdates, TestBinaryTerms, TestCodecs, TestConcurrentMergeScheduler, TestConsistentFieldNumbers, TestCrash, TestCrashCausesCorruptIndex, TestCustomNorms, TestDirectoryReader, TestDirectoryReaderReopen, TestDoc, TestDocValues, TestDocValuesFieldUpdates, TestDocValuesIndexing, TestDocumentsWriterDeleteQueue, TestDocumentsWriterStallControl, TestDuelingCodecs, TestExceedMaxTermLength, TestExitableDirectoryReader, TestFilterLeafReader, TestFilterMergePolicy, TestFlex, TestFlushByRamOrCountsPolicy, TestForTooMuchCloning, TestForceMergeForever, TestIndexCommit, TestIndexFileDeleter, TestIndexInput, TestIndexSorting, TestIndexTooManyDocs, TestIndexWriter, TestIndexWriterCommit, TestIndexWriterConfig, TestIndexWriterDelete]
   [junit4]   2> NOTE: download the large Jenkins line-docs file by running 'ant get-jenkins-line-docs' in the lucene directory.
   [junit4]   2> NOTE: reproduce with: ant test  -Dtestcase=TestIndexWriterDelete -Dtests.seed=9F8B417443135BE6 -Dtests.multiplier=2 -Dtests.nightly=true -Dtests.slow=true -Dtests.linedocsfile=/home/jenkins/jenkins-slave/workspace/Lucene-Solr-NightlyTests-master/test-data/enwiki.random.lines.txt -Dtests.locale=fr-LU -Dtests.timezone=HST -Dtests.asserts=true -Dtests.file.encoding=UTF-8
   [junit4] ERROR   0.00s J1 | TestIndexWriterDelete (suite) <<<
   [junit4]    > Throwable #1: java.lang.Exception: Suite timeout exceeded (>= 7200000 msec).
   [junit4]    > 	at __randomizedtesting.SeedInfo.seed([9F8B417443135BE6]:0)
   [junit4] Completed [510/510 (1!)] on J1 in 7220.13s, 25 tests, 2 errors, 2 skipped <<< FAILURES!

[...truncated 8154 lines...]
   [junit4] Suite: org.apache.lucene.document.TestLatLonLineShapeQueries
   [junit4]   2> NOTE: download the large Jenkins line-docs file by running 'ant get-jenkins-line-docs' in the lucene directory.
   [junit4]   2> NOTE: reproduce with: ant test  -Dtestcase=TestLatLonLineShapeQueries -Dtests.method=testRandomBig -Dtests.seed=9EFA06E36489750C -Dtests.multiplier=2 -Dtests.nightly=true -Dtests.slow=true -Dtests.linedocsfile=/home/jenkins/jenkins-slave/workspace/Lucene-Solr-NightlyTests-master/test-data/enwiki.random.lines.txt -Dtests.locale=ar-EG -Dtests.timezone=Asia/Taipei -Dtests.asserts=true -Dtests.file.encoding=UTF-8
   [junit4] ERROR   1502s J2 | TestLatLonLineShapeQueries.testRandomBig <<<
   [junit4]    > Throwable #1: java.lang.OutOfMemoryError: Java heap space
   [junit4]    > 	at __randomizedtesting.SeedInfo.seed([9EFA06E36489750C:19AD7B6CF5D0098C]:0)
   [junit4]    > 	at java.util.Arrays.copyOf(Arrays.java:3332)
   [junit4]    > 	at java.lang.AbstractStringBuilder.ensureCapacityInternal(AbstractStringBuilder.java:124)
   [junit4]    > 	at java.lang.AbstractStringBuilder.append(AbstractStringBuilder.java:448)
   [junit4]    > 	at java.lang.StringBuilder.append(StringBuilder.java:136)
   [junit4]    > 	at org.apache.lucene.index.CorruptIndexException.<init>(CorruptIndexException.java:62)
   [junit4]    > 	at org.apache.lucene.index.CorruptIndexException.<init>(CorruptIndexException.java:47)
   [junit4]    > 	at org.apache.lucene.codecs.CodecUtil.checkFooter(CodecUtil.java:471)
   [junit4]    > 	at org.apache.lucene.util.bkd.BKDWriter.verifyChecksum(BKDWriter.java:1412)
   [junit4]    > 	at org.apache.lucene.util.bkd.BKDWriter.build(BKDWriter.java:1835)
   [junit4]    > 	at org.apache.lucene.util.bkd.BKDWriter.build(BKDWriter.java:1854)
   [junit4]    > 	at org.apache.lucene.util.bkd.BKDWriter.finish(BKDWriter.java:1007)
   [junit4]    > 	at org.apache.lucene.index.RandomCodec$1$1.writeField(RandomCodec.java:139)
   [junit4]    > 	at org.apache.lucene.codecs.PointsWriter.mergeOneField(PointsWriter.java:62)
   [junit4]    > 	at org.apache.lucene.codecs.PointsWriter.merge(PointsWriter.java:186)
   [junit4]    > 	at org.apache.lucene.codecs.lucene60.Lucene60PointsWriter.merge(Lucene60PointsWriter.java:144)
   [junit4]    > 	at org.apache.lucene.codecs.asserting.AssertingPointsFormat$AssertingPointsWriter.merge(AssertingPointsFormat.java:142)
   [junit4]    > 	at org.apache.lucene.index.SegmentMerger.mergePoints(SegmentMerger.java:201)
   [junit4]    > 	at org.apache.lucene.index.SegmentMerger.merge(SegmentMerger.java:161)
   [junit4]    > 	at org.apache.lucene.index.IndexWriter.mergeMiddle(IndexWriter.java:4453)
   [junit4]    > 	at org.apache.lucene.index.IndexWriter.merge(IndexWriter.java:4075)
   [junit4]    > 	at org.apache.lucene.index.SerialMergeScheduler.merge(SerialMergeScheduler.java:40)
   [junit4]    > 	at org.apache.lucene.index.IndexWriter.maybeMerge(IndexWriter.java:2178)
   [junit4]    > 	at org.apache.lucene.index.IndexWriter.forceMerge(IndexWriter.java:2011)
   [junit4]    > 	at org.apache.lucene.index.IndexWriter.forceMerge(IndexWriter.java:1962)
   [junit4]    > 	at org.apache.lucene.document.BaseLatLonShapeTestCase.indexRandomShapes(BaseLatLonShapeTestCase.java:226)
   [junit4]    > 	at org.apache.lucene.document.BaseLatLonShapeTestCase.verify(BaseLatLonShapeTestCase.java:192)
   [junit4]    > 	at org.apache.lucene.document.BaseLatLonShapeTestCase.doTestRandom(BaseLatLonShapeTestCase.java:173)
   [junit4]    > 	at org.apache.lucene.document.BaseLatLonShapeTestCase.testRandomBig(BaseLatLonShapeTestCase.java:149)
   [junit4]   2> NOTE: leaving temporary files on disk at: /x1/jenkins/jenkins-slave/workspace/Lucene-Solr-NightlyTests-master/checkout/lucene/build/sandbox/test/J2/temp/lucene.document.TestLatLonLineShapeQueries_9EFA06E36489750C-001
   [junit4]   2> NOTE: test params are: codec=Asserting(Lucene80): {id=PostingsFormat(name=LuceneVarGapDocFreqInterval)}, docValues:{shape=DocValuesFormat(name=Lucene70), id=DocValuesFormat(name=Lucene70)}, maxPointsInLeafNode=1145, maxMBSortInHeap=7.655228595855366, sim=Asserting(org.apache.lucene.search.similarities.AssertingSimilarity@690b87d9), locale=ar-EG, timezone=Asia/Taipei
   [junit4]   2> NOTE: Linux 4.4.0-130-generic amd64/Oracle Corporation 1.8.0_172 (64-bit)/cpus=4,threads=1,free=94303400,total=517472256
   [junit4]   2> NOTE: All tests run in this JVM: [FuzzyLikeThisQueryTest, TestNearest, TestLatLonLineShapeQueries]
   [junit4] Completed [20/21 (1!)] on J2 in 1695.12s, 4 tests, 1 error <<< FAILURES!

[...truncated 4 lines...]
   [junit4] JVM J2: stdout was not empty, see: /x1/jenkins/jenkins-slave/workspace/Lucene-Solr-NightlyTests-master/checkout/lucene/build/sandbox/test/temp/junit4-J2-20180928_095542_9326924847590751581394.sysout
   [junit4] >>> JVM J2 emitted unexpected output (verbatim) ----
   [junit4] java.lang.OutOfMemoryError: Java heap space
   [junit4] Dumping heap to /x1/jenkins/jenkins-slave/workspace/Lucene-Solr-NightlyTests-master/checkout/heapdumps/java_pid11514.hprof ...
   [junit4] Heap dump file created [513915183 bytes in 0.756 secs]
   [junit4] <<< JVM J2: EOF ----

[...truncated 4604 lines...]
   [junit4] Suite: org.apache.solr.cloud.autoscaling.sim.TestSimExtremeIndexing
   [junit4]   2> 3394453 INFO  (SUITE-TestSimExtremeIndexing-seed#[A588F677BD53BB3B]-worker) [    ] o.a.s.SolrTestCaseJ4 SecureRandom sanity checks: test.solr.allowed.securerandom=null & java.security.egd=file:/dev/./urandom
   [junit4]   2> Creating dataDir: /x1/jenkins/jenkins-slave/workspace/Lucene-Solr-NightlyTests-master/checkout/solr/build/solr-core/test/J2/temp/solr.cloud.autoscaling.sim.TestSimExtremeIndexing_A588F677BD53BB3B-001/init-core-data-001
   [junit4]   2> 3394455 INFO  (SUITE-TestSimExtremeIndexing-seed#[A588F677BD53BB3B]-worker) [    ] o.a.s.SolrTestCaseJ4 Using PointFields (NUMERIC_POINTS_SYSPROP=true) w/NUMERIC_DOCVALUES_SYSPROP=true
   [junit4]   2> 3394457 INFO  (SUITE-TestSimExtremeIndexing-seed#[A588F677BD53BB3B]-worker) [    ] o.a.s.SolrTestCaseJ4 Randomized ssl (true) and clientAuth (true) via: @org.apache.solr.util.RandomizeSSL(reason=, ssl=NaN, value=NaN, clientAuth=NaN)
   [junit4]   2> 3394462 DEBUG (SUITE-TestSimExtremeIndexing-seed#[A588F677BD53BB3B]-worker) [    ] o.a.s.c.a.s.SimClusterStateProvider --- new Overseer leader: 127.0.0.1:10009_solr
   [junit4]   2> 3394463 DEBUG (Simulated OverseerAutoScalingTriggerThread) [    ] o.a.s.c.a.OverseerTriggerThread Adding .auto_add_replicas and .scheduled_maintenance triggers
   [junit4]   2> 3394463 DEBUG (Simulated OverseerAutoScalingTriggerThread) [    ] o.a.s.c.a.OverseerTriggerThread Refreshing /autoscaling.json with znode version 0
   [junit4]   2> 3394464 DEBUG (Simulated OverseerAutoScalingTriggerThread) [    ] o.a.s.c.a.OverseerTriggerThread Current znodeVersion 0, lastZnodeVersion -1
   [junit4]   2> 3394464 DEBUG (Simulated OverseerAutoScalingTriggerThread) [    ] o.a.s.c.a.OverseerTriggerThread Processed trigger updates upto znodeVersion 0
   [junit4]   2> 3394464 DEBUG (SUITE-TestSimExtremeIndexing-seed#[A588F677BD53BB3B]-worker) [    ] o.a.s.c.a.s.SimClusterStateProvider ** creating new collection states
   [junit4]   2> 3394464 DEBUG (SUITE-TestSimExtremeIndexing-seed#[A588F677BD53BB3B]-worker) [    ] o.a.s.c.a.s.SimClusterStateProvider ** saved cluster state version -1
   [junit4]   2> 3394464 INFO  (SUITE-TestSimExtremeIndexing-seed#[A588F677BD53BB3B]-worker) [    ] o.a.s.h.a.MetricsHistoryHandler No .system collection, keeping metrics history in memory.
   [junit4]   2> 3394486 DEBUG (Simulated OverseerAutoScalingTriggerThread) [    ] o.a.s.c.a.OverseerTriggerThread -- clean old nodeAdded markers
   [junit4]   2> 3394486 DEBUG (Simulated OverseerAutoScalingTriggerThread) [    ] o.a.s.c.a.OverseerTriggerThread Current znodeVersion 0, lastZnodeVersion 0
   [junit4]   2> 3394504 INFO  (TEST-TestSimExtremeIndexing.testScaleUp-seed#[A588F677BD53BB3B]) [    ] o.a.s.SolrTestCaseJ4 ###Starting testScaleUp
   [junit4]   2> 3394504 DEBUG (TEST-TestSimExtremeIndexing.testScaleUp-seed#[A588F677BD53BB3B]) [    ] o.a.s.c.a.OverseerTriggerThread Refreshing /autoscaling.json with znode version 1
   [junit4]   2> 3394505 INFO  (TEST-TestSimExtremeIndexing.testScaleUp-seed#[A588F677BD53BB3B]) [    ] o.a.s.c.a.s.SimCloudManager === Restarting OverseerTriggerThread and clearing object cache...
   [junit4]   2> 3394506 DEBUG (TEST-TestSimExtremeIndexing.testScaleUp-seed#[A588F677BD53BB3B]) [    ] o.a.s.c.a.ScheduledTriggers Shutting down scheduled thread pool executor now
   [junit4]   2> 3394506 DEBUG (TEST-TestSimExtremeIndexing.testScaleUp-seed#[A588F677BD53BB3B]) [    ] o.a.s.c.a.ScheduledTriggers Shutting down action executor now
   [junit4]   2> 3394506 DEBUG (TEST-TestSimExtremeIndexing.testScaleUp-seed#[A588F677BD53BB3B]) [    ] o.a.s.c.a.ScheduledTriggers Awaiting termination for action executor
   [junit4]   2> 3394506 DEBUG (TEST-TestSimExtremeIndexing.testScaleUp-seed#[A588F677BD53BB3B]) [    ] o.a.s.c.a.ScheduledTriggers Awaiting termination for scheduled thread pool executor
   [junit4]   2> 3394506 DEBUG (TEST-TestSimExtremeIndexing.testScaleUp-seed#[A588F677BD53BB3B]) [    ] o.a.s.c.a.ScheduledTriggers ScheduledTriggers closed completely
   [junit4]   2> 3394506 DEBUG (TEST-TestSimExtremeIndexing.testScaleUp-seed#[A588F677BD53BB3B]) [    ] o.a.s.c.a.OverseerTriggerThread OverseerTriggerThread has been closed explicitly
   [junit4]   2> 3394507 DEBUG (Simulated OverseerAutoScalingTriggerThread) [    ] o.a.s.c.a.OverseerTriggerThread Adding .auto_add_replicas and .scheduled_maintenance triggers
   [junit4]   2> 3394507 DEBUG (Simulated OverseerAutoScalingTriggerThread) [    ] o.a.s.c.a.OverseerTriggerThread Refreshing /autoscaling.json with znode version 2
   [junit4]   2> 3394507 DEBUG (Simulated OverseerAutoScalingTriggerThread) [    ] o.a.s.c.a.OverseerTriggerThread Current znodeVersion 2, lastZnodeVersion -1
   [junit4]   2> 3394507 DEBUG (Simulated OverseerAutoScalingTriggerThread) [    ] o.a.s.c.a.OverseerTriggerThread Processed trigger updates upto znodeVersion 2
   [junit4]   2> 3394508 DEBUG (Simulated OverseerAutoScalingTriggerThread) [    ] o.a.s.c.a.OverseerTriggerThread -- clean old nodeAdded markers
   [junit4]   2> 3394508 DEBUG (Simulated OverseerAutoScalingTriggerThread) [    ] o.a.s.c.a.OverseerTriggerThread Current znodeVersion 2, lastZnodeVersion 2
   [junit4]   2> 3394508 WARN  (Simulated OverseerAutoScalingTriggerThread) [    ] o.a.s.c.a.OverseerTriggerThread OverseerTriggerThread woken up but we are closed, exiting.
   [junit4]   2> 3394559 DEBUG (simCloudManagerPool-16989-thread-1) [    ] o.a.s.c.a.s.SimClusterStateProvider ** creating new collection states
   [junit4]   2> 3394560 DEBUG (simCloudManagerPool-16989-thread-1) [    ] o.a.s.c.a.s.SimClusterStateProvider ** saved cluster state version 0
   [junit4]   2> 3394575 DEBUG (simCloudManagerPool-16989-thread-2) [    ] o.a.s.c.a.s.SimClusterStateProvider ** creating new collection states
   [junit4]   2> 3394578 DEBUG (simCloudManagerPool-16989-thread-2) [    ] o.a.s.c.a.s.SimClusterStateProvider ** saved cluster state version 1
   [junit4]   2> 3394581 DEBUG (simCloudManagerPool-16989-thread-6) [    ] o.a.s.c.a.s.SimClusterStateProvider -- elected new leader for testScaleUp_collection / shard1: {"core_node1":{
   [junit4]   2>     "core":"testScaleUp_collection_shard1_replica_n1",
   [junit4]   2>     "shard":"shard1",
   [junit4]   2>     "collection":"testScaleUp_collection",
   [junit4]   2>     "node_name":"127.0.0.1:10120_solr",
   [junit4]   2>     "type":"NRT",
   [junit4]   2>     "leader":"true",
   [junit4]   2>     "SEARCHER.searcher.maxDoc":0,
   [junit4]   2>     "SEARCHER.searcher.deletedDocs":0,
   [junit4]   2>     "INDEX.sizeInBytes":10240,
   [junit4]   2>     "state":"active",
   [junit4]   2>     "INDEX.sizeInGB":9.5367431640625E-6,
   [junit4]   2>     "SEARCHER.searcher.numDocs":0}}
   [junit4]   2> 3394585 DEBUG (simCloudManagerPool-16989-thread-3) [    ] o.a.s.c.a.s.SimClusterStateProvider ** creating new collection states
   [junit4]   2> 3394585 DEBUG (simCloudManagerPool-16989-thread-3) [    ] o.a.s.c.a.s.SimClusterStateProvider ** saved cluster state version 2
   [junit4]   2> 3394590 DEBUG (simCloudManagerPool-16989-thread-4) [    ] o.a.s.c.a.s.SimClusterStateProvider ** creating new collection states
   [junit4]   2> 3394591 DEBUG (simCloudManagerPool-16989-thread-4) [    ] o.a.s.c.a.s.SimClusterStateProvider ** saved cluster state version 3
   [junit4]   2> 3394591 DEBUG (simCloudManagerPool-16989-thread-7) [    ] o.a.s.c.a.s.SimClusterStateProvider -- elected new leader for testScaleUp_collection / shard2: {"core_node3":{
   [junit4]   2>     "core":"testScaleUp_collection_shard2_replica_n3",
   [junit4]   2>     "shard":"shard2",
   [junit4]   2>     "collection":"testScaleUp_collection",
   [junit4]   2>     "node_name":"127.0.0.1:10025_solr",
   [junit4]   2>     "type":"NRT",
   [junit4]   2>     "leader":"true",
   [junit4]   2>     "SEARCHER.searcher.maxDoc":0,
   [junit4]   2>     "SEARCHER.searcher.deletedDocs":0,
   [junit4]   2>     "INDEX.sizeInBytes":10240,
   [junit4]   2>     "state":"active",
   [junit4]   2>     "INDEX.sizeInGB":9.5367431640625E-6,
   [junit4]   2>     "SEARCHER.searcher.numDocs":0}}
   [junit4]   2> 3394596 DEBUG (simCloudManagerPool-16989-thread-5) [    ] o.a.s.c.a.s.SimClusterStateProvider ** creating new collection states
   [junit4]   2> 3394596 DEBUG (simCloudManagerPool-16989-thread-5) [    ] o.a.s.c.a.s.SimClusterStateProvider ** saved cluster state version 4
   [junit4]   2> 3394596 DEBUG (TEST-TestSimExtremeIndexing.testScaleUp-seed#[A588F677BD53BB3B]) [    ] o.a.s.c.a.s.SimClusterStateProvider ** creating new collection states
   [junit4]   2> 3394597 DEBUG (TEST-TestSimExtremeIndexing.testScaleUp-seed#[A588F677BD53BB3B]) [    ] o.a.s.c.a.s.SimClusterStateProvider ** saved cluster state version 5
   [junit4]   2> 3394617 DEBUG (simCloudManagerPool-16989-thread-8) [    ] o.a.s.c.a.AutoScalingHandler Verified autoscaling configuration
   [junit4]   2> 3394618 DEBUG (simCloudManagerPool-16989-thread-8) [    ] o.a.s.c.a.OverseerTriggerThread Refreshing /autoscaling.json with znode version 3
   [junit4]   2> 3394619 DEBUG (Simulated OverseerAutoScalingTriggerThread) [    ] o.a.s.c.a.OverseerTriggerThread Processed trigger updates upto znodeVersion 3
   [junit4]   2> 3394619 DEBUG (Simulated OverseerAutoScalingTriggerThread) [    ] o.a.s.c.a.OverseerTriggerThread -- clean old nodeAdded markers
   [junit4]   2> 3394619 DEBUG (Simulated OverseerAutoScalingTriggerThread) [    ] o.a.s.c.a.OverseerTriggerThread Current znodeVersion 3, lastZnodeVersion 3
   [junit4]   2> 3394654 INFO  (TEST-TestSimExtremeIndexing.testScaleUp-seed#[A588F677BD53BB3B]) [    ] o.a.s.c.a.s.TestSimExtremeIndexing #### Total docs so far: 200,000
   [junit4]   2> 3394679 INFO  (TEST-TestSimExtremeIndexing.testScaleUp-seed#[A588F677BD53BB3B]) [    ] o.a.s.c.a.s.TestSimExtremeIndexing #### Total docs so far: 400,000
   [junit4]   2> 3394693 INFO  (TEST-TestSimExtremeIndexing.testScaleUp-seed#[A588F677BD53BB3B]) [    ] o.a.s.c.a.s.TestSimExtremeIndexing #### Total docs so far: 600,000
   [junit4]   2> 3394710 INFO  (TEST-TestSimExtremeIndexing.testScaleUp-seed#[A588F677BD53BB3B]) [    ] o.a.s.c.a.s.TestSimExtremeIndexing #### Total docs so far: 800,000
   [junit4]   2> 3394713 INFO  (TEST-TestSimExtremeIndexing.testScaleUp-seed#[A588F677BD53BB3B]) [    ] o.a.s.c.a.s.TestSimExtremeIndexing #### Total docs so far: 1,000,000
   [junit4]   2> 3394717 INFO  (TEST-TestSimExtremeIndexing.testScaleUp-seed#[A588F677BD53BB3B]) [    ] o.a.s.c.a.s.TestSimExtremeIndexing #### Total docs so far: 1,200,000
   [junit4]   2> 3394720 INFO  (TEST-TestSimExtremeIndexing.testScaleUp-seed#[A588F677BD53BB3B]) [    ] o.a.s.c.a.s.TestSimExtremeIndexing #### Total docs so far: 1,400,000
   [junit4]   2> 3394723 INFO  (TEST-TestSimExtremeIndexing.testScaleUp-seed#[A588F677BD53BB3B]) [    ] o.a.s.c.a.s.TestSimExtremeIndexing #### Total docs so far: 1,600,000
   [junit4]   2> 3394727 INFO  (TEST-TestSimExtremeIndexing.testScaleUp-seed#[A588F677BD53BB3B]) [    ] o.a.s.c.a.s.TestSimExtremeIndexing #### Total docs so far: 1,800,000
   [junit4]   2> 3394730 INFO  (TEST-TestSimExtremeIndexing.testScaleUp-seed#[A588F677BD53BB3B]) [    ] o.a.s.c.a.s.TestSimExtremeIndexing #### Total docs so far: 2,000,000
   [junit4]   2> 3394734 INFO  (TEST-TestSimExtremeIndexing.testScaleUp-seed#[A588F677BD53BB3B]) [    ] o.a.s.c.a.s.TestSimExtremeIndexing #### Total docs so far: 2,200,000
   [junit4]   2> 3394739 INFO  (TEST-TestSimExtremeIndexing.testScaleUp-seed#[A588F677BD53BB3B]) [    ] o.a.s.c.a.s.TestSimExtremeIndexing #### Total docs so far: 2,400,000
   [junit4]   2> 3394742 INFO  (TEST-TestSimExtremeIndexing.testScaleUp-seed#[A588F677BD53BB3B]) [    ] o.a.s.c.a.s.TestSimExtremeIndexing #### Total docs so far: 2,600,000
   [junit4]   2> 3394745 INFO  (TEST-TestSimExtremeIndexing.testScaleUp-seed#[A588F677BD53BB3B]) [    ] o.a.s.c.a.s.TestSimExtremeIndexing #### Total docs so far: 2,800,000
   [junit4]   2> 3394749 INFO  (TEST-TestSimExtremeIndexing.testScaleUp-seed#[A588F677BD53BB3B]) [    ] o.a.s.c.a.s.TestSimExtremeIndexing #### Total docs so far: 3,000,000
   [junit4]   2> 3394750 INFO  (TEST-TestSimExtremeIndexing.testScaleUp-seed#[A588F677BD53BB3B]) [    ] o.a.s.c.a.s.TestSimExtremeIndexing #### Total docs so far: 3,200,000
   [junit4]   2> 3394754 INFO  (TEST-TestSimExtremeIndexing.testScaleUp-seed#[A588F677BD53BB3B]) [    ] o.a.s.c.a.s.TestSimExtremeIndexing #### Total docs so far: 3,400,000
   [junit4]   2> 3394754 INFO  (TEST-TestSimExtremeIndexing.testScaleUp-seed#[A588F677BD53BB3B]) [    ] o.a.s.c.a.s.TestSimExtremeIndexing #### Total docs so far: 3,600,000
   [junit4]   2> 3394755 INFO  (TEST-TestSimExtremeIndexing.testScaleUp-seed#[A588F677BD53BB3B]) [    ] o.a.s.c.a.s.TestSimExtremeIndexing #### Total docs so far: 3,800,000
   [junit4]   2> 3394758 INFO  (TEST-TestSimExtremeIndexing.testScaleUp-seed#[A588F677BD53BB3B]) [    ] o.a.s.c.a.s.TestSimExtremeIndexing #### Total docs so far: 4,000,000
   [junit4]   2> 3394758 INFO  (TEST-TestSimExtremeIndexing.testScaleUp-seed#[A588F677BD53BB3B]) [    ] o.a.s.c.a.s.TestSimExtremeIndexing #### Total docs so far: 4,200,000
   [junit4]   2> 3394759 INFO  (TEST-TestSimExtremeIndexing.testScaleUp-seed#[A588F677BD53BB3B]) [    ] o.a.s.c.a.s.TestSimExtremeIndexing #### Total docs so far: 4,400,000
   [junit4]   2> 3394759 INFO  (TEST-TestSimExtremeIndexing.testScaleUp-seed#[A588F677BD53BB3B]) [    ] o.a.s.c.a.s.TestSimExtremeIndexing #### Total docs so far: 4,600,000
   [junit4]   2> 3394760 INFO  (TEST-TestSimExtremeIndexing.testScaleUp-seed#[A588F677BD53BB3B]) [    ] o.a.s.c.a.s.TestSimExtremeIndexing #### Total docs so far: 4,800,000
   [junit4]   2> 3394760 INFO  (TEST-TestSimExtremeIndexing.testScaleUp-seed#[A588F677BD53BB3B]) [    ] o.a.s.c.a.s.TestSimExtremeIndexing #### Total docs so far: 5,000,000
   [junit4]   2> 3394761 INFO  (TEST-TestSimExtremeIndexing.testScaleUp-seed#[A588F677BD53BB3B]) [    ] o.a.s.c.a.s.TestSimExtremeIndexing #### Total docs so far: 5,200,000
   [junit4]   2> 3394761 INFO  (TEST-TestSimExtremeIndexing.testScaleUp-seed#[A588F677BD53BB3B]) [    ] o.a.s.c.a.s.TestSimExtremeIndexing #### Total docs so far: 5,400,000
   [junit4]   2> 3394762 INFO  (TEST-TestSimExtremeIndexing.testScaleUp-seed#[A588F677BD53BB3B]) [    ] o.a.s.c.a.s.TestSimExtremeIndexing #### Total docs so far: 5,600,000
   [junit4]   2> 3394762 INFO  (TEST-TestSimExtremeIndexing.testScaleUp-seed#[A588F677BD53BB3B]) [    ] o.a.s.c.a.s.TestSimExtremeIndexing #### Total docs so far: 5,800,000
   [junit4]   2> 3394763 INFO  (TEST-TestSimExtremeIndexing.testScaleUp-seed#[A588F677BD53BB3B]) [    ] o.a.s.c.a.s.TestSimExtremeIndexing #### Total docs so far: 6,000,000
   [junit4]   2> 3394763 INFO  (TEST-TestSimExtremeIndexing.testScaleUp-seed#[A588F677BD53BB3B]) [    ] o.a.s.c.a.s.TestSimExtremeIndexing #### Total docs so far: 6,200,000
   [junit4]   2> 3394764 INFO  (TEST-TestSimExtremeIndexing.testScaleUp-seed#[A588F677BD53BB3B]) [    ] o.a.s.c.a.s.TestSimExtremeIndexing #### Total docs so far: 6,400,000
   [junit4]   2> 3394765 INFO  (TEST-TestSimExtremeIndexing.testScaleUp-seed#[A588F677BD53BB3B]) [    ] o.a.s.c.a.s.TestSimExtremeIndexing #### Total docs so far: 6,600,000
   [junit4]   2> 3394765 INFO  (TEST-TestSimExtremeIndexing.testScaleUp-seed#[A588F677BD53BB3B]) [    ] o.a.s.c.a.s.TestSimExtremeIndexing #### Total docs so far: 6,800,000
   [junit4]   2> 3394766 INFO  (TEST-TestSimExtremeIndexing.testScaleUp-seed#[A588F677BD53BB3B]) [    ] o.a.s.c.a.s.TestSimExtremeIndexing #### Total docs so far: 7,000,000
   [junit4]   2> 3394766 INFO  (TEST-TestSimExtremeIndexing.testScaleUp-seed#[A588F677BD53BB3B]) [    ] o.a.s.c.a.s.TestSimExtremeIndexing #### Total docs so far: 7,200,000
   [junit4]   2> 3394767 INFO  (TEST-TestSimExtremeIndexing.testScaleUp-seed#[A588F677BD53BB3B]) [    ] o.a.s.c.a.s.TestSimExtremeIndexing #### Total docs so far: 7,400,000
   [junit4]   2> 3394768 INFO  (TEST-TestSimExtremeIndexing.testScaleUp-seed#[A588F677BD53BB3B]) [    ] o.a.s.c.a.s.TestSimExtremeIndexing #### Total docs so far: 7,600,000
   [junit4]   2> 3394768 INFO  (TEST-TestSimExtremeIndexing.testScaleUp-seed#[A588F677BD53BB3B]) [    ] o.a.s.c.a.s.TestSimExtremeIndexing #### Total docs so far: 7,800,000
   [junit4]   2> 3394769 INFO  (TEST-TestSimExtremeIndexing.testScaleUp-seed#[A588F677BD53BB3B]) [    ] o.a.s.c.a.s.TestSimExtremeIndexing #### Total docs so far: 8,000,000
   [junit4]   2> 3394769 INFO  (TEST-TestSimExtremeIndexing.testScaleUp-seed#[A588F677BD53BB3B]) [    ] o.a.s.c.a.s.TestSimExtremeIndexing #### Total docs so far: 8,200,000
   [junit4]   2> 3394770 INFO  (TEST-TestSimExtremeIndexing.testScaleUp-seed#[A588F677BD53BB3B]) [    ] o.a.s.c.a.s.TestSimExtremeIndexing #### Total docs so far: 8,400,000
   [junit4]   2> 3394770 INFO  (TEST-TestSimExtremeIndexing.testScaleUp-seed#[A588F677BD53BB3B]) [    ] o.a.s.c.a.s.TestSimExtremeIndexing #### Total docs so far: 8,600,000
   [junit4]   2> 3394771 INFO  (TEST-TestSimExtremeIndexing.testScaleUp-seed#[A588F677BD53BB3B]) [    ] o.a.s.c.a.s.TestSimExtremeIndexing #### Total docs so far: 8,800,000
   [junit4]   2> 3394771 INFO  (TEST-TestSimExtremeIndexing.testScaleUp-seed#[A588F677BD53BB3B]) [    ] o.a.s.c.a.s.TestSimExtremeIndexing #### Total docs so far: 9,000,000
   [junit4]   2> 3394772 INFO  (TEST-TestSimExtremeIndexing.testScaleUp-seed#[A588F677BD53BB3B]) [    ] o.a.s.c.a.s.TestSimExtremeIndexing #### Total docs so far: 9,200,000
   [junit4]   2> 3394773 INFO  (TEST-TestSimExtremeIndexing.testScaleUp-seed#[A588F677BD53BB3B]) [    ] o.a.s.c.a.s.TestSimExtremeIndexing #### Total docs so far: 9,400,000
   [junit4]   2> 3394773 INFO  (TEST-TestSimExtremeIndexing.testScaleUp-seed#[A588F677BD53BB3B]) [    ] o.a.s.c.a.s.TestSimExtremeIndexing #### Total docs so far: 9,600,000
   [junit4]   2> 3394774 INFO  (TEST-TestSimExtremeIndexing.testScaleUp-seed#[A588F677BD53BB3B]) [    ] o.a.s.c.a.s.TestSimExtremeIndexing #### Total docs so far: 9,800,000
   [junit4]   2> 3394774 INFO  (TEST-TestSimExtremeIndexing.testScaleUp-seed#[A588F677BD53BB3B]) [    ] o.a.s.c.a.s.TestSimExtremeIndexing #### Total docs so far: 10,000,000
   [junit4]   2> 3394775 INFO  (TEST-TestSimExtremeIndexing.testScaleUp-seed#[A588F677BD53BB3B]) [    ] o.a.s.c.a.s.TestSimExtremeIndexing #### Total docs so far: 10,200,000
   [junit4]   2> 3394775 INFO  (TEST-TestSimExtremeIndexing.testScaleUp-seed#[A588F677BD53BB3B]) [    ] o.a.s.c.a.s.TestSimExtremeIndexing #### Total docs so far: 10,400,000
   [junit4]   2> 3394776 INFO  (TEST-TestSimExtremeIndexing.testScaleUp-seed#[A588F677BD53BB3B]) [    ] o.a.s.c.a.s.TestSimExtremeIndexing #### Total docs so far: 10,600,000
   [junit4]   2> 3394776 INFO  (TEST-TestSimExtremeIndexing.testScaleUp-seed#[A588F677BD53BB3B]) [    ] o.a.s.c.a.s.TestSimExtremeIndexing #### Total docs so far: 10,800,000
   [junit4]   2> 3394777 INFO  (TEST-TestSimExtremeIndexing.testScaleUp-seed#[A588F677BD53BB3B]) [    ] o.a.s.c.a.s.TestSimExtremeIndexing #### Total docs so far: 11,000,000
   [junit4]   2> 3394778 INFO  (TEST-TestSimExtremeIndexing.testScaleUp-seed#[A588F677BD53BB3B]) [    ] o.a.s.c.a.s.TestSimExtremeIndexing #### Total docs so far: 11,200,000
   [junit4]   2> 3394782 INFO  (TEST-TestSimExtremeIndexing.testScaleUp-seed#[A588F677BD53BB3B]) [    ] o.a.s.c.a.s.TestSimExtremeIndexing #### Total docs so far: 11,400,000
   [junit4]   2> 3394783 INFO  (TEST-TestSimExtremeIndexing.testScaleUp-seed#[A588F677BD53BB3B]) [    ] o.a.s.c.a.s.TestSimExtremeIndexing #### Total docs so far: 11,600,000
   [junit4]   2> 3394784 INFO  (TEST-TestSimExtremeIndexing.testScaleUp-seed#[A588F677BD53BB3B]) [    ] o.a.s.c.a.s.TestSimExtremeIndexing #### Total docs so far: 11,800,000
   [junit4]   2> 3394784 INFO  (TEST-TestSimExtremeIndexing.testScaleUp-seed#[A588F677BD53BB3B]) [    ] o.a.s.c.a.s.TestSimExtremeIndexing #### Total docs so far: 12,000,000
   [junit4]   2> 3394785 INFO  (TEST-TestSimExtremeIndexing.testScaleUp-seed#[A588F677BD53BB3B]) [    ] o.a.s.c.a.s.TestSimExtremeIndexing #### Total docs so far: 12,200,000
   [junit4]   2> 3394786 INFO  (TEST-TestSimExtremeIndexing.testScaleUp-seed#[A588F677BD53BB3B]) [    ] o.a.s.c.a.s.TestSimExtremeIndexing #### Total docs so far: 12,400,000
   [junit4]   2> 3394787 INFO  (TEST-TestSimExtremeIndexing.testScaleUp-seed#[A588F677BD53BB3B]) [    ] o.a.s.c.a.s.TestSimExtremeIndexing #### Total docs so far: 12,600,000
   [junit4]   2> 3394787 INFO  (TEST-TestSimExtremeIndexing.testScaleUp-seed#[A588F677BD53BB3B]) [    ] o.a.s.c.a.s.TestSimExtremeIndexing #### Total docs so far: 12,800,000
   [junit4]   2> 3394788 INFO  (TEST-TestSimExtremeIndexing.testScaleUp-seed#[A588F677BD53BB3B]) [    ] o.a.s.c.a.s.TestSimExtremeIndexing #### Total docs so far: 13,000,000
   [junit4]   2> 3394788 INFO  (TEST-TestSimExtremeIndexing.testScaleUp-seed#[A588F677BD53BB3B]) [    ] o.a.s.c.a.s.TestSimExtremeIndexing #### Total docs so far: 13,200,000
   [junit4]   2> 3394789 INFO  (TEST-TestSimExtremeIndexing.testScaleUp-seed#[A588F677BD53BB3B]) [    ] o.a.s.c.a.s.TestSimExtremeIndexing #### Total docs so far: 13,400,000
   [junit4]   2> 3394790 INFO  (TEST-TestSimExtremeIndexing.testScaleUp-seed#[A588F677BD53BB3B]) [    ] o.a.s.c.a.s.TestSimExtremeIndexing #### Total docs so far: 13,600,000
   [junit4]   2> 3394790 INFO  (TEST-TestSimExtremeIndexing.testScaleUp-seed#[A588F677BD53BB3B]) [    ] o.a.s.c.a.s.TestSimExtremeIndexing #### Total docs so far: 13,800,000
   [junit4]   2> 3394791 INFO  (TEST-TestSimExtremeIndexing.testScaleUp-seed#[A588F677BD53BB3B]) [    ] o.a.s.c.a.s.TestSimExtremeIndexing #### Total docs so far: 14,000,000
   [junit4]   2> 3394791 INFO  (TEST-TestSimExtremeIndexing.testScaleUp-seed#[A588F677BD53BB3B]) [    ] o.a.s.c.a.s.TestSimExtremeIndexing #### Total docs so far: 14,200,000
   [junit4]   2> 3394792 INFO  (TEST-TestSimExtremeIndexing.testScaleUp-seed#[A588F677BD53BB3B]) [    ] o.a.s.c.a.s.TestSimExtremeIndexing #### Total docs so far: 14,400,000
   [junit4]   2> 3394792 INFO  (TEST-TestSimExtremeIndexing.testScaleUp-seed#[A588F677BD53BB3B]) [    ] o.a.s.c.a.s.TestSimExtremeIndexing #### Total docs so far: 14,600,000
   [junit4]   2> 3394793 INFO  (TEST-TestSimExtremeIndexing.testScaleUp-seed#[A588F677BD53BB3B]) [    ] o.a.s.c.a.s.TestSimExtremeIndexing #### Total docs so far: 14,800,000
   [junit4]   2> 3394794 INFO  (TEST-TestSimExtremeIndexing.testScaleUp-seed#[A588F677BD53BB3B]) [    ] o.a.s.c.a.s.TestSimExtremeIndexing #### Total docs so far: 15,000,000
   [junit4]   2> 3394794 INFO  (TEST-TestSimExtremeIndexing.testScaleUp-seed#[A588F677BD53BB3B]) [    ] o.a.s.c.a.s.TestSimExtremeIndexing #### Total docs so far: 15,200,000
   [junit4]   2> 3394795 INFO  (TEST-TestSimExtremeIndexing.testScaleUp-seed#[A588F677BD53BB3B]) [    ] o.a.s.c.a.s.TestSimExtremeIndexing #### Total docs so far: 15,400,000
   [junit4]   2> 3394796 INFO  (TEST-TestSimExtremeIndexing.testScaleUp-seed#[A588F677BD53BB3B]) [    ] o.a.s.c.a.s.TestSimExtremeIndexing #### Total docs so far: 15,600,000
   [junit4]   2> 3394796 INFO  (TEST-TestSimExtremeIndexing.testScaleUp-seed#[A588F677BD53BB3B]) [    ] o.a.s.c.a.s.TestSimExtremeIndexing #### Total docs so far: 15,800,000
   [junit4]   2> 3394797 INFO  (TEST-TestSimExtremeIndexing.testScaleUp-seed#[A588F677BD53BB3B]) [    ] o.a.s.c.a.s.TestSimExtremeIndexing #### Total docs so far: 16,000,000
   [junit4]   2> 3394797 INFO  (TEST-TestSimExtremeIndexing.testScaleUp-seed#[A588F677BD53BB3B]) [    ] o.a.s.c.a.s.TestSimExtremeIndexing #### Total docs so far: 16,200,000
   [junit4]   2> 3394798 INFO  (TEST-TestSimExtremeIndexing.testScaleUp-seed#[A588F677BD53BB3B]) [    ] o.a.s.c.a.s.TestSimExtremeIndexing #### Total docs so far: 16,400,000
   [junit4]   2> 3394799 INFO  (TEST-TestSimExtremeIndexing.testScaleUp-seed#[A588F677BD53BB3B]) [    ] o.a.s.c.a.s.TestSimExtremeIndexing #### Total docs so far: 16,600,000
   [junit4]   2> 3394800 INFO  (TEST-TestSimExtremeIndexing.testScaleUp-seed#[A588F677BD53BB3B]) [    ] o.a.s.c.a.s.TestSimExtremeIndexing #### Total docs so far: 16,800,000
   [junit4]   2> 3394800 INFO  (TEST-TestSimExtremeIndexing.testScaleUp-seed#[A588F677BD53BB3B]) [    ] o.a.s.c.a.s.TestSimExtremeIndexing #### Total docs so far: 17,000,000
   [junit4]   2> 3394801 INFO  (TEST-TestSimExtremeIndexing.testScaleUp-seed#[A588F677BD53BB3B]) [    ] o.a.s.c.a.s.TestSimExtremeIndexing #### Total docs so far: 17,200,000
   [junit4]   2> 3394801 INFO  (TEST-TestSimExtremeIndexing.testScaleUp-seed#[A588F677BD53BB3B]) [    ] o.a.s.c.a.s.TestSimExtremeIndexing #### Total docs so far: 17,400,000
   [junit4]   2> 3394802 INFO  (TEST-TestSimExtremeIndexing.testScaleUp-seed#[A588F677BD53BB3B]) [    ] o.a.s.c.a.s.TestSimExtremeIndexing #### Total docs so far: 17,600,000
   [junit4]   2> 3394802 INFO  (TEST-TestSimExtremeIndexing.testScaleUp-seed#[A588F677BD53BB3B]) [    ] o.a.s.c.a.s.TestSimExtremeIndexing #### Total docs so far: 17,800,000
   [junit4]   2> 3394803 INFO  (TEST-TestSimExtremeIndexing.testScaleUp-seed#[A588F677BD53BB3B]) [    ] o.a.s.c.a.s.TestSimExtremeIndexing #### Total docs so far: 18,000,000
   [junit4]   2> 3394803 INFO  (TEST-TestSimExtremeIndexing.testScaleUp-seed#[A588F677BD53BB3B]) [    ] o.a.s.c.a.s.TestSimExtremeIndexing #### Total docs so far: 18,200,000
   [junit4]   2> 3394804 INFO  (TEST-TestSimExtremeIndexing.testScaleUp-seed#[A588F677BD53BB3B]) [    ] o.a.s.c.a.s.TestSimExtremeIndexing #### Total docs so far: 18,400,000
   [junit4]   2> 3394805 INFO  (TEST-TestSimExtremeIndexing.testScaleUp-seed#[A588F677BD53BB3B]) [    ] o.a.s.c.a.s.TestSimExtremeIndexing #### Total docs so far: 18,600,000
   [junit4]   2> 3394805 INFO  (TEST-TestSimExtremeIndexing.testScaleUp-seed#[A588F677BD53BB3B]) [    ] o.a.s.c.a.s.TestSimExtremeIndexing #### Total docs so far: 18,800,000
   [junit4]   2> 3394806 INFO  (TEST-TestSimExtremeIndexing.testScaleUp-seed#[A588F677BD53BB3B]) [    ] o.a.s.c.a.s.TestSimExtremeIndexing #### Total docs so far: 19,000,000
   [junit4]   2> 3394806 INFO  (TEST-TestSimExtremeIndexing.testScaleUp-seed#[A588F677BD53BB3B]) [    ] o.a.s.c.a.s.TestSimExtremeIndexing #### Total docs so far: 19,200,000
   [junit4]   2> 3394807 INFO  (TEST-TestSimExtremeIndexing.testScaleUp-seed#[A588F677BD53BB3B]) [    ] o.a.s.c.a.s.TestSimExtremeIndexing #### Total docs so far: 19,400,000
   [junit4]   2> 3394807 INFO  (TEST-TestSimExtremeIndexing.testScaleUp-seed#[A588F677BD53BB3B]) [    ] o.a.s.c.a.s.TestSimExtremeIndexing #### Total docs so far: 19,600,000
   [junit4]   2> 3394808 INFO  (TEST-TestSimExtremeIndexing.testScaleUp-seed#[A588F677BD53BB3B]) [    ] o.a.s.c.a.s.TestSimExtremeIndexing #### Total docs so far: 19,800,000
   [junit4]   2> 3394808 INFO  (TEST-TestSimExtremeIndexing.testScaleUp-seed#[A588F677BD53BB3B]) [    ] o.a.s.c.a.s.TestSimExtremeIndexing #### Total docs so far: 20,000,000
   [junit4]   2> 3394809 INFO  (TEST-TestSimExtremeIndexing.testScaleUp-seed#[A588F677BD53BB3B]) [    ] o.a.s.c.a.s.TestSimExtremeIndexing #### Total docs so far: 20,200,000
   [junit4]   2> 3394810 INFO  (TEST-TestSimExtremeIndexing.testScaleUp-seed#[A588F677BD53BB3B]) [    ] o.a.s.c.a.s.TestSimExtremeIndexing #### Total docs so far: 20,400,000
   [junit4]   2> 3394810 INFO  (TEST-TestSimExtremeIndexing.testScaleUp-seed#[A588F677BD53BB3B]) [    ] o.a.s.c.a.s.TestSimExtremeIndexing #### Total docs so far: 20,600,000
   [junit4]   2> 3394811 INFO  (TEST-TestSimExtremeIndexing.testScaleUp-seed#[A588F677BD53BB3B]) [    ] o.a.s.c.a.s.TestSimExtremeIndexing #### Total docs so far: 20,800,000
   [junit4]   2> 3394811 INFO  (TEST-TestSimExtremeIndexing.testScaleUp-seed#[A588F677BD53BB3B]) [    ] o.a.s.c.a.s.TestSimExtremeIndexing #### Total docs so far: 21,000,000
   [junit4]   2> 3394812 INFO  (TEST-TestSimExtremeIndexing.testScaleUp-seed#[A588F677BD53BB3B]) [    ] o.a.s.c.a.s.TestSimExtremeIndexing #### Total docs so far: 21,200,000
   [junit4]   2> 3394812 INFO  (TEST-TestSimExtremeIndexing.testScaleUp-seed#[A588F677BD53BB3B]) [    ] o.a.s.c.a.s.TestSimExtremeIndexing #### Total docs so far: 21,400,000
   [junit4]   2> 3394813 INFO  (TEST-TestSimExtremeIndexing.testScaleUp-seed#[A588F677BD53BB3B]) [    ] o.a.s.c.a.s.TestSimExtremeIndexing #### Total docs so far: 21,600,000
   [junit4]   2> 3394814 INFO  (TEST-TestSimExtremeIndexing.testScaleUp-seed#[A588F677BD53BB3B]) [    ] o.a.s.c.a.s.TestSimExtremeIndexing #### Total docs so far: 21,800,000
   [junit4]   2> 3394814 INFO  (TEST-TestSimExtremeIndexing.testScaleUp-seed#[A588F677BD53BB3B]) [    ] o.a.s.c.a.s.TestSimExtremeIndexing #### Total docs so far: 22,000,000
   [junit4]   2> 3394815 INFO  (TEST-TestSimExtremeIndexing.testScaleUp-seed#[A588F677BD53BB3B]) [    ] o.a.s.c.a.s.TestSimExtremeIndexing #### Total docs so far: 22,200,000
   [junit4]   2> 3394816 INFO  (TEST-TestSimExtremeIndexing.testScaleUp-seed#[A588F677BD53BB3B]) [    ] o.a.s.c.a.s.TestSimExtremeIndexing #### Total docs so far: 22,400,000
   [junit4]   2> 3394816 INFO  (TEST-TestSimExtremeIndexing.testScaleUp-seed#[A588F677BD53BB3B]) [    ] o.a.s.c.a.s.TestSimExtremeIndexing #### Total docs so far: 22,600,000
   [junit4]   2> 3394817 INFO  (TEST-TestSimExtremeIndexing.testScaleUp-seed#[A588F677BD53BB3B]) [    ] o.a.s.c.a.s.TestSimExtremeIndexing #### Total docs so far: 22,800,000
   [junit4]   2> 3394817 INFO  (TEST-TestSimExtremeIndexing.testScaleUp-seed#[A588F677BD53BB3B]) [    ] o.a.s.c.a.s.TestSimExtremeIndexing #### Total docs so far: 23,000,000
   [junit4]   2> 3394818 INFO  (TEST-TestSimExtremeIndexing.testScaleUp-seed#[A588F677BD53BB3B]) [    ] o.a.s.c.a.s.TestSimExtremeIndexing #### Total docs so far: 23,200,000
   [junit4]   2> 3394818 INFO  (TEST-TestSimExtremeIndexing.testScaleUp-seed#[A588F677BD53BB3B]) [    ] o.a.s.c.a.s.TestSimExtremeIndexing #### Total docs so far: 23,400,000
   [junit4]   2> 3394819 INFO  (TEST-TestSimExtremeIndexing.testScaleUp-seed#[A588F677BD53BB3B]) [    ] o.a.s.c.a.s.TestSimExtremeIndexing #### Total docs so far: 23,600,000
   [junit4]   2> 3394820 INFO  (TEST-TestSimExtremeIndexing.testScaleUp-seed#[A588F677BD53BB3B]) [    ] o.a.s.c.a.s.TestSimExtremeIndexing #### Total docs so far: 23,800,000
   [junit4]   2> 3394820 INFO  (TEST-TestSimExtremeIndexing.testScaleUp-seed#[A588F677BD53BB3B]) [    ] o.a.s.c.a.s.TestSimExtremeIndexing #### Total docs so far: 24,000,000
   [junit4]   2> 3394821 INFO  (TEST-TestSimExtremeIndexing.testScaleUp-seed#[A588F677BD53BB3B]) [    ] o.a.s.c.a.s.TestSimExtremeIndexing #### Total docs so far: 24,200,000
   [junit4]   2> 3394821 INFO  (TEST-TestSimExtremeIndexing.testScaleUp-seed#[A588F677BD53BB3B]) [    ] o.a.s.c.a.s.TestSimExtremeIndexing #### Total docs so far: 24,400,000
   [junit4]   2> 3394822 INFO  (TEST-TestSimExtremeIndexing.testScaleUp-seed#[A588F677BD53BB3B]) [    ] o.a.s.c.a.s.TestSimExtremeIndexing #### Total docs so far: 24,600,000
   [junit4]   2> 3394824 INFO  (TEST-TestSimExtremeIndexing.testScaleUp-seed#[A588F677BD53BB3B]) [    ] o.a.s.c.a.s.TestSimExtremeIndexing #### Total docs so far: 24,800,000
   [junit4]   2> 3394824 INFO  (TEST-TestSimExtremeIndexing.testScaleUp-seed#[A588F677BD53BB3B]) [    ] o.a.s.c.a.s.TestSimExtremeIndexing #### Total docs so far: 25,000,000
   [junit4]   2> 3394825 INFO  (TEST-TestSimExtremeIndexing.testScaleUp-seed#[A588F677BD53BB3B]) [    ] o.a.s.c.a.s.TestSimExtremeIndexing #### Total docs so far: 25,200,000
   [junit4]   2> 3394825 INFO  (TEST-TestSimExtremeIndexing.testScaleUp-seed#[A588F677BD53BB3B]) [    ] o.a.s.c.a.s.TestSimExtremeIndexing #### Total docs so far: 25,400,000
   [junit4]   2> 3394826 INFO  (TEST-TestSimExtremeIndexing.testScaleUp-seed#[A588F677BD53BB3B]) [    ] o.a.s.c.a.s.TestSimExtremeIndexing #### Total docs so far: 25,600,000
   [junit4]   2> 3394826 INFO  (TEST-TestSimExtremeIndexing.testScaleUp-seed#[A588F677BD53BB3B]) [    ] o.a.s.c.a.s.TestSimExtremeIndexing #### Total docs so far: 25,800,000
   [junit4]   2> 3394827 INFO  (TEST-TestSimExtremeIndexing.testScaleUp-seed#[A588F677BD53BB3B]) [    ] o.a.s.c.a.s.TestSimExtremeIndexing #### Total docs so far: 26,000,000
   [junit4]   2> 3394828 INFO  (TEST-TestSimExtremeIndexing.testScaleUp-seed#[A588F677BD53BB3B]) [    ] o.a.s.c.a.s.TestSimExtremeIndexing #### Total docs so far: 26,200,000
   [junit4]   2> 3394829 INFO  (TEST-TestSimExtremeIndexing.testScaleUp-seed#[A588F677BD53BB3B]) [    ] o.a.s.c.a.s.TestSimExtremeIndexing #### Total docs so far: 26,400,000
   [junit4]   2> 3394829 INFO  (TEST-TestSimExtremeIndexing.testScaleUp-seed#[A588F677BD53BB3B]) [    ] o.a.s.c.a.s.TestSimExtremeIndexing #### Total docs so far: 26,600,000
   [junit4]   2> 3394830 INFO  (TEST-TestSimExtremeIndexing.testScaleUp-seed#[A588F677BD53BB3B]) [    ] o.a.s.c.a.s.TestSimExtremeIndexing #### Total docs so far: 26,800,000
   [junit4]   2> 3394830 INFO  (TEST-TestSimExtremeIndexing.testScaleUp-seed#[A588F677BD53BB3B]) [    ] o.a.s.c.a.s.TestSimExtremeIndexing #### Total docs so far: 27,000,000
   [junit4]   2> 3394831 INFO  (TEST-TestSimExtremeIndexing.testScaleUp-seed#[A588F677BD53BB3B]) [    ] o.a.s.c.a.s.TestSimExtremeIndexing #### Total docs so far: 27,200,000
   [junit4]   2> 3394831 INFO  (TEST-TestSimExtremeIndexing.testScaleUp-seed#[A588F677BD53BB3B]) [    ] o.a.s.c.a.s.TestSimExtremeIndexing #### Total docs so far: 27,400,000
   [junit4]   2> 3394832 INFO  (TEST-TestSimExtremeIndexing.testScaleUp-seed#[A588F677BD53BB3B]) [    ] o.a.s.c.a.s.TestSimExtremeIndexing #### Total docs so far: 27,600,000
   [junit4]   2> 3394832 INFO  (TEST-TestSimExtremeIndexing.testScaleUp-seed#[A588F677BD53BB3B]) [    ] o.a.s.c.a.s.TestSimExtremeIndexing #### Total docs so far: 27,800,000
   [junit4]   2> 3394833 INFO  (TEST-TestSimExtremeIndexing.testScaleUp-seed#[A588F677BD53BB3B]) [    ] o.a.s.c.a.s.TestSimExtremeIndexing #### Total docs so far: 28,000,000
   [junit4]   2> 3394833 INFO  (TEST-TestSimExtremeIndexing.testScaleUp-seed#[A588F677BD53BB3B]) [    ] o.a.s.c.a.s.TestSimExtremeIndexing #### Total docs so far: 28,200,000
   [junit4]   2> 3394834 INFO  (TEST-TestSimExtremeIndexing.testScaleUp-seed#[A588F677BD53BB3B]) [    ] o.a.s.c.a.s.TestSimExtremeIndexing #### Total docs so far: 28,400,000
   [junit4]   2> 3394835 INFO  (TEST-TestSimExtremeIndexing.testScaleUp-seed#[A588F677BD53BB3B]) [    ] o.a.s.c.a.s.TestSimExtremeIndexing #### Total docs so far: 28,600,000
   [junit4]   2> 3394835 INFO  (TEST-TestSimExtremeIndexing.testScaleUp-seed#[A588F677BD53BB3B]) [    ] o.a.s.c.a.s.TestSimExtremeIndexing #### Total docs so far: 28,800,000
   [junit4]   2> 3394836 INFO  (TEST-TestSimExtremeIndexing.testScaleUp-seed#[A588F677BD53BB3B]) [    ] o.a.s.c.a.s.TestSimExtremeIndexing #### Total docs so far: 29,000,000
   [junit4]   2> 3394836 INFO  (TEST-TestSimExtremeIndexing.testScaleUp-seed#[A588F677BD53BB3B]) [    ] o.a.s.c.a.s.TestSimExtremeIndexing #### Total docs so far: 29,200,000
   [junit4]   2> 3394837 INFO  (TEST-TestSimExtremeIndexing.testScaleUp-seed#[A588F677BD53BB3B]) [    ] o.a.s.c.a.s.TestSimExtremeIndexing #### Total docs so far: 29,400,000
   [junit4]   2> 3394837 INFO  (TEST-TestSimExtremeIndexing.testScaleUp-seed#[A588F677BD53BB3B]) [    ] o.a.s.c.a.s.TestSimExtremeIndexing #### Total docs so far: 29,600,000
   [junit4]   2> 3394838 INFO  (TEST-TestSimExtremeIndexing.testScaleUp-seed#[A588F677BD53BB3B]) [    ] o.a.s.c.a.s.TestSimExtremeIndexing #### Total docs so far: 29,800,000
   [junit4]   2> 3394838 INFO  (TEST-TestSimExtremeIndexing.testScaleUp-seed#[A588F677BD53BB3B]) [    ] o.a.s.c.a.s.TestSimExtremeIndexing #### Total docs so far: 30,000,000
   [junit4]   2> 3394839 INFO  (TEST-TestSimExtremeIndexing.testScaleUp-seed#[A588F677BD53BB3B]) [    ] o.a.s.c.a.s.TestSimExtremeIndexing #### Total docs so far: 30,200,000
   [junit4]   2> 3394839 INFO  (TEST-TestSimExtremeIndexing.testScaleUp-seed#[A588F677BD53BB3B]) [    ] o.a.s.c.a.s.TestSimExtremeIndexing #### Total docs so far: 30,400,000
   [junit4]   2> 3394841 INFO  (TEST-TestSimExtremeIndexing.testScaleUp-seed#[A588F677BD53BB3B]) [    ] o.a.s.c.a.s.TestSimExtremeIndexing #### Total docs so far: 30,600,000
   [junit4]   2> 3394842 INFO  (TEST-TestSimExtremeIndexing.testScaleUp-seed#[A588F677BD53BB3B]) [    ] o.a.s.c.a.s.TestSimExtremeIndexing #### Total docs so far: 30,800,000
   [junit4]   2> 3394842 INFO  (TEST-TestSimExtremeIndexing.testScaleUp-seed#[A588F677BD53BB3B]) [    ] o.a.s.c.a.s.TestSimExtremeIndexing #### Total docs so far: 31,000,000
   [junit4]   2> 3394843 INFO  (TEST-TestSimExtremeIndexing.testScaleUp-seed#[A588F677BD53BB3B]) [    ] o.a.s.c.a.s.TestSimExtremeIndexing #### Total docs so far: 31,200,000
   [junit4]   2> 3394843 INFO  (TEST-TestSimExtremeIndexing.testScaleUp-seed#[A588F677BD53BB3B]) [    ] o.a.s.c.a.s.TestSimExtremeIndexing #### Total docs so far: 31,400,000
   [junit4]   2> 3394844 INFO  (TEST-TestSimExtremeIndexing.testScaleUp-seed#[A588F677BD53BB3B]) [    ] o.a.s.c.a.s.TestSimExtremeIndexing #### Total docs so far: 31,600,000
   [junit4]   2> 3394845 INFO  (TEST-TestSimExtremeIndexing.testScaleUp-seed#[A588F677BD53BB3B]) [    ] o.a.s.c.a.s.TestSimExtremeIndexing #### Total docs so far: 31,800,000
   [junit4]   2> 3394845 INFO  (TEST-TestSimExtremeIndexing.testScaleUp-seed#[A588F677BD53BB3B]) [    ] o.a.s.c.a.s.TestSimExtremeIndexing #### Total docs so far: 32,000,000
   [junit4]   2> 3394846 INFO  (TEST-TestSimExtremeIndexing.testScaleUp-seed#[A588F677BD53BB3B]) [    ] o.a.s.c.a.s.TestSimExtremeIndexing #### Total docs so far: 32,200,000
   [junit4]   2> 3394846 INFO  (TEST-TestSimExtremeIndexing.testScaleUp-seed#[A588F677BD53BB3B]) [    ] o.a.s.c.a.s.TestSimExtremeIndexing #### Total docs so far: 32,400,000
   [junit4]   2> 3394847 INFO  (TEST-TestSimExtremeIndexing.testScaleUp-seed#[A588F677BD53BB3B]) [    ] o.a.s.c.a.s.TestSimExtremeIndexing #### Total docs so far: 32,600,000
   [junit4]   2> 3394847 INFO  (TEST-TestSimExtremeIndexing.testScaleUp-seed#[A588F677BD53BB3B]) [    ] o.a.s.c.a.s.TestSimExtremeIndexing #### Total docs so far: 32,800,000
   [junit4]   2> 3394848 INFO  (TEST-TestSimExtremeIndexing.testScaleUp-seed#[A588F677BD53BB3B]) [    ] o.a.s.c.a.s.TestSimExtremeIndexing #### Total docs so far: 33,000,000
   [junit4]   2> 3394848 INFO  (TEST-TestSimExtremeIndexing.testScaleUp-seed#[A588F677BD53BB3B]) [    ] o.a.s.c.a.s.TestSimExtremeIndexing #### Total docs so far: 33,200,000
   [junit4]   2> 3394849 INFO  (TEST-TestSimExtremeIndexing.testScaleUp-seed#[A588F677BD53BB3B]) [    ] o.a.s.c.a.s.TestSimExtremeIndexing #### Total docs so far: 33,400,000
   [junit4]   2> 3394849 INFO  (TEST-TestSimExtremeIndexing.testScaleUp-seed#[A588F677BD53BB3B]) [    ] o.a.s.c.a.s.TestSimExtremeIndexing #### Total docs so far: 33,600,000
   [junit4]   2> 3394850 INFO  (TEST-TestSimExtremeIndexing.testScaleUp-seed#[A588F677BD53BB3B]) [    ] o.a.s.c.a.s.TestSimExtremeIndexing #### Total docs so far: 33,800,000
   [junit4]   2> 3394850 INFO  (TEST-TestSimExtremeIndexing.testScaleUp-seed#[A588F677BD53BB3B]) [    ] o.a.s.c.a.s.TestSimExtremeIndexing #### Total docs so far: 34,000,000
   [junit4]   2> 3394851 INFO  (TEST-TestSimExtremeIndexing.testScaleUp-seed#[A588F677BD53BB3B]) [    ] o.a.s.c.a.s.TestSimExtremeIndexing #### Total docs so far: 34,200,000
   [junit4]   2> 3394852 INFO  (TEST-TestSimExtremeIndexing.testScaleUp-seed#[A588F677BD53BB3B]) [    ] o.a.s.c.a.s.TestSimExtremeIndexing #### Total docs so far: 34,400,000
   [junit4]   2> 3394853 INFO  (TEST-TestSimExtremeIndexing.testScaleUp-seed#[A588F677BD53BB3B]) [    ] o.a.s.c.a.s.TestSimExtremeIndexing #### Total docs so far: 34,600,000
   [junit4]   2> 3394854 INFO  (TEST-TestSimExtremeIndexing.testScaleUp-seed#[A588F677BD53BB3B]) [    ] o.a.s.c.a.s.TestSimExtremeIndexing #### Total docs so far: 34,800,000
   [junit4]   2> 3394855 INFO  (TEST-TestSimExtremeIndexing.testScaleUp-seed#[A588F677BD53BB3B]) [    ] o.a.s.c.a.s.TestSimExtremeIndexing #### Total docs so far: 35,000,000
   [junit4]   2> 3394855 INFO  (TEST-TestSimExtremeIndexing.testScaleUp-seed#[A588F677BD53BB3B]) [    ] o.a.s.c.a.s.TestSimExtremeIndexing #### Total docs so far: 35,200,000
   [junit4]   2> 3394856 INFO  (TEST-TestSimExtremeIndexing.testScaleUp-seed#[A588F677BD53BB3B]) [    ] o.a.s.c.a.s.TestSimExtremeIndexing #### Total docs so far: 35,400,000
   [junit4]   2> 3394857 INFO  (TEST-TestSimExtremeIndexing.testScaleUp-seed#[A588F677BD53BB3B]) [    ] o.a.s.c.a.s.TestSimExtremeIndexing #### Total docs so far: 35,600,000
   [junit4]   2> 3394857 INFO  (TEST-TestSimExtremeIndexing.testScaleUp-seed#[A588F677BD53BB3B]) [    ] o.a.s.c.a.s.TestSimExtremeIndexing #### Total docs so far: 35,800,000
   [junit4]   2> 3394858 INFO  (TEST-TestSimExtremeIndexing.testScaleUp-seed#[A588F677BD53BB3B]) [    ] o.a.s.c.a.s.TestSimExtremeIndexing #### Total docs so far: 36,000,000
   [junit4]   2> 3394859 INFO  (TEST-TestSimExtremeIndexing.testScaleUp-seed#[A588F677BD53BB3B]) [    ] o.a.s.c.a.s.TestSimExtremeIndexing #### Total docs so far: 36,200,000
   [junit4]   2> 3394859 INFO  (TEST-TestSimExtremeIndexing.testScaleUp-seed#[A588F677BD53BB3B]) [    ] o.a.s.c.a.s.TestSimExtremeIndexing #### Total docs so far: 36,400,000
   [junit4]   2> 3394860 INFO  (TEST-TestSimExtremeIndexing.testScaleUp-seed#[A588F677BD53BB3B]) [    ] o.a.s.c.a.s.TestSimExtremeIndexing #### Total docs so far: 36,600,000
   [junit4]   2> 3394860 INFO  (TEST-TestSimExtremeIndexing.testScaleUp-seed#[A588F677BD53BB3B]) [    ] o.a.s.c.a.s.TestSimExtremeIndexing #### Total docs so far: 36,800,000
   [junit4]   2> 3394861 INFO  (TEST-TestSimExtremeIndexing.testScaleUp-seed#[A588F677BD53BB3B]) [    ] o.a.s.c.a.s.TestSimExtremeIndexing #### Total docs so far: 37,000,000
   [junit4]   2> 3394862 INFO  (TEST-TestSimExtremeIndexing.testScaleUp-seed#[A588F677BD53BB3B]) [    ] o.a.s.c.a.s.TestSimExtremeIndexing #### Total docs so far: 37,200,000
   [junit4]   2> 3394863 INFO  (TEST-TestSimExtremeIndexing.testScaleUp-seed#[A588F677BD53BB3B]) [    ] o.a.s.c.a.s.TestSimExtremeIndexing #### Total docs so far: 37,400,000
   [junit4]   2> 3394863 INFO  (TEST-TestSimExtremeIndexing.testScaleUp-seed#[A588F677BD53BB3B]) [    ] o.a.s.c.a.s.TestSimExtremeIndexing #### Total docs so far: 37,600,000
   [junit4]   2> 3394864 INFO  (TEST-TestSimExtremeIndexing.testScaleUp-seed#[A588F677BD53BB3B]) [    ] o.a.s.c.a.s.TestSimExtremeIndexing #### Total docs so far: 37,800,000
   [junit4]   2> 3394864 INFO  (TEST-TestSimExtremeIndexing.testScaleUp-seed#[A588F677BD53BB3B]) [    ] o.a.s.c.a.s.TestSimExtremeIndexing #### Total docs so far: 38,000,000
   [junit4]   2> 3394865 INFO  (TEST-TestSimExtremeIndexing.testScaleUp-seed#[A588F677BD53BB3B]) [    ] o.a.s.c.a.s.TestSimExtremeIndexing #### Total docs so far: 38,200,000
   [junit4]   2> 3394868 INFO  (TEST-TestSimExtremeIndexing.testScaleUp-seed#[A588F677BD53BB3B]) [    ] o.a.s.c.a.s.TestSimExtremeIndexing #### Total docs so far: 38,400,000
   [junit4]   2> 3394868 INFO  (TEST-TestSimExtremeIndexing.testScaleUp-seed#[A588F677BD53BB3B]) [    ] o.a.s.c.a.s.TestSimExtremeIndexing #### Total docs so far: 38,600,000
   [junit4]   2> 3394869 INFO  (TEST-TestSimExtremeIndexing.testScaleUp-seed#[A588F677BD53BB3B]) [    ] o.a.s.c.a.s.TestSimExtremeIndexing #### Total docs so far: 38,800,000
   [junit4]   2> 3394869 INFO  (TEST-TestSimExtremeIndexing.testScaleUp-seed#[A588F677BD53BB3B]) [    ] o.a.s.c.a.s.TestSimExtremeIndexing #### Total docs so far: 39,000,000
   [junit4]   2> 3394869 INFO  (TEST-TestSimExtremeIndexing.testScaleUp-seed#[A588F677BD53BB3B]) [    ] o.a.s.c.a.s.TestSimExtremeIndexing #### Total docs so far: 39,200,000
   [junit4]   2> 3394870 INFO  (TEST-TestSimExtremeIndexing.testScaleUp-seed#[A588F677BD53BB3B]) [    ] o.a.s.c.a.s.TestSimExtremeIndexing #### Total docs so far: 39,400,000
   [junit4]   2> 3394870 INFO  (TEST-TestSimExtremeIndexing.testScaleUp-seed#[A588F677BD53BB3B]) [    ] o.a.s.c.a.s.TestSimExtremeIndexing #### Total docs so far: 39,600,000
   [junit4]   2> 3394870 INFO  (TEST-TestSimExtremeIndexing.testScaleUp-seed#[A588F677BD53BB3B]) [    ] o.a.s.c.a.s.TestSimExtremeIndexing #### Total docs so far: 39,800,000
   [junit4]   2> 3394871 INFO  (TEST-TestSimExtremeIndexing.testScaleUp-seed#[A588F677BD53BB3B]) [    ] o.a.s.c.a.s.TestSimExtremeIndexing #### Total docs so far: 40,000,000
   [junit4]   2> 3394871 INFO  (TEST-TestSimExtremeIndexing.testScaleUp-seed#[A588F677BD53BB3B]) [    ] o.a.s.c.a.s.TestSimExtremeIndexing #### Total docs so far: 40,200,000
   [junit4]   2> 3394872 INFO  (TEST-TestSimExtremeIndexing.testScaleUp-seed#[A588F677BD53BB3B]) [    ] o.a.s.c.a.s.TestSimExtremeIndexing #### Total docs so far: 40,400,000
   [junit4]   2> 3394872 INFO  (TEST-TestSimExtremeIndexing.testScaleUp-seed#[A588F677BD53BB3B]) [    ] o.a.s.c.a.s.TestSimExtremeIndexing #### Total docs so far: 40,600,000
   [junit4]   2> 3394872 INFO  (TEST-TestSimExtremeIndexing.testScaleUp-seed#[A588F677BD53BB3B]) [    ] o.a.s.c.a.s.TestSimExtremeIndexing #### Total docs so far: 40,800,000
   [junit4]   2> 3394873 INFO  (TEST-TestSimExtremeIndexing.testScaleUp-seed#[A588F677BD53BB3B]) [    ] o.a.s.c.a.s.TestSimExtremeIndexing #### Total docs so far: 41,000,000
   [junit4]   2> 3394873 INFO  (TEST-TestSimExtremeIndexing.testScaleUp-seed#[A588F677BD53BB3B]) [    ] o.a.s.c.a.s.TestSimExtremeIndexing #### Total docs so far: 41,200,000
   [junit4]   2> 3394873 INFO  (TEST-TestSimExtremeIndexing.testScaleUp-seed#[A588F677BD53BB3B]) [    ] o.a.s.c.a.s.TestSimExtremeIndexing #### Total docs so far: 41,400,000
   [junit4]   2> 3394874 INFO  (TEST-TestSimExtremeIndexing.testScaleUp-seed#[A588F677BD53BB3B]) [    ] o.a.s.c.a.s.TestSimExtremeIndexing #### Total docs so far: 41,600,000
   [junit4]   2> 3394875 INFO  (TEST-TestSimExtremeIndexing.testScaleUp-seed#[A588F677BD53BB3B]) [    ] o.a.s.c.a.s.TestSimExtremeIndexing #### Total docs so far: 41,800,000
   [junit4]   2> 3394876 INFO  (TEST-TestSimExtremeIndexing.testScaleUp-seed#[A588F677BD53BB3B]) [    ] o.a.s.c.a.s.TestSimExtremeIndexing #### Total docs so far: 42,000,000
   [junit4]   2> 3394876 INFO  (TEST-TestSimExtremeIndexing.testScaleUp-seed#[A588F677BD53BB3B]) [    ] o.a.s.c.a.s.TestSimExtremeIndexing #### Total docs so far: 42,200,000
   [junit4]   2> 3394877 INFO  (TEST-TestSimExtremeIndexing.testScaleUp-seed#[A588F677BD53BB3B]) [    ] o.a.s.c.a.s.TestSimExtremeIndexing #### Total docs so far: 42,400,000
   [junit4]   2> 3394877 INFO  (TEST-TestSimExtremeIndexing.testScaleUp-seed#[A588F677BD53BB3B]) [    ] o.a.s.c.a.s.TestSimExtremeIndexing #### Total docs so far: 42,600,000
   [junit4]   2> 3394877 INFO  (TEST-TestSimExtremeIndexing.testScaleUp-seed#[A588F677BD53BB3B]) [    ] o.a.s.c.a.s.TestSimExtremeIndexing #### Total docs so far: 42,800,000
   [junit4]   2> 3394878 INFO  (TEST-TestSimExtremeIndexing.testScaleUp-seed#[A588F677BD53BB3B]) [    ] o.a.s.c.a.s.TestSimExtremeIndexing #### Total docs so far: 43,000,000
   [junit4]   2> 3394878 INFO  (TEST-TestSimExtremeIndexing.testScaleUp-seed#[A588F677BD53BB3B]) [    ] o.a.s.c.a.s.TestSimExtremeIndexing #### Total docs so far: 43,200,000
   [junit4]   2> 3394879 INFO  (TEST-TestSimExtremeIndexing.testScaleUp-seed#[A588F677BD53BB3B]) [    ] o.a.s.c.a.s.TestSimExtremeIndexing #### Total docs so far: 43,400,000
   [junit4]   2> 3394879 INFO  (TEST-TestSimExtremeIndexing.testScaleUp-seed#[A588F677BD53BB3B]) [    ] o.a.s.c.a.s.TestSimExtremeIndexing #### Total docs so far: 43,600,000
   [junit4]   2> 3394879 INFO  (TEST-TestSimExtremeIndexing.testScaleUp-seed#[A588F677BD53BB3B]) [    ] o.a.s.c.a.s.TestSimExtremeIndexing #### Total docs so far: 43,800,000
   [junit4]   2> 3394880 INFO  (TEST-TestSimExtremeIndexing.testScaleUp-seed#[A588F677BD53BB3B]) [    ] o.a.s.c.a.s.TestSimExtremeIndexing #### Total docs so far: 44,000,000
   [junit4]   2> 3394880 INFO  (TEST-TestSimExtremeIndexing.testScaleUp-seed#[A588F677BD53BB3B]) [    ] o.a.s.c.a.s.TestSimExtremeIndexing #### Total docs so far: 44,200,000
   [junit4]   2> 3394880 INFO  (TEST-TestSimExtremeIndexing.testScaleUp-seed#[A588F677BD53BB3B]) [    ] o.a.s.c.a.s.TestSimExtremeIndexing #### Total docs so far: 44,400,000
   [junit4]   2> 3394881 INFO  (TEST-TestSimExtremeIndexing.testScaleUp-seed#[A588F677BD53BB3B]) [    ] o.a.s.c.a.s.TestSimExtremeIndexing #### Total docs so far: 44,600,000
   [junit4]   2> 3394881 INFO  (TEST-TestSimExtremeIndexing.testScaleUp-seed#[A588F677BD53BB3B]) [    ] o.a.s.c.a.s.TestSimExtremeIndexing #### Total docs so far: 44,800,000
   [junit4]   2> 3394881 INFO  (TEST-TestSimExtremeIndexing.testScaleUp-seed#[A588F677BD53BB3B]) [    ] o.a.s.c.a.s.TestSimExtremeIndexing #### Total docs so far: 45,000,000
   [junit4]   2> 3394882 INFO  (TEST-TestSimExtremeIndexing.testScaleUp-seed#[A588F677BD53BB3B]) [    ] o.a.s.c.a.s.TestSimExtremeIndexing #### Total docs so far: 45,200,000
   [junit4]   2> 3394882 INFO  (TEST-TestSimExtremeIndexing.testScaleUp-seed#[A588F677BD53BB3B]) [    ] o.a.s.c.a.s.TestSimExtremeIndexing #### Total docs so far: 45,400,000
   [junit4]   2> 3394882 INFO  (TEST-TestSimExtremeIndexing.testScaleUp-seed#[A588F677BD53BB3B]) [    ] o.a.s.c.a.s.TestSimExtremeIndexing #### Total docs so far: 45,600,000
   [junit4]   2> 3394883 INFO  (TEST-TestSimExtremeIndexing.testScaleUp-seed#[A588F677BD53BB3B]) [    ] o.a.s.c.a.s.TestSimExtremeIndexing #### Total docs so far: 45,800,000
   [junit4]   2> 3394883 INFO  (TEST-TestSimExtremeIndexing.testScaleUp-seed#[A588F677BD53BB3B]) [    ] o.a.s.c.a.s.TestSimExtremeIndexing #### Total docs so far: 46,000,000
   [junit4]   2> 3394883 INFO  (TEST-TestSimExtremeIndexing.testScaleUp-seed#[A588F677BD53BB3B]) [    ] o.a.s.c.a.s.TestSimExtremeIndexing #### Total docs so far: 46,200,000
   [junit4]   2> 3394884 INFO  (TEST-TestSimExtremeIndexing.testScaleUp-seed#[A588F677BD53BB3B]) [    ] o.a.s.c.a.s.TestSimExtremeIndexing #### Total docs so far: 46,400,000
   [junit4]   2> 3394884 INFO  (TEST-TestSimExtremeIndexing.testScaleUp-seed#[A588F677BD53BB3B]) [    ] o.a.s.c.a.s.TestSimExtremeIndexing #### Total docs so far: 46,600,000
   [junit4]   2> 3394884 INFO  (TEST-TestSimExtremeIndexing.testScaleUp-seed#[A588F677BD53BB3B]) [    ] o.a.s.c.a.s.TestSimExtremeIndexing #### Total docs so far: 46,800,000
   [junit4]   2> 3394885 INFO  (TEST-TestSimExtremeIndexing.testScaleUp-seed#[A588F677BD53BB3B]) [    ] o.a.s.c.a.s.TestSimExtremeIndexing #### Total docs so far: 47,000,000
   [junit4]   2> 3394885 INFO  (TEST-TestSimExtremeIndexing.testScaleUp-seed#[A588F677BD53BB3B]) [    ] o.a.s.c.a.s.TestSimExtremeIndexing #### Total docs so far: 47,200,000
   [junit4]   2> 3394886 INFO  (TEST-TestSimExtremeIndexing.testScaleUp-seed#[A588F677BD53BB3B]) [    ] o.a.s.c.a.s.TestSimExtremeIndexing #### Total docs so far: 47,400,000
   [junit4]   2> 3394886 INFO  (TEST-TestSimExtremeIndexing.testScaleUp-seed#[A588F677BD53BB3B]) [    ] o.a.s.c.a.s.TestSimExtremeIndexing #### Total docs so far: 47,600,000
   [junit4]   2> 3394886 INFO  (TEST-TestSimExtremeIndexing.testScaleUp-seed#[A588F677BD53BB3B]) [    ] o.a.s.c.a.s.TestSimExtremeIndexing #### Total docs so far: 47,800,000
   [junit4]   2> 3394887 INFO  (TEST-TestSimExtremeIndexing.testScaleUp-seed#[A588F677BD53BB3B]) [    ] o.a.s.c.a.s.TestSimExtremeIndexing #### Total docs so far: 48,000,000
   [junit4]   2> 3394887 INFO  (TEST-TestSimExtremeIndexing.testScaleUp-seed#[A588F677BD53BB3B]) [    ] o.a.s.c.a.s.TestSimExtremeIndexing #### Total docs so far: 48,200,000
   [junit4]   2> 3394887 INFO  (TEST-TestSimExtremeIndexing.testScaleUp-seed#[A588F677BD53BB3B]) [    ] o.a.s.c.a.s.TestSimExtremeIndexing #### Total docs so far: 48,400,000
   [junit4]   2> 3394888 INFO  (TEST-TestSimExtremeIndexing.testScaleUp-seed#[A588F677BD53BB3B]) [    ] o.a.s.c.a.s.TestSimExtremeIndexing #### Total docs so far: 48,600,000
   [junit4]   2> 3394894 INFO  (TEST-TestSimExtremeIndexing.testScaleUp-seed#[A588F677BD53BB3B]) [    ] o.a.s.c.a.s.TestSimExtremeIndexing #### Total docs so far: 48,800,000
   [junit4]   2> 3394895 INFO  (TEST-TestSimExtremeIndexing.testScaleUp-seed#[A588F677BD53BB3B]) [    ] o.a.s.c.a.s.TestSimExtremeIndexing #### Total docs so far: 49,000,000
   [junit4]   2> 3394896 DEBUG (ScheduledTrigger-16990-thread-1) [    ] o.a.s.c.a.ScheduledTrig

[...truncated too long message...]

 -Dtests.locale=ja-JP-u-ca-japanese-x-lvariant-JP -Dtests.timezone=America/Danmarkshavn -Dtests.asserts=true -Dtests.file.encoding=US-ASCII
   [junit4] ERROR   71.3s J2 | TestDocTermOrdsUninvertLimit.testTriggerUnInvertLimit <<<
   [junit4]    > Throwable #1: java.lang.OutOfMemoryError: GC overhead limit exceeded
   [junit4]    > 	at __randomizedtesting.SeedInfo.seed([A588F677BD53BB3B:963ADEB3B0E4618C]:0)
   [junit4]    > 	at org.apache.lucene.codecs.memory.DirectPostingsFormat$DirectField.<init>(DirectPostingsFormat.java:460)
   [junit4]    > 	at org.apache.lucene.codecs.memory.DirectPostingsFormat$DirectFields.<init>(DirectPostingsFormat.java:131)
   [junit4]    > 	at org.apache.lucene.codecs.memory.DirectPostingsFormat.fieldsProducer(DirectPostingsFormat.java:115)
   [junit4]    > 	at org.apache.lucene.codecs.perfield.PerFieldPostingsFormat$FieldsReader.<init>(PerFieldPostingsFormat.java:293)
   [junit4]    > 	at org.apache.lucene.codecs.perfield.PerFieldPostingsFormat.fieldsProducer(PerFieldPostingsFormat.java:373)
   [junit4]    > 	at org.apache.lucene.index.SegmentCoreReaders.<init>(SegmentCoreReaders.java:113)
   [junit4]    > 	at org.apache.lucene.index.SegmentReader.<init>(SegmentReader.java:83)
   [junit4]    > 	at org.apache.lucene.index.ReadersAndUpdates.getReader(ReadersAndUpdates.java:172)
   [junit4]    > 	at org.apache.lucene.index.IndexWriter.mergeMiddle(IndexWriter.java:4598)
   [junit4]    > 	at org.apache.lucene.index.IndexWriter.merge(IndexWriter.java:4075)
   [junit4]    > 	at org.apache.lucene.index.SerialMergeScheduler.merge(SerialMergeScheduler.java:40)
   [junit4]    > 	at org.apache.lucene.index.IndexWriter.maybeMerge(IndexWriter.java:2178)
   [junit4]    > 	at org.apache.lucene.index.IndexWriter.processEvents(IndexWriter.java:5110)
   [junit4]    > 	at org.apache.lucene.index.IndexWriter.updateDocument(IndexWriter.java:1620)
   [junit4]    > 	at org.apache.lucene.index.IndexWriter.addDocument(IndexWriter.java:1236)
   [junit4]    > 	at org.apache.lucene.index.RandomIndexWriter.addDocument(RandomIndexWriter.java:189)
   [junit4]    > 	at org.apache.solr.uninverting.TestDocTermOrdsUninvertLimit.testTriggerUnInvertLimit(TestDocTermOrdsUninvertLimit.java:64)
   [junit4]   2> NOTE: test params are: codec=Asserting(Lucene80): {field=PostingsFormat(name=Direct)}, docValues:{}, maxPointsInLeafNode=1856, maxMBSortInHeap=6.518954451381442, sim=Asserting(org.apache.lucene.search.similarities.AssertingSimilarity@fecea9a), locale=ja-JP-u-ca-japanese-x-lvariant-JP, timezone=America/Danmarkshavn
   [junit4]   2> NOTE: Linux 4.4.0-130-generic amd64/Oracle Corporation 1.8.0_172 (64-bit)/cpus=4,threads=1,free=161208664,total=477626368
   [junit4]   2> NOTE: All tests run in this JVM: [CheckHdfsIndexTest, PeerSyncWithLeaderTest, TestManagedSchemaAPI, TestSolrJ, CustomHighlightComponentTest, DistributedFacetPivotLongTailTest, DistributedQueueTest, BJQParserTest, TestUtils, DistribCursorPagingTest, CollectionReloadTest, BasicAuthStandaloneTest, ResponseBuilderTest, InfixSuggestersTest, HttpPartitionOnCommitTest, DistributedExpandComponentTest, HdfsBasicDistributedZk2Test, CoreAdminOperationTest, OutOfBoxZkACLAndCredentialsProvidersTest, HdfsRecoveryZkTest, TestStressLiveNodes, CdcrUpdateLogTest, ClusterStateUpdateTest, TestLazyCores, EmbeddedSolrNoSerializeTest, TestFieldSortValues, TestSimpleTrackingShardHandler, DistributedUpdateProcessorTest, LeaderElectionTest, TestCharFilters, SaslZkACLProviderTest, AtomicUpdatesTest, TestSolrDeletionPolicy1, CdcrVersionReplicationTest, IndexSchemaTest, CircularListTest, HdfsWriteToMultipleCollectionsTest, TestSimNodeLostTrigger, TestAtomicUpdateErrorCases, TestJsonRequest, PropertiesRequestHandlerTest, TestPointFields, TestAuthenticationFramework, BigEndianAscendingWordSerializerTest, TestFieldCollectionResource, TestInfoStreamLogging, TestPseudoReturnFields, AddReplicaTest, TestConfigSetsAPI, ExitableDirectoryReaderTest, ZkStateReaderTest, TestJettySolrRunner, TestUniqueKeyFieldResource, ZkControllerTest, LeaderTragicEventTest, TestGeoJSONResponseWriter, HttpSolrCallGetCoreTest, DistributedFacetPivotWhiteBoxTest, TestLegacyFieldReuse, UUIDFieldTest, UUIDUpdateProcessorFallbackTest, ReplicaListTransformerTest, CollectionsAPIDistributedZkTest, BlobRepositoryCloudTest, RuleEngineTest, SolrRrdBackendFactoryTest, TestDocumentBuilder, DocumentBuilderTest, HdfsChaosMonkeySafeLeaderTest, TestStandardQParsers, BlockDirectoryTest, TestOrdValues, AutoAddReplicasIntegrationTest, TestFieldCacheSortRandom, SolrPluginUtilsTest, TransactionLogTest, TestCollapseQParserPlugin, TestRecovery, TaggerTest, TestBinaryResponseWriter, SortSpecParsingTest, TestReloadDeadlock, TestDistributedGrouping, ClassificationUpdateProcessorTest, TestDelegationWithHadoopAuth, TestSurroundQueryParser, TestSlowCompositeReaderWrapper, MoveReplicaHDFSFailoverTest, BasicZkTest, SolrTestCaseJ4Test, TestCoreAdminApis, TestReqParamsAPI, DocumentAnalysisRequestHandlerTest, SolrMetricReporterTest, TestLRUCache, SchemaVersionSpecificBehaviorTest, HighlighterTest, TemplateUpdateProcessorTest, TestQuerySenderListener, PreAnalyzedUpdateProcessorTest, TestBM25SimilarityFactory, TestJoin, TestPullReplicaErrorHandling, TestSortableTextField, OrderedExecutorTest, ReplaceNodeNoTargetTest, TestSolrCloudWithSecureImpersonation, TestOverriddenPrefixQueryForCustomFieldType, DeleteReplicaTest, TestPerFieldSimilarityWithDefaultOverride, TestSolrCLIRunExample, BooleanFieldTest, ZkShardTermsTest, TestSolr4Spatial2, TestShardHandlerFactory, MetricsHistoryIntegrationTest, SolrGraphiteReporterTest, LIRRollingUpdatesTest, TestSubQueryTransformerCrossCore, AsyncCallRequestStatusResponseTest, NotRequiredUniqueKeyTest, RestartWhileUpdatingTest, TestFieldTypeResource, TestCloudManagedSchema, TestWordDelimiterFilterFactory, CollectionsAPISolrJTest, TestSystemCollAutoCreate, IgnoreCommitOptimizeUpdateProcessorFactoryTest, ConfigureRecoveryStrategyTest, DistributedIntervalFacetingTest, TestLegacyFieldCache, TestTrackingShardHandlerFactory, TestIntervalFaceting, TestChildDocTransformer, SubstringBytesRefFilterTest, TestZkAclsWithHadoopAuth, MoveReplicaTest, MultiSolrCloudTestCaseTest, OverriddenZkACLAndCredentialsProvidersTest, OverseerCollectionConfigSetProcessorTest, OverseerModifyCollectionTest, OverseerRolesTest, OverseerStatusTest, OverseerTaskQueueTest, RecoveryAfterSoftCommitTest, ReplaceNodeTest, RollingRestartTest, TestCloudSearcherWarming, TestDistributedMap, TestDownShardTolerantSearch, TestExclusionRuleCollectionAccess, TestHashPartitioner, TestLeaderInitiatedRecoveryThread, TestMiniSolrCloudClusterSSL, TestRandomFlRTGCloud, TestSizeLimitedDistributedMap, TestTolerantUpdateProcessorCloud, TestTolerantUpdateProcessorRandomCloud, TestUtilizeNode, TestZkChroot, TriLevelCompositeIdRoutingTest, ZkSolrClientTest, CollectionTooManyReplicasTest, ConcurrentDeleteAndCreateCollectionTest, HdfsCollectionsAPIDistributedZkTest, SimpleCollectionCreateDeleteTest, TestCollectionAPI, TestHdfsCloudBackupRestore, TestLocalFSCloudBackupRestore, AutoScalingHandlerTest, ComputePlanActionTest, HttpTriggerListenerTest, MetricTriggerIntegrationTest, NodeAddedTriggerTest, NodeLostTriggerTest, NodeMarkersRegistrationTest, ScheduledTriggerIntegrationTest, SearchRateTriggerIntegrationTest, SystemLogListenerTest, TriggerEventQueueTest, TriggerIntegrationTest, TestSimExtremeIndexing, TestSimLargeCluster, CdcrOpsAndBoundariesTest, PluginInfoTest, RAMDirectoryFactoryTest, RequestHandlersTest, ResourceLoaderTest, SOLR749Test, SolrCoreCheckLockOnStartupTest, TestBackupRepositoryFactory, TestBadConfig, TestCodecSupport, TestConfig, TestConfigOverlay, TestConfigSetProperties, TestConfigSets, TestCoreContainer, TestCoreDiscovery, TestCorePropertiesReload, TestCustomStream, TestDirectoryFactory, TestDynamicLoading, TestSolrIndexConfig, TestSolrXml, TestSolrCloudSnapshots, TestCSVLoader, TestConfigReload, TestSQLHandler, TestSQLHandlerNonCloud, TestSolrConfigHandlerCloud, CoreAdminRequestStatusTest, CoreMergeIndexesAdminHandlerTest, InfoHandlerTest, LukeRequestHandlerTest, MBeansHandlerTest, DistributedQueryComponentOptimizationTest, DistributedSuggestComponentTest, ShufflingReplicaListTransformerTest, SpellCheckComponentTest, StatsComponentTest, TestDistributedStatsComponentCardinality, TestLegacyNumericRangeQueryBuilder, TestMaxScoreQueryParser, TestMissingGroups, TestSimpleQParserPlugin, TestSolrQueryParser, TestStressLucene, TestStressUserVersions, TestValueSourceCache, TestXmlQParser, TestXmlQParserPlugin, DistributedFacetSimpleRefinementLongTailTest, TestJsonFacetRefinement, TestJsonFacets, TestAuthorizationFramework, TestDocTermOrdsUninvertLimit]
   [junit4] Completed [794/835 (2!)] on J2 in 71.34s, 1 test, 1 error <<< FAILURES!

[...truncated 122 lines...]
   [junit4] JVM J2: stdout was not empty, see: /x1/jenkins/jenkins-slave/workspace/Lucene-Solr-NightlyTests-master/checkout/solr/build/solr-core/test/temp/junit4-J2-20180928_104208_9222603220182909842860.sysout
   [junit4] >>> JVM J2 emitted unexpected output (verbatim) ----
   [junit4] java.lang.OutOfMemoryError: GC overhead limit exceeded
   [junit4] Dumping heap to /x1/jenkins/jenkins-slave/workspace/Lucene-Solr-NightlyTests-master/checkout/heapdumps/java_pid22425.hprof ...
   [junit4] Heap dump file created [485314320 bytes in 2.005 secs]
   [junit4] <<< JVM J2: EOF ----

[...truncated 8969 lines...]
BUILD FAILED
/x1/jenkins/jenkins-slave/workspace/Lucene-Solr-NightlyTests-master/checkout/build.xml:651: The following error occurred while executing this line:
/x1/jenkins/jenkins-slave/workspace/Lucene-Solr-NightlyTests-master/checkout/build.xml:585: Some of the tests produced a heap dump, but did not fail. Maybe a suppressed OutOfMemoryError? Dumps created:
* java_pid11514.hprof
* java_pid22425.hprof

Total time: 372 minutes 23 seconds
Build step 'Invoke Ant' marked build as failure
Archiving artifacts
Recording test results
Email was triggered for: Failure - Any
Sending email for trigger: Failure - Any

Mime
View raw message