lucene-dev mailing list archives

Site index · List index
Message view « Date » · « Thread »
Top « Date » · « Thread »
From Policeman Jenkins Server <jenk...@thetaphi.de>
Subject [JENKINS] Lucene-Solr-7.x-MacOSX (64bit/jdk1.8.0) - Build # 837 - Unstable!
Date Thu, 13 Sep 2018 08:52:27 GMT
Build: https://jenkins.thetaphi.de/job/Lucene-Solr-7.x-MacOSX/837/
Java: 64bit/jdk1.8.0 -XX:+UseCompressedOops -XX:+UseG1GC

5 tests failed.
FAILED:  org.apache.solr.cloud.TestPullReplicaErrorHandling.testCantConnectToLeader

Error Message:
Error from server at http://127.0.0.1:55039/solr: Could not find collection : pull_replica_error_handling_test_cant_connect_to_leader

Stack Trace:
org.apache.solr.client.solrj.impl.HttpSolrClient$RemoteSolrException: Error from server at http://127.0.0.1:55039/solr: Could not find collection : pull_replica_error_handling_test_cant_connect_to_leader
	at __randomizedtesting.SeedInfo.seed([3994D13779CB7808:B798B1470CD3FC22]:0)
	at org.apache.solr.client.solrj.impl.HttpSolrClient.executeMethod(HttpSolrClient.java:643)
	at org.apache.solr.client.solrj.impl.HttpSolrClient.request(HttpSolrClient.java:255)
	at org.apache.solr.client.solrj.impl.HttpSolrClient.request(HttpSolrClient.java:244)
	at org.apache.solr.client.solrj.impl.LBHttpSolrClient.doRequest(LBHttpSolrClient.java:483)
	at org.apache.solr.client.solrj.impl.LBHttpSolrClient.request(LBHttpSolrClient.java:413)
	at org.apache.solr.client.solrj.impl.CloudSolrClient.sendRequest(CloudSolrClient.java:1107)
	at org.apache.solr.client.solrj.impl.CloudSolrClient.requestWithRetryOnStaleState(CloudSolrClient.java:884)
	at org.apache.solr.client.solrj.impl.CloudSolrClient.request(CloudSolrClient.java:817)
	at org.apache.solr.client.solrj.SolrRequest.process(SolrRequest.java:194)
	at org.apache.solr.client.solrj.SolrRequest.process(SolrRequest.java:211)
	at org.apache.solr.cloud.TestPullReplicaErrorHandling.tearDown(TestPullReplicaErrorHandling.java:128)
	at sun.reflect.NativeMethodAccessorImpl.invoke0(Native Method)
	at sun.reflect.NativeMethodAccessorImpl.invoke(NativeMethodAccessorImpl.java:62)
	at sun.reflect.DelegatingMethodAccessorImpl.invoke(DelegatingMethodAccessorImpl.java:43)
	at java.lang.reflect.Method.invoke(Method.java:498)
	at com.carrotsearch.randomizedtesting.RandomizedRunner.invoke(RandomizedRunner.java:1742)
	at com.carrotsearch.randomizedtesting.RandomizedRunner$10.evaluate(RandomizedRunner.java:993)
	at com.carrotsearch.randomizedtesting.rules.SystemPropertiesRestoreRule$1.evaluate(SystemPropertiesRestoreRule.java:57)
	at org.apache.lucene.util.TestRuleSetupTeardownChained$1.evaluate(TestRuleSetupTeardownChained.java:49)
	at org.apache.lucene.util.AbstractBeforeAfterRule$1.evaluate(AbstractBeforeAfterRule.java:45)
	at org.apache.lucene.util.TestRuleThreadAndTestName$1.evaluate(TestRuleThreadAndTestName.java:48)
	at org.apache.lucene.util.TestRuleIgnoreAfterMaxFailures$1.evaluate(TestRuleIgnoreAfterMaxFailures.java:64)
	at org.apache.lucene.util.TestRuleMarkFailure$1.evaluate(TestRuleMarkFailure.java:47)
	at com.carrotsearch.randomizedtesting.rules.StatementAdapter.evaluate(StatementAdapter.java:36)
	at com.carrotsearch.randomizedtesting.ThreadLeakControl$StatementRunner.run(ThreadLeakControl.java:368)
	at com.carrotsearch.randomizedtesting.ThreadLeakControl.forkTimeoutingTask(ThreadLeakControl.java:817)
	at com.carrotsearch.randomizedtesting.ThreadLeakControl$3.evaluate(ThreadLeakControl.java:468)
	at com.carrotsearch.randomizedtesting.RandomizedRunner.runSingleTest(RandomizedRunner.java:944)
	at com.carrotsearch.randomizedtesting.RandomizedRunner$5.evaluate(RandomizedRunner.java:830)
	at com.carrotsearch.randomizedtesting.RandomizedRunner$6.evaluate(RandomizedRunner.java:880)
	at com.carrotsearch.randomizedtesting.RandomizedRunner$7.evaluate(RandomizedRunner.java:891)
	at com.carrotsearch.randomizedtesting.rules.StatementAdapter.evaluate(StatementAdapter.java:36)
	at com.carrotsearch.randomizedtesting.rules.SystemPropertiesRestoreRule$1.evaluate(SystemPropertiesRestoreRule.java:57)
	at org.apache.lucene.util.AbstractBeforeAfterRule$1.evaluate(AbstractBeforeAfterRule.java:45)
	at com.carrotsearch.randomizedtesting.rules.StatementAdapter.evaluate(StatementAdapter.java:36)
	at org.apache.lucene.util.TestRuleStoreClassName$1.evaluate(TestRuleStoreClassName.java:41)
	at com.carrotsearch.randomizedtesting.rules.NoShadowingOrOverridesOnMethodsRule$1.evaluate(NoShadowingOrOverridesOnMethodsRule.java:40)
	at com.carrotsearch.randomizedtesting.rules.NoShadowingOrOverridesOnMethodsRule$1.evaluate(NoShadowingOrOverridesOnMethodsRule.java:40)
	at com.carrotsearch.randomizedtesting.rules.StatementAdapter.evaluate(StatementAdapter.java:36)
	at com.carrotsearch.randomizedtesting.rules.StatementAdapter.evaluate(StatementAdapter.java:36)
	at com.carrotsearch.randomizedtesting.rules.StatementAdapter.evaluate(StatementAdapter.java:36)
	at org.apache.lucene.util.TestRuleAssertionsRequired$1.evaluate(TestRuleAssertionsRequired.java:53)
	at org.apache.lucene.util.TestRuleMarkFailure$1.evaluate(TestRuleMarkFailure.java:47)
	at org.apache.lucene.util.TestRuleIgnoreAfterMaxFailures$1.evaluate(TestRuleIgnoreAfterMaxFailures.java:64)
	at org.apache.lucene.util.TestRuleIgnoreTestSuites$1.evaluate(TestRuleIgnoreTestSuites.java:54)
	at com.carrotsearch.randomizedtesting.rules.StatementAdapter.evaluate(StatementAdapter.java:36)
	at com.carrotsearch.randomizedtesting.ThreadLeakControl$StatementRunner.run(ThreadLeakControl.java:368)
	at java.lang.Thread.run(Thread.java:748)


FAILED:  org.apache.solr.cloud.TestPullReplicaErrorHandling.testCantConnectToLeader

Error Message:
Error from server at http://127.0.0.1:55988/solr: Could not find collection : pull_replica_error_handling_test_cant_connect_to_leader

Stack Trace:
org.apache.solr.client.solrj.impl.HttpSolrClient$RemoteSolrException: Error from server at http://127.0.0.1:55988/solr: Could not find collection : pull_replica_error_handling_test_cant_connect_to_leader
	at __randomizedtesting.SeedInfo.seed([3994D13779CB7808:B798B1470CD3FC22]:0)
	at org.apache.solr.client.solrj.impl.HttpSolrClient.executeMethod(HttpSolrClient.java:643)
	at org.apache.solr.client.solrj.impl.HttpSolrClient.request(HttpSolrClient.java:255)
	at org.apache.solr.client.solrj.impl.HttpSolrClient.request(HttpSolrClient.java:244)
	at org.apache.solr.client.solrj.impl.LBHttpSolrClient.doRequest(LBHttpSolrClient.java:483)
	at org.apache.solr.client.solrj.impl.LBHttpSolrClient.request(LBHttpSolrClient.java:413)
	at org.apache.solr.client.solrj.impl.CloudSolrClient.sendRequest(CloudSolrClient.java:1107)
	at org.apache.solr.client.solrj.impl.CloudSolrClient.requestWithRetryOnStaleState(CloudSolrClient.java:884)
	at org.apache.solr.client.solrj.impl.CloudSolrClient.request(CloudSolrClient.java:817)
	at org.apache.solr.client.solrj.SolrRequest.process(SolrRequest.java:194)
	at org.apache.solr.client.solrj.SolrRequest.process(SolrRequest.java:211)
	at org.apache.solr.cloud.TestPullReplicaErrorHandling.tearDown(TestPullReplicaErrorHandling.java:128)
	at sun.reflect.NativeMethodAccessorImpl.invoke0(Native Method)
	at sun.reflect.NativeMethodAccessorImpl.invoke(NativeMethodAccessorImpl.java:62)
	at sun.reflect.DelegatingMethodAccessorImpl.invoke(DelegatingMethodAccessorImpl.java:43)
	at java.lang.reflect.Method.invoke(Method.java:498)
	at com.carrotsearch.randomizedtesting.RandomizedRunner.invoke(RandomizedRunner.java:1742)
	at com.carrotsearch.randomizedtesting.RandomizedRunner$10.evaluate(RandomizedRunner.java:993)
	at com.carrotsearch.randomizedtesting.rules.SystemPropertiesRestoreRule$1.evaluate(SystemPropertiesRestoreRule.java:57)
	at org.apache.lucene.util.TestRuleSetupTeardownChained$1.evaluate(TestRuleSetupTeardownChained.java:49)
	at org.apache.lucene.util.AbstractBeforeAfterRule$1.evaluate(AbstractBeforeAfterRule.java:45)
	at org.apache.lucene.util.TestRuleThreadAndTestName$1.evaluate(TestRuleThreadAndTestName.java:48)
	at org.apache.lucene.util.TestRuleIgnoreAfterMaxFailures$1.evaluate(TestRuleIgnoreAfterMaxFailures.java:64)
	at org.apache.lucene.util.TestRuleMarkFailure$1.evaluate(TestRuleMarkFailure.java:47)
	at com.carrotsearch.randomizedtesting.rules.StatementAdapter.evaluate(StatementAdapter.java:36)
	at com.carrotsearch.randomizedtesting.ThreadLeakControl$StatementRunner.run(ThreadLeakControl.java:368)
	at com.carrotsearch.randomizedtesting.ThreadLeakControl.forkTimeoutingTask(ThreadLeakControl.java:817)
	at com.carrotsearch.randomizedtesting.ThreadLeakControl$3.evaluate(ThreadLeakControl.java:468)
	at com.carrotsearch.randomizedtesting.RandomizedRunner.runSingleTest(RandomizedRunner.java:944)
	at com.carrotsearch.randomizedtesting.RandomizedRunner$5.evaluate(RandomizedRunner.java:830)
	at com.carrotsearch.randomizedtesting.RandomizedRunner$6.evaluate(RandomizedRunner.java:880)
	at com.carrotsearch.randomizedtesting.RandomizedRunner$7.evaluate(RandomizedRunner.java:891)
	at com.carrotsearch.randomizedtesting.rules.StatementAdapter.evaluate(StatementAdapter.java:36)
	at com.carrotsearch.randomizedtesting.rules.SystemPropertiesRestoreRule$1.evaluate(SystemPropertiesRestoreRule.java:57)
	at org.apache.lucene.util.AbstractBeforeAfterRule$1.evaluate(AbstractBeforeAfterRule.java:45)
	at com.carrotsearch.randomizedtesting.rules.StatementAdapter.evaluate(StatementAdapter.java:36)
	at org.apache.lucene.util.TestRuleStoreClassName$1.evaluate(TestRuleStoreClassName.java:41)
	at com.carrotsearch.randomizedtesting.rules.NoShadowingOrOverridesOnMethodsRule$1.evaluate(NoShadowingOrOverridesOnMethodsRule.java:40)
	at com.carrotsearch.randomizedtesting.rules.NoShadowingOrOverridesOnMethodsRule$1.evaluate(NoShadowingOrOverridesOnMethodsRule.java:40)
	at com.carrotsearch.randomizedtesting.rules.StatementAdapter.evaluate(StatementAdapter.java:36)
	at com.carrotsearch.randomizedtesting.rules.StatementAdapter.evaluate(StatementAdapter.java:36)
	at com.carrotsearch.randomizedtesting.rules.StatementAdapter.evaluate(StatementAdapter.java:36)
	at org.apache.lucene.util.TestRuleAssertionsRequired$1.evaluate(TestRuleAssertionsRequired.java:53)
	at org.apache.lucene.util.TestRuleMarkFailure$1.evaluate(TestRuleMarkFailure.java:47)
	at org.apache.lucene.util.TestRuleIgnoreAfterMaxFailures$1.evaluate(TestRuleIgnoreAfterMaxFailures.java:64)
	at org.apache.lucene.util.TestRuleIgnoreTestSuites$1.evaluate(TestRuleIgnoreTestSuites.java:54)
	at com.carrotsearch.randomizedtesting.rules.StatementAdapter.evaluate(StatementAdapter.java:36)
	at com.carrotsearch.randomizedtesting.ThreadLeakControl$StatementRunner.run(ThreadLeakControl.java:368)
	at java.lang.Thread.run(Thread.java:748)


FAILED:  org.apache.solr.cloud.TestPullReplicaErrorHandling.testCantConnectToLeader

Error Message:
Error from server at http://127.0.0.1:56060/solr: Could not find collection : pull_replica_error_handling_test_cant_connect_to_leader

Stack Trace:
org.apache.solr.client.solrj.impl.HttpSolrClient$RemoteSolrException: Error from server at http://127.0.0.1:56060/solr: Could not find collection : pull_replica_error_handling_test_cant_connect_to_leader
	at __randomizedtesting.SeedInfo.seed([3994D13779CB7808:B798B1470CD3FC22]:0)
	at org.apache.solr.client.solrj.impl.HttpSolrClient.executeMethod(HttpSolrClient.java:643)
	at org.apache.solr.client.solrj.impl.HttpSolrClient.request(HttpSolrClient.java:255)
	at org.apache.solr.client.solrj.impl.HttpSolrClient.request(HttpSolrClient.java:244)
	at org.apache.solr.client.solrj.impl.LBHttpSolrClient.doRequest(LBHttpSolrClient.java:483)
	at org.apache.solr.client.solrj.impl.LBHttpSolrClient.request(LBHttpSolrClient.java:413)
	at org.apache.solr.client.solrj.impl.CloudSolrClient.sendRequest(CloudSolrClient.java:1107)
	at org.apache.solr.client.solrj.impl.CloudSolrClient.requestWithRetryOnStaleState(CloudSolrClient.java:884)
	at org.apache.solr.client.solrj.impl.CloudSolrClient.request(CloudSolrClient.java:817)
	at org.apache.solr.client.solrj.SolrRequest.process(SolrRequest.java:194)
	at org.apache.solr.client.solrj.SolrRequest.process(SolrRequest.java:211)
	at org.apache.solr.cloud.TestPullReplicaErrorHandling.tearDown(TestPullReplicaErrorHandling.java:128)
	at sun.reflect.NativeMethodAccessorImpl.invoke0(Native Method)
	at sun.reflect.NativeMethodAccessorImpl.invoke(NativeMethodAccessorImpl.java:62)
	at sun.reflect.DelegatingMethodAccessorImpl.invoke(DelegatingMethodAccessorImpl.java:43)
	at java.lang.reflect.Method.invoke(Method.java:498)
	at com.carrotsearch.randomizedtesting.RandomizedRunner.invoke(RandomizedRunner.java:1742)
	at com.carrotsearch.randomizedtesting.RandomizedRunner$10.evaluate(RandomizedRunner.java:993)
	at com.carrotsearch.randomizedtesting.rules.SystemPropertiesRestoreRule$1.evaluate(SystemPropertiesRestoreRule.java:57)
	at org.apache.lucene.util.TestRuleSetupTeardownChained$1.evaluate(TestRuleSetupTeardownChained.java:49)
	at org.apache.lucene.util.AbstractBeforeAfterRule$1.evaluate(AbstractBeforeAfterRule.java:45)
	at org.apache.lucene.util.TestRuleThreadAndTestName$1.evaluate(TestRuleThreadAndTestName.java:48)
	at org.apache.lucene.util.TestRuleIgnoreAfterMaxFailures$1.evaluate(TestRuleIgnoreAfterMaxFailures.java:64)
	at org.apache.lucene.util.TestRuleMarkFailure$1.evaluate(TestRuleMarkFailure.java:47)
	at com.carrotsearch.randomizedtesting.rules.StatementAdapter.evaluate(StatementAdapter.java:36)
	at com.carrotsearch.randomizedtesting.ThreadLeakControl$StatementRunner.run(ThreadLeakControl.java:368)
	at com.carrotsearch.randomizedtesting.ThreadLeakControl.forkTimeoutingTask(ThreadLeakControl.java:817)
	at com.carrotsearch.randomizedtesting.ThreadLeakControl$3.evaluate(ThreadLeakControl.java:468)
	at com.carrotsearch.randomizedtesting.RandomizedRunner.runSingleTest(RandomizedRunner.java:944)
	at com.carrotsearch.randomizedtesting.RandomizedRunner$5.evaluate(RandomizedRunner.java:830)
	at com.carrotsearch.randomizedtesting.RandomizedRunner$6.evaluate(RandomizedRunner.java:880)
	at com.carrotsearch.randomizedtesting.RandomizedRunner$7.evaluate(RandomizedRunner.java:891)
	at com.carrotsearch.randomizedtesting.rules.StatementAdapter.evaluate(StatementAdapter.java:36)
	at com.carrotsearch.randomizedtesting.rules.SystemPropertiesRestoreRule$1.evaluate(SystemPropertiesRestoreRule.java:57)
	at org.apache.lucene.util.AbstractBeforeAfterRule$1.evaluate(AbstractBeforeAfterRule.java:45)
	at com.carrotsearch.randomizedtesting.rules.StatementAdapter.evaluate(StatementAdapter.java:36)
	at org.apache.lucene.util.TestRuleStoreClassName$1.evaluate(TestRuleStoreClassName.java:41)
	at com.carrotsearch.randomizedtesting.rules.NoShadowingOrOverridesOnMethodsRule$1.evaluate(NoShadowingOrOverridesOnMethodsRule.java:40)
	at com.carrotsearch.randomizedtesting.rules.NoShadowingOrOverridesOnMethodsRule$1.evaluate(NoShadowingOrOverridesOnMethodsRule.java:40)
	at com.carrotsearch.randomizedtesting.rules.StatementAdapter.evaluate(StatementAdapter.java:36)
	at com.carrotsearch.randomizedtesting.rules.StatementAdapter.evaluate(StatementAdapter.java:36)
	at com.carrotsearch.randomizedtesting.rules.StatementAdapter.evaluate(StatementAdapter.java:36)
	at org.apache.lucene.util.TestRuleAssertionsRequired$1.evaluate(TestRuleAssertionsRequired.java:53)
	at org.apache.lucene.util.TestRuleMarkFailure$1.evaluate(TestRuleMarkFailure.java:47)
	at org.apache.lucene.util.TestRuleIgnoreAfterMaxFailures$1.evaluate(TestRuleIgnoreAfterMaxFailures.java:64)
	at org.apache.lucene.util.TestRuleIgnoreTestSuites$1.evaluate(TestRuleIgnoreTestSuites.java:54)
	at com.carrotsearch.randomizedtesting.rules.StatementAdapter.evaluate(StatementAdapter.java:36)
	at com.carrotsearch.randomizedtesting.ThreadLeakControl$StatementRunner.run(ThreadLeakControl.java:368)
	at java.lang.Thread.run(Thread.java:748)


FAILED:  org.apache.solr.cloud.TestPullReplicaErrorHandling.testCantConnectToLeader

Error Message:
Error from server at http://127.0.0.1:56986/solr: Could not find collection : pull_replica_error_handling_test_cant_connect_to_leader

Stack Trace:
org.apache.solr.client.solrj.impl.HttpSolrClient$RemoteSolrException: Error from server at http://127.0.0.1:56986/solr: Could not find collection : pull_replica_error_handling_test_cant_connect_to_leader
	at __randomizedtesting.SeedInfo.seed([3994D13779CB7808:B798B1470CD3FC22]:0)
	at org.apache.solr.client.solrj.impl.HttpSolrClient.executeMethod(HttpSolrClient.java:643)
	at org.apache.solr.client.solrj.impl.HttpSolrClient.request(HttpSolrClient.java:255)
	at org.apache.solr.client.solrj.impl.HttpSolrClient.request(HttpSolrClient.java:244)
	at org.apache.solr.client.solrj.impl.LBHttpSolrClient.doRequest(LBHttpSolrClient.java:483)
	at org.apache.solr.client.solrj.impl.LBHttpSolrClient.request(LBHttpSolrClient.java:413)
	at org.apache.solr.client.solrj.impl.CloudSolrClient.sendRequest(CloudSolrClient.java:1107)
	at org.apache.solr.client.solrj.impl.CloudSolrClient.requestWithRetryOnStaleState(CloudSolrClient.java:884)
	at org.apache.solr.client.solrj.impl.CloudSolrClient.request(CloudSolrClient.java:817)
	at org.apache.solr.client.solrj.SolrRequest.process(SolrRequest.java:194)
	at org.apache.solr.client.solrj.SolrRequest.process(SolrRequest.java:211)
	at org.apache.solr.cloud.TestPullReplicaErrorHandling.tearDown(TestPullReplicaErrorHandling.java:128)
	at sun.reflect.NativeMethodAccessorImpl.invoke0(Native Method)
	at sun.reflect.NativeMethodAccessorImpl.invoke(NativeMethodAccessorImpl.java:62)
	at sun.reflect.DelegatingMethodAccessorImpl.invoke(DelegatingMethodAccessorImpl.java:43)
	at java.lang.reflect.Method.invoke(Method.java:498)
	at com.carrotsearch.randomizedtesting.RandomizedRunner.invoke(RandomizedRunner.java:1742)
	at com.carrotsearch.randomizedtesting.RandomizedRunner$10.evaluate(RandomizedRunner.java:993)
	at com.carrotsearch.randomizedtesting.rules.SystemPropertiesRestoreRule$1.evaluate(SystemPropertiesRestoreRule.java:57)
	at org.apache.lucene.util.TestRuleSetupTeardownChained$1.evaluate(TestRuleSetupTeardownChained.java:49)
	at org.apache.lucene.util.AbstractBeforeAfterRule$1.evaluate(AbstractBeforeAfterRule.java:45)
	at org.apache.lucene.util.TestRuleThreadAndTestName$1.evaluate(TestRuleThreadAndTestName.java:48)
	at org.apache.lucene.util.TestRuleIgnoreAfterMaxFailures$1.evaluate(TestRuleIgnoreAfterMaxFailures.java:64)
	at org.apache.lucene.util.TestRuleMarkFailure$1.evaluate(TestRuleMarkFailure.java:47)
	at com.carrotsearch.randomizedtesting.rules.StatementAdapter.evaluate(StatementAdapter.java:36)
	at com.carrotsearch.randomizedtesting.ThreadLeakControl$StatementRunner.run(ThreadLeakControl.java:368)
	at com.carrotsearch.randomizedtesting.ThreadLeakControl.forkTimeoutingTask(ThreadLeakControl.java:817)
	at com.carrotsearch.randomizedtesting.ThreadLeakControl$3.evaluate(ThreadLeakControl.java:468)
	at com.carrotsearch.randomizedtesting.RandomizedRunner.runSingleTest(RandomizedRunner.java:944)
	at com.carrotsearch.randomizedtesting.RandomizedRunner$5.evaluate(RandomizedRunner.java:830)
	at com.carrotsearch.randomizedtesting.RandomizedRunner$6.evaluate(RandomizedRunner.java:880)
	at com.carrotsearch.randomizedtesting.RandomizedRunner$7.evaluate(RandomizedRunner.java:891)
	at com.carrotsearch.randomizedtesting.rules.StatementAdapter.evaluate(StatementAdapter.java:36)
	at com.carrotsearch.randomizedtesting.rules.SystemPropertiesRestoreRule$1.evaluate(SystemPropertiesRestoreRule.java:57)
	at org.apache.lucene.util.AbstractBeforeAfterRule$1.evaluate(AbstractBeforeAfterRule.java:45)
	at com.carrotsearch.randomizedtesting.rules.StatementAdapter.evaluate(StatementAdapter.java:36)
	at org.apache.lucene.util.TestRuleStoreClassName$1.evaluate(TestRuleStoreClassName.java:41)
	at com.carrotsearch.randomizedtesting.rules.NoShadowingOrOverridesOnMethodsRule$1.evaluate(NoShadowingOrOverridesOnMethodsRule.java:40)
	at com.carrotsearch.randomizedtesting.rules.NoShadowingOrOverridesOnMethodsRule$1.evaluate(NoShadowingOrOverridesOnMethodsRule.java:40)
	at com.carrotsearch.randomizedtesting.rules.StatementAdapter.evaluate(StatementAdapter.java:36)
	at com.carrotsearch.randomizedtesting.rules.StatementAdapter.evaluate(StatementAdapter.java:36)
	at com.carrotsearch.randomizedtesting.rules.StatementAdapter.evaluate(StatementAdapter.java:36)
	at org.apache.lucene.util.TestRuleAssertionsRequired$1.evaluate(TestRuleAssertionsRequired.java:53)
	at org.apache.lucene.util.TestRuleMarkFailure$1.evaluate(TestRuleMarkFailure.java:47)
	at org.apache.lucene.util.TestRuleIgnoreAfterMaxFailures$1.evaluate(TestRuleIgnoreAfterMaxFailures.java:64)
	at org.apache.lucene.util.TestRuleIgnoreTestSuites$1.evaluate(TestRuleIgnoreTestSuites.java:54)
	at com.carrotsearch.randomizedtesting.rules.StatementAdapter.evaluate(StatementAdapter.java:36)
	at com.carrotsearch.randomizedtesting.ThreadLeakControl$StatementRunner.run(ThreadLeakControl.java:368)
	at java.lang.Thread.run(Thread.java:748)


FAILED:  org.apache.solr.cloud.TestPullReplicaErrorHandling.testCantConnectToLeader

Error Message:
Error from server at http://127.0.0.1:59322/solr: Could not find collection : pull_replica_error_handling_test_cant_connect_to_leader

Stack Trace:
org.apache.solr.client.solrj.impl.HttpSolrClient$RemoteSolrException: Error from server at http://127.0.0.1:59322/solr: Could not find collection : pull_replica_error_handling_test_cant_connect_to_leader
	at __randomizedtesting.SeedInfo.seed([3994D13779CB7808:B798B1470CD3FC22]:0)
	at org.apache.solr.client.solrj.impl.HttpSolrClient.executeMethod(HttpSolrClient.java:643)
	at org.apache.solr.client.solrj.impl.HttpSolrClient.request(HttpSolrClient.java:255)
	at org.apache.solr.client.solrj.impl.HttpSolrClient.request(HttpSolrClient.java:244)
	at org.apache.solr.client.solrj.impl.LBHttpSolrClient.doRequest(LBHttpSolrClient.java:483)
	at org.apache.solr.client.solrj.impl.LBHttpSolrClient.request(LBHttpSolrClient.java:413)
	at org.apache.solr.client.solrj.impl.CloudSolrClient.sendRequest(CloudSolrClient.java:1107)
	at org.apache.solr.client.solrj.impl.CloudSolrClient.requestWithRetryOnStaleState(CloudSolrClient.java:884)
	at org.apache.solr.client.solrj.impl.CloudSolrClient.request(CloudSolrClient.java:817)
	at org.apache.solr.client.solrj.SolrRequest.process(SolrRequest.java:194)
	at org.apache.solr.client.solrj.SolrRequest.process(SolrRequest.java:211)
	at org.apache.solr.cloud.TestPullReplicaErrorHandling.tearDown(TestPullReplicaErrorHandling.java:128)
	at sun.reflect.GeneratedMethodAccessor105.invoke(Unknown Source)
	at sun.reflect.DelegatingMethodAccessorImpl.invoke(DelegatingMethodAccessorImpl.java:43)
	at java.lang.reflect.Method.invoke(Method.java:498)
	at com.carrotsearch.randomizedtesting.RandomizedRunner.invoke(RandomizedRunner.java:1742)
	at com.carrotsearch.randomizedtesting.RandomizedRunner$10.evaluate(RandomizedRunner.java:993)
	at com.carrotsearch.randomizedtesting.rules.SystemPropertiesRestoreRule$1.evaluate(SystemPropertiesRestoreRule.java:57)
	at org.apache.lucene.util.TestRuleSetupTeardownChained$1.evaluate(TestRuleSetupTeardownChained.java:49)
	at org.apache.lucene.util.AbstractBeforeAfterRule$1.evaluate(AbstractBeforeAfterRule.java:45)
	at org.apache.lucene.util.TestRuleThreadAndTestName$1.evaluate(TestRuleThreadAndTestName.java:48)
	at org.apache.lucene.util.TestRuleIgnoreAfterMaxFailures$1.evaluate(TestRuleIgnoreAfterMaxFailures.java:64)
	at org.apache.lucene.util.TestRuleMarkFailure$1.evaluate(TestRuleMarkFailure.java:47)
	at com.carrotsearch.randomizedtesting.rules.StatementAdapter.evaluate(StatementAdapter.java:36)
	at com.carrotsearch.randomizedtesting.ThreadLeakControl$StatementRunner.run(ThreadLeakControl.java:368)
	at com.carrotsearch.randomizedtesting.ThreadLeakControl.forkTimeoutingTask(ThreadLeakControl.java:817)
	at com.carrotsearch.randomizedtesting.ThreadLeakControl$3.evaluate(ThreadLeakControl.java:468)
	at com.carrotsearch.randomizedtesting.RandomizedRunner.runSingleTest(RandomizedRunner.java:944)
	at com.carrotsearch.randomizedtesting.RandomizedRunner$5.evaluate(RandomizedRunner.java:830)
	at com.carrotsearch.randomizedtesting.RandomizedRunner$6.evaluate(RandomizedRunner.java:880)
	at com.carrotsearch.randomizedtesting.RandomizedRunner$7.evaluate(RandomizedRunner.java:891)
	at com.carrotsearch.randomizedtesting.rules.StatementAdapter.evaluate(StatementAdapter.java:36)
	at com.carrotsearch.randomizedtesting.rules.SystemPropertiesRestoreRule$1.evaluate(SystemPropertiesRestoreRule.java:57)
	at org.apache.lucene.util.AbstractBeforeAfterRule$1.evaluate(AbstractBeforeAfterRule.java:45)
	at com.carrotsearch.randomizedtesting.rules.StatementAdapter.evaluate(StatementAdapter.java:36)
	at org.apache.lucene.util.TestRuleStoreClassName$1.evaluate(TestRuleStoreClassName.java:41)
	at com.carrotsearch.randomizedtesting.rules.NoShadowingOrOverridesOnMethodsRule$1.evaluate(NoShadowingOrOverridesOnMethodsRule.java:40)
	at com.carrotsearch.randomizedtesting.rules.NoShadowingOrOverridesOnMethodsRule$1.evaluate(NoShadowingOrOverridesOnMethodsRule.java:40)
	at com.carrotsearch.randomizedtesting.rules.StatementAdapter.evaluate(StatementAdapter.java:36)
	at com.carrotsearch.randomizedtesting.rules.StatementAdapter.evaluate(StatementAdapter.java:36)
	at com.carrotsearch.randomizedtesting.rules.StatementAdapter.evaluate(StatementAdapter.java:36)
	at org.apache.lucene.util.TestRuleAssertionsRequired$1.evaluate(TestRuleAssertionsRequired.java:53)
	at org.apache.lucene.util.TestRuleMarkFailure$1.evaluate(TestRuleMarkFailure.java:47)
	at org.apache.lucene.util.TestRuleIgnoreAfterMaxFailures$1.evaluate(TestRuleIgnoreAfterMaxFailures.java:64)
	at org.apache.lucene.util.TestRuleIgnoreTestSuites$1.evaluate(TestRuleIgnoreTestSuites.java:54)
	at com.carrotsearch.randomizedtesting.rules.StatementAdapter.evaluate(StatementAdapter.java:36)
	at com.carrotsearch.randomizedtesting.ThreadLeakControl$StatementRunner.run(ThreadLeakControl.java:368)
	at java.lang.Thread.run(Thread.java:748)




Build Log:
[...truncated 14209 lines...]
   [junit4] Suite: org.apache.solr.cloud.TestPullReplicaErrorHandling
   [junit4]   2> 3012150 INFO  (SUITE-TestPullReplicaErrorHandling-seed#[3994D13779CB7808]-worker) [    ] o.a.s.SolrTestCaseJ4 SecureRandom sanity checks: test.solr.allowed.securerandom=null & java.security.egd=file:/dev/./urandom
   [junit4]   2> Creating dataDir: /Users/jenkins/workspace/Lucene-Solr-7.x-MacOSX/solr/build/solr-core/test/J0/temp/solr.cloud.TestPullReplicaErrorHandling_3994D13779CB7808-001/init-core-data-001
   [junit4]   2> 3012151 WARN  (SUITE-TestPullReplicaErrorHandling-seed#[3994D13779CB7808]-worker) [    ] o.a.s.SolrTestCaseJ4 startTrackingSearchers: numOpens=9 numCloses=9
   [junit4]   2> 3012152 INFO  (SUITE-TestPullReplicaErrorHandling-seed#[3994D13779CB7808]-worker) [    ] o.a.s.SolrTestCaseJ4 Using TrieFields (NUMERIC_POINTS_SYSPROP=false) w/NUMERIC_DOCVALUES_SYSPROP=false
   [junit4]   2> 3012156 INFO  (SUITE-TestPullReplicaErrorHandling-seed#[3994D13779CB7808]-worker) [    ] o.a.s.SolrTestCaseJ4 Randomized ssl (false) and clientAuth (false) via: @org.apache.solr.SolrTestCaseJ4$SuppressSSL(bugUrl=https://issues.apache.org/jira/browse/SOLR-5776) w/ MAC_OS_X supressed clientAuth
   [junit4]   2> 3012157 INFO  (SUITE-TestPullReplicaErrorHandling-seed#[3994D13779CB7808]-worker) [    ] o.a.s.c.MiniSolrCloudCluster Starting cluster of 4 servers in /Users/jenkins/workspace/Lucene-Solr-7.x-MacOSX/solr/build/solr-core/test/J0/temp/solr.cloud.TestPullReplicaErrorHandling_3994D13779CB7808-001/tempDir-001
   [junit4]   2> 3012157 INFO  (SUITE-TestPullReplicaErrorHandling-seed#[3994D13779CB7808]-worker) [    ] o.a.s.c.ZkTestServer STARTING ZK TEST SERVER
   [junit4]   2> 3012158 INFO  (Thread-3179) [    ] o.a.s.c.ZkTestServer client port:0.0.0.0/0.0.0.0:0
   [junit4]   2> 3012158 INFO  (Thread-3179) [    ] o.a.s.c.ZkTestServer Starting server
   [junit4]   2> 3012161 ERROR (Thread-3179) [    ] o.a.z.s.ZooKeeperServer ZKShutdownHandler is not registered, so ZooKeeper server won't take any action on ERROR or SHUTDOWN server state changes
   [junit4]   2> 3012261 INFO  (SUITE-TestPullReplicaErrorHandling-seed#[3994D13779CB7808]-worker) [    ] o.a.s.c.ZkTestServer start zk server on port:59264
   [junit4]   2> 3012279 INFO  (zkConnectionManagerCallback-6623-thread-1) [    ] o.a.s.c.c.ConnectionManager zkClient has connected
   [junit4]   2> 3012285 INFO  (jetty-launcher-6620-thread-1) [    ] o.e.j.s.Server jetty-9.4.11.v20180605; built: 2018-06-05T18:24:03.829Z; git: d5fc0523cfa96bfebfbda19606cad384d772f04c; jvm 1.8.0_172-b11
   [junit4]   2> 3012285 INFO  (jetty-launcher-6620-thread-3) [    ] o.e.j.s.Server jetty-9.4.11.v20180605; built: 2018-06-05T18:24:03.829Z; git: d5fc0523cfa96bfebfbda19606cad384d772f04c; jvm 1.8.0_172-b11
   [junit4]   2> 3012286 INFO  (jetty-launcher-6620-thread-4) [    ] o.e.j.s.Server jetty-9.4.11.v20180605; built: 2018-06-05T18:24:03.829Z; git: d5fc0523cfa96bfebfbda19606cad384d772f04c; jvm 1.8.0_172-b11
   [junit4]   2> 3012286 INFO  (jetty-launcher-6620-thread-2) [    ] o.e.j.s.Server jetty-9.4.11.v20180605; built: 2018-06-05T18:24:03.829Z; git: d5fc0523cfa96bfebfbda19606cad384d772f04c; jvm 1.8.0_172-b11
   [junit4]   2> 3012287 INFO  (jetty-launcher-6620-thread-1) [    ] o.e.j.s.session DefaultSessionIdManager workerName=node0
   [junit4]   2> 3012287 INFO  (jetty-launcher-6620-thread-1) [    ] o.e.j.s.session No SessionScavenger set, using defaults
   [junit4]   2> 3012288 INFO  (jetty-launcher-6620-thread-1) [    ] o.e.j.s.session node0 Scavenging every 600000ms
   [junit4]   2> 3012289 INFO  (jetty-launcher-6620-thread-1) [    ] o.e.j.s.h.ContextHandler Started o.e.j.s.ServletContextHandler@38eb6bf0{/solr,null,AVAILABLE}
   [junit4]   2> 3012290 INFO  (jetty-launcher-6620-thread-2) [    ] o.e.j.s.session DefaultSessionIdManager workerName=node0
   [junit4]   2> 3012290 INFO  (jetty-launcher-6620-thread-2) [    ] o.e.j.s.session No SessionScavenger set, using defaults
   [junit4]   2> 3012290 INFO  (jetty-launcher-6620-thread-2) [    ] o.e.j.s.session node0 Scavenging every 600000ms
   [junit4]   2> 3012290 INFO  (jetty-launcher-6620-thread-1) [    ] o.e.j.s.AbstractConnector Started ServerConnector@1c6871f9{HTTP/1.1,[http/1.1]}{127.0.0.1:59266}
   [junit4]   2> 3012290 INFO  (jetty-launcher-6620-thread-1) [    ] o.e.j.s.Server Started @3012367ms
   [junit4]   2> 3012290 INFO  (jetty-launcher-6620-thread-1) [    ] o.a.s.c.s.e.JettySolrRunner Jetty properties: {hostContext=/solr, hostPort=59266}
   [junit4]   2> 3012290 INFO  (jetty-launcher-6620-thread-2) [    ] o.e.j.s.h.ContextHandler Started o.e.j.s.ServletContextHandler@312fdb8f{/solr,null,AVAILABLE}
   [junit4]   2> 3012290 ERROR (jetty-launcher-6620-thread-1) [    ] o.a.s.u.StartupLoggingUtils Missing Java Option solr.log.dir. Logging may be missing or incomplete.
   [junit4]   2> 3012290 INFO  (jetty-launcher-6620-thread-1) [    ] o.a.s.s.SolrDispatchFilter Using logger factory org.apache.logging.slf4j.Log4jLoggerFactory
   [junit4]   2> 3012291 INFO  (jetty-launcher-6620-thread-1) [    ] o.a.s.s.SolrDispatchFilter  ___      _       Welcome to Apache Solr™ version 7.6.0
   [junit4]   2> 3012291 INFO  (jetty-launcher-6620-thread-1) [    ] o.a.s.s.SolrDispatchFilter / __| ___| |_ _   Starting in cloud mode on port null
   [junit4]   2> 3012291 INFO  (jetty-launcher-6620-thread-1) [    ] o.a.s.s.SolrDispatchFilter \__ \/ _ \ | '_|  Install dir: null
   [junit4]   2> 3012291 INFO  (jetty-launcher-6620-thread-1) [    ] o.a.s.s.SolrDispatchFilter |___/\___/_|_|    Start time: 2018-09-13T07:18:07.592Z
   [junit4]   2> 3012291 INFO  (jetty-launcher-6620-thread-2) [    ] o.e.j.s.AbstractConnector Started ServerConnector@7243370a{HTTP/1.1,[http/1.1]}{127.0.0.1:59267}
   [junit4]   2> 3012291 INFO  (jetty-launcher-6620-thread-2) [    ] o.e.j.s.Server Started @3012368ms
   [junit4]   2> 3012291 INFO  (jetty-launcher-6620-thread-2) [    ] o.a.s.c.s.e.JettySolrRunner Jetty properties: {hostContext=/solr, hostPort=59267}
   [junit4]   2> 3012291 ERROR (jetty-launcher-6620-thread-2) [    ] o.a.s.u.StartupLoggingUtils Missing Java Option solr.log.dir. Logging may be missing or incomplete.
   [junit4]   2> 3012291 INFO  (jetty-launcher-6620-thread-2) [    ] o.a.s.s.SolrDispatchFilter Using logger factory org.apache.logging.slf4j.Log4jLoggerFactory
   [junit4]   2> 3012292 INFO  (jetty-launcher-6620-thread-2) [    ] o.a.s.s.SolrDispatchFilter  ___      _       Welcome to Apache Solr™ version 7.6.0
   [junit4]   2> 3012292 INFO  (jetty-launcher-6620-thread-2) [    ] o.a.s.s.SolrDispatchFilter / __| ___| |_ _   Starting in cloud mode on port null
   [junit4]   2> 3012292 INFO  (jetty-launcher-6620-thread-2) [    ] o.a.s.s.SolrDispatchFilter \__ \/ _ \ | '_|  Install dir: null
   [junit4]   2> 3012292 INFO  (jetty-launcher-6620-thread-2) [    ] o.a.s.s.SolrDispatchFilter |___/\___/_|_|    Start time: 2018-09-13T07:18:07.593Z
   [junit4]   2> 3012292 INFO  (jetty-launcher-6620-thread-4) [    ] o.e.j.s.session DefaultSessionIdManager workerName=node0
   [junit4]   2> 3012292 INFO  (jetty-launcher-6620-thread-4) [    ] o.e.j.s.session No SessionScavenger set, using defaults
   [junit4]   2> 3012292 INFO  (jetty-launcher-6620-thread-4) [    ] o.e.j.s.session node0 Scavenging every 600000ms
   [junit4]   2> 3012293 INFO  (jetty-launcher-6620-thread-4) [    ] o.e.j.s.h.ContextHandler Started o.e.j.s.ServletContextHandler@12488fb3{/solr,null,AVAILABLE}
   [junit4]   2> 3012294 INFO  (jetty-launcher-6620-thread-4) [    ] o.e.j.s.AbstractConnector Started ServerConnector@1b086843{HTTP/1.1,[http/1.1]}{127.0.0.1:59269}
   [junit4]   2> 3012294 INFO  (jetty-launcher-6620-thread-4) [    ] o.e.j.s.Server Started @3012371ms
   [junit4]   2> 3012295 INFO  (jetty-launcher-6620-thread-4) [    ] o.a.s.c.s.e.JettySolrRunner Jetty properties: {hostContext=/solr, hostPort=59269}
   [junit4]   2> 3012295 INFO  (zkConnectionManagerCallback-6625-thread-1) [    ] o.a.s.c.c.ConnectionManager zkClient has connected
   [junit4]   2> 3012295 ERROR (jetty-launcher-6620-thread-4) [    ] o.a.s.u.StartupLoggingUtils Missing Java Option solr.log.dir. Logging may be missing or incomplete.
   [junit4]   2> 3012295 INFO  (jetty-launcher-6620-thread-4) [    ] o.a.s.s.SolrDispatchFilter Using logger factory org.apache.logging.slf4j.Log4jLoggerFactory
   [junit4]   2> 3012295 INFO  (jetty-launcher-6620-thread-4) [    ] o.a.s.s.SolrDispatchFilter  ___      _       Welcome to Apache Solr™ version 7.6.0
   [junit4]   2> 3012295 INFO  (jetty-launcher-6620-thread-4) [    ] o.a.s.s.SolrDispatchFilter / __| ___| |_ _   Starting in cloud mode on port null
   [junit4]   2> 3012295 INFO  (jetty-launcher-6620-thread-4) [    ] o.a.s.s.SolrDispatchFilter \__ \/ _ \ | '_|  Install dir: null
   [junit4]   2> 3012295 INFO  (jetty-launcher-6620-thread-4) [    ] o.a.s.s.SolrDispatchFilter |___/\___/_|_|    Start time: 2018-09-13T07:18:07.596Z
   [junit4]   2> 3012296 INFO  (jetty-launcher-6620-thread-3) [    ] o.e.j.s.session DefaultSessionIdManager workerName=node0
   [junit4]   2> 3012296 INFO  (jetty-launcher-6620-thread-3) [    ] o.e.j.s.session No SessionScavenger set, using defaults
   [junit4]   2> 3012296 INFO  (jetty-launcher-6620-thread-3) [    ] o.e.j.s.session node0 Scavenging every 600000ms
   [junit4]   2> 3012297 INFO  (jetty-launcher-6620-thread-1) [    ] o.a.s.s.SolrDispatchFilter solr.xml found in ZooKeeper. Loading...
   [junit4]   2> 3012298 INFO  (jetty-launcher-6620-thread-3) [    ] o.e.j.s.h.ContextHandler Started o.e.j.s.ServletContextHandler@476ef51b{/solr,null,AVAILABLE}
   [junit4]   2> 3012298 INFO  (zkConnectionManagerCallback-6627-thread-1) [    ] o.a.s.c.c.ConnectionManager zkClient has connected
   [junit4]   2> 3012298 INFO  (jetty-launcher-6620-thread-3) [    ] o.e.j.s.AbstractConnector Started ServerConnector@5586acaa{HTTP/1.1,[http/1.1]}{127.0.0.1:59272}
   [junit4]   2> 3012298 INFO  (jetty-launcher-6620-thread-3) [    ] o.e.j.s.Server Started @3012374ms
   [junit4]   2> 3012298 INFO  (jetty-launcher-6620-thread-3) [    ] o.a.s.c.s.e.JettySolrRunner Jetty properties: {hostContext=/solr, hostPort=59272}
   [junit4]   2> 3012298 ERROR (jetty-launcher-6620-thread-3) [    ] o.a.s.u.StartupLoggingUtils Missing Java Option solr.log.dir. Logging may be missing or incomplete.
   [junit4]   2> 3012298 INFO  (jetty-launcher-6620-thread-3) [    ] o.a.s.s.SolrDispatchFilter Using logger factory org.apache.logging.slf4j.Log4jLoggerFactory
   [junit4]   2> 3012298 INFO  (jetty-launcher-6620-thread-3) [    ] o.a.s.s.SolrDispatchFilter  ___      _       Welcome to Apache Solr™ version 7.6.0
   [junit4]   2> 3012298 INFO  (jetty-launcher-6620-thread-3) [    ] o.a.s.s.SolrDispatchFilter / __| ___| |_ _   Starting in cloud mode on port null
   [junit4]   2> 3012299 INFO  (jetty-launcher-6620-thread-3) [    ] o.a.s.s.SolrDispatchFilter \__ \/ _ \ | '_|  Install dir: null
   [junit4]   2> 3012299 INFO  (jetty-launcher-6620-thread-3) [    ] o.a.s.s.SolrDispatchFilter |___/\___/_|_|    Start time: 2018-09-13T07:18:07.600Z
   [junit4]   2> 3012300 INFO  (zkConnectionManagerCallback-6629-thread-1) [    ] o.a.s.c.c.ConnectionManager zkClient has connected
   [junit4]   2> 3012300 INFO  (jetty-launcher-6620-thread-2) [    ] o.a.s.s.SolrDispatchFilter solr.xml found in ZooKeeper. Loading...
   [junit4]   2> 3012301 INFO  (jetty-launcher-6620-thread-4) [    ] o.a.s.s.SolrDispatchFilter solr.xml found in ZooKeeper. Loading...
   [junit4]   2> 3012305 INFO  (zkConnectionManagerCallback-6631-thread-1) [    ] o.a.s.c.c.ConnectionManager zkClient has connected
   [junit4]   2> 3012309 INFO  (jetty-launcher-6620-thread-3) [    ] o.a.s.s.SolrDispatchFilter solr.xml found in ZooKeeper. Loading...
   [junit4]   2> 3012464 INFO  (jetty-launcher-6620-thread-1) [    ] o.a.s.c.ZkContainer Zookeeper client=127.0.0.1:59264/solr
   [junit4]   2> 3012466 INFO  (zkConnectionManagerCallback-6635-thread-1) [    ] o.a.s.c.c.ConnectionManager zkClient has connected
   [junit4]   2> 3012469 INFO  (zkConnectionManagerCallback-6637-thread-1) [    ] o.a.s.c.c.ConnectionManager zkClient has connected
   [junit4]   2> 3012638 INFO  (jetty-launcher-6620-thread-1) [n:127.0.0.1:59266_solr    ] o.a.s.c.OverseerElectionContext I am going to be the leader 127.0.0.1:59266_solr
   [junit4]   2> 3012639 INFO  (jetty-launcher-6620-thread-1) [n:127.0.0.1:59266_solr    ] o.a.s.c.Overseer Overseer (id=72327910827425798-127.0.0.1:59266_solr-n_0000000000) starting
   [junit4]   2> 3012648 INFO  (zkConnectionManagerCallback-6644-thread-1) [    ] o.a.s.c.c.ConnectionManager zkClient has connected
   [junit4]   2> 3012652 INFO  (jetty-launcher-6620-thread-1) [n:127.0.0.1:59266_solr    ] o.a.s.c.s.i.ZkClientClusterStateProvider Cluster at 127.0.0.1:59264/solr ready
   [junit4]   2> 3012652 INFO  (OverseerStateUpdate-72327910827425798-127.0.0.1:59266_solr-n_0000000000) [n:127.0.0.1:59266_solr    ] o.a.s.c.Overseer Starting to work on the main queue : 127.0.0.1:59266_solr
   [junit4]   2> 3012655 INFO  (jetty-launcher-6620-thread-1) [n:127.0.0.1:59266_solr    ] o.a.s.c.ZkController Register node as live in ZooKeeper:/live_nodes/127.0.0.1:59266_solr
   [junit4]   2> 3012657 INFO  (zkCallback-6643-thread-1) [    ] o.a.s.c.c.ZkStateReader Updated live nodes from ZooKeeper... (0) -> (1)
   [junit4]   2> 3012657 INFO  (zkCallback-6636-thread-1) [    ] o.a.s.c.c.ZkStateReader Updated live nodes from ZooKeeper... (0) -> (1)
   [junit4]   2> 3012716 INFO  (jetty-launcher-6620-thread-1) [n:127.0.0.1:59266_solr    ] o.a.s.h.a.MetricsHistoryHandler No .system collection, keeping metrics history in memory.
   [junit4]   2> 3012716 INFO  (jetty-launcher-6620-thread-3) [    ] o.a.s.c.ZkContainer Zookeeper client=127.0.0.1:59264/solr
   [junit4]   2> 3012717 INFO  (zkConnectionManagerCallback-6649-thread-1) [    ] o.a.s.c.c.ConnectionManager zkClient has connected
   [junit4]   2> 3012719 INFO  (zkConnectionManagerCallback-6651-thread-1) [    ] o.a.s.c.c.ConnectionManager zkClient has connected
   [junit4]   2> 3012735 INFO  (jetty-launcher-6620-thread-3) [n:127.0.0.1:59272_solr    ] o.a.s.c.c.ZkStateReader Updated live nodes from ZooKeeper... (0) -> (1)
   [junit4]   2> 3012741 INFO  (jetty-launcher-6620-thread-3) [n:127.0.0.1:59272_solr    ] o.a.s.c.TransientSolrCoreCacheDefault Allocating transient cache for 2147483647 transient cores
   [junit4]   2> 3012741 INFO  (jetty-launcher-6620-thread-3) [n:127.0.0.1:59272_solr    ] o.a.s.c.ZkController Register node as live in ZooKeeper:/live_nodes/127.0.0.1:59272_solr
   [junit4]   2> 3012742 INFO  (zkCallback-6643-thread-1) [    ] o.a.s.c.c.ZkStateReader Updated live nodes from ZooKeeper... (1) -> (2)
   [junit4]   2> 3012742 INFO  (zkCallback-6650-thread-1) [    ] o.a.s.c.c.ZkStateReader Updated live nodes from ZooKeeper... (1) -> (2)
   [junit4]   2> 3012742 INFO  (zkCallback-6636-thread-1) [    ] o.a.s.c.c.ZkStateReader Updated live nodes from ZooKeeper... (1) -> (2)
   [junit4]   2> 3012774 INFO  (jetty-launcher-6620-thread-1) [n:127.0.0.1:59266_solr    ] o.a.s.m.r.SolrJmxReporter JMX monitoring for 'solr_59266.solr.node' (registry 'solr.node') enabled at server: com.sun.jmx.mbeanserver.JmxMBeanServer@364a61ae
   [junit4]   2> 3012778 INFO  (jetty-launcher-6620-thread-4) [    ] o.a.s.c.ZkContainer Zookeeper client=127.0.0.1:59264/solr
   [junit4]   2> 3012779 INFO  (zkConnectionManagerCallback-6657-thread-1) [    ] o.a.s.c.c.ConnectionManager zkClient has connected
   [junit4]   2> 3012782 INFO  (zkConnectionManagerCallback-6659-thread-1) [    ] o.a.s.c.c.ConnectionManager zkClient has connected
   [junit4]   2> 3012789 INFO  (jetty-launcher-6620-thread-1) [n:127.0.0.1:59266_solr    ] o.a.s.m.r.SolrJmxReporter JMX monitoring for 'solr_59266.solr.jvm' (registry 'solr.jvm') enabled at server: com.sun.jmx.mbeanserver.JmxMBeanServer@364a61ae
   [junit4]   2> 3012789 INFO  (jetty-launcher-6620-thread-1) [n:127.0.0.1:59266_solr    ] o.a.s.m.r.SolrJmxReporter JMX monitoring for 'solr_59266.solr.jetty' (registry 'solr.jetty') enabled at server: com.sun.jmx.mbeanserver.JmxMBeanServer@364a61ae
   [junit4]   2> 3012790 INFO  (jetty-launcher-6620-thread-1) [n:127.0.0.1:59266_solr    ] o.a.s.c.CorePropertiesLocator Found 0 core definitions underneath /Users/jenkins/workspace/Lucene-Solr-7.x-MacOSX/solr/build/solr-core/test/J0/temp/solr.cloud.TestPullReplicaErrorHandling_3994D13779CB7808-001/tempDir-001/node1/.
   [junit4]   2> 3012792 INFO  (jetty-launcher-6620-thread-4) [n:127.0.0.1:59269_solr    ] o.a.s.c.c.ZkStateReader Updated live nodes from ZooKeeper... (0) -> (2)
   [junit4]   2> 3012794 INFO  (zkConnectionManagerCallback-6666-thread-1) [    ] o.a.s.c.c.ConnectionManager zkClient has connected
   [junit4]   2> 3012795 INFO  (jetty-launcher-6620-thread-3) [n:127.0.0.1:59272_solr    ] o.a.s.c.c.ZkStateReader Updated live nodes from ZooKeeper... (0) -> (2)
   [junit4]   2> 3012797 INFO  (jetty-launcher-6620-thread-3) [n:127.0.0.1:59272_solr    ] o.a.s.c.s.i.ZkClientClusterStateProvider Cluster at 127.0.0.1:59264/solr ready
   [junit4]   2> 3012797 INFO  (jetty-launcher-6620-thread-3) [n:127.0.0.1:59272_solr    ] o.a.s.h.a.MetricsHistoryHandler No .system collection, keeping metrics history in memory.
   [junit4]   2> 3012798 INFO  (jetty-launcher-6620-thread-4) [n:127.0.0.1:59269_solr    ] o.a.s.c.TransientSolrCoreCacheDefault Allocating transient cache for 2147483647 transient cores
   [junit4]   2> 3012798 INFO  (jetty-launcher-6620-thread-4) [n:127.0.0.1:59269_solr    ] o.a.s.c.ZkController Register node as live in ZooKeeper:/live_nodes/127.0.0.1:59269_solr
   [junit4]   2> 3012799 INFO  (zkCallback-6650-thread-1) [    ] o.a.s.c.c.ZkStateReader Updated live nodes from ZooKeeper... (2) -> (3)
   [junit4]   2> 3012799 INFO  (zkCallback-6643-thread-1) [    ] o.a.s.c.c.ZkStateReader Updated live nodes from ZooKeeper... (2) -> (3)
   [junit4]   2> 3012799 INFO  (zkCallback-6665-thread-1) [    ] o.a.s.c.c.ZkStateReader Updated live nodes from ZooKeeper... (2) -> (3)
   [junit4]   2> 3012800 INFO  (zkCallback-6658-thread-1) [    ] o.a.s.c.c.ZkStateReader Updated live nodes from ZooKeeper... (2) -> (3)
   [junit4]   2> 3012800 INFO  (zkCallback-6636-thread-1) [    ] o.a.s.c.c.ZkStateReader Updated live nodes from ZooKeeper... (2) -> (3)
   [junit4]   2> 3012851 INFO  (jetty-launcher-6620-thread-3) [n:127.0.0.1:59272_solr    ] o.a.s.m.r.SolrJmxReporter JMX monitoring for 'solr_59272.solr.node' (registry 'solr.node') enabled at server: com.sun.jmx.mbeanserver.JmxMBeanServer@364a61ae
   [junit4]   2> 3012863 INFO  (jetty-launcher-6620-thread-3) [n:127.0.0.1:59272_solr    ] o.a.s.m.r.SolrJmxReporter JMX monitoring for 'solr_59272.solr.jvm' (registry 'solr.jvm') enabled at server: com.sun.jmx.mbeanserver.JmxMBeanServer@364a61ae
   [junit4]   2> 3012863 INFO  (jetty-launcher-6620-thread-3) [n:127.0.0.1:59272_solr    ] o.a.s.m.r.SolrJmxReporter JMX monitoring for 'solr_59272.solr.jetty' (registry 'solr.jetty') enabled at server: com.sun.jmx.mbeanserver.JmxMBeanServer@364a61ae
   [junit4]   2> 3012866 INFO  (jetty-launcher-6620-thread-3) [n:127.0.0.1:59272_solr    ] o.a.s.c.CorePropertiesLocator Found 0 core definitions underneath /Users/jenkins/workspace/Lucene-Solr-7.x-MacOSX/solr/build/solr-core/test/J0/temp/solr.cloud.TestPullReplicaErrorHandling_3994D13779CB7808-001/tempDir-001/node3/.
   [junit4]   2> 3012900 INFO  (zkConnectionManagerCallback-6672-thread-1) [    ] o.a.s.c.c.ConnectionManager zkClient has connected
   [junit4]   2> 3012903 INFO  (jetty-launcher-6620-thread-4) [n:127.0.0.1:59269_solr    ] o.a.s.c.c.ZkStateReader Updated live nodes from ZooKeeper... (0) -> (3)
   [junit4]   2> 3012905 INFO  (jetty-launcher-6620-thread-4) [n:127.0.0.1:59269_solr    ] o.a.s.c.s.i.ZkClientClusterStateProvider Cluster at 127.0.0.1:59264/solr ready
   [junit4]   2> 3012905 INFO  (jetty-launcher-6620-thread-4) [n:127.0.0.1:59269_solr    ] o.a.s.h.a.MetricsHistoryHandler No .system collection, keeping metrics history in memory.
   [junit4]   2> 3012974 INFO  (jetty-launcher-6620-thread-4) [n:127.0.0.1:59269_solr    ] o.a.s.m.r.SolrJmxReporter JMX monitoring for 'solr_59269.solr.node' (registry 'solr.node') enabled at server: com.sun.jmx.mbeanserver.JmxMBeanServer@364a61ae
   [junit4]   2> 3012980 INFO  (jetty-launcher-6620-thread-4) [n:127.0.0.1:59269_solr    ] o.a.s.m.r.SolrJmxReporter JMX monitoring for 'solr_59269.solr.jvm' (registry 'solr.jvm') enabled at server: com.sun.jmx.mbeanserver.JmxMBeanServer@364a61ae
   [junit4]   2> 3012980 INFO  (jetty-launcher-6620-thread-4) [n:127.0.0.1:59269_solr    ] o.a.s.m.r.SolrJmxReporter JMX monitoring for 'solr_59269.solr.jetty' (registry 'solr.jetty') enabled at server: com.sun.jmx.mbeanserver.JmxMBeanServer@364a61ae
   [junit4]   2> 3012981 INFO  (jetty-launcher-6620-thread-4) [n:127.0.0.1:59269_solr    ] o.a.s.c.CorePropertiesLocator Found 0 core definitions underneath /Users/jenkins/workspace/Lucene-Solr-7.x-MacOSX/solr/build/solr-core/test/J0/temp/solr.cloud.TestPullReplicaErrorHandling_3994D13779CB7808-001/tempDir-001/node4/.
   [junit4]   2> 3012991 INFO  (jetty-launcher-6620-thread-2) [    ] o.a.s.c.ZkContainer Zookeeper client=127.0.0.1:59264/solr
   [junit4]   2> 3012993 INFO  (zkConnectionManagerCallback-6677-thread-1) [    ] o.a.s.c.c.ConnectionManager zkClient has connected
   [junit4]   2> 3012996 INFO  (zkConnectionManagerCallback-6679-thread-1) [    ] o.a.s.c.c.ConnectionManager zkClient has connected
   [junit4]   2> 3013010 INFO  (jetty-launcher-6620-thread-2) [n:127.0.0.1:59267_solr    ] o.a.s.c.c.ZkStateReader Updated live nodes from ZooKeeper... (0) -> (3)
   [junit4]   2> 3013017 INFO  (jetty-launcher-6620-thread-2) [n:127.0.0.1:59267_solr    ] o.a.s.c.TransientSolrCoreCacheDefault Allocating transient cache for 2147483647 transient cores
   [junit4]   2> 3013017 INFO  (jetty-launcher-6620-thread-2) [n:127.0.0.1:59267_solr    ] o.a.s.c.ZkController Register node as live in ZooKeeper:/live_nodes/127.0.0.1:59267_solr
   [junit4]   2> 3013020 INFO  (zkCallback-6650-thread-1) [    ] o.a.s.c.c.ZkStateReader Updated live nodes from ZooKeeper... (3) -> (4)
   [junit4]   2> 3013020 INFO  (zkCallback-6658-thread-1) [    ] o.a.s.c.c.ZkStateReader Updated live nodes from ZooKeeper... (3) -> (4)
   [junit4]   2> 3013020 INFO  (zkCallback-6665-thread-1) [    ] o.a.s.c.c.ZkStateReader Updated live nodes from ZooKeeper... (3) -> (4)
   [junit4]   2> 3013020 INFO  (zkCallback-6643-thread-1) [    ] o.a.s.c.c.ZkStateReader Updated live nodes from ZooKeeper... (3) -> (4)
   [junit4]   2> 3013020 INFO  (zkCallback-6678-thread-1) [    ] o.a.s.c.c.ZkStateReader Updated live nodes from ZooKeeper... (3) -> (4)
   [junit4]   2> 3013020 INFO  (zkCallback-6636-thread-1) [    ] o.a.s.c.c.ZkStateReader Updated live nodes from ZooKeeper... (3) -> (4)
   [junit4]   2> 3013020 INFO  (zkCallback-6671-thread-1) [    ] o.a.s.c.c.ZkStateReader Updated live nodes from ZooKeeper... (3) -> (4)
   [junit4]   2> 3013076 INFO  (zkConnectionManagerCallback-6686-thread-1) [    ] o.a.s.c.c.ConnectionManager zkClient has connected
   [junit4]   2> 3013078 INFO  (jetty-launcher-6620-thread-2) [n:127.0.0.1:59267_solr    ] o.a.s.c.c.ZkStateReader Updated live nodes from ZooKeeper... (0) -> (4)
   [junit4]   2> 3013080 INFO  (jetty-launcher-6620-thread-2) [n:127.0.0.1:59267_solr    ] o.a.s.c.s.i.ZkClientClusterStateProvider Cluster at 127.0.0.1:59264/solr ready
   [junit4]   2> 3013080 INFO  (jetty-launcher-6620-thread-2) [n:127.0.0.1:59267_solr    ] o.a.s.h.a.MetricsHistoryHandler No .system collection, keeping metrics history in memory.
   [junit4]   2> 3013107 INFO  (jetty-launcher-6620-thread-2) [n:127.0.0.1:59267_solr    ] o.a.s.m.r.SolrJmxReporter JMX monitoring for 'solr_59267.solr.node' (registry 'solr.node') enabled at server: com.sun.jmx.mbeanserver.JmxMBeanServer@364a61ae
   [junit4]   2> 3013114 INFO  (jetty-launcher-6620-thread-2) [n:127.0.0.1:59267_solr    ] o.a.s.m.r.SolrJmxReporter JMX monitoring for 'solr_59267.solr.jvm' (registry 'solr.jvm') enabled at server: com.sun.jmx.mbeanserver.JmxMBeanServer@364a61ae
   [junit4]   2> 3013114 INFO  (jetty-launcher-6620-thread-2) [n:127.0.0.1:59267_solr    ] o.a.s.m.r.SolrJmxReporter JMX monitoring for 'solr_59267.solr.jetty' (registry 'solr.jetty') enabled at server: com.sun.jmx.mbeanserver.JmxMBeanServer@364a61ae
   [junit4]   2> 3013115 INFO  (jetty-launcher-6620-thread-2) [n:127.0.0.1:59267_solr    ] o.a.s.c.CorePropertiesLocator Found 0 core definitions underneath /Users/jenkins/workspace/Lucene-Solr-7.x-MacOSX/solr/build/solr-core/test/J0/temp/solr.cloud.TestPullReplicaErrorHandling_3994D13779CB7808-001/tempDir-001/node2/.
   [junit4]   2> 3013170 INFO  (zkConnectionManagerCallback-6689-thread-1) [    ] o.a.s.c.c.ConnectionManager zkClient has connected
   [junit4]   2> 3013208 INFO  (zkConnectionManagerCallback-6694-thread-1) [    ] o.a.s.c.c.ConnectionManager zkClient has connected
   [junit4]   2> 3013209 INFO  (SUITE-TestPullReplicaErrorHandling-seed#[3994D13779CB7808]-worker) [    ] o.a.s.c.c.ZkStateReader Updated live nodes from ZooKeeper... (0) -> (4)
   [junit4]   2> 3013211 INFO  (SUITE-TestPullReplicaErrorHandling-seed#[3994D13779CB7808]-worker) [    ] o.a.s.c.s.i.ZkClientClusterStateProvider Cluster at 127.0.0.1:59264/solr ready
   [junit4]   2> 3013222 INFO  (SUITE-TestPullReplicaErrorHandling-seed#[3994D13779CB7808]-worker) [    ] o.e.j.s.AbstractConnector Stopped ServerConnector@1c6871f9{HTTP/1.1,[http/1.1]}{127.0.0.1:0}
   [junit4]   2> 3013225 INFO  (SUITE-TestPullReplicaErrorHandling-seed#[3994D13779CB7808]-worker) [    ] o.a.s.c.CoreContainer Shutting down CoreContainer instance=207454567
   [junit4]   2> 3013226 INFO  (SUITE-TestPullReplicaErrorHandling-seed#[3994D13779CB7808]-worker) [    ] o.a.s.m.SolrMetricManager Closing metric reporters for registry=solr.node, tag=null
   [junit4]   2> 3013226 INFO  (SUITE-TestPullReplicaErrorHandling-seed#[3994D13779CB7808]-worker) [    ] o.a.s.m.r.SolrJmxReporter Closing reporter [org.apache.solr.metrics.reporters.SolrJmxReporter@5a8b3282: rootName = solr_59266, domain = solr.node, service url = null, agent id = null] for registry solr.node / com.codahale.metrics.MetricRegistry@44b035b4
   [junit4]   2> 3013231 INFO  (SUITE-TestPullReplicaErrorHandling-seed#[3994D13779CB7808]-worker) [    ] o.a.s.m.SolrMetricManager Closing metric reporters for registry=solr.jvm, tag=null
   [junit4]   2> 3013231 INFO  (SUITE-TestPullReplicaErrorHandling-seed#[3994D13779CB7808]-worker) [    ] o.a.s.m.r.SolrJmxReporter Closing reporter [org.apache.solr.metrics.reporters.SolrJmxReporter@5f774493: rootName = solr_59266, domain = solr.jvm, service url = null, agent id = null] for registry solr.jvm / com.codahale.metrics.MetricRegistry@16355c76
   [junit4]   2> 3013234 INFO  (SUITE-TestPullReplicaErrorHandling-seed#[3994D13779CB7808]-worker) [    ] o.a.s.m.SolrMetricManager Closing metric reporters for registry=solr.jetty, tag=null
   [junit4]   2> 3013235 INFO  (SUITE-TestPullReplicaErrorHandling-seed#[3994D13779CB7808]-worker) [    ] o.a.s.m.r.SolrJmxReporter Closing reporter [org.apache.solr.metrics.reporters.SolrJmxReporter@2aa1f5a3: rootName = solr_59266, domain = solr.jetty, service url = null, agent id = null] for registry solr.jetty / com.codahale.metrics.MetricRegistry@639d887f
   [junit4]   2> 3013237 INFO  (SUITE-TestPullReplicaErrorHandling-seed#[3994D13779CB7808]-worker) [    ] o.a.s.c.ZkController Remove node as live in ZooKeeper:/live_nodes/127.0.0.1:59266_solr
   [junit4]   2> 3013239 INFO  (SUITE-TestPullReplicaErrorHandling-seed#[3994D13779CB7808]-worker) [    ] o.a.s.m.SolrMetricManager Closing metric reporters for registry=solr.cluster, tag=null
   [junit4]   2> 3013239 INFO  (zkCallback-6658-thread-1) [    ] o.a.s.c.c.ZkStateReader Updated live nodes from ZooKeeper... (4) -> (3)
   [junit4]   2> 3013239 INFO  (zkCallback-6665-thread-1) [    ] o.a.s.c.c.ZkStateReader Updated live nodes from ZooKeeper... (4) -> (3)
   [junit4]   2> 3013239 INFO  (SUITE-TestPullReplicaErrorHandling-seed#[3994D13779CB7808]-worker) [    ] o.a.s.c.TransientSolrCoreCacheDefault Allocating transient cache for 2147483647 transient cores
   [junit4]   2> 3013239 INFO  (zkCallback-6650-thread-1) [    ] o.a.s.c.c.ZkStateReader Updated live nodes from ZooKeeper... (4) -> (3)
   [junit4]   2> 3013239 INFO  (zkCallback-6678-thread-1) [    ] o.a.s.c.c.ZkStateReader Updated live nodes from ZooKeeper... (4) -> (3)
   [junit4]   2> 3013240 INFO  (SUITE-TestPullReplicaErrorHandling-seed#[3994D13779CB7808]-worker) [    ] o.a.s.c.Overseer Overseer (id=72327910827425798-127.0.0.1:59266_solr-n_0000000000) closing
   [junit4]   2> 3013240 INFO  (OverseerStateUpdate-72327910827425798-127.0.0.1:59266_solr-n_0000000000) [n:127.0.0.1:59266_solr    ] o.a.s.c.Overseer Overseer Loop exiting : 127.0.0.1:59266_solr
   [junit4]   2> 3013240 WARN  (OverseerAutoScalingTriggerThread-72327910827425798-127.0.0.1:59266_solr-n_0000000000) [    ] o.a.s.c.a.OverseerTriggerThread OverseerTriggerThread woken up but we are closed, exiting.
   [junit4]   2> 3013240 INFO  (zkCallback-6685-thread-1) [    ] o.a.s.c.c.ZkStateReader Updated live nodes from ZooKeeper... (4) -> (3)
   [junit4]   2> 3013240 INFO  (zkCallback-6671-thread-1) [    ] o.a.s.c.c.ZkStateReader Updated live nodes from ZooKeeper... (4) -> (3)
   [junit4]   2> 3013240 INFO  (zkCallback-6643-thread-1) [    ] o.a.s.c.c.ZkStateReader Updated live nodes from ZooKeeper... (4) -> (3)
   [junit4]   2> 3013241 INFO  (zkCallback-6693-thread-1) [    ] o.a.s.c.c.ZkStateReader Updated live nodes from ZooKeeper... (4) -> (3)
   [junit4]   2> 3013241 INFO  (zkCallback-6636-thread-1) [    ] o.a.s.c.c.ZkStateReader Updated live nodes from ZooKeeper... (4) -> (3)
   [junit4]   2> 3013246 INFO  (SUITE-TestPullReplicaErrorHandling-seed#[3994D13779CB7808]-worker) [    ] o.e.j.s.h.ContextHandler Stopped o.e.j.s.ServletContextHandler@38eb6bf0{/solr,null,UNAVAILABLE}
   [junit4]   2> 3013247 INFO  (SUITE-TestPullReplicaErrorHandling-seed#[3994D13779CB7808]-worker) [    ] o.e.j.s.session node0 Stopped scavenging
   [junit4]   2> 3013247 INFO  (zkCallback-6650-thread-1) [    ] o.a.s.c.OverseerElectionContext I am going to be the leader 127.0.0.1:59272_solr
   [junit4]   2> 3013248 INFO  (SUITE-TestPullReplicaErrorHandling-seed#[3994D13779CB7808]-worker) [    ] o.e.j.s.Server jetty-9.4.11.v20180605; built: 2018-06-05T18:24:03.829Z; git: d5fc0523cfa96bfebfbda19606cad384d772f04c; jvm 1.8.0_172-b11
   [junit4]   2> 3013249 INFO  (SUITE-TestPullReplicaErrorHandling-seed#[3994D13779CB7808]-worker) [    ] o.e.j.s.session DefaultSessionIdManager workerName=node0
   [junit4]   2> 3013249 INFO  (SUITE-TestPullReplicaErrorHandling-seed#[3994D13779CB7808]-worker) [    ] o.e.j.s.session No SessionScavenger set, using defaults
   [junit4]   2> 3013249 INFO  (SUITE-TestPullReplicaErrorHandling-seed#[3994D13779CB7808]-worker) [    ] o.e.j.s.session node0 Scavenging every 660000ms
   [junit4]   2> 3013249 INFO  (zkCallback-6650-thread-1) [n:127.0.0.1:59272_solr    ] o.a.s.c.Overseer Overseer (id=72327910827425801-127.0.0.1:59272_solr-n_0000000001) starting
   [junit4]   2> 3013249 INFO  (SUITE-TestPullReplicaErrorHandling-seed#[3994D13779CB7808]-worker) [    ] o.e.j.s.h.ContextHandler Started o.e.j.s.ServletContextHandler@51f7cbcd{/solr,null,AVAILABLE}
   [junit4]   2> 3013250 INFO  (SUITE-TestPullReplicaErrorHandling-seed#[3994D13779CB7808]-worker) [    ] o.e.j.s.AbstractConnector Started ServerConnector@7d485606{HTTP/1.1,[http/1.1]}{127.0.0.1:59305}
   [junit4]   2> 3013250 INFO  (SUITE-TestPullReplicaErrorHandling-seed#[3994D13779CB7808]-worker) [    ] o.e.j.s.Server Started @3013326ms
   [junit4]   2> 3013250 INFO  (SUITE-TestPullReplicaErrorHandling-seed#[3994D13779CB7808]-worker) [    ] o.a.s.c.s.e.JettySolrRunner Jetty properties: {hostContext=/solr, hostPort=59304}
   [junit4]   2> 3013250 ERROR (SUITE-TestPullReplicaErrorHandling-seed#[3994D13779CB7808]-worker) [    ] o.a.s.u.StartupLoggingUtils Missing Java Option solr.log.dir. Logging may be missing or incomplete.
   [junit4]   2> 3013250 INFO  (SUITE-TestPullReplicaErrorHandling-seed#[3994D13779CB7808]-worker) [    ] o.a.s.s.SolrDispatchFilter Using logger factory org.apache.logging.slf4j.Log4jLoggerFactory
   [junit4]   2> 3013250 INFO  (SUITE-TestPullReplicaErrorHandling-seed#[3994D13779CB7808]-worker) [    ] o.a.s.s.SolrDispatchFilter  ___      _       Welcome to Apache Solr™ version 7.6.0
   [junit4]   2> 3013250 INFO  (SUITE-TestPullReplicaErrorHandling-seed#[3994D13779CB7808]-worker) [    ] o.a.s.s.SolrDispatchFilter / __| ___| |_ _   Starting in cloud mode on port null
   [junit4]   2> 3013250 INFO  (SUITE-TestPullReplicaErrorHandling-seed#[3994D13779CB7808]-worker) [    ] o.a.s.s.SolrDispatchFilter \__ \/ _ \ | '_|  Install dir: null
   [junit4]   2> 3013251 INFO  (SUITE-TestPullReplicaErrorHandling-seed#[3994D13779CB7808]-worker) [    ] o.a.s.s.SolrDispatchFilter |___/\___/_|_|    Start time: 2018-09-13T07:18:08.552Z
   [junit4]   2> 3013253 INFO  (zkConnectionManagerCallback-6696-thread-1) [    ] o.a.s.c.c.ConnectionManager zkClient has connected
   [junit4]   2> 3013253 INFO  (SUITE-TestPullReplicaErrorHandling-seed#[3994D13779CB7808]-worker) [    ] o.a.s.s.SolrDispatchFilter solr.xml found in ZooKeeper. Loading...
   [junit4]   2> 3013259 INFO  (OverseerStateUpdate-72327910827425801-127.0.0.1:59272_solr-n_0000000001) [n:127.0.0.1:59272_solr    ] o.a.s.c.Overseer Starting to work on the main queue : 127.0.0.1:59272_solr
   [junit4]   2> 3013264 WARN  (NIOServerCxn.Factory:0.0.0.0/0.0.0.0:0) [    ] o.a.z.s.NIOServerCnxn Unable to read additional data from client sessionid 0x100f5da08370013, likely client has closed socket
   [junit4]   2> 3013324 INFO  (SUITE-TestPullReplicaErrorHandling-seed#[3994D13779CB7808]-worker) [    ] o.a.s.c.ZkContainer Zookeeper client=127.0.0.1:59264/solr
   [junit4]   2> 3013326 INFO  (zkConnectionManagerCallback-6700-thread-1) [    ] o.a.s.c.c.ConnectionManager zkClient has connected
   [junit4]   2> 3013329 INFO  (zkConnectionManagerCallback-6702-thread-1) [    ] o.a.s.c.c.ConnectionManager zkClient has connected
   [junit4]   2> 3013361 INFO  (SUITE-TestPullReplicaErrorHandling-seed#[3994D13779CB7808]-worker) [n:127.0.0.1:59304_solr    ] o.a.s.c.c.ZkStateReader Updated live nodes from ZooKeeper... (0) -> (3)
   [junit4]   2> 3013372 INFO  (SUITE-TestPullReplicaErrorHandling-seed#[3994D13779CB7808]-worker) [n:127.0.0.1:59304_solr    ] o.a.s.c.TransientSolrCoreCacheDefault Allocating transient cache for 2147483647 transient cores
   [junit4]   2> 3013372 INFO  (SUITE-TestPullReplicaErrorHandling-seed#[3994D13779CB7808]-worker) [n:127.0.0.1:59304_solr    ] o.a.s.c.ZkController Register node as live in ZooKeeper:/live_nodes/127.0.0.1:59304_solr
   [junit4]   2> 3013374 INFO  (zkCallback-6650-thread-1) [    ] o.a.s.c.c.ZkStateReader Updated live nodes from ZooKeeper... (3) -> (4)
   [junit4]   2> 3013374 INFO  (zkCallback-6678-thread-1) [    ] o.a.s.c.c.ZkStateReader Updated live nodes from ZooKeeper... (3) -> (4)
   [junit4]   2> 3013374 INFO  (zkCallback-6665-thread-1) [    ] o.a.s.c.c.ZkStateReader Updated live nodes from ZooKeeper... (3) -> (4)
   [junit4]   2> 3013374 INFO  (zkCallback-6685-thread-1) [    ] o.a.s.c.c.ZkStateReader Updated live nodes from ZooKeeper... (3) -> (4)
   [junit4]   2> 3013374 INFO  (zkCallback-6671-thread-1) [    ] o.a.s.c.c.ZkStateReader Updated live nodes from ZooKeeper... (3) -> (4)
   [junit4]   2> 3013374 INFO  (zkCallback-6658-thread-1) [    ] o.a.s.c.c.ZkStateReader Updated live nodes from ZooKeeper... (3) -> (4)
   [junit4]   2> 3013374 INFO  (zkCallback-6693-thread-1) [    ] o.a.s.c.c.ZkStateReader Updated live nodes from ZooKeeper... (3) -> (4)
   [junit4]   2> 3013374 INFO  (zkCallback-6701-thread-1) [    ] o.a.s.c.c.ZkStateReader Updated live nodes from ZooKeeper... (3) -> (4)
   [junit4]   2> 3013423 INFO  (zkConnectionManagerCallback-6709-thread-1) [    ] o.a.s.c.c.ConnectionManager zkClient has connected
   [junit4]   2> 3013425 INFO  (SUITE-TestPullReplicaErrorHandling-seed#[3994D13779CB7808]-worker) [n:127.0.0.1:59304_solr    ] o.a.s.c.c.ZkStateReader Updated live nodes from ZooKeeper... (0) -> (4)
   [junit4]   2> 3013427 INFO  (SUITE-TestPullReplicaErrorHandling-seed#[3994D13779CB7808]-worker) [n:127.0.0.1:59304_solr    ] o.a.s.c.s.i.ZkClientClusterStateProvider Cluster at 127.0.0.1:59264/solr ready
   [junit4]   2> 3013427 INFO  (SUITE-TestPullReplicaErrorHandling-seed#[3994D13779CB7808]-worker) [n:127.0.0.1:59304_solr    ] o.a.s.h.a.MetricsHistoryHandler No .system collection, keeping metrics history in memory.
   [junit4]   2> 3013449 INFO  (SUITE-TestPullReplicaErrorHandling-seed#[3994D13779CB7808]-worker) [n:127.0.0.1:59304_solr    ] o.a.s.m.r.SolrJmxReporter JMX monitoring for 'solr_59304.solr.node' (registry 'solr.node') enabled at server: com.sun.jmx.mbeanserver.JmxMBeanServer@364a61ae
   [junit4]   2> 3013457 INFO  (SUITE-TestPullReplicaErrorHandling-seed#[3994D13779CB7808]-worker) [n:127.0.0.1:59304_solr    ] o.a.s.m.r.SolrJmxReporter JMX monitoring for 'solr_59304.solr.jvm' (registry 'solr.jvm') enabled at server: com.sun.jmx.mbeanserver.JmxMBeanServer@364a61ae
   [junit4]   2> 3013457 INFO  (SUITE-TestPullReplicaErrorHandling-seed#[3994D13779CB7808]-worker) [n:127.0.0.1:59304_solr    ] o.a.s.m.r.SolrJmxReporter JMX monitoring for 'solr_59304.solr.jetty' (registry 'solr.jetty') enabled at server: com.sun.jmx.mbeanserver.JmxMBeanServer@364a61ae
   [junit4]   2> 3013458 INFO  (SUITE-TestPullReplicaErrorHandling-seed#[3994D13779CB7808]-worker) [n:127.0.0.1:59304_solr    ] o.a.s.c.CorePropertiesLocator Found 0 core definitions underneath /Users/jenkins/workspace/Lucene-Solr-7.x-MacOSX/solr/build/solr-core/test/J0/temp/solr.cloud.TestPullReplicaErrorHandling_3994D13779CB7808-001/tempDir-001/node1/.
   [junit4]   2> 3013519 INFO  (SUITE-TestPullReplicaErrorHandling-seed#[3994D13779CB7808]-worker) [    ] o.a.s.c.TestPullReplicaErrorHandling Adding proxy for URL: http://127.0.0.1:59305/solr. Proxy: http://127.0.0.1:59304/solr
   [junit4]   2> 3013521 INFO  (SUITE-TestPullReplicaErrorHandling-seed#[3994D13779CB7808]-worker) [    ] o.e.j.s.AbstractConnector Stopped ServerConnector@5586acaa{HTTP/1.1,[http/1.1]}{127.0.0.1:0}
   [junit4]   2> 3013524 INFO  (SUITE-TestPullReplicaErrorHandling-seed#[3994D13779CB7808]-worker) [    ] o.a.s.c.CoreContainer Shutting down CoreContainer instance=807614363
   [junit4]   2> 3013524 INFO  (SUITE-TestPullReplicaErrorHandling-seed#[3994D13779CB7808]-worker) [    ] o.a.s.m.SolrMetricManager Closing metric reporters for registry=solr.node, tag=null
   [junit4]   2> 3013524 INFO  (SUITE-TestPullReplicaErrorHandling-seed#[3994D13779CB7808]-worker) [    ] o.a.s.m.r.SolrJmxReporter Closing reporter [org.apache.solr.metrics.reporters.SolrJmxReporter@68bb8279: rootName = solr_59272, domain = solr.node, service url = null, agent id = null] for registry solr.node / com.codahale.metrics.MetricRegistry@14e9c0d2
   [junit4]   2> 3013543 INFO  (SUITE-TestPullReplicaErrorHandling-seed#[3994D13779CB7808]-worker) [    ] o.a.s.m.SolrMetricManager Closing metric reporters for registry=solr.jvm, tag=null
   [junit4]   2> 3013544 INFO  (SUITE-TestPullReplicaErrorHandling-seed#[3994D13779CB7808]-worker) [    ] o.a.s.m.r.SolrJmxReporter Closing reporter [org.apache.solr.metrics.reporters.SolrJmxReporter@54f8c922: rootName = solr_59272, domain = solr.jvm, service url = null, agent id = null] for registry solr.jvm / com.codahale.metrics.MetricRegistry@16355c76
   [junit4]   2> 3013553 INFO  (SUITE-TestPullReplicaErrorHandling-seed#[3994D13779CB7808]-worker) [    ] o.a.s.m.SolrMetricManager Closing metric reporters for registry=solr.jetty, tag=null
   [junit4]   2> 3013553 INFO  (SUITE-TestPullReplicaErrorHandling-seed#[3994D13779CB7808]-worker) [    ] o.a.s.m.r.SolrJmxReporter Closing reporter [org.apache.solr.metrics.reporters.SolrJmxReporter@74bac4: rootName = solr_59272, domain = solr.jetty, service url = null, agent id = null] for registry solr.jetty / com.codahale.metrics.MetricRegistry@639d887f
   [junit4]   2> 3013555 INFO  (SUITE-TestPullReplicaErrorHandling-seed#[3994D13779CB7808]-worker) [    ] o.a.s.c.ZkController Remove node as live in ZooKeeper:/live_nodes/127.0.0.1:59272_solr
   [junit4]   2> 3013557 INFO  (zkCallback-6678-thread-1) [    ] o.a.s.c.c.ZkStateReader Updated live nodes from ZooKeeper... (4) -> (3)
   [junit4]   2> 3013558 INFO  (zkCallback-6701-thread-1) [    ] o.a.s.c.c.ZkStateReader Updated live nodes from ZooKeeper... (4) -> (3)
   [junit4]   2> 3013558 INFO  (zkCallback-6665-thread-1) [    ] o.a.s.c.c.ZkStateReader Updated live nodes from ZooKeeper... (4) -> (3)
   [junit4]   2> 3013558 INFO  (zkCallback-6671-thread-1) [    ] o.a.s.c.c.ZkStateReader Updated live nodes from ZooKeeper... (4) -> (3)
   [junit4]   2> 3013558 INFO  (zkCallback-6685-thread-1) [    ] o.a.s.c.c.ZkStateReader Updated live nodes from ZooKeeper... (4) -> (3)
   [junit4]   2> 3013558 INFO  (zkCallback-6658-thread-1) [    ] o.a.s.c.c.ZkStateReader Updated live nodes from ZooKeeper... (4) -> (3)
   [junit4]   2> 3013558 INFO  (zkCallback-6650-thread-1) [    ] o.a.s.c.c.ZkStateReader Updated live nodes from ZooKeeper... (4) -> (3)
   [junit4]   2> 3013558 INFO  (zkCallback-6693-thread-1) [    ] o.a.s.c.c.ZkStateReader Updated live nodes from ZooKeeper... (4) -> (3)
   [junit4]   2> 3013558 INFO  (zkCallback-6708-thread-1) [    ] o.a.s.c.c.ZkStateReader Updated live nodes from ZooKeeper... (4) -> (3)
   [junit4]   2> 3013559 INFO  (SUITE-TestPullReplicaErrorHandling-seed#[3994D13779CB7808]-worker) [    ] o.a.s.m.SolrMetricManager Closing metric reporters for registry=solr.cluster, tag=null
   [junit4]   2> 3013560 INFO  (SUITE-TestPullReplicaErrorHandling-seed#[3994D13779CB7808]-worker) [    ] o.a.s.c.Overseer Overseer (id=72327910827425801-127.0.0.1:59272_solr-n_0000000001) closing
   [junit4]   2> 3013561 INFO  (OverseerStateUpdate-72327910827425801-127.0.0.1:59272_solr-n_0000000001) [n:127.0.0.1:59272_solr    ] o.a.s.c.Overseer Overseer Loop exiting : 127.0.0.1:59272_solr
   [junit4]   2> 3013561 WARN  (OverseerAutoScalingTriggerThread-72327910827425801-127.0.0.1:59272_solr-n_0000000001) [    ] o.a.s.c.a.OverseerTriggerThread OverseerTriggerThread woken up but we are closed, exiting.
   [junit4]   2> 3013566 INFO  (zkCallback-6658-thread-1) [    ] o.a.s.c.OverseerElectionContext I am going to be the leader 127.0.0.1:59269_solr
   [junit4]   2> 3013566 INFO  (SUITE-TestPullReplicaErrorHandling-seed#[3994D13779CB7808]-worker) [    ] o.e.j.s.h.ContextHandler Stopped o.e.j.s.ServletContextHandler@476ef51b{/solr,null,UNAVAILABLE}
   [junit4]   2> 3013567 INFO  (SUITE-TestPullReplicaErrorHandling-seed#[3994D13779CB7808]-worker) [    ] o.e.j.s.session node0 Stopped scavenging
   [junit4]   2> 3013568 INFO  (zkCallback-6658-thread-1) [n:127.0.0.1:59269_solr    ] o.a.s.c.Overseer Overseer (id=72327910827425803-127.0.0.1:59269_solr-n_0000000002) starting
   [junit4]   2> 3013569 INFO  (SUITE-TestPullReplicaErrorHandling-seed#[3994D13779CB7808]-worker) [    ] o.e.j.s.Server jetty-9.4.11.v20180605; built: 2018-06-05T18:24:03.829Z; git: d5fc0523cfa96bfebfbda19606cad384d772f04c; jvm 1.8.0_172-b11
   [junit4]   2> 3013571 INFO  (SUITE-TestPullReplicaErrorHandling-seed#[3994D13779CB7808]-worker) [    ] o.e.j.s.session DefaultSessionIdManager workerName=node0
   [junit4]   2> 3013571 INFO  (SUITE-TestPullReplicaErrorHandling-seed#[3994D13779CB7808]-worker) [    ] o.e.j.s.session No SessionScavenger set, using defaults
   [junit4]   2> 3013571 INFO  (SUITE-TestPullReplicaErrorHandling-seed#[3994D13779CB7808]-worker) [    ] o.e.j.s.session node0 Scavenging every 660000ms
   [junit4]   2> 3013572 INFO  (SUITE-TestPullReplicaErrorHandling-seed#[3994D13779CB7808]-worker) [    ] o.e.j.s.h.ContextHandler Started o.e.j.s.ServletContextHandler@7b1dc425{/solr,null,AVAILABLE}
   [junit4]   2> 3013573 INFO  (SUITE-TestPullReplicaErrorHandling-seed#[3994D13779CB7808]-worker) [    ] o.e.j.s.AbstractConnector Started ServerConnector@537d79f4{HTTP/1.1,[http/1.1]}{127.0.0.1:59325}
   [junit4]   2> 3013573 INFO  (SUITE-TestPullReplicaErrorHandling-seed#[3994D13779CB7808]-worker) [    ] o.e.j.s.Server Started @3013650ms
   [junit4]   2> 3013573 INFO  (SUITE-TestPullReplicaErrorHandling-seed#[3994D13779CB7808]-worker) [    ] o.a.s.c.s.e.JettySolrRunner Jetty properties: {hostContext=/solr, hostPort=59322}
   [junit4]   2> 3013574 ERROR (SUITE-TestPullReplicaErrorHandling-seed#[3994D13779CB7808]-worker) [    ] o.a.s.u.StartupLoggingUtils Missing Java Option solr.log.dir. Logging may be missing or incomplete.
   [junit4]   2> 3013574 INFO  (SUITE-TestPullReplicaErrorHandling-seed#[3994D13779CB7808]-worker) [    ] o.a.s.s.SolrDispatchFilter Using logger factory org.apache.logging.slf4j.Log4jLoggerFactory
   [junit4]   2> 3013574 INFO  (SUITE-TestPullReplicaErrorHandling-seed#[3994D13779CB7808]-worker) [    ] o.a.s.s.SolrDispatchFilter  ___      _       Welcome to Apache Solr™ version 7.6.0
   [junit4]   2> 3013574 INFO  (SUITE-TestPullReplicaErrorHandling-seed#[3994D13779CB7808]-worker) [    ] o.a.s.s.SolrDispatchFilter / __| ___| |_ _   Starting in cloud mode on port null
   [junit4]   2> 3013574 INFO  (SUITE-TestPullReplicaErrorHandling-seed#[3994D13779CB7808]-worker) [    ] o.a.s.s.SolrDispatchFilter \__ \/ _ \ | '_|  Install dir: null
   [junit4]   2> 3013574 INFO  (SUITE-TestPullReplicaErrorHandling-seed#[3994D13779CB7808]-worker) [    ] o.a.s.s.SolrDispatchFilter |___/\___/_|_|    Start time: 2018-09-13T07:18:08.875Z
   [junit4]   2> 3013576 INFO  (OverseerStateUpdate-72327910827425803-127.0.0.1:59269_solr-n_0000000002) [n:127.0.0.1:59269_solr    ] o.a.s.c.Overseer Starting to work on the main queue : 127.0.0.1:59269_solr
   [junit4]   2> 3013580 INFO  (zkConnectionManagerCallback-6712-thread-1) [    ] o.a.s.c.c.ConnectionManager zkClient has connected
   [junit4]   2> 3013582 INFO  (SUITE-TestPullReplicaErrorHandling-seed#[3994D13779CB7808]-worker) [    ] o.a.s.s.SolrDispatchFilter solr.xml found in ZooKeeper. Loading...
   [junit4]   2> 3013645 INFO  (SUITE-TestPullReplicaErrorHandling-seed#[3994D13779CB7808]-worker) [    ] o.a.s.c.ZkContainer Zookeeper client=127.0.0.1:59264/solr
   [junit4]   2> 3013649 INFO  (zkConnectionManagerCallback-6716-thread-1) [    ] o.a.s.c.c.ConnectionManager zkClient has connected
   [junit4]   2> 3013652 INFO  (zkConnectionManagerCallback-6718-thread-1) [    ] o.a.s.c.c.ConnectionManager zkClient has connected
   [junit4]   2> 3013667 INFO  (SUITE-TestPullReplicaErrorHandling-seed#[3994D13779CB7808]-worker) [    ] o.a.s.c.c.ZkStateReader Updated live nodes from ZooKeeper... (0) -> (3)
   [junit4]   2> 3013675 INFO  (SUITE-TestPullReplicaErrorHandling-seed#[3994D13779CB7808]-worker) [    ] o.a.s.c.TransientSolrCoreCacheDefault Allocating transient cache for 2147483647 transient cores
   [junit4]   2> 3013675 INFO  (SUITE-TestPullReplicaErrorHandling-seed#[3994D13779CB7808]-worker) [    ] o.a.s.c.ZkController Register node as live in ZooKeeper:/live_nodes/127.0.0.1:59322_solr
   [junit4]   2> 3013677 INFO  (zkCallback-6658-thread-1) [    ] o.a.s.c.c.ZkStateReader Updated live nodes from ZooKeeper... (3) -> (4)
   [junit4]   2> 3013678 INFO  (zkCallback-6678-thread-1) [    ] o.a.s.c.c.ZkStateReader Updated live nodes from ZooKeeper... (3) -> (4)
   [junit4]   2> 3013678 INFO  (zkCallback-6693-thread-1) [    ] o.a.s.c.c.ZkStateReader Updated live nodes from ZooKeeper... (3) -> (4)
   [junit4]   2> 3013678 INFO  (zkCallback-6701-thread-1) [    ] o.a.s.c.c.ZkStateReader Updated live nodes from ZooKeeper... (3) -> (4)
   [junit4]   2> 3013678 INFO  (zkCallback-6685-thread-1) [    ] o.a.s.c.c.ZkStateReader Updated live nodes from ZooKeeper... (3) -> (4)
   [junit4]   2> 3013678 INFO  (zkCallback-6671-thread-1) [    ] o.a.s.c.c.ZkStateReader Updated live nodes from ZooKeeper... (3) -> (4)
   [junit4]   2> 3013678 INFO  (zkCallback-6708-thread-1) [    ] o.a.s.c.c.ZkStateReader Updated live nodes from ZooKeeper... (3) -> (4)
   [junit4]   2> 3013678 INFO  (zkCallback-6717-thread-1) [    ] o.a.s.c.c.ZkStateReader Updated live nodes from ZooKeeper... (3) -> (4)
   [junit4]   2> 3013716 INFO  (zkConnectionManagerCallback-6725-thread-1) [    ] o.a.s.c.c.ConnectionManager zkClient has connected
   [junit4]   2> 3013718 INFO  (SUITE-TestPullReplicaErrorHandling-seed#[3994D13779CB7808]-worker) [    ] o.a.s.c.c.ZkStateReader Updated live nodes from ZooKeeper... (0) -> (4)
   [junit4]   2> 3013720 INFO  (SUITE-TestPullReplicaErrorHandling-seed#[3994D13779CB7808]-worker) [    ] o.a.s.c.s.i.ZkClientClusterStateProvider Cluster at 127.0.0.1:59264/solr ready
   [junit4]   2> 3013720 INFO  (SUITE-TestPullReplicaErrorHandling-seed#[3994D13779CB7808]-worker) [    ] o.a.s.h.a.MetricsHistoryHandler No .system collection, keeping metrics history in memory.
   [junit4]   2> 3013740 INFO  (SUITE-TestPullReplicaErrorHandling-seed#[3994D13779CB7808]-worker) [    ] o.a.s.m.r.SolrJmxReporter JMX monitoring for 'solr_59322.solr.node' (registry 'solr.node') enabled at server: com.sun.jmx.mbeanserver.JmxMBeanServer@364a61ae
   [junit4]   2> 3013747 INFO  (SUITE-TestPullReplicaErrorHandling-seed#[3994D13779CB7808]-worker) [    ] o.a.s.m.r.SolrJmxReporter JMX monitoring for 'solr_59322.solr.jvm' (registry 'solr.jvm') enabled at server: com.sun.jmx.mbeanserver.JmxMBeanServer@364a61ae
   [junit4]   2> 3013747 INFO  (SUITE-TestPullReplicaErrorHandling-seed#[3994D13779CB7808]-worker) [    ] o.a.s.m.r.SolrJmxReporter JMX monitoring for 'solr_59322.solr.jetty' (registry 'solr.jetty') enabled at server: com.sun.jmx.mbeanserver.JmxMBeanServer@364a61ae
   [junit4]   2> 3013748 INFO  (SUITE-TestPullReplicaErrorHandling-seed#[3994D13779CB7808]-worker) [    ] o.a.s.c.CorePropertiesLocator Found 0 core definitions underneath /Users/jenkins/workspace/Lucene-Solr-7.x-MacOSX/solr/build/solr-core/test/J0/temp/solr.cloud.TestPullReplicaErrorHandling_3994D13779CB7808-001/tempDir-001/node3/.
   [junit4]   2> 3013799 INFO  (SUITE-TestPullReplicaErrorHandling-seed#[3994D13779CB7808]-worker) [    ] o.a.s.c.TestPullReplicaErrorHandling Adding proxy for URL: http://127.0.0.1:59325/solr. Proxy: http://127.0.0.1:59322/solr
   [junit4]   2> 3013800 INFO  (SUITE-TestPullReplicaErrorHandling-seed#[3994D13779CB7808]-worker) [    ] o.e.j.s.AbstractConnector Stopped ServerConnector@1b086843{HTTP/1.1,[http/1.1]}{127.0.0.1:0}
   [junit4]   2> 3013800 INFO  (SUITE-TestPullReplicaErrorHandling-seed#[3994D13779CB7808]-worker) [    ] o.a.s.c.CoreContainer Shutting down CoreContainer instance=1676005538
   [junit4]   2> 3013801 INFO  (SUITE-TestPullReplicaErrorHandling-seed#[3994D13779CB7808]-worker) [    ] o.a.s.m.SolrMetricManager Closing metric reporters for registry=solr.node, tag=null
   [junit4]   2> 3013801 INFO  (SUITE-TestPullReplicaErrorHandling-seed#[3994D13779CB7808]-worker) [    ] o.a.s.m.r.SolrJmxReporter Closing reporter [org.apache.solr.metrics.reporters.SolrJmxReporter@394fdac2: rootName = solr_59269, domain = solr.node, service url = null, agent id = null] for registry solr.node / com.codahale.metrics.MetricRegistry@7ce55165
   [junit4]   2> 3013806 INFO  (SUITE-TestPullReplicaErrorHandling-seed#[3994D13779CB7808]-worker) [    ] o.a.s.m.SolrMetricManager Closing metric reporters for registry=solr.jvm, tag=null
   [junit4]   2> 3013806 INFO  (SUITE-TestPullReplicaErrorHandling-seed#[3994D13779CB7808]-worker) [    ] o.a.s.m.r.SolrJmxReporter Closing reporter [org.apache.solr.metrics.reporters.SolrJmxReporter@24f4aa3d: rootName = solr_59269, domain = solr.jvm, service url = null, agent id = null] for registry solr.jvm / com.codahale.metrics.MetricRegistry@16355c76
   [junit4]   2> 3013809 INFO  (SUITE-TestPullReplicaErrorHandling-seed#[3994D13779CB7808]-worker) [    ] o.a.s.m.SolrMetricManager Closing metric reporters for registry=solr.jetty, tag=null
   [junit4]   2> 3013809 INFO  (SUITE-TestPullReplicaErrorHandling-seed#[3994D13779CB7808]-worker) [    ] o.a.s.m.r.SolrJmxReporter Closing reporter [org.apache.solr.metrics.reporters.SolrJmxReporter@329d59af: rootName = solr_59269, domain = solr.jetty, service url = null, agent id = null] for registry solr.jetty / com.codahale.metrics.MetricRegistry@639d887f
   [junit4]   2> 3013812 INFO  (SUITE-TestPullReplicaErrorHandling-seed#[3994D13779CB7808]-worker) [    ] o.a.s.c.ZkController Remove node as live in ZooKeeper:/live_nodes/127.0.0.1:59269_solr
   [junit4]   2> 3013814 INFO  (zkCallback-6658-thread-1) [    ] o.a.s.c.c.ZkStateReader Updated live nodes from ZooKeeper... (4) -> (3)
   [junit4]   2> 3013814 INFO  (zkCallback-6701-thread-1) [    ] o.a.s.c.c.ZkStateReader Updated live nodes from ZooKeeper... (4) -> (3)
   [junit4]   2> 3013814 INFO  (zkCallback-6717-thread-1) [    ] o.a.s.c.c.ZkStateReader Updated live nodes from ZooKeeper... (4) -> (3)
   [junit4]   2> 3013814 INFO  (zkCallback-6685-thread-1) [    ] o.a.s.c.c.ZkStateReader Updated live nodes from ZooKeeper... (4) -> (3)
   [junit4]   2> 3013814 INFO  (zkCallback-6678-thread-1) [    ] o.a.s.c.c.ZkStateReader Updated live nodes from ZooKeeper... (4) -> (3)
   [junit4]   2> 3013814 INFO  (zkCallback-6671-thread-1) [    ] o.a.s.c.c.ZkStateReader Updated live nodes from ZooKeeper... (4) -> (3)
   [junit4]   2> 3013814 INFO  (zkCallback-6693-thread-1) [    ] o.a.s.c.c.ZkStateReader Updated live nodes from ZooKeeper... (4) -> (3)
   [junit4]   2> 3013814 INFO  (zkCallback-6708-thread-1) [    ] o.a.s.c.c.ZkStateReader Updated live nodes from ZooKeeper... (4) -> (3)
   [junit4]   2> 3013814 INFO  (zkCallback-6724-thread-1) [    ] o.a.s.c.c.ZkStateReader Updated live nodes from ZooKeeper... (4) -> (3)
   [junit4]   2> 3013815 INFO  (SUITE-TestPullReplicaErrorHandling-seed#[3994D13779CB7808]-worker) [    ] o.a.s.m.SolrMetricManager Closing metric reporters for registry=solr.cluster, tag=null
   [junit4]   2> 3013816 INFO  (SUITE-TestPullReplicaErrorHandling-seed#[3994D13779CB7808]-worker) [    ] o.a.s.c.Overseer Overseer (id=72327910827425803-127.0.0.1:59269_solr-n_0000000002) closing
   [junit4]   2> 3013816 INFO  (OverseerStateUpdate-72327910827425803-127.0.0.1:59269_solr-n_0000000002) [n:127.0.0.1:59269_solr    ] o.a.s.c.Overseer Overseer Loop exiting : 127.0.0.1:59269_solr
   [junit4]   2> 3013817 WARN  (OverseerAutoScalingTriggerThread-72327910827425803-127.0.0.1:59269_solr-n_0000000002) [    ] o.a.s.c.a.OverseerTriggerThread OverseerTriggerThread woken up but we are closed, exiting.
   [junit4]   2> 3013821 INFO  (SUITE-TestPullReplicaErrorHandling-seed#[3994D13779CB7808]-worker) [    ] o.e.j.s.h.ContextHandler Stopped o.e.j.s.ServletContextHandler@12488fb3{/solr,null,UNAVAILABLE}
   [junit4]   2> 3013822 INFO  (SUITE-TestPullReplicaErrorHandling-seed#[3994D13779CB7808]-worker) [    ] o.e.j.s.session node0 Stopped scavenging
   [junit4]   2> 3013822 INFO  (zkCallback-6678-thread-1) [    ] o.a.s.c.OverseerElectionContext I am going to be the leader 127.0.0.1:59267_solr
   [junit4]   2> 3013823 INFO  (SUITE-TestPullReplicaErrorHandling-seed#[3994D13779CB7808]-worker) [    ] o.e.j.s.Server jetty-9.4.11.v20180605; built: 2018-06-05T18:24:03.829Z; git: d5fc0523cfa96bfebfbda19606cad384d772f04c; jvm 1.8.0_172-b11
   [junit4]   2> 3013824 INFO  (zkCallback-6678-thread-1) [n:127.0.0.1:59267_solr    ] o.a.s.c.Overseer Overseer (id=72327910827425807-127.0.0.1:59267_solr-n_0000000003) starting
   [junit4]   2> 3013824 INFO  (SUITE-TestPullReplicaErrorHandling-seed#[3994D13779CB7808]-worker) [    ] o.e.j.s.session DefaultSessionIdManager workerName=node0
   [junit4]   2> 3013824 INFO  (SUITE-TestPullReplicaErrorHandling-seed#[3994D13779CB7808]-worker) [    ] o.e.j.s.session No SessionScavenger set, using defaults
   [junit4]   2> 3013824 INFO  (SUITE-TestPullReplicaErrorHandling-seed#[3994D13779CB7808]-worker) [    ] o.e.j.s.session node0 Scavenging every 600000ms
   [junit4]   2> 3013825 INFO  (SUITE-TestPullReplicaErrorHandling-seed#[3994D13779CB7808]-worker) [    ] o.e.j.s.h.ContextHandler Started o.e.j.s.ServletContextHandler@153eac29{/solr,null,AVAILABLE}
   [junit4]   2> 3013825 INFO  (SUITE-TestPullReplicaErrorHandling-seed#[3994D13779CB7808]-worker) [    ] o.e.j.s.AbstractConnector Started ServerConnector@7905e319{HTTP/1.1,[http/1.1]}{127.0.0.1:59331}
   [junit4]   2> 3013825 INFO  (SUITE-TestPullReplicaErrorHandling-seed#[3994D13779CB7808]-worker) [    ] o.e.j.s.Server Started @3013901ms
   [junit4]   2> 3013825 INFO  (SUITE-TestPullReplicaErrorHandling-seed#[3994D13779CB7808]-worker) [    ] o.a.s.c.s.e.JettySolrRunner Jetty properties: {hostContext=/solr, hostPort=59330}
   [junit4]   2> 3013825 ERROR (SUITE-TestPullReplicaErrorHandling-seed#[3994D13779CB7808]-worker) [    ] o.a.s.u.StartupLoggingUtils Missing Java Option solr.log.dir. Logging may be missing or incomplete.
   [junit4]   2> 3013825 INFO  (SUITE-TestPullReplicaErrorHandling-seed#[3994D13779CB7808]-worker) [    ] o.a.s.s.SolrDispatchFilter Using logger factory org.apache.logging.slf4j.Log4jLoggerFactory
   [junit4]   2> 3013826 INFO  (SUITE-TestPullReplicaErrorHandling-seed#[3994D13779CB7808]-worker) [    ] o.a.s.s.SolrDispatchFilter  ___      _       Welcome to Apache Solr™ version 7.6.0
   [junit4]   2> 3013826 INFO  (SUITE-TestPullReplicaErrorHandling-seed#[3994D13779CB7808]-worker) [    ] o.a.s.s.SolrDispatchFilter / __| ___| |_ _   Starting in cloud mode on port null
   [junit4]   2> 3013826 INFO  (SUITE-TestPullReplicaErrorHandling-seed#[3994D13779CB7808]-worker) [    ] o.a.s.s.SolrDispatchFilter \__ \/ _ \ | '_|  Install dir: null
   [junit4]   2> 3013826 INFO  (SUITE-TestPullReplicaErrorHandling-seed#[3994D13779CB7808]-worker) [    ] o.a.s.s.SolrDispatchFilter |___/\___/_|_|    Start time: 2018-09-13T07:18:09.127Z
   [junit4]   2> 3013829 INFO  (zkConnectionManagerCallback-6728-thread-1) [    ] o.a.s.c.c.ConnectionManager zkClient has connected
   [junit4]   2> 3013830 INFO  (SUITE-TestPullReplicaErrorHandling-seed#[3994D13779CB7808]-worker) [    ] o.a.s.s.SolrDispatchFilter solr.xml found in ZooKeeper. Loading...
   [junit4]   2> 3013837 INFO  (OverseerStateUpdate-72327910827425807-127.0.0.1:59267_solr-n_0000000003) [n:127.0.0.1:59267_solr    ] o.a.s.c.Overseer Starting to work on the main queue : 127.0.0.1:59267_solr
   [junit4]   2> 3013946 INFO  (SUITE-TestPullReplicaErrorHandling-seed#[3994D13779CB7808]-worker) [    ] o.a.s.c.ZkContainer Zookeeper client=127.0.0.1:59264/solr
   [junit4]   2> 3013948 INFO  (zkConnectionManagerCallback-6732-thread-1) [    ] o.a.s.c.c.ConnectionManager zkClient has connected
   [junit4]   2> 3013951 INFO  (zkConnectionManagerCallback-6734-thread-1) [    ] o.a.s.c.c.ConnectionManager zkClient has connected
   [junit4]   2> 3013965 INFO  (SUITE-TestPullReplicaErrorHandling-seed#[3994D13779CB7808]-worker) [    ] o.a.s.c.c.ZkStateReader Updated live nodes from ZooKeeper... (0) -> (3)
   [junit4]   2> 3013974 INFO  (SUITE-TestPullReplicaErrorHandling-seed#[3994D13779CB7808]-worker) [    ] o.a.s.c.TransientSolrCoreCacheDefault Allocating transient cache for 2147483647 transient cores
   [junit4]   2> 3013974 INFO  (SUITE-TestPullReplicaErrorHandling-seed#[3994D13779CB7808]-worker) [    ] o.a.s.c.ZkController Register node as live in ZooKeeper:/live_nodes/127.0.0.1:59330_solr
   [junit4]   2> 3013977 INFO  (zkCallback-6678-thread-1) [    ] o.a.s.c.c.ZkStateReader Updated live nodes from ZooKeeper... (3) -> (4)
   [junit4]   2> 3013977 INFO  (zkCallback-6685-thread-1) [    ] o.a.s.c.c.ZkStateReader Updated live nodes from ZooKeeper... (3) -> (4)
   [junit4]   2> 3013977 INFO  (zkCallback-6701-thread-1) [    ] o.a.s.c.c.ZkStateReader Updated live nodes from ZooKeeper... (3) -> (4)
   [junit4]   2> 3013977 INFO  (zkCallback-6717-thread-1) [    ] o.a.s.c.c.ZkStateReader Updated live nodes from ZooKeeper... (3) -> (4)
   [junit4]   2> 3013978 INFO  (zkCallback-6724-thread-1) [    ] o.a.s.c.c.ZkStateReader Updated live nodes from ZooKeeper... (3) -> (4)
   [junit4]   2> 3013978 INFO  (zkCallback-6693-thread-1) [    ] o.a.s.c.c.ZkStateReader Updated live nodes from ZooKeeper... (3) -> (4)
   [junit4]   2> 3013978 INFO  (zkCallback-6708-thread-1) [    ] o.a.s.c.c.ZkStateReader Updated live nodes from ZooKeeper... (3) -> (4)
   [junit4]   2> 3013978 INFO  (zkCallback-6733-thread-1) [    ] o.a.s.c.c.ZkStateReader Updated live nodes from ZooKeeper... (3) -> (4)
   [junit4]   2> 3014026 INFO  (zkConnectionManagerCallback-6741-thread-1) [    ] o.a.s.c.c.ConnectionManager zkClient has connected
   [junit4]   2> 3014027 INFO  (SUITE-TestPullReplicaErrorHandling-seed#[3994D13779CB7808]-worker) [    ] o.a.s.c.c.ZkStateReader Updated live nodes from ZooKeeper... (0) -> (4)
   [junit4]   2> 3014029 INFO  (SUITE-TestPullReplicaErrorHandling-seed#[3994D13779CB7808]-worker) [    ] o.a.s.c.s.i.ZkClientClusterStateProvider Cluster at 127.0.0.1:59264/solr ready
   [junit4]   2> 3014029 INFO  (SUITE-TestPullReplicaErrorHandling-seed#[3994D13779CB7808]-worker) [    ] o.a.s.h.a.MetricsHistoryHandler No .system collection, keeping metrics history in memory.
   [junit4]   2> 3014050 INFO  (SUITE-TestPullReplicaErrorHandling-seed#[3994D13779CB7808]-worker) [    ] o.a.s.m.r.SolrJmxReporter JMX monitoring for 'solr_59330.solr.node' (registry 'solr.node') enabled at server: com.sun.jmx.mbeanserver.JmxMBeanServer@364a61ae
   [junit4]   2> 3014057 INFO  (SUITE-TestPullReplicaErrorHandling-seed#[3994D13779CB7808]-worker) [    ] o.a.s.m.r.SolrJmxReporter JMX monitoring for 'solr_59330.solr.jvm' (registry 'solr.jvm') enabled at server: com.sun.jmx.mbeanserver.JmxMBeanServer@364a61ae
   [junit4]   2> 3014057 INFO  (SUITE-TestPullReplicaErrorHandling-seed#[3994D13779CB7808]-worker) [    ] o.a.s.m.r.SolrJmxReporter JMX monitoring for 'solr_59330.solr.jetty' (registry 'solr.jetty') enabled at server: com.sun.jmx.mbeanserver.JmxMBeanServer@364a61ae
   [junit4]   2> 3014058 INFO  (SUITE-TestPullReplicaErrorHandling-seed#[3994D13779CB7808]-worker) [    ] o.a.s.c.CorePropertiesLocator Found 0 core definitions underneath /Users/jenkins/workspace/Lucene-Solr-7.x-MacOSX/solr/build/solr-core/test/J0/temp/solr.cloud.TestPullReplicaErrorHandling_3994D13779CB7808-001/tempDir-001/node4/.
   [junit4]   2> 3014106 INFO  (SUITE-TestPullReplicaErrorHandling-seed#[3994D13779CB7808]-worker) [    ] o.a.s.c.TestPullReplicaErrorHandling Adding proxy for URL: http://127.0.0.1:59331/solr. Proxy: http://127.0.0.1:59330/solr
   [junit4]   2> 3014107 INFO  (SUITE-TestPullReplicaErrorHandling-seed#[3994D13779CB7808]-worker) [    ] o.e.j.s.AbstractConnector Stopped ServerConnector@7243370a{HTTP/1.1,[http/1.1]}{127.0.0.1:0}
   [junit4]   2> 3014107 INFO  (SUITE-TestPullReplicaErrorHandling-seed#[3994D13779CB7808]-worker) [    ] o.a.s.c.CoreContainer Shutting down CoreContainer instance=344846481
   [junit4]   2> 3014108 INFO  (SUITE-TestPullReplicaErrorHandling-seed#[3994D13779CB7808]-worker) [    ] o.a.s.m.SolrMetricManager Closing metric reporters for registry=solr.node, tag=null
   [junit4]   2> 3014108 INFO  (SUITE-TestPullReplicaErrorHandling-seed#[3994D13779CB7808]-worker) [    ] o.a.s.m.r.SolrJmxReporter Closing reporter [org.apache.solr.metrics.reporters.SolrJmxReporter@71d76286: rootName = solr_59267, domain = solr.node, service url = null, agent id = null] for registry solr.node / com.codahale.metrics.MetricRegistry@2eeff3d6
   [junit4]   2> 3014111 INFO  (SUITE-TestPullReplicaErrorHandling-seed#[3994D13779CB7808]-worker) [    ] o.a.s.m.SolrMetricManager Closing metric reporters for registry=solr.jvm, tag=null
   [junit4]   2> 3014111 INFO  (SUITE-TestPullReplicaErrorHandling-seed#[3994D13779CB7808]-worker) [    ] o.a.s.m.r.SolrJmxReporter Closing reporter [org.apache.solr.metrics.reporters.SolrJmxReporter@5405166b: rootName = solr_59267, domain = solr.jvm, service url = null, agent id = null] for registry solr.jvm / com.codahale.metrics.MetricRegistry@16355c76
   [junit4]   2> 3014118 INFO  (SUITE-TestPullReplicaErrorHandling-seed#[3994D13779CB7808]-worker) [    ] o.a.s.m.SolrMetricManager Closing metric reporters for registry=solr.jetty, tag=null
   [junit4]   2> 3014118 INFO  (SUITE-TestPullReplicaErrorHandling-seed#[3994D13779CB7808]-worker) [    ] o.a.s.m.r.SolrJmxReporter Closing reporter [org.apache.solr.metrics.reporters.SolrJmxReporter@49c0583f: rootName = solr_59267, domain = solr.jetty, service url = null, agent id = null] for registry so

[...truncated too long message...]

Closing metric reporters for registry=solr.jetty, tag=null
   [junit4]   2> 1928957 INFO  (jetty-closer-285-thread-4) [    ] o.a.s.m.SolrMetricManager Closing metric reporters for registry=solr.jetty, tag=null
   [junit4]   2> 1928957 INFO  (jetty-closer-285-thread-2) [    ] o.a.s.m.r.SolrJmxReporter Closing reporter [org.apache.solr.metrics.reporters.SolrJmxReporter@7da871bc: rootName = solr_56992, domain = solr.jetty, service url = null, agent id = null] for registry solr.jetty / com.codahale.metrics.MetricRegistry@6a6d871d
   [junit4]   2> 1928957 INFO  (jetty-closer-285-thread-4) [    ] o.a.s.m.r.SolrJmxReporter Closing reporter [org.apache.solr.metrics.reporters.SolrJmxReporter@40526b03: rootName = solr_57004, domain = solr.jetty, service url = null, agent id = null] for registry solr.jetty / com.codahale.metrics.MetricRegistry@6a6d871d
   [junit4]   2> 1928957 INFO  (jetty-closer-285-thread-3) [    ] o.a.s.c.ZkController Remove node as live in ZooKeeper:/live_nodes/127.0.0.1:56998_solr
   [junit4]   2> 1928959 INFO  (jetty-closer-285-thread-3) [    ] o.a.s.m.SolrMetricManager Closing metric reporters for registry=solr.cluster, tag=null
   [junit4]   2> 1928963 INFO  (zkCallback-413-thread-3) [    ] o.a.s.c.c.ZkStateReader Updated live nodes from ZooKeeper... (3) -> (2)
   [junit4]   2> 1928963 INFO  (zkCallback-404-thread-2) [    ] o.a.s.c.c.ZkStateReader Updated live nodes from ZooKeeper... (3) -> (2)
   [junit4]   2> 1928964 INFO  (jetty-closer-285-thread-2) [    ] o.a.s.c.ZkController Remove node as live in ZooKeeper:/live_nodes/127.0.0.1:56992_solr
   [junit4]   2> 1928964 INFO  (jetty-closer-285-thread-4) [    ] o.a.s.c.ZkController Remove node as live in ZooKeeper:/live_nodes/127.0.0.1:57004_solr
   [junit4]   2> 1928964 INFO  (zkCallback-397-thread-8) [    ] o.a.s.c.c.ZkStateReader Updated live nodes from ZooKeeper... (3) -> (2)
   [junit4]   2> 1928964 INFO  (zkCallback-381-thread-2) [    ] o.a.s.c.c.ZkStateReader Updated live nodes from ZooKeeper... (3) -> (2)
   [junit4]   2> 1928964 INFO  (zkCallback-420-thread-2) [    ] o.a.s.c.c.ZkStateReader Updated live nodes from ZooKeeper... (3) -> (2)
   [junit4]   2> 1928965 INFO  (zkCallback-388-thread-2) [    ] o.a.s.c.c.ZkStateReader Updated live nodes from ZooKeeper... (3) -> (2)
   [junit4]   2> 1928968 INFO  (jetty-closer-285-thread-2) [    ] o.a.s.m.SolrMetricManager Closing metric reporters for registry=solr.cluster, tag=null
   [junit4]   2> 1928968 INFO  (jetty-closer-285-thread-4) [    ] o.a.s.m.SolrMetricManager Closing metric reporters for registry=solr.cluster, tag=null
   [junit4]   2> 1928973 INFO  (zkCallback-388-thread-2) [    ] o.a.s.c.c.ZkStateReader Updated live nodes from ZooKeeper... (2) -> (0)
   [junit4]   2> 1928975 INFO  (zkCallback-420-thread-2) [    ] o.a.s.c.c.ZkStateReader Updated live nodes from ZooKeeper... (2) -> (0)
   [junit4]   2> 1928975 INFO  (zkCallback-413-thread-4) [    ] o.a.s.c.c.ZkStateReader Updated live nodes from ZooKeeper... (2) -> (0)
   [junit4]   2> 1928975 INFO  (zkCallback-381-thread-3) [    ] o.a.s.c.c.ZkStateReader Updated live nodes from ZooKeeper... (2) -> (0)
   [junit4]   2> 1928979 INFO  (jetty-closer-285-thread-4) [    ] o.e.j.s.h.ContextHandler Stopped o.e.j.s.ServletContextHandler@b505f9c{/solr,null,UNAVAILABLE}
   [junit4]   2> 1928979 INFO  (jetty-closer-285-thread-2) [    ] o.e.j.s.h.ContextHandler Stopped o.e.j.s.ServletContextHandler@25fa7277{/solr,null,UNAVAILABLE}
   [junit4]   2> 1928980 INFO  (jetty-closer-285-thread-2) [    ] o.e.j.s.session node0 Stopped scavenging
   [junit4]   2> 1928980 INFO  (jetty-closer-285-thread-4) [    ] o.e.j.s.session node0 Stopped scavenging
   [junit4]   2> 1930478 WARN  (zkCallback-397-thread-8) [    ] o.a.s.c.c.ZkStateReader ZooKeeper watch triggered, but Solr cannot talk to ZK: [KeeperErrorCode = Session expired for /live_nodes]
   [junit4]   2> 1930480 INFO  (jetty-closer-285-thread-3) [    ] o.e.j.s.h.ContextHandler Stopped o.e.j.s.ServletContextHandler@30e08e{/solr,null,UNAVAILABLE}
   [junit4]   2> 1930480 INFO  (jetty-closer-285-thread-3) [    ] o.e.j.s.session node0 Stopped scavenging
   [junit4]   2> 1930487 ERROR (SUITE-TestPullReplicaErrorHandling-seed#[3994D13779CB7808]-worker) [    ] o.a.z.s.ZooKeeperServer ZKShutdownHandler is not registered, so ZooKeeper server won't take any action on ERROR or SHUTDOWN server state changes
   [junit4]   2> 1930487 INFO  (SUITE-TestPullReplicaErrorHandling-seed#[3994D13779CB7808]-worker) [    ] o.a.s.c.ZkTestServer connecting to 127.0.0.1:56962 56962
   [junit4]   2> 1931012 INFO  (Thread-158) [    ] o.a.s.c.ZkTestServer connecting to 127.0.0.1:56962 56962
   [junit4]   2> 1931303 WARN  (Thread-158) [    ] o.a.s.c.ZkTestServer Watch limit violations: 
   [junit4]   2> Maximum concurrent create/delete watches above limit:
   [junit4]   2> 
   [junit4]   2> 	18	/solr/aliases.json
   [junit4]   2> 	17	/solr/clusterprops.json
   [junit4]   2> 	9	/solr/security.json
   [junit4]   2> 	8	/solr/collections/pull_replica_error_handling_test_pull_replica_disconnects_from_zoo_keeper/terms/shard1
   [junit4]   2> 	8	/solr/configs/conf
   [junit4]   2> 	7	/solr/collections/pull_replica_error_handling_test_cant_connect_to_leader/terms/shard1
   [junit4]   2> 	6	/solr/collections/pull_replica_error_handling_test_cant_connect_to_pull_replica/terms/shard1
   [junit4]   2> 	6	/solr/collections/pull_replica_error_handling_test_cant_connect_to_pull_replica/terms/shard2
   [junit4]   2> 
   [junit4]   2> Maximum concurrent data watches above limit:
   [junit4]   2> 
   [junit4]   2> 	18	/solr/clusterstate.json
   [junit4]   2> 	10	/solr/clusterprops.json
   [junit4]   2> 	7	/solr/collections/pull_replica_error_handling_test_pull_replica_disconnects_from_zoo_keeper/state.json
   [junit4]   2> 	5	/solr/autoscaling.json
   [junit4]   2> 	4	/solr/collections/pull_replica_error_handling_test_cant_connect_to_pull_replica/state.json
   [junit4]   2> 	2	/solr/collections/pull_replica_error_handling_test_cant_connect_to_leader/state.json
   [junit4]   2> 	2	/solr/overseer_elect/election/72328222362763289-127.0.0.1:56992_solr-n_0000000005
   [junit4]   2> 
   [junit4]   2> Maximum concurrent children watches above limit:
   [junit4]   2> 
   [junit4]   2> 	18	/solr/collections
   [junit4]   2> 	17	/solr/live_nodes
   [junit4]   2> 	5	/solr/overseer/queue
   [junit4]   2> 	5	/solr/autoscaling/events/.scheduled_maintenance
   [junit4]   2> 	5	/solr/autoscaling/events/.auto_add_replicas
   [junit4]   2> 	5	/solr/overseer/collection-queue-work
   [junit4]   2> 	5	/solr/overseer/queue-work
   [junit4]   2> 
   [junit4]   2> NOTE: leaving temporary files on disk at: /Users/jenkins/workspace/Lucene-Solr-7.x-MacOSX/solr/build/solr-core/test/J0/temp/solr.cloud.TestPullReplicaErrorHandling_3994D13779CB7808-003
   [junit4]   2> NOTE: test params are: codec=CheapBastard, sim=RandomSimilarity(queryNorm=true): {}, locale=es-ES, timezone=Asia/Almaty
   [junit4]   2> NOTE: Mac OS X 10.11.6 x86_64/Oracle Corporation 1.8.0_172 (64-bit)/cpus=3,threads=1,free=151305080,total=273678336
   [junit4]   2> NOTE: All tests run in this JVM: [TestPullReplicaErrorHandling, TestPullReplicaErrorHandling, TestPullReplicaErrorHandling]
   [junit4] Completed [5/5 (5!)] on J0 in 639.18s, 3 tests, 1 error <<< FAILURES!
   [junit4] 
   [junit4] 
   [junit4] Tests with failures [seed: 3994D13779CB7808]:
   [junit4]   - org.apache.solr.cloud.TestPullReplicaErrorHandling.testCantConnectToLeader
   [junit4]   - org.apache.solr.cloud.TestPullReplicaErrorHandling.testCantConnectToLeader
   [junit4]   - org.apache.solr.cloud.TestPullReplicaErrorHandling.testCantConnectToLeader
   [junit4]   - org.apache.solr.cloud.TestPullReplicaErrorHandling.testCantConnectToLeader
   [junit4]   - org.apache.solr.cloud.TestPullReplicaErrorHandling.testCantConnectToLeader
   [junit4] 
   [junit4] 
   [junit4] JVM J0:     0.69 ..  1932.97 =  1932.28s
   [junit4] JVM J1:     0.69 ..  1303.38 =  1302.69s
   [junit4] Execution time total: 32 minutes 13 seconds
   [junit4] Tests summary: 5 suites, 15 tests, 5 errors

BUILD FAILED
/Users/jenkins/workspace/Lucene-Solr-7.x-MacOSX/lucene/common-build.xml:1567: The following error occurred while executing this line:
/Users/jenkins/workspace/Lucene-Solr-7.x-MacOSX/lucene/common-build.xml:1092: There were test failures: 5 suites, 15 tests, 5 errors [seed: 3994D13779CB7808]

Total time: 32 minutes 15 seconds

[repro] Setting last failure code to 256

[repro] Failures:
[repro]   5/5 failed: org.apache.solr.cloud.TestPullReplicaErrorHandling
[repro] Exiting with code 256
+ mv lucene/build lucene/build.repro
+ mv solr/build solr/build.repro
+ mv lucene/build.orig lucene/build
+ mv solr/build.orig solr/build
Archiving artifacts
Setting ANT_1_8_2_HOME=/Users/jenkins/tools/hudson.tasks.Ant_AntInstallation/ANT_1.8.2
[WARNINGS] Parsing warnings in console log with parser Java Compiler (javac)
Setting ANT_1_8_2_HOME=/Users/jenkins/tools/hudson.tasks.Ant_AntInstallation/ANT_1.8.2
Setting ANT_1_8_2_HOME=/Users/jenkins/tools/hudson.tasks.Ant_AntInstallation/ANT_1.8.2
<Git Blamer> Using GitBlamer to create author and commit information for all warnings.
<Git Blamer> GIT_COMMIT=f76a424aa2b1a29eda229e0e7b292551d96e9d29, workspace=/Users/jenkins/workspace/Lucene-Solr-7.x-MacOSX
[WARNINGS] Computing warning deltas based on reference build #836
Recording test results
Setting ANT_1_8_2_HOME=/Users/jenkins/tools/hudson.tasks.Ant_AntInstallation/ANT_1.8.2
Build step 'Publish JUnit test result report' changed build result to UNSTABLE
Email was triggered for: Unstable (Test Failures)
Sending email for trigger: Unstable (Test Failures)
Setting ANT_1_8_2_HOME=/Users/jenkins/tools/hudson.tasks.Ant_AntInstallation/ANT_1.8.2
Setting ANT_1_8_2_HOME=/Users/jenkins/tools/hudson.tasks.Ant_AntInstallation/ANT_1.8.2
Setting ANT_1_8_2_HOME=/Users/jenkins/tools/hudson.tasks.Ant_AntInstallation/ANT_1.8.2
Setting ANT_1_8_2_HOME=/Users/jenkins/tools/hudson.tasks.Ant_AntInstallation/ANT_1.8.2

Mime
View raw message