lucene-dev mailing list archives

Site index · List index
Message view « Date » · « Thread »
Top « Date » · « Thread »
From Policeman Jenkins Server <jenk...@thetaphi.de>
Subject [JENKINS] Lucene-Solr-master-Linux (64bit/jdk-9.0.4) - Build # 22906 - Unstable!
Date Sun, 23 Sep 2018 03:13:59 GMT
Build: https://jenkins.thetaphi.de/job/Lucene-Solr-master-Linux/22906/
Java: 64bit/jdk-9.0.4 -XX:+UseCompressedOops -XX:+UseG1GC

3 tests failed.
FAILED:  org.apache.solr.cloud.MoveReplicaHDFSTest.testFailedMove

Error Message:
No live SolrServers available to handle this request:[http://127.0.0.1:33317/solr/MoveReplicaHDFSTest_failed_coll_true, http://127.0.0.1:43139/solr/MoveReplicaHDFSTest_failed_coll_true]

Stack Trace:
org.apache.solr.client.solrj.SolrServerException: No live SolrServers available to handle this request:[http://127.0.0.1:33317/solr/MoveReplicaHDFSTest_failed_coll_true, http://127.0.0.1:43139/solr/MoveReplicaHDFSTest_failed_coll_true]
	at __randomizedtesting.SeedInfo.seed([621CEBD1EB2F0054:C8D138235CFCD584]:0)
	at org.apache.solr.client.solrj.impl.LBHttpSolrClient.request(LBHttpSolrClient.java:462)
	at org.apache.solr.client.solrj.impl.CloudSolrClient.sendRequest(CloudSolrClient.java:1107)
	at org.apache.solr.client.solrj.impl.CloudSolrClient.requestWithRetryOnStaleState(CloudSolrClient.java:884)
	at org.apache.solr.client.solrj.impl.CloudSolrClient.requestWithRetryOnStaleState(CloudSolrClient.java:994)
	at org.apache.solr.client.solrj.impl.CloudSolrClient.request(CloudSolrClient.java:817)
	at org.apache.solr.client.solrj.SolrRequest.process(SolrRequest.java:194)
	at org.apache.solr.client.solrj.SolrClient.query(SolrClient.java:942)
	at org.apache.solr.cloud.MoveReplicaTest.testFailedMove(MoveReplicaTest.java:301)
	at java.base/jdk.internal.reflect.NativeMethodAccessorImpl.invoke0(Native Method)
	at java.base/jdk.internal.reflect.NativeMethodAccessorImpl.invoke(NativeMethodAccessorImpl.java:62)
	at java.base/jdk.internal.reflect.DelegatingMethodAccessorImpl.invoke(DelegatingMethodAccessorImpl.java:43)
	at java.base/java.lang.reflect.Method.invoke(Method.java:564)
	at com.carrotsearch.randomizedtesting.RandomizedRunner.invoke(RandomizedRunner.java:1742)
	at com.carrotsearch.randomizedtesting.RandomizedRunner$8.evaluate(RandomizedRunner.java:935)
	at com.carrotsearch.randomizedtesting.RandomizedRunner$9.evaluate(RandomizedRunner.java:971)
	at com.carrotsearch.randomizedtesting.RandomizedRunner$10.evaluate(RandomizedRunner.java:985)
	at com.carrotsearch.randomizedtesting.rules.SystemPropertiesRestoreRule$1.evaluate(SystemPropertiesRestoreRule.java:57)
	at org.apache.lucene.util.TestRuleSetupTeardownChained$1.evaluate(TestRuleSetupTeardownChained.java:49)
	at org.apache.lucene.util.AbstractBeforeAfterRule$1.evaluate(AbstractBeforeAfterRule.java:45)
	at org.apache.lucene.util.TestRuleThreadAndTestName$1.evaluate(TestRuleThreadAndTestName.java:48)
	at org.apache.lucene.util.TestRuleIgnoreAfterMaxFailures$1.evaluate(TestRuleIgnoreAfterMaxFailures.java:64)
	at org.apache.lucene.util.TestRuleMarkFailure$1.evaluate(TestRuleMarkFailure.java:47)
	at com.carrotsearch.randomizedtesting.rules.StatementAdapter.evaluate(StatementAdapter.java:36)
	at com.carrotsearch.randomizedtesting.ThreadLeakControl$StatementRunner.run(ThreadLeakControl.java:368)
	at com.carrotsearch.randomizedtesting.ThreadLeakControl.forkTimeoutingTask(ThreadLeakControl.java:817)
	at com.carrotsearch.randomizedtesting.ThreadLeakControl$3.evaluate(ThreadLeakControl.java:468)
	at com.carrotsearch.randomizedtesting.RandomizedRunner.runSingleTest(RandomizedRunner.java:944)
	at com.carrotsearch.randomizedtesting.RandomizedRunner$5.evaluate(RandomizedRunner.java:830)
	at com.carrotsearch.randomizedtesting.RandomizedRunner$6.evaluate(RandomizedRunner.java:880)
	at com.carrotsearch.randomizedtesting.RandomizedRunner$7.evaluate(RandomizedRunner.java:891)
	at com.carrotsearch.randomizedtesting.rules.StatementAdapter.evaluate(StatementAdapter.java:36)
	at com.carrotsearch.randomizedtesting.rules.SystemPropertiesRestoreRule$1.evaluate(SystemPropertiesRestoreRule.java:57)
	at org.apache.lucene.util.AbstractBeforeAfterRule$1.evaluate(AbstractBeforeAfterRule.java:45)
	at com.carrotsearch.randomizedtesting.rules.StatementAdapter.evaluate(StatementAdapter.java:36)
	at org.apache.lucene.util.TestRuleStoreClassName$1.evaluate(TestRuleStoreClassName.java:41)
	at com.carrotsearch.randomizedtesting.rules.NoShadowingOrOverridesOnMethodsRule$1.evaluate(NoShadowingOrOverridesOnMethodsRule.java:40)
	at com.carrotsearch.randomizedtesting.rules.NoShadowingOrOverridesOnMethodsRule$1.evaluate(NoShadowingOrOverridesOnMethodsRule.java:40)
	at com.carrotsearch.randomizedtesting.rules.StatementAdapter.evaluate(StatementAdapter.java:36)
	at com.carrotsearch.randomizedtesting.rules.StatementAdapter.evaluate(StatementAdapter.java:36)
	at org.apache.lucene.util.TestRuleAssertionsRequired$1.evaluate(TestRuleAssertionsRequired.java:53)
	at org.apache.lucene.util.TestRuleMarkFailure$1.evaluate(TestRuleMarkFailure.java:47)
	at org.apache.lucene.util.TestRuleIgnoreAfterMaxFailures$1.evaluate(TestRuleIgnoreAfterMaxFailures.java:64)
	at org.apache.lucene.util.TestRuleIgnoreTestSuites$1.evaluate(TestRuleIgnoreTestSuites.java:54)
	at com.carrotsearch.randomizedtesting.rules.StatementAdapter.evaluate(StatementAdapter.java:36)
	at com.carrotsearch.randomizedtesting.ThreadLeakControl$StatementRunner.run(ThreadLeakControl.java:368)
	at java.base/java.lang.Thread.run(Thread.java:844)
Caused by: org.apache.solr.client.solrj.impl.HttpSolrClient$RemoteSolrException: Error from server at http://127.0.0.1:43139/solr/MoveReplicaHDFSTest_failed_coll_true: no servers hosting shard: shard1
	at org.apache.solr.client.solrj.impl.HttpSolrClient.executeMethod(HttpSolrClient.java:643)
	at org.apache.solr.client.solrj.impl.HttpSolrClient.request(HttpSolrClient.java:255)
	at org.apache.solr.client.solrj.impl.HttpSolrClient.request(HttpSolrClient.java:244)
	at org.apache.solr.client.solrj.impl.LBHttpSolrClient.doRequest(LBHttpSolrClient.java:483)
	at org.apache.solr.client.solrj.impl.LBHttpSolrClient.request(LBHttpSolrClient.java:413)
	... 45 more


FAILED:  org.apache.solr.cloud.MoveReplicaHDFSTest.testFailedMove

Error Message:
No live SolrServers available to handle this request:[http://127.0.0.1:42313/solr/MoveReplicaHDFSTest_failed_coll_true, http://127.0.0.1:33747/solr/MoveReplicaHDFSTest_failed_coll_true]

Stack Trace:
org.apache.solr.client.solrj.SolrServerException: No live SolrServers available to handle this request:[http://127.0.0.1:42313/solr/MoveReplicaHDFSTest_failed_coll_true, http://127.0.0.1:33747/solr/MoveReplicaHDFSTest_failed_coll_true]
	at __randomizedtesting.SeedInfo.seed([621CEBD1EB2F0054:C8D138235CFCD584]:0)
	at org.apache.solr.client.solrj.impl.LBHttpSolrClient.request(LBHttpSolrClient.java:462)
	at org.apache.solr.client.solrj.impl.CloudSolrClient.sendRequest(CloudSolrClient.java:1107)
	at org.apache.solr.client.solrj.impl.CloudSolrClient.requestWithRetryOnStaleState(CloudSolrClient.java:884)
	at org.apache.solr.client.solrj.impl.CloudSolrClient.requestWithRetryOnStaleState(CloudSolrClient.java:994)
	at org.apache.solr.client.solrj.impl.CloudSolrClient.request(CloudSolrClient.java:817)
	at org.apache.solr.client.solrj.SolrRequest.process(SolrRequest.java:194)
	at org.apache.solr.client.solrj.SolrClient.query(SolrClient.java:942)
	at org.apache.solr.cloud.MoveReplicaTest.testFailedMove(MoveReplicaTest.java:301)
	at java.base/jdk.internal.reflect.NativeMethodAccessorImpl.invoke0(Native Method)
	at java.base/jdk.internal.reflect.NativeMethodAccessorImpl.invoke(NativeMethodAccessorImpl.java:62)
	at java.base/jdk.internal.reflect.DelegatingMethodAccessorImpl.invoke(DelegatingMethodAccessorImpl.java:43)
	at java.base/java.lang.reflect.Method.invoke(Method.java:564)
	at com.carrotsearch.randomizedtesting.RandomizedRunner.invoke(RandomizedRunner.java:1742)
	at com.carrotsearch.randomizedtesting.RandomizedRunner$8.evaluate(RandomizedRunner.java:935)
	at com.carrotsearch.randomizedtesting.RandomizedRunner$9.evaluate(RandomizedRunner.java:971)
	at com.carrotsearch.randomizedtesting.RandomizedRunner$10.evaluate(RandomizedRunner.java:985)
	at com.carrotsearch.randomizedtesting.rules.SystemPropertiesRestoreRule$1.evaluate(SystemPropertiesRestoreRule.java:57)
	at org.apache.lucene.util.TestRuleSetupTeardownChained$1.evaluate(TestRuleSetupTeardownChained.java:49)
	at org.apache.lucene.util.AbstractBeforeAfterRule$1.evaluate(AbstractBeforeAfterRule.java:45)
	at org.apache.lucene.util.TestRuleThreadAndTestName$1.evaluate(TestRuleThreadAndTestName.java:48)
	at org.apache.lucene.util.TestRuleIgnoreAfterMaxFailures$1.evaluate(TestRuleIgnoreAfterMaxFailures.java:64)
	at org.apache.lucene.util.TestRuleMarkFailure$1.evaluate(TestRuleMarkFailure.java:47)
	at com.carrotsearch.randomizedtesting.rules.StatementAdapter.evaluate(StatementAdapter.java:36)
	at com.carrotsearch.randomizedtesting.ThreadLeakControl$StatementRunner.run(ThreadLeakControl.java:368)
	at com.carrotsearch.randomizedtesting.ThreadLeakControl.forkTimeoutingTask(ThreadLeakControl.java:817)
	at com.carrotsearch.randomizedtesting.ThreadLeakControl$3.evaluate(ThreadLeakControl.java:468)
	at com.carrotsearch.randomizedtesting.RandomizedRunner.runSingleTest(RandomizedRunner.java:944)
	at com.carrotsearch.randomizedtesting.RandomizedRunner$5.evaluate(RandomizedRunner.java:830)
	at com.carrotsearch.randomizedtesting.RandomizedRunner$6.evaluate(RandomizedRunner.java:880)
	at com.carrotsearch.randomizedtesting.RandomizedRunner$7.evaluate(RandomizedRunner.java:891)
	at com.carrotsearch.randomizedtesting.rules.StatementAdapter.evaluate(StatementAdapter.java:36)
	at com.carrotsearch.randomizedtesting.rules.SystemPropertiesRestoreRule$1.evaluate(SystemPropertiesRestoreRule.java:57)
	at org.apache.lucene.util.AbstractBeforeAfterRule$1.evaluate(AbstractBeforeAfterRule.java:45)
	at com.carrotsearch.randomizedtesting.rules.StatementAdapter.evaluate(StatementAdapter.java:36)
	at org.apache.lucene.util.TestRuleStoreClassName$1.evaluate(TestRuleStoreClassName.java:41)
	at com.carrotsearch.randomizedtesting.rules.NoShadowingOrOverridesOnMethodsRule$1.evaluate(NoShadowingOrOverridesOnMethodsRule.java:40)
	at com.carrotsearch.randomizedtesting.rules.NoShadowingOrOverridesOnMethodsRule$1.evaluate(NoShadowingOrOverridesOnMethodsRule.java:40)
	at com.carrotsearch.randomizedtesting.rules.StatementAdapter.evaluate(StatementAdapter.java:36)
	at com.carrotsearch.randomizedtesting.rules.StatementAdapter.evaluate(StatementAdapter.java:36)
	at org.apache.lucene.util.TestRuleAssertionsRequired$1.evaluate(TestRuleAssertionsRequired.java:53)
	at org.apache.lucene.util.TestRuleMarkFailure$1.evaluate(TestRuleMarkFailure.java:47)
	at org.apache.lucene.util.TestRuleIgnoreAfterMaxFailures$1.evaluate(TestRuleIgnoreAfterMaxFailures.java:64)
	at org.apache.lucene.util.TestRuleIgnoreTestSuites$1.evaluate(TestRuleIgnoreTestSuites.java:54)
	at com.carrotsearch.randomizedtesting.rules.StatementAdapter.evaluate(StatementAdapter.java:36)
	at com.carrotsearch.randomizedtesting.ThreadLeakControl$StatementRunner.run(ThreadLeakControl.java:368)
	at java.base/java.lang.Thread.run(Thread.java:844)
Caused by: org.apache.solr.client.solrj.impl.HttpSolrClient$RemoteSolrException: Error from server at http://127.0.0.1:33747/solr/MoveReplicaHDFSTest_failed_coll_true: no servers hosting shard: shard2
	at org.apache.solr.client.solrj.impl.HttpSolrClient.executeMethod(HttpSolrClient.java:643)
	at org.apache.solr.client.solrj.impl.HttpSolrClient.request(HttpSolrClient.java:255)
	at org.apache.solr.client.solrj.impl.HttpSolrClient.request(HttpSolrClient.java:244)
	at org.apache.solr.client.solrj.impl.LBHttpSolrClient.doRequest(LBHttpSolrClient.java:483)
	at org.apache.solr.client.solrj.impl.LBHttpSolrClient.request(LBHttpSolrClient.java:436)
	... 45 more


FAILED:  org.apache.solr.cloud.MoveReplicaHDFSTest.testFailedMove

Error Message:
No live SolrServers available to handle this request:[http://127.0.0.1:33025/solr/MoveReplicaHDFSTest_failed_coll_true, http://127.0.0.1:39455/solr/MoveReplicaHDFSTest_failed_coll_true]

Stack Trace:
org.apache.solr.client.solrj.SolrServerException: No live SolrServers available to handle this request:[http://127.0.0.1:33025/solr/MoveReplicaHDFSTest_failed_coll_true, http://127.0.0.1:39455/solr/MoveReplicaHDFSTest_failed_coll_true]
	at __randomizedtesting.SeedInfo.seed([621CEBD1EB2F0054:C8D138235CFCD584]:0)
	at org.apache.solr.client.solrj.impl.LBHttpSolrClient.request(LBHttpSolrClient.java:462)
	at org.apache.solr.client.solrj.impl.CloudSolrClient.sendRequest(CloudSolrClient.java:1107)
	at org.apache.solr.client.solrj.impl.CloudSolrClient.requestWithRetryOnStaleState(CloudSolrClient.java:884)
	at org.apache.solr.client.solrj.impl.CloudSolrClient.requestWithRetryOnStaleState(CloudSolrClient.java:994)
	at org.apache.solr.client.solrj.impl.CloudSolrClient.request(CloudSolrClient.java:817)
	at org.apache.solr.client.solrj.SolrRequest.process(SolrRequest.java:194)
	at org.apache.solr.client.solrj.SolrClient.query(SolrClient.java:942)
	at org.apache.solr.cloud.MoveReplicaTest.testFailedMove(MoveReplicaTest.java:301)
	at java.base/jdk.internal.reflect.NativeMethodAccessorImpl.invoke0(Native Method)
	at java.base/jdk.internal.reflect.NativeMethodAccessorImpl.invoke(NativeMethodAccessorImpl.java:62)
	at java.base/jdk.internal.reflect.DelegatingMethodAccessorImpl.invoke(DelegatingMethodAccessorImpl.java:43)
	at java.base/java.lang.reflect.Method.invoke(Method.java:564)
	at com.carrotsearch.randomizedtesting.RandomizedRunner.invoke(RandomizedRunner.java:1742)
	at com.carrotsearch.randomizedtesting.RandomizedRunner$8.evaluate(RandomizedRunner.java:935)
	at com.carrotsearch.randomizedtesting.RandomizedRunner$9.evaluate(RandomizedRunner.java:971)
	at com.carrotsearch.randomizedtesting.RandomizedRunner$10.evaluate(RandomizedRunner.java:985)
	at com.carrotsearch.randomizedtesting.rules.SystemPropertiesRestoreRule$1.evaluate(SystemPropertiesRestoreRule.java:57)
	at org.apache.lucene.util.TestRuleSetupTeardownChained$1.evaluate(TestRuleSetupTeardownChained.java:49)
	at org.apache.lucene.util.AbstractBeforeAfterRule$1.evaluate(AbstractBeforeAfterRule.java:45)
	at org.apache.lucene.util.TestRuleThreadAndTestName$1.evaluate(TestRuleThreadAndTestName.java:48)
	at org.apache.lucene.util.TestRuleIgnoreAfterMaxFailures$1.evaluate(TestRuleIgnoreAfterMaxFailures.java:64)
	at org.apache.lucene.util.TestRuleMarkFailure$1.evaluate(TestRuleMarkFailure.java:47)
	at com.carrotsearch.randomizedtesting.rules.StatementAdapter.evaluate(StatementAdapter.java:36)
	at com.carrotsearch.randomizedtesting.ThreadLeakControl$StatementRunner.run(ThreadLeakControl.java:368)
	at com.carrotsearch.randomizedtesting.ThreadLeakControl.forkTimeoutingTask(ThreadLeakControl.java:817)
	at com.carrotsearch.randomizedtesting.ThreadLeakControl$3.evaluate(ThreadLeakControl.java:468)
	at com.carrotsearch.randomizedtesting.RandomizedRunner.runSingleTest(RandomizedRunner.java:944)
	at com.carrotsearch.randomizedtesting.RandomizedRunner$5.evaluate(RandomizedRunner.java:830)
	at com.carrotsearch.randomizedtesting.RandomizedRunner$6.evaluate(RandomizedRunner.java:880)
	at com.carrotsearch.randomizedtesting.RandomizedRunner$7.evaluate(RandomizedRunner.java:891)
	at com.carrotsearch.randomizedtesting.rules.StatementAdapter.evaluate(StatementAdapter.java:36)
	at com.carrotsearch.randomizedtesting.rules.SystemPropertiesRestoreRule$1.evaluate(SystemPropertiesRestoreRule.java:57)
	at org.apache.lucene.util.AbstractBeforeAfterRule$1.evaluate(AbstractBeforeAfterRule.java:45)
	at com.carrotsearch.randomizedtesting.rules.StatementAdapter.evaluate(StatementAdapter.java:36)
	at org.apache.lucene.util.TestRuleStoreClassName$1.evaluate(TestRuleStoreClassName.java:41)
	at com.carrotsearch.randomizedtesting.rules.NoShadowingOrOverridesOnMethodsRule$1.evaluate(NoShadowingOrOverridesOnMethodsRule.java:40)
	at com.carrotsearch.randomizedtesting.rules.NoShadowingOrOverridesOnMethodsRule$1.evaluate(NoShadowingOrOverridesOnMethodsRule.java:40)
	at com.carrotsearch.randomizedtesting.rules.StatementAdapter.evaluate(StatementAdapter.java:36)
	at com.carrotsearch.randomizedtesting.rules.StatementAdapter.evaluate(StatementAdapter.java:36)
	at org.apache.lucene.util.TestRuleAssertionsRequired$1.evaluate(TestRuleAssertionsRequired.java:53)
	at org.apache.lucene.util.TestRuleMarkFailure$1.evaluate(TestRuleMarkFailure.java:47)
	at org.apache.lucene.util.TestRuleIgnoreAfterMaxFailures$1.evaluate(TestRuleIgnoreAfterMaxFailures.java:64)
	at org.apache.lucene.util.TestRuleIgnoreTestSuites$1.evaluate(TestRuleIgnoreTestSuites.java:54)
	at com.carrotsearch.randomizedtesting.rules.StatementAdapter.evaluate(StatementAdapter.java:36)
	at com.carrotsearch.randomizedtesting.ThreadLeakControl$StatementRunner.run(ThreadLeakControl.java:368)
	at java.base/java.lang.Thread.run(Thread.java:844)
Caused by: org.apache.solr.client.solrj.impl.HttpSolrClient$RemoteSolrException: Error from server at http://127.0.0.1:39455/solr/MoveReplicaHDFSTest_failed_coll_true: no servers hosting shard: shard2
	at org.apache.solr.client.solrj.impl.HttpSolrClient.executeMethod(HttpSolrClient.java:643)
	at org.apache.solr.client.solrj.impl.HttpSolrClient.request(HttpSolrClient.java:255)
	at org.apache.solr.client.solrj.impl.HttpSolrClient.request(HttpSolrClient.java:244)
	at org.apache.solr.client.solrj.impl.LBHttpSolrClient.doRequest(LBHttpSolrClient.java:483)
	at org.apache.solr.client.solrj.impl.LBHttpSolrClient.request(LBHttpSolrClient.java:436)
	... 45 more




Build Log:
[...truncated 12721 lines...]
   [junit4] Suite: org.apache.solr.cloud.MoveReplicaHDFSTest
   [junit4]   2> 234472 INFO  (SUITE-MoveReplicaHDFSTest-seed#[621CEBD1EB2F0054]-worker) [    ] o.a.s.SolrTestCaseJ4 SecureRandom sanity checks: test.solr.allowed.securerandom=null & java.security.egd=file:/dev/./urandom
   [junit4]   2> Creating dataDir: /home/jenkins/workspace/Lucene-Solr-master-Linux/solr/build/solr-core/test/J0/temp/solr.cloud.MoveReplicaHDFSTest_621CEBD1EB2F0054-001/init-core-data-001
   [junit4]   2> 234473 WARN  (SUITE-MoveReplicaHDFSTest-seed#[621CEBD1EB2F0054]-worker) [    ] o.a.s.SolrTestCaseJ4 startTrackingSearchers: numOpens=1 numCloses=1
   [junit4]   2> 234473 INFO  (SUITE-MoveReplicaHDFSTest-seed#[621CEBD1EB2F0054]-worker) [    ] o.a.s.SolrTestCaseJ4 Using PointFields (NUMERIC_POINTS_SYSPROP=true) w/NUMERIC_DOCVALUES_SYSPROP=true
   [junit4]   2> 234473 INFO  (SUITE-MoveReplicaHDFSTest-seed#[621CEBD1EB2F0054]-worker) [    ] o.a.s.SolrTestCaseJ4 Randomized ssl (false) and clientAuth (true) via: @org.apache.solr.util.RandomizeSSL(reason="", ssl=0.0/0.0, value=0.0/0.0, clientAuth=0.0/0.0)
   [junit4]   2> 234474 INFO  (SUITE-MoveReplicaHDFSTest-seed#[621CEBD1EB2F0054]-worker) [    ] o.a.s.c.MiniSolrCloudCluster Starting cluster of 4 servers in /home/jenkins/workspace/Lucene-Solr-master-Linux/solr/build/solr-core/test/J0/temp/solr.cloud.MoveReplicaHDFSTest_621CEBD1EB2F0054-001/tempDir-001
   [junit4]   2> 234474 INFO  (SUITE-MoveReplicaHDFSTest-seed#[621CEBD1EB2F0054]-worker) [    ] o.a.s.c.ZkTestServer STARTING ZK TEST SERVER
   [junit4]   2> 234474 INFO  (Thread-745) [    ] o.a.s.c.ZkTestServer client port:0.0.0.0/0.0.0.0:0
   [junit4]   2> 234474 INFO  (Thread-745) [    ] o.a.s.c.ZkTestServer Starting server
   [junit4]   2> 234476 ERROR (Thread-745) [    ] o.a.z.s.ZooKeeperServer ZKShutdownHandler is not registered, so ZooKeeper server won't take any action on ERROR or SHUTDOWN server state changes
   [junit4]   2> 234574 INFO  (SUITE-MoveReplicaHDFSTest-seed#[621CEBD1EB2F0054]-worker) [    ] o.a.s.c.ZkTestServer start zk server on port:42707
   [junit4]   2> 234576 INFO  (zkConnectionManagerCallback-766-thread-1) [    ] o.a.s.c.c.ConnectionManager zkClient has connected
   [junit4]   2> 234579 INFO  (jetty-launcher-763-thread-4) [    ] o.e.j.s.Server jetty-9.4.11.v20180605; built: 2018-06-05T18:24:03.829Z; git: d5fc0523cfa96bfebfbda19606cad384d772f04c; jvm 9.0.4+11
   [junit4]   2> 234579 INFO  (jetty-launcher-763-thread-1) [    ] o.e.j.s.Server jetty-9.4.11.v20180605; built: 2018-06-05T18:24:03.829Z; git: d5fc0523cfa96bfebfbda19606cad384d772f04c; jvm 9.0.4+11
   [junit4]   2> 234579 INFO  (jetty-launcher-763-thread-2) [    ] o.e.j.s.Server jetty-9.4.11.v20180605; built: 2018-06-05T18:24:03.829Z; git: d5fc0523cfa96bfebfbda19606cad384d772f04c; jvm 9.0.4+11
   [junit4]   2> 234580 INFO  (jetty-launcher-763-thread-3) [    ] o.e.j.s.Server jetty-9.4.11.v20180605; built: 2018-06-05T18:24:03.829Z; git: d5fc0523cfa96bfebfbda19606cad384d772f04c; jvm 9.0.4+11
   [junit4]   2> 234581 INFO  (jetty-launcher-763-thread-1) [    ] o.e.j.s.session DefaultSessionIdManager workerName=node0
   [junit4]   2> 234581 INFO  (jetty-launcher-763-thread-1) [    ] o.e.j.s.session No SessionScavenger set, using defaults
   [junit4]   2> 234581 INFO  (jetty-launcher-763-thread-1) [    ] o.e.j.s.session node0 Scavenging every 600000ms
   [junit4]   2> 234581 INFO  (jetty-launcher-763-thread-4) [    ] o.e.j.s.session DefaultSessionIdManager workerName=node0
   [junit4]   2> 234581 INFO  (jetty-launcher-763-thread-4) [    ] o.e.j.s.session No SessionScavenger set, using defaults
   [junit4]   2> 234581 INFO  (jetty-launcher-763-thread-4) [    ] o.e.j.s.session node0 Scavenging every 600000ms
   [junit4]   2> 234581 INFO  (jetty-launcher-763-thread-1) [    ] o.e.j.s.h.ContextHandler Started o.e.j.s.ServletContextHandler@62606f33{/solr,null,AVAILABLE}
   [junit4]   2> 234581 INFO  (jetty-launcher-763-thread-4) [    ] o.e.j.s.h.ContextHandler Started o.e.j.s.ServletContextHandler@53ba011{/solr,null,AVAILABLE}
   [junit4]   2> 234584 INFO  (jetty-launcher-763-thread-2) [    ] o.e.j.s.session DefaultSessionIdManager workerName=node0
   [junit4]   2> 234584 INFO  (jetty-launcher-763-thread-2) [    ] o.e.j.s.session No SessionScavenger set, using defaults
   [junit4]   2> 234584 INFO  (jetty-launcher-763-thread-2) [    ] o.e.j.s.session node0 Scavenging every 660000ms
   [junit4]   2> 234584 INFO  (jetty-launcher-763-thread-3) [    ] o.e.j.s.session DefaultSessionIdManager workerName=node0
   [junit4]   2> 234584 INFO  (jetty-launcher-763-thread-3) [    ] o.e.j.s.session No SessionScavenger set, using defaults
   [junit4]   2> 234585 INFO  (jetty-launcher-763-thread-3) [    ] o.e.j.s.session node0 Scavenging every 600000ms
   [junit4]   2> 234585 INFO  (jetty-launcher-763-thread-2) [    ] o.e.j.s.h.ContextHandler Started o.e.j.s.ServletContextHandler@3b8becf5{/solr,null,AVAILABLE}
   [junit4]   2> 234585 INFO  (jetty-launcher-763-thread-3) [    ] o.e.j.s.h.ContextHandler Started o.e.j.s.ServletContextHandler@3965812e{/solr,null,AVAILABLE}
   [junit4]   2> 234586 INFO  (jetty-launcher-763-thread-4) [    ] o.e.j.s.AbstractConnector Started ServerConnector@5c5ece04{HTTP/1.1,[http/1.1]}{127.0.0.1:45297}
   [junit4]   2> 234586 INFO  (jetty-launcher-763-thread-2) [    ] o.e.j.s.AbstractConnector Started ServerConnector@37fcc9d{HTTP/1.1,[http/1.1]}{127.0.0.1:33675}
   [junit4]   2> 234586 INFO  (jetty-launcher-763-thread-4) [    ] o.e.j.s.Server Started @234642ms
   [junit4]   2> 234586 INFO  (jetty-launcher-763-thread-3) [    ] o.e.j.s.AbstractConnector Started ServerConnector@6e3a5a34{HTTP/1.1,[http/1.1]}{127.0.0.1:38281}
   [junit4]   2> 234586 INFO  (jetty-launcher-763-thread-2) [    ] o.e.j.s.Server Started @234642ms
   [junit4]   2> 234586 INFO  (jetty-launcher-763-thread-1) [    ] o.e.j.s.AbstractConnector Started ServerConnector@62629a56{HTTP/1.1,[http/1.1]}{127.0.0.1:39455}
   [junit4]   2> 234586 INFO  (jetty-launcher-763-thread-3) [    ] o.e.j.s.Server Started @234642ms
   [junit4]   2> 234586 INFO  (jetty-launcher-763-thread-4) [    ] o.a.s.c.s.e.JettySolrRunner Jetty properties: {hostContext=/solr, hostPort=45297}
   [junit4]   2> 234586 INFO  (jetty-launcher-763-thread-1) [    ] o.e.j.s.Server Started @234643ms
   [junit4]   2> 234586 INFO  (jetty-launcher-763-thread-2) [    ] o.a.s.c.s.e.JettySolrRunner Jetty properties: {hostContext=/solr, hostPort=33675}
   [junit4]   2> 234586 INFO  (jetty-launcher-763-thread-3) [    ] o.a.s.c.s.e.JettySolrRunner Jetty properties: {hostContext=/solr, hostPort=38281}
   [junit4]   2> 234586 INFO  (jetty-launcher-763-thread-1) [    ] o.a.s.c.s.e.JettySolrRunner Jetty properties: {hostContext=/solr, hostPort=39455}
   [junit4]   2> 234586 ERROR (jetty-launcher-763-thread-4) [    ] o.a.s.u.StartupLoggingUtils Missing Java Option solr.log.dir. Logging may be missing or incomplete.
   [junit4]   2> 234586 ERROR (jetty-launcher-763-thread-3) [    ] o.a.s.u.StartupLoggingUtils Missing Java Option solr.log.dir. Logging may be missing or incomplete.
   [junit4]   2> 234586 ERROR (jetty-launcher-763-thread-1) [    ] o.a.s.u.StartupLoggingUtils Missing Java Option solr.log.dir. Logging may be missing or incomplete.
   [junit4]   2> 234586 INFO  (jetty-launcher-763-thread-3) [    ] o.a.s.s.SolrDispatchFilter Using logger factory org.apache.logging.slf4j.Log4jLoggerFactory
   [junit4]   2> 234586 INFO  (jetty-launcher-763-thread-1) [    ] o.a.s.s.SolrDispatchFilter Using logger factory org.apache.logging.slf4j.Log4jLoggerFactory
   [junit4]   2> 234586 ERROR (jetty-launcher-763-thread-2) [    ] o.a.s.u.StartupLoggingUtils Missing Java Option solr.log.dir. Logging may be missing or incomplete.
   [junit4]   2> 234586 INFO  (jetty-launcher-763-thread-4) [    ] o.a.s.s.SolrDispatchFilter Using logger factory org.apache.logging.slf4j.Log4jLoggerFactory
   [junit4]   2> 234586 INFO  (jetty-launcher-763-thread-2) [    ] o.a.s.s.SolrDispatchFilter Using logger factory org.apache.logging.slf4j.Log4jLoggerFactory
   [junit4]   2> 234586 INFO  (jetty-launcher-763-thread-3) [    ] o.a.s.s.SolrDispatchFilter  ___      _       Welcome to Apache Solr? version 8.0.0
   [junit4]   2> 234586 INFO  (jetty-launcher-763-thread-1) [    ] o.a.s.s.SolrDispatchFilter  ___      _       Welcome to Apache Solr? version 8.0.0
   [junit4]   2> 234586 INFO  (jetty-launcher-763-thread-4) [    ] o.a.s.s.SolrDispatchFilter  ___      _       Welcome to Apache Solr? version 8.0.0
   [junit4]   2> 234586 INFO  (jetty-launcher-763-thread-3) [    ] o.a.s.s.SolrDispatchFilter / __| ___| |_ _   Starting in cloud mode on port null
   [junit4]   2> 234586 INFO  (jetty-launcher-763-thread-1) [    ] o.a.s.s.SolrDispatchFilter / __| ___| |_ _   Starting in cloud mode on port null
   [junit4]   2> 234586 INFO  (jetty-launcher-763-thread-4) [    ] o.a.s.s.SolrDispatchFilter / __| ___| |_ _   Starting in cloud mode on port null
   [junit4]   2> 234586 INFO  (jetty-launcher-763-thread-3) [    ] o.a.s.s.SolrDispatchFilter \__ \/ _ \ | '_|  Install dir: null
   [junit4]   2> 234586 INFO  (jetty-launcher-763-thread-1) [    ] o.a.s.s.SolrDispatchFilter \__ \/ _ \ | '_|  Install dir: null
   [junit4]   2> 234586 INFO  (jetty-launcher-763-thread-2) [    ] o.a.s.s.SolrDispatchFilter  ___      _       Welcome to Apache Solr? version 8.0.0
   [junit4]   2> 234586 INFO  (jetty-launcher-763-thread-3) [    ] o.a.s.s.SolrDispatchFilter |___/\___/_|_|    Start time: 2018-09-23T02:01:44.948792Z
   [junit4]   2> 234586 INFO  (jetty-launcher-763-thread-1) [    ] o.a.s.s.SolrDispatchFilter |___/\___/_|_|    Start time: 2018-09-23T02:01:44.948803Z
   [junit4]   2> 234586 INFO  (jetty-launcher-763-thread-4) [    ] o.a.s.s.SolrDispatchFilter \__ \/ _ \ | '_|  Install dir: null
   [junit4]   2> 234586 INFO  (jetty-launcher-763-thread-2) [    ] o.a.s.s.SolrDispatchFilter / __| ___| |_ _   Starting in cloud mode on port null
   [junit4]   2> 234586 INFO  (jetty-launcher-763-thread-4) [    ] o.a.s.s.SolrDispatchFilter |___/\___/_|_|    Start time: 2018-09-23T02:01:44.948859Z
   [junit4]   2> 234586 INFO  (jetty-launcher-763-thread-2) [    ] o.a.s.s.SolrDispatchFilter \__ \/ _ \ | '_|  Install dir: null
   [junit4]   2> 234586 INFO  (jetty-launcher-763-thread-2) [    ] o.a.s.s.SolrDispatchFilter |___/\___/_|_|    Start time: 2018-09-23T02:01:44.948896Z
   [junit4]   2> 234588 INFO  (zkConnectionManagerCallback-771-thread-1) [    ] o.a.s.c.c.ConnectionManager zkClient has connected
   [junit4]   2> 234588 INFO  (zkConnectionManagerCallback-770-thread-1) [    ] o.a.s.c.c.ConnectionManager zkClient has connected
   [junit4]   2> 234588 INFO  (zkConnectionManagerCallback-772-thread-1) [    ] o.a.s.c.c.ConnectionManager zkClient has connected
   [junit4]   2> 234588 INFO  (zkConnectionManagerCallback-774-thread-1) [    ] o.a.s.c.c.ConnectionManager zkClient has connected
   [junit4]   2> 234588 INFO  (jetty-launcher-763-thread-3) [    ] o.a.s.s.SolrDispatchFilter solr.xml found in ZooKeeper. Loading...
   [junit4]   2> 234588 INFO  (jetty-launcher-763-thread-4) [    ] o.a.s.s.SolrDispatchFilter solr.xml found in ZooKeeper. Loading...
   [junit4]   2> 234588 INFO  (jetty-launcher-763-thread-1) [    ] o.a.s.s.SolrDispatchFilter solr.xml found in ZooKeeper. Loading...
   [junit4]   2> 234588 INFO  (jetty-launcher-763-thread-2) [    ] o.a.s.s.SolrDispatchFilter solr.xml found in ZooKeeper. Loading...
   [junit4]   2> 234591 WARN  (NIOServerCxn.Factory:0.0.0.0/0.0.0.0:0) [    ] o.a.z.s.NIOServerCnxn Unable to read additional data from client sessionid 0x100c2895e410004, likely client has closed socket
   [junit4]   2> 234649 INFO  (jetty-launcher-763-thread-1) [    ] o.a.s.c.ZkContainer Zookeeper client=127.0.0.1:42707/solr
   [junit4]   2> 234650 INFO  (zkConnectionManagerCallback-778-thread-1) [    ] o.a.s.c.c.ConnectionManager zkClient has connected
   [junit4]   2> 234651 DEBUG (jetty-launcher-763-thread-1) [n:127.0.0.1:39455_solr    ] o.a.s.c.ZkController Added new OnReconnect listener org.apache.solr.cloud.ZkController$$Lambda$196/520537219@5aa81c58
   [junit4]   2> 234661 INFO  (zkConnectionManagerCallback-780-thread-1) [    ] o.a.s.c.c.ConnectionManager zkClient has connected
   [junit4]   2> 234678 INFO  (jetty-launcher-763-thread-3) [    ] o.a.s.c.ZkContainer Zookeeper client=127.0.0.1:42707/solr
   [junit4]   2> 234685 INFO  (zkConnectionManagerCallback-786-thread-1) [    ] o.a.s.c.c.ConnectionManager zkClient has connected
   [junit4]   2> 234686 DEBUG (jetty-launcher-763-thread-3) [n:127.0.0.1:38281_solr    ] o.a.s.c.ZkController Added new OnReconnect listener org.apache.solr.cloud.ZkController$$Lambda$196/520537219@4890f562
   [junit4]   2> 234693 INFO  (zkConnectionManagerCallback-788-thread-1) [    ] o.a.s.c.c.ConnectionManager zkClient has connected
   [junit4]   2> 234697 DEBUG (SyncThread:0) [    ] o.a.s.c.ZkTestServer Watch added: create/delete: /solr/clusterprops.json
   [junit4]   2> 234697 DEBUG (SyncThread:0) [    ] o.a.s.c.ZkTestServer Watch added: children: /solr/live_nodes
   [junit4]   2> 234697 DEBUG (SyncThread:0) [    ] o.a.s.c.ZkTestServer Watch added: data: /solr/clusterstate.json
   [junit4]   2> 234697 DEBUG (SyncThread:0) [    ] o.a.s.c.ZkTestServer Watch added: children: /solr/collections
   [junit4]   2> 234698 DEBUG (SyncThread:0) [    ] o.a.s.c.ZkTestServer Watch added: create/delete: /solr/aliases.json
   [junit4]   2> 234700 DEBUG (SyncThread:0) [    ] o.a.s.c.ZkTestServer Watch added: create/delete: /solr/security.json
   [junit4]   2> 234702 DEBUG (jetty-launcher-763-thread-3) [n:127.0.0.1:38281_solr    ] o.a.s.c.LeaderElector Joined leadership election with path: /overseer_elect/election/72271489285554184-127.0.0.1:38281_solr-n_0000000000
   [junit4]   2> 234702 INFO  (jetty-launcher-763-thread-3) [n:127.0.0.1:38281_solr    ] o.a.s.c.OverseerElectionContext I am going to be the leader 127.0.0.1:38281_solr
   [junit4]   2> 234702 INFO  (jetty-launcher-763-thread-3) [n:127.0.0.1:38281_solr    ] o.a.s.c.Overseer Overseer (id=72271489285554184-127.0.0.1:38281_solr-n_0000000000) starting
   [junit4]   2> 234710 INFO  (jetty-launcher-763-thread-2) [    ] o.a.s.c.ZkContainer Zookeeper client=127.0.0.1:42707/solr
   [junit4]   2> 234712 DEBUG (SyncThread:0) [    ] o.a.s.c.ZkTestServer Watch added: create/delete: /solr/clusterprops.json
   [junit4]   2> 234712 DEBUG (SyncThread:0) [    ] o.a.s.c.ZkTestServer Watch added: children: /solr/live_nodes
   [junit4]   2> 234712 DEBUG (SyncThread:0) [    ] o.a.s.c.ZkTestServer Watch added: data: /solr/clusterstate.json
   [junit4]   2> 234712 DEBUG (SyncThread:0) [    ] o.a.s.c.ZkTestServer Watch added: children: /solr/collections
   [junit4]   2> 234712 DEBUG (SyncThread:0) [    ] o.a.s.c.ZkTestServer Watch added: create/delete: /solr/aliases.json
   [junit4]   2> 234713 DEBUG (SyncThread:0) [    ] o.a.s.c.ZkTestServer Watch added: create/delete: /solr/security.json
   [junit4]   2> 234713 DEBUG (jetty-launcher-763-thread-1) [n:127.0.0.1:39455_solr    ] o.a.s.c.LeaderElector Joined leadership election with path: /overseer_elect/election/72271489285554182-127.0.0.1:39455_solr-n_0000000001
   [junit4]   2> 234713 DEBUG (SyncThread:0) [    ] o.a.s.c.ZkTestServer Watch added: data: /solr/overseer_elect/election/72271489285554184-127.0.0.1:38281_solr-n_0000000000
   [junit4]   2> 234713 DEBUG (jetty-launcher-763-thread-1) [n:127.0.0.1:39455_solr    ] o.a.s.c.LeaderElector Watching path /overseer_elect/election/72271489285554184-127.0.0.1:38281_solr-n_0000000000 to know if I could be the leader
   [junit4]   2> 234713 INFO  (jetty-launcher-763-thread-1) [n:127.0.0.1:39455_solr    ] o.a.s.c.ZkController Register node as live in ZooKeeper:/live_nodes/127.0.0.1:39455_solr
   [junit4]   2> 234714 DEBUG (SyncThread:0) [    ] o.a.s.c.ZkTestServer Watch fired: children: /solr/live_nodes
   [junit4]   2> 234714 DEBUG (SyncThread:0) [    ] o.a.s.c.ZkTestServer Watch fired: children: /solr/live_nodes
   [junit4]   2> 234721 INFO  (zkConnectionManagerCallback-799-thread-1) [    ] o.a.s.c.c.ConnectionManager zkClient has connected
   [junit4]   2> 234721 INFO  (zkConnectionManagerCallback-796-thread-1) [    ] o.a.s.c.c.ConnectionManager zkClient has connected
   [junit4]   2> 234722 DEBUG (SyncThread:0) [    ] o.a.s.c.ZkTestServer Watch added: children: /solr/live_nodes
   [junit4]   2> 234722 DEBUG (SyncThread:0) [    ] o.a.s.c.ZkTestServer Watch added: children: /solr/live_nodes
   [junit4]   2> 234722 INFO  (zkCallback-779-thread-1) [    ] o.a.s.c.c.ZkStateReader Updated live nodes from ZooKeeper... (0) -> (1)
   [junit4]   2> 234722 INFO  (zkCallback-787-thread-1) [    ] o.a.s.c.c.ZkStateReader Updated live nodes from ZooKeeper... (0) -> (1)
   [junit4]   2> 234722 DEBUG (SyncThread:0) [    ] o.a.s.c.ZkTestServer Watch added: create/delete: /solr/clusterprops.json
   [junit4]   2> 234723 DEBUG (jetty-launcher-763-thread-2) [n:127.0.0.1:33675_solr    ] o.a.s.c.ZkController Added new OnReconnect listener org.apache.solr.cloud.ZkController$$Lambda$196/520537219@158c131d
   [junit4]   2> 234723 DEBUG (SyncThread:0) [    ] o.a.s.c.ZkTestServer Watch added: children: /solr/live_nodes
   [junit4]   2> 234723 INFO  (jetty-launcher-763-thread-3) [n:127.0.0.1:38281_solr    ] o.a.s.c.c.ZkStateReader Updated live nodes from ZooKeeper... (0) -> (1)
   [junit4]   2> 234723 DEBUG (SyncThread:0) [    ] o.a.s.c.ZkTestServer Watch added: data: /solr/clusterstate.json
   [junit4]   2> 234723 DEBUG (SyncThread:0) [    ] o.a.s.c.ZkTestServer Watch added: children: /solr/collections
   [junit4]   2> 234723 DEBUG (SyncThread:0) [    ] o.a.s.c.ZkTestServer Watch added: create/delete: /solr/aliases.json
   [junit4]   2> 234723 INFO  (jetty-launcher-763-thread-3) [n:127.0.0.1:38281_solr    ] o.a.s.c.s.i.ZkClientClusterStateProvider Cluster at 127.0.0.1:42707/solr ready
   [junit4]   2> 234725 INFO  (zkConnectionManagerCallback-801-thread-1) [    ] o.a.s.c.c.ConnectionManager zkClient has connected
   [junit4]   2> 234725 DEBUG (OverseerCollectionConfigSetProcessor-72271489285554184-127.0.0.1:38281_solr-n_0000000000) [n:127.0.0.1:38281_solr    ] o.a.s.c.OverseerTaskProcessor Process current queue of overseer operations
   [junit4]   2> 234726 INFO  (OverseerStateUpdate-72271489285554184-127.0.0.1:38281_solr-n_0000000000) [n:127.0.0.1:38281_solr    ] o.a.s.c.Overseer Starting to work on the main queue : 127.0.0.1:38281_solr
   [junit4]   2> 234726 DEBUG (jetty-launcher-763-thread-3) [n:127.0.0.1:38281_solr    ] o.a.s.c.ZkController Publish node=127.0.0.1:38281_solr as DOWN
   [junit4]   2> 234726 DEBUG (OverseerAutoScalingTriggerThread-72271489285554184-127.0.0.1:38281_solr-n_0000000000) [    ] o.a.s.c.a.OverseerTriggerThread Adding .auto_add_replicas and .scheduled_maintenance triggers
   [junit4]   2> 234726 DEBUG (OverseerCollectionConfigSetProcessor-72271489285554184-127.0.0.1:38281_solr-n_0000000000) [n:127.0.0.1:38281_solr    ] o.a.s.c.OverseerTaskProcessor Cleaning up work-queue. #Running tasks: 0
   [junit4]   2> 234726 DEBUG (OverseerCollectionConfigSetProcessor-72271489285554184-127.0.0.1:38281_solr-n_0000000000) [n:127.0.0.1:38281_solr    ] o.a.s.c.OverseerTaskProcessor RunningTasks: []
   [junit4]   2> 234726 DEBUG (OverseerCollectionConfigSetProcessor-72271489285554184-127.0.0.1:38281_solr-n_0000000000) [n:127.0.0.1:38281_solr    ] o.a.s.c.OverseerTaskProcessor BlockedTasks: []
   [junit4]   2> 234726 DEBUG (OverseerCollectionConfigSetProcessor-72271489285554184-127.0.0.1:38281_solr-n_0000000000) [n:127.0.0.1:38281_solr    ] o.a.s.c.OverseerTaskProcessor CompletedTasks: []
   [junit4]   2> 234726 DEBUG (OverseerCollectionConfigSetProcessor-72271489285554184-127.0.0.1:38281_solr-n_0000000000) [n:127.0.0.1:38281_solr    ] o.a.s.c.OverseerTaskProcessor RunningZKTasks: []
   [junit4]   2> 234726 DEBUG (OverseerCollectionConfigSetProcessor-72271489285554184-127.0.0.1:38281_solr-n_0000000000) [n:127.0.0.1:38281_solr    ] o.a.s.c.OverseerTaskQueue Peeking for top 100 elements. ExcludeSet: []
   [junit4]   2> 234726 DEBUG (SyncThread:0) [    ] o.a.s.c.ZkTestServer Watch added: children: /solr/overseer/queue-work
   [junit4]   2> 234726 INFO  (jetty-launcher-763-thread-3) [n:127.0.0.1:38281_solr    ] o.a.s.c.TransientSolrCoreCacheDefault Allocating transient cache for 2147483647 transient cores
   [junit4]   2> 234726 DEBUG (SyncThread:0) [    ] o.a.s.c.ZkTestServer Watch added: data: /solr/autoscaling.json
   [junit4]   2> 234726 INFO  (jetty-launcher-763-thread-3) [n:127.0.0.1:38281_solr    ] o.a.s.c.ZkController Register node as live in ZooKeeper:/live_nodes/127.0.0.1:38281_solr
   [junit4]   2> 234726 DEBUG (SyncThread:0) [    ] o.a.s.c.ZkTestServer Watch added: children: /solr/overseer/collection-queue-work
   [junit4]   2> 234726 DEBUG (OverseerAutoScalingTriggerThread-72271489285554184-127.0.0.1:38281_solr-n_0000000000) [    ] o.a.s.c.a.OverseerTriggerThread Refreshing /autoscaling.json with znode version 1
   [junit4]   2> 234726 DEBUG (SyncThread:0) [    ] o.a.s.c.ZkTestServer Watch added: children: /solr/overseer/queue
   [junit4]   2> 234727 DEBUG (SyncThread:0) [    ] o.a.s.c.ZkTestServer Watch fired: children: /solr/live_nodes
   [junit4]   2> 234727 DEBUG (SyncThread:0) [    ] o.a.s.c.ZkTestServer Watch fired: children: /solr/live_nodes
   [junit4]   2> 234727 DEBUG (SyncThread:0) [    ] o.a.s.c.ZkTestServer Watch fired: children: /solr/live_nodes
   [junit4]   2> 234727 DEBUG (SyncThread:0) [    ] o.a.s.c.ZkTestServer Watch added: children: /solr/live_nodes
   [junit4]   2> 234727 DEBUG (SyncThread:0) [    ] o.a.s.c.ZkTestServer Watch added: children: /solr/live_nodes
   [junit4]   2> 234727 DEBUG (OverseerAutoScalingTriggerThread-72271489285554184-127.0.0.1:38281_solr-n_0000000000) [    ] o.a.s.c.a.OverseerTriggerThread Current znodeVersion 1, lastZnodeVersion -1
   [junit4]   2> 234727 INFO  (zkCallback-787-thread-1) [    ] o.a.s.c.c.ZkStateReader Updated live nodes from ZooKeeper... (1) -> (2)
   [junit4]   2> 234727 DEBUG (OverseerAutoScalingTriggerThread-72271489285554184-127.0.0.1:38281_solr-n_0000000000) [    ] o.a.s.c.a.OverseerTriggerThread Processed trigger updates upto znodeVersion 1
   [junit4]   2> 234727 INFO  (zkCallback-779-thread-1) [    ] o.a.s.c.c.ZkStateReader Updated live nodes from ZooKeeper... (1) -> (2)
   [junit4]   2> 234728 DEBUG (SyncThread:0) [    ] o.a.s.c.ZkTestServer Watch added: create/delete: /solr/clusterprops.json
   [junit4]   2> 234728 DEBUG (SyncThread:0) [    ] o.a.s.c.ZkTestServer Watch added: children: /solr/live_nodes
   [junit4]   2> 234728 INFO  (jetty-launcher-763-thread-2) [n:127.0.0.1:33675_solr    ] o.a.s.c.c.ZkStateReader Updated live nodes from ZooKeeper... (0) -> (2)
   [junit4]   2> 234728 DEBUG (SyncThread:0) [    ] o.a.s.c.ZkTestServer Watch added: data: /solr/clusterstate.json
   [junit4]   2> 234729 DEBUG (SyncThread:0) [    ] o.a.s.c.ZkTestServer Watch added: children: /solr/collections
   [junit4]   2> 234729 DEBUG (SyncThread:0) [    ] o.a.s.c.ZkTestServer Watch added: create/delete: /solr/aliases.json
   [junit4]   2> 234729 DEBUG (SyncThread:0) [    ] o.a.s.c.ZkTestServer Watch added: create/delete: /solr/security.json
   [junit4]   2> 234729 DEBUG (jetty-launcher-763-thread-2) [n:127.0.0.1:33675_solr    ] o.a.s.c.LeaderElector Joined leadership election with path: /overseer_elect/election/72271489285554187-127.0.0.1:33675_solr-n_0000000002
   [junit4]   2> 234730 DEBUG (SyncThread:0) [    ] o.a.s.c.ZkTestServer Watch added: data: /solr/overseer_elect/election/72271489285554182-127.0.0.1:39455_solr-n_0000000001
   [junit4]   2> 234730 DEBUG (jetty-launcher-763-thread-2) [n:127.0.0.1:33675_solr    ] o.a.s.c.LeaderElector Watching path /overseer_elect/election/72271489285554182-127.0.0.1:39455_solr-n_0000000001 to know if I could be the leader
   [junit4]   2> 234730 DEBUG (jetty-launcher-763-thread-2) [n:127.0.0.1:33675_solr    ] o.a.s.c.ZkController Publish node=127.0.0.1:33675_solr as DOWN
   [junit4]   2> 234730 DEBUG (SyncThread:0) [    ] o.a.s.c.ZkTestServer Watch fired: children: /solr/overseer/queue
   [junit4]   2> 234730 INFO  (jetty-launcher-763-thread-2) [n:127.0.0.1:33675_solr    ] o.a.s.c.TransientSolrCoreCacheDefault Allocating transient cache for 2147483647 transient cores
   [junit4]   2> 234730 INFO  (jetty-launcher-763-thread-2) [n:127.0.0.1:33675_solr    ] o.a.s.c.ZkController Register node as live in ZooKeeper:/live_nodes/127.0.0.1:33675_solr
   [junit4]   2> 234731 DEBUG (SyncThread:0) [    ] o.a.s.c.ZkTestServer Watch fired: children: /solr/live_nodes
   [junit4]   2> 234731 DEBUG (SyncThread:0) [    ] o.a.s.c.ZkTestServer Watch fired: children: /solr/live_nodes
   [junit4]   2> 234731 DEBUG (SyncThread:0) [    ] o.a.s.c.ZkTestServer Watch fired: children: /solr/live_nodes
   [junit4]   2> 234731 DEBUG (SyncThread:0) [    ] o.a.s.c.ZkTestServer Watch added: children: /solr/live_nodes
   [junit4]   2> 234731 INFO  (zkCallback-779-thread-1) [    ] o.a.s.c.c.ZkStateReader Updated live nodes from ZooKeeper... (2) -> (3)
   [junit4]   2> 234733 DEBUG (SyncThread:0) [    ] o.a.s.c.ZkTestServer Watch added: children: /solr/live_nodes
   [junit4]   2> 234735 DEBUG (SyncThread:0) [    ] o.a.s.c.ZkTestServer Watch added: children: /solr/live_nodes
   [junit4]   2> 234735 DEBUG (SyncThread:0) [    ] o.a.s.c.ZkTestServer Watch added: children: /solr/live_nodes
   [junit4]   2> 234735 INFO  (zkCallback-787-thread-2) [    ] o.a.s.c.c.ZkStateReader Updated live nodes from ZooKeeper... (2) -> (3)
   [junit4]   2> 234735 DEBUG (SyncThread:0) [    ] o.a.s.c.ZkTestServer Watch added: children: /solr/overseer/queue
   [junit4]   2> 234738 INFO  (zkCallback-795-thread-1) [    ] o.a.s.c.c.ZkStateReader Updated live nodes from ZooKeeper... (1) -> (3)
   [junit4]   2> 234738 INFO  (zkCallback-800-thread-1) [    ] o.a.s.c.c.ZkStateReader Updated live nodes from ZooKeeper... (2) -> (3)
   [junit4]   2> 234738 DEBUG (SyncThread:0) [    ] o.a.s.c.ZkTestServer Watch added: children: /solr/autoscaling/events/.scheduled_maintenance
   [junit4]   2> 234738 DEBUG (OverseerAutoScalingTriggerThread-72271489285554184-127.0.0.1:38281_solr-n_0000000000) [    ] o.a.s.c.a.NodeLostTrigger NodeLostTrigger .auto_add_replicas - Initial livenodes: [127.0.0.1:33675_solr, 127.0.0.1:39455_solr, 127.0.0.1:38281_solr]
   [junit4]   2> 234741 DEBUG (OverseerAutoScalingTriggerThread-72271489285554184-127.0.0.1:38281_solr-n_0000000000) [    ] o.a.s.c.a.OverseerTriggerThread -- clean old nodeAdded markers
   [junit4]   2> 234741 DEBUG (SyncThread:0) [    ] o.a.s.c.ZkTestServer Watch added: children: /solr/autoscaling/events/.auto_add_replicas
   [junit4]   2> 234742 INFO  (jetty-launcher-763-thread-3) [n:127.0.0.1:38281_solr    ] o.a.s.h.a.MetricsHistoryHandler No .system collection, keeping metrics history in memory.
   [junit4]   2> 234742 DEBUG (OverseerAutoScalingTriggerThread-72271489285554184-127.0.0.1:38281_solr-n_0000000000) [    ] o.a.s.c.a.OverseerTriggerThread Current znodeVersion 1, lastZnodeVersion 1
   [junit4]   2> 234742 DEBUG (ScheduledTrigger-1318-thread-1) [    ] o.a.s.c.a.NodeLostTrigger Running NodeLostTrigger: .auto_add_replicas with currently live nodes: 3
   [junit4]   2> 234745 INFO  (zkConnectionManagerCallback-806-thread-1) [    ] o.a.s.c.c.ConnectionManager zkClient has connected
   [junit4]   2> 234746 DEBUG (SyncThread:0) [    ] o.a.s.c.ZkTestServer Watch added: create/delete: /solr/clusterprops.json
   [junit4]   2> 234746 DEBUG (SyncThread:0) [    ] o.a.s.c.ZkTestServer Watch added: children: /solr/live_nodes
   [junit4]   2> 234746 INFO  (jetty-launcher-763-thread-1) [n:127.0.0.1:39455_solr    ] o.a.s.c.c.ZkStateReader Updated live nodes from ZooKeeper... (0) -> (3)
   [junit4]   2> 234746 DEBUG (SyncThread:0) [    ] o.a.s.c.ZkTestServer Watch added: data: /solr/clusterstate.json
   [junit4]   2> 234746 DEBUG (SyncThread:0) [    ] o.a.s.c.ZkTestServer Watch added: children: /solr/collections
   [junit4]   2> 234747 DEBUG (SyncThread:0) [    ] o.a.s.c.ZkTestServer Watch added: create/delete: /solr/aliases.json
   [junit4]   2> 234747 INFO  (jetty-launcher-763-thread-1) [n:127.0.0.1:39455_solr    ] o.a.s.c.s.i.ZkClientClusterStateProvider Cluster at 127.0.0.1:42707/solr ready
   [junit4]   2> 234752 INFO  (jetty-launcher-763-thread-3) [n:127.0.0.1:38281_solr    ] o.a.s.m.r.SolrJmxReporter JMX monitoring for 'solr_38281.solr.node' (registry 'solr.node') enabled at server: com.sun.jmx.mbeanserver.JmxMBeanServer@5da9ee1d
   [junit4]   2> 234753 INFO  (jetty-launcher-763-thread-1) [n:127.0.0.1:39455_solr    ] o.a.s.h.a.MetricsHistoryHandler No .system collection, keeping metrics history in memory.
   [junit4]   2> 234754 INFO  (jetty-launcher-763-thread-4) [    ] o.a.s.c.ZkContainer Zookeeper client=127.0.0.1:42707/solr
   [junit4]   2> 234761 INFO  (zkConnectionManagerCallback-814-thread-1) [    ] o.a.s.c.c.ConnectionManager zkClient has connected
   [junit4]   2> 234761 INFO  (zkConnectionManagerCallback-819-thread-1) [    ] o.a.s.c.c.ConnectionManager zkClient has connected
   [junit4]   2> 234761 DEBUG (SyncThread:0) [    ] o.a.s.c.ZkTestServer Watch added: create/delete: /solr/clusterprops.json
   [junit4]   2> 234761 DEBUG (SyncThread:0) [    ] o.a.s.c.ZkTestServer Watch added: children: /solr/live_nodes
   [junit4]   2> 234761 INFO  (jetty-launcher-763-thread-2) [n:127.0.0.1:33675_solr    ] o.a.s.c.c.ZkStateReader Updated live nodes from ZooKeeper... (0) -> (3)
   [junit4]   2> 234762 INFO  (jetty-launcher-763-thread-3) [n:127.0.0.1:38281_solr    ] o.a.s.m.r.SolrJmxReporter JMX monitoring for 'solr_38281.solr.jvm' (registry 'solr.jvm') enabled at server: com.sun.jmx.mbeanserver.JmxMBeanServer@5da9ee1d
   [junit4]   2> 234762 DEBUG (SyncThread:0) [    ] o.a.s.c.ZkTestServer Watch added: data: /solr/clusterstate.json
   [junit4]   2> 234762 DEBUG (jetty-launcher-763-thread-4) [n:127.0.0.1:45297_solr    ] o.a.s.c.ZkController Added new OnReconnect listener org.apache.solr.cloud.ZkController$$Lambda$196/520537219@599e20fb
   [junit4]   2> 234762 INFO  (jetty-launcher-763-thread-3) [n:127.0.0.1:38281_solr    ] o.a.s.m.r.SolrJmxReporter JMX monitoring for 'solr_38281.solr.jetty' (registry 'solr.jetty') enabled at server: com.sun.jmx.mbeanserver.JmxMBeanServer@5da9ee1d
   [junit4]   2> 234762 DEBUG (SyncThread:0) [    ] o.a.s.c.ZkTestServer Watch added: children: /solr/collections
   [junit4]   2> 234762 DEBUG (SyncThread:0) [    ] o.a.s.c.ZkTestServer Watch added: create/delete: /solr/aliases.json
   [junit4]   2> 234762 INFO  (jetty-launcher-763-thread-2) [n:127.0.0.1:33675_solr    ] o.a.s.c.s.i.ZkClientClusterStateProvider Cluster at 127.0.0.1:42707/solr ready
   [junit4]   2> 234763 INFO  (jetty-launcher-763-thread-3) [n:127.0.0.1:38281_solr    ] o.a.s.c.CorePropertiesLocator Found 0 core definitions underneath /home/jenkins/workspace/Lucene-Solr-master-Linux/solr/build/solr-core/test/J0/temp/solr.cloud.MoveReplicaHDFSTest_621CEBD1EB2F0054-001/tempDir-001/node3/.
   [junit4]   2> 234764 INFO  (jetty-launcher-763-thread-1) [n:127.0.0.1:39455_solr    ] o.a.s.m.r.SolrJmxReporter JMX monitoring for 'solr_39455.solr.node' (registry 'solr.node') enabled at server: com.sun.jmx.mbeanserver.JmxMBeanServer@5da9ee1d
   [junit4]   2> 234768 INFO  (zkConnectionManagerCallback-821-thread-1) [    ] o.a.s.c.c.ConnectionManager zkClient has connected
   [junit4]   2> 234769 INFO  (jetty-launcher-763-thread-1) [n:127.0.0.1:39455_solr    ] o.a.s.m.r.SolrJmxReporter JMX monitoring for 'solr_39455.solr.jvm' (registry 'solr.jvm') enabled at server: com.sun.jmx.mbeanserver.JmxMBeanServer@5da9ee1d
   [junit4]   2> 234769 INFO  (jetty-launcher-763-thread-1) [n:127.0.0.1:39455_solr    ] o.a.s.m.r.SolrJmxReporter JMX monitoring for 'solr_39455.solr.jetty' (registry 'solr.jetty') enabled at server: com.sun.jmx.mbeanserver.JmxMBeanServer@5da9ee1d
   [junit4]   2> 234769 INFO  (jetty-launcher-763-thread-2) [n:127.0.0.1:33675_solr    ] o.a.s.h.a.MetricsHistoryHandler No .system collection, keeping metrics history in memory.
   [junit4]   2> 234770 INFO  (jetty-launcher-763-thread-1) [n:127.0.0.1:39455_solr    ] o.a.s.c.CorePropertiesLocator Found 0 core definitions underneath /home/jenkins/workspace/Lucene-Solr-master-Linux/solr/build/solr-core/test/J0/temp/solr.cloud.MoveReplicaHDFSTest_621CEBD1EB2F0054-001/tempDir-001/node1/.
   [junit4]   2> 234773 DEBUG (SyncThread:0) [    ] o.a.s.c.ZkTestServer Watch added: create/delete: /solr/clusterprops.json
   [junit4]   2> 234774 DEBUG (SyncThread:0) [    ] o.a.s.c.ZkTestServer Watch added: children: /solr/live_nodes
   [junit4]   2> 234774 INFO  (jetty-launcher-763-thread-4) [n:127.0.0.1:45297_solr    ] o.a.s.c.c.ZkStateReader Updated live nodes from ZooKeeper... (0) -> (3)
   [junit4]   2> 234774 DEBUG (SyncThread:0) [    ] o.a.s.c.ZkTestServer Watch added: data: /solr/clusterstate.json
   [junit4]   2> 234774 DEBUG (SyncThread:0) [    ] o.a.s.c.ZkTestServer Watch added: children: /solr/collections
   [junit4]   2> 234774 DEBUG (SyncThread:0) [    ] o.a.s.c.ZkTestServer Watch added: create/delete: /solr/aliases.json
   [junit4]   2> 234774 DEBUG (SyncThread:0) [    ] o.a.s.c.ZkTestServer Watch added: create/delete: /solr/security.json
   [junit4]   2> 234775 DEBUG (jetty-launcher-763-thread-4) [n:127.0.0.1:45297_solr    ] o.a.s.c.LeaderElector Joined leadership election with path: /overseer_elect/election/72271489285554191-127.0.0.1:45297_solr-n_0000000003
   [junit4]   2> 234775 DEBUG (SyncThread:0) [    ] o.a.s.c.ZkTestServer Watch added: data: /solr/overseer_elect/election/72271489285554187-127.0.0.1:33675_solr-n_0000000002
   [junit4]   2> 234775 DEBUG (jetty-launcher-763-thread-4) [n:127.0.0.1:45297_solr    ] o.a.s.c.LeaderElector Watching path /overseer_elect/election/72271489285554187-127.0.0.1:33675_solr-n_0000000002 to know if I could be the leader
   [junit4]   2> 234775 DEBUG (jetty-launcher-763-thread-4) [n:127.0.0.1:45297_solr    ] o.a.s.c.ZkController Publish node=127.0.0.1:45297_solr as DOWN
   [junit4]   2> 234776 DEBUG (SyncThread:0) [    ] o.a.s.c.ZkTestServer Watch fired: children: /solr/overseer/queue
   [junit4]   2> 234776 INFO  (jetty-launcher-763-thread-4) [n:127.0.0.1:45297_solr    ] o.a.s.c.TransientSolrCoreCacheDefault Allocating transient cache for 2147483647 transient cores
   [junit4]   2> 234776 INFO  (jetty-launcher-763-thread-4) [n:127.0.0.1:45297_solr    ] o.a.s.c.ZkController Register node as live in ZooKeeper:/live_nodes/127.0.0.1:45297_solr
   [junit4]   2> 234776 DEBUG (SyncThread:0) [    ] o.a.s.c.ZkTestServer Watch added: children: /solr/overseer/queue
   [junit4]   2> 234776 DEBUG (SyncThread:0) [    ] o.a.s.c.ZkTestServer Watch fired: children: /solr/live_nodes
   [junit4]   2> 234776 DEBUG (SyncThread:0) [    ] o.a.s.c.ZkTestServer Watch fired: children: /solr/live_nodes
   [junit4]   2> 234776 DEBUG (SyncThread:0) [    ] o.a.s.c.ZkTestServer Watch fired: children: /solr/live_nodes
   [junit4]   2> 234776 DEBUG (SyncThread:0) [    ] o.a.s.c.ZkTestServer Watch fired: children: /solr/live_nodes
   [junit4]   2> 234776 DEBUG (SyncThread:0) [    ] o.a.s.c.ZkTestServer Watch fired: children: /solr/live_nodes
   [junit4]   2> 234776 DEBUG (SyncThread:0) [    ] o.a.s.c.ZkTestServer Watch fired: children: /solr/live_nodes
   [junit4]   2> 234776 DEBUG (SyncThread:0) [    ] o.a.s.c.ZkTestServer Watch fired: children: /solr/live_nodes
   [junit4]   2> 234776 DEBUG (SyncThread:0) [    ] o.a.s.c.ZkTestServer Watch added: children: /solr/live_nodes
   [junit4]   2> 234776 DEBUG (SyncThread:0) [    ] o.a.s.c.ZkTestServer Watch added: children: /solr/live_nodes
   [junit4]   2> 234776 DEBUG (SyncThread:0) [    ] o.a.s.c.ZkTestServer Watch added: children: /solr/live_nodes
   [junit4]   2> 234776 INFO  (zkCallback-800-thread-1) [    ] o.a.s.c.c.ZkStateReader Updated live nodes from ZooKeeper... (3) -> (4)
   [junit4]   2> 234776 INFO  (zkCallback-795-thread-1) [    ] o.a.s.c.c.ZkStateReader Updated live nodes from ZooKeeper... (3) -> (4)
   [junit4]   2> 234776 DEBUG (SyncThread:0) [    ] o.a.s.c.ZkTestServer Watch added: children: /solr/live_nodes
   [junit4]   2> 234777 INFO  (zkCallback-787-thread-2) [    ] o.a.s.c.c.ZkStateReader Updated live nodes from ZooKeeper... (3) -> (4)
   [junit4]   2> 234777 INFO  (zkCallback-779-thread-1) [    ] o.a.s.c.c.ZkStateReader Updated live nodes from ZooKeeper... (3) -> (4)
   [junit4]   2> 234777 DEBUG (SyncThread:0) [    ] o.a.s.c.ZkTestServer Watch added: children: /solr/live_nodes
   [junit4]   2> 234777 DEBUG (SyncThread:0) [    ] o.a.s.c.ZkTestServer Watch added: children: /solr/live_nodes
   [junit4]   2> 234777 INFO  (zkCallback-805-thread-1) [    ] o.a.s.c.c.ZkStateReader Updated live nodes from ZooKeeper... (3) -> (4)
   [junit4]   2> 234777 DEBUG (SyncThread:0) [    ] o.a.s.c.ZkTestServer Watch added: children: /solr/live_nodes
   [junit4]   2> 234777 INFO  (zkCallback-813-thread-1) [    ] o.a.s.c.c.ZkStateReader Updated live nodes from ZooKeeper... (3) -> (4)
   [junit4]   2> 234777 INFO  (zkCallback-820-thread-1) [    ] o.a.s.c.c.ZkStateReader Updated live nodes from ZooKeeper... (3) -> (4)
   [junit4]   2> 234782 INFO  (jetty-launcher-763-thread-2) [n:127.0.0.1:33675_solr    ] o.a.s.m.r.SolrJmxReporter JMX monitoring for 'solr_33675.solr.node' (registry 'solr.node') enabled at server: com.sun.jmx.mbeanserver.JmxMBeanServer@5da9ee1d
   [junit4]   2> 234789 INFO  (jetty-launcher-763-thread-2) [n:127.0.0.1:33675_solr    ] o.a.s.m.r.SolrJmxReporter JMX monitoring for 'solr_33675.solr.jvm' (registry 'solr.jvm') enabled at server: com.sun.jmx.mbeanserver.JmxMBeanServer@5da9ee1d
   [junit4]   2> 234789 INFO  (zkConnectionManagerCallback-829-thread-1) [    ] o.a.s.c.c.ConnectionManager zkClient has connected
   [junit4]   2> 234789 INFO  (jetty-launcher-763-thread-2) [n:127.0.0.1:33675_solr    ] o.a.s.m.r.SolrJmxReporter JMX monitoring for 'solr_33675.solr.jetty' (registry 'solr.jetty') enabled at server: com.sun.jmx.mbeanserver.JmxMBeanServer@5da9ee1d
   [junit4]   2> 234790 DEBUG (SyncThread:0) [    ] o.a.s.c.ZkTestServer Watch added: create/delete: /solr/clusterprops.json
   [junit4]   2> 234790 DEBUG (SyncThread:0) [    ] o.a.s.c.ZkTestServer Watch added: children: /solr/live_nodes
   [junit4]   2> 234790 INFO  (jetty-launcher-763-thread-4) [n:127.0.0.1:45297_solr    ] o.a.s.c.c.ZkStateReader Updated live nodes from ZooKeeper... (0) -> (4)
   [junit4]   2> 234790 INFO  (jetty-launcher-763-thread-2) [n:127.0.0.1:33675_solr    ] o.a.s.c.CorePropertiesLocator Found 0 core definitions underneath /home/jenkins/workspace/Lucene-Solr-master-Linux/solr/build/solr-core/test/J0/temp/solr.cloud.MoveReplicaHDFSTest_621CEBD1EB2F0054-001/tempDir-001/node2/.
   [junit4]   2> 234790 DEBUG (SyncThread:0) [    ] o.a.s.c.ZkTestServer Watch added: data: /solr/clusterstate.json
   [junit4]   2> 234790 DEBUG (SyncThread:0) [    ] o.a.s.c.ZkTestServer Watch added: children: /solr/collections
   [junit4]   2> 234790 DEBUG (SyncThread:0) [    ] o.a.s.c.ZkTestServer Watch added: create/delete: /solr/aliases.json
   [junit4]   2> 234791 INFO  (jetty-launcher-763-thread-4) [n:127.0.0.1:45297_solr    ] o.a.s.c.s.i.ZkClientClusterStateProvider Cluster at 127.0.0.1:42707/solr ready
   [junit4]   2> 234791 INFO  (jetty-launcher-763-thread-4) [n:127.0.0.1:45297_solr    ] o.a.s.h.a.MetricsHistoryHandler No .system collection, keeping metrics history in memory.
   [junit4]   2> 234805 INFO  (jetty-launcher-763-thread-4) [n:127.0.0.1:45297_solr    ] o.a.s.m.r.SolrJmxReporter JMX monitoring for 'solr_45297.solr.node' (registry 'solr.node') enabled at server: com.sun.jmx.mbeanserver.JmxMBeanServer@5da9ee1d
   [junit4]   2> 234811 INFO  (jetty-launcher-763-thread-4) [n:127.0.0.1:45297_solr    ] o.a.s.m.r.SolrJmxReporter JMX monitoring for 'solr_45297.solr.jvm' (registry 'solr.jvm') enabled at server: com.sun.jmx.mbeanserver.JmxMBeanServer@5da9ee1d
   [junit4]   2> 234811 INFO  (jetty-launcher-763-thread-4) [n:127.0.0.1:45297_solr    ] o.a.s.m.r.SolrJmxReporter JMX monitoring for 'solr_45297.solr.jetty' (registry 'solr.jetty') enabled at server: com.sun.jmx.mbeanserver.JmxMBeanServer@5da9ee1d
   [junit4]   2> 234812 INFO  (jetty-launcher-763-thread-4) [n:127.0.0.1:45297_solr    ] o.a.s.c.CorePropertiesLocator Found 0 core definitions underneath /home/jenkins/workspace/Lucene-Solr-master-Linux/solr/build/solr-core/test/J0/temp/solr.cloud.MoveReplicaHDFSTest_621CEBD1EB2F0054-001/tempDir-001/node4/.
   [junit4]   2> 234851 INFO  (zkConnectionManagerCallback-832-thread-1) [    ] o.a.s.c.c.ConnectionManager zkClient has connected
   [junit4]   2> 234853 INFO  (zkConnectionManagerCallback-837-thread-1) [    ] o.a.s.c.c.ConnectionManager zkClient has connected
   [junit4]   2> 234854 DEBUG (SyncThread:0) [    ] o.a.s.c.ZkTestServer Watch added: create/delete: /solr/clusterprops.json
   [junit4]   2> 234854 DEBUG (SyncThread:0) [    ] o.a.s.c.ZkTestServer Watch added: children: /solr/live_nodes
   [junit4]   2> 234855 INFO  (SUITE-MoveReplicaHDFSTest-seed#[621CEBD1EB2F0054]-worker) [    ] o.a.s.c.c.ZkStateReader Updated live nodes from ZooKeeper... (0) -> (4)
   [junit4]   2> 234855 DEBUG (SyncThread:0) [    ] o.a.s.c.ZkTestServer Watch added: data: /solr/clusterstate.json
   [junit4]   2> 234855 DEBUG (SyncThread:0) [    ] o.a.s.c.ZkTestServer Watch added: children: /solr/collections
   [junit4]   2> 234855 DEBUG (SyncThread:0) [    ] o.a.s.c.ZkTestServer Watch added: create/delete: /solr/aliases.json
   [junit4]   2> 234855 INFO  (SUITE-MoveReplicaHDFSTest-seed#[621CEBD1EB2F0054]-worker) [    ] o.a.s.c.s.i.ZkClientClusterStateProvider Cluster at 127.0.0.1:42707/solr ready
   [junit4]   2> 234859 INFO  (qtp143007212-2947) [n:127.0.0.1:33675_solr    ] o.a.s.h.a.CollectionsHandler Invoked Collection Action :overseerstatus with params action=OVERSEERSTATUS&wt=javabin&version=2 and sendToOCPQueue=true
   [junit4]   2> 234859 DEBUG (SyncThread:0) [    ] o.a.s.c.ZkTestServer Watch fired: children: /solr/overseer/collection-queue-work
   [junit4]   2> 234860 DEBUG (SyncThread:0) [    ] o.a.s.c.ZkTestServer Watch added: create/delete: /solr/overseer/collection-queue-work/qnr-0000000000
   [junit4]   2> 234860 DEBUG (SyncThread:0) [    ] o.a.s.c.ZkTestServer Watch added: children: /solr/overseer/collection-queue-work
   [junit4]   2> 234860 DEBUG (OverseerCollectionConfigSetProcessor-72271489285554184-127.0.0.1:38281_solr-n_0000000000) [n:127.0.0.1:38281_solr    ] o.a.s.c.ZkDistributedQueue Found child node with improper name: qnr-0000000000
   [junit4]   2> 234860 DEBUG (SyncThread:0) [    ] o.a.s.c.ZkTestServer Watch fired: children: /solr/overseer/collection-queue-work
   [junit4]   2> 234861 DEBUG (SyncThread:0) [    ] o.a.s.c.ZkTestServer Watch added: children: /solr/overseer/collection-queue-work
   [junit4]   2> 234861 DEBUG (OverseerCollectionConfigSetProcessor-72271489285554184-127.0.0.1:38281_solr-n_0000000000) [n:127.0.0.1:38281_solr    ] o.a.s.c.ZkDistributedQueue Found child node with improper name: qnr-0000000000
   [junit4]   2> 234861 DEBUG (OverseerCollectionConfigSetProcessor-72271489285554184-127.0.0.1:38281_solr-n_0000000000) [n:127.0.0.1:38281_solr    ] o.a.s.c.OverseerTaskQueue Returning topN elements: [/overseer/collection-queue-work/qn-0000000000, ]
   [junit4]   2> 234861 DEBUG (OverseerCollectionConfigSetProcessor-72271489285554184-127.0.0.1:38281_solr-n_0000000000) [n:127.0.0.1:38281_solr    ] o.a.s.c.OverseerTaskProcessor Got 1 tasks from work-queue : [[org.apache.solr.cloud.OverseerTaskQueue$QueueEvent@2e684ecf]]
   [junit4]   2> 234861 DEBUG (OverseerCollectionConfigSetProcessor-72271489285554184-127.0.0.1:38281_solr-n_0000000000) [n:127.0.0.1:38281_solr    ] o.a.s.c.OverseerTaskProcessor Marked task [/overseer/collection-queue-work/qn-0000000000] as running
   [junit4]   2> 234861 DEBUG (OverseerCollectionConfigSetProcessor-72271489285554184-127.0.0.1:38281_solr-n_0000000000) [n:127.0.0.1:38281_solr    ] o.a.s.c.OverseerTaskProcessor Overseer Collection Message Handler: Get the message id:/overseer/collection-queue-work/qn-0000000000 message:{"operation":"overseerstatus"}
   [junit4]   2> 234862 DEBUG (OverseerThreadFactory-1320-thread-1-processing-n:127.0.0.1:38281_solr) [n:127.0.0.1:38281_solr    ] o.a.s.c.OverseerTaskProcessor Runner processing /overseer/collection-queue-work/qn-0000000000
   [junit4]   2> 234862 DEBUG (OverseerThreadFactory-1320-thread-1-processing-n:127.0.0.1:38281_solr) [n:127.0.0.1:38281_solr    ] o.a.s.c.a.c.OverseerCollectionMessageHandler OverseerCollectionMessageHandler.processMessage : overseerstatus , {"operation":"overseerstatus"}
   [junit4]   2> 234862 DEBUG (OverseerCollectionConfigSetProcessor-72271489285554184-127.0.0.1:38281_solr-n_0000000000) [n:127.0.0.1:38281_solr    ] o.a.s.c.OverseerTaskProcessor Cleaning up work-queue. #Running tasks: 1
   [junit4]   2> 234862 DEBUG (OverseerCollectionConfigSetProcessor-72271489285554184-127.0.0.1:38281_solr-n_0000000000) [n:127.0.0.1:38281_solr    ] o.a.s.c.OverseerTaskProcessor RunningTasks: [/overseer/collection-queue-work/qn-0000000000]
   [junit4]   2> 234862 DEBUG (OverseerCollectionConfigSetProcessor-72271489285554184-127.0.0.1:38281_solr-n_0000000000) [n:127.0.0.1:38281_solr    ] o.a.s.c.OverseerTaskProcessor BlockedTasks: []
   [junit4]   2> 234862 DEBUG (OverseerCollectionConfigSetProcessor-72271489285554184-127.0.0.1:38281_solr-n_0000000000) [n:127.0.0.1:38281_solr    ] o.a.s.c.OverseerTaskProcessor CompletedTasks: []
   [junit4]   2> 234862 DEBUG (OverseerCollectionConfigSetProcessor-72271489285554184-127.0.0.1:38281_solr-n_0000000000) [n:127.0.0.1:38281_solr    ] o.a.s.c.OverseerTaskProcessor RunningZKTasks: [/overseer/collection-queue-work/qn-0000000000]
   [junit4]   2> 234862 DEBUG (OverseerCollectionConfigSetProcessor-72271489285554184-127.0.0.1:38281_solr-n_0000000000) [n:127.0.0.1:38281_solr    ] o.a.s.c.OverseerTaskQueue Peeking for top 99 elements. ExcludeSet: [/overseer/collection-queue-work/qn-0000000000],[]
   [junit4]   2> 234863 DEBUG (OverseerThreadFactory-1320-thread-1-processing-n:127.0.0.1:38281_solr) [n:127.0.0.1:38281_solr    ] o.a.s.c.OverseerTaskProcessor Completed task:[/overseer/collection-queue-work/qn-0000000000]
   [junit4]   2> 234863 DEBUG (SyncThread:0) [    ] o.a.s.c.ZkTestServer Watch fired: data: /solr/overseer/collection-queue-work/qnr-0000000000
   [junit4]   2> 234864 DEBUG (zkCallback-800-thread-1) [    ] o.a.s.c.OverseerTaskQueue NodeDataChanged fired on path /overseer/collection-queue-work/qnr-0000000000 state SyncConnected latchEventType null
   [junit4]   2> 234864 DEBUG (SyncThread:0) [    ] o.a.s.c.ZkTestServer Watch fired: children: /solr/overseer/collection-queue-work
   [junit4]   2> 234864 DEBUG (OverseerThreadFactory-1320-thread-1-processing-n:127.0.0.1:38281_solr) [n:127.0.0.1:38281_solr    ] o.a.s.c.OverseerTaskProcessor Marked task [/overseer/collection-queue-work/qn-0000000000] as completed.
   [junit4]   2> 234864 DEBUG (OverseerThreadFactory-1320-thread-1-processing-n:127.0.0.1:38281_solr) [n:127.0.0.1:38281_solr    ] o.a.s.c.OverseerTaskProcessor RunningTasks: []
   [junit4]   2> 234864 DEBUG (OverseerThreadFactory-1320-thread-1-processing-n:127.0.0.1:38281_solr) [n:127.0.0.1:38281_solr    ] o.a.s.c.OverseerTaskProcessor BlockedTasks: []
   [junit4]   2> 234864 DEBUG (OverseerThreadFactory-1320-thread-1-processing-n:127.0.0.1:38281_solr) [n:127.0.0.1:38281_solr    ] o.a.s.c.OverseerTaskProcessor CompletedTasks: [/overseer/collection-queue-work/qn-0000000000]
   [junit4]   2> 234864 DEBUG (OverseerThreadFactory-1320-thread-1-processing-n:127.0.0.1:38281_solr) [n:127.0.0.1:38281_solr    ] o.a.s.c.OverseerTaskProcessor RunningZKTasks: [/overseer/collection-queue-work/qn-0000000000]
   [junit4]   2> 234864 DEBUG (SyncThread:0) [    ] o.a.s.c.ZkTestServer Watch added: children: /solr/overseer/collection-queue-work
   [junit4]   2> 234864 DEBUG (OverseerThreadFactory-1320-thread-1-processing-n:127.0.0.1:38281_solr) [n:127.0.0.1:38281_solr    ] o.a.s.c.OverseerTaskProcessor Overseer Collection Message Handler: Message id:/overseer/collection-queue-work/qn-0000000000 complete, response:{leader=127.0.0.1:38281_solr,overseer_queue_size=3,overseer_work_queue_size=0,overseer_collection_queue_size=2,overseer_operations={am_i_leader={requests=2,errors=0,avgRequestsPerSecond=14.572024379871108,5minRateRequestsPerSecond=0.0,15minRateRequestsPerSecond=0.0,avgTimePerRequest=0.1289055,medianRequestTime=0.139324,75thPcRequestTime=0.139324,95thPcRequestTime=0.139324,99thPcRequestTime=0.139324,999thPcRequestTime=0.139324},downnode={requests=3,errors=0,avgRequestsPerSecond=22.08043426738256,5minRateRequestsPerSecond=0.0,15minRateRequestsPerSecond=0.0,avgTimePerRequest=0.010801333333333333,medianRequestTime=0.011105,75thPcRequestTime=0.011995,95thPcRequestTime=0.011995,99thPcRequestTime=0.011995,999thPcRequestTime=0.011995}},collection_operations={am_i_leader={requests=3,errors=0,avgRequestsPerSecond=21.871350195653445,5minRateRequestsPerSecond=0.0,15minRateRequestsPerSecond=0.0,avgTimePerRequest=0.1878403333333333,medianRequestTime=0.148364,75thPcRequestTime=0.293591,95thPcRequestTime=0.293591,99thPcRequestTime=0.293591,999thPcRequestTime=0.293591},overseerstatus={requests=0,errors=0,avgRequestsPerSecond=0.0,5minRateRequestsPerSecond=0.0,15minRateRequestsPerSecond=0.0,avgTimePerRequest=0.0,medianRequestTime=0.0,75thPcRequestTime=0.0,95thPcRequestTime=0.0,99thPcRequestTime=0.0,999thPcRequestTime=0.0}},overseer_queue={},overseer_internal_queue={peek={avgRequestsPerSecond=7.325279520579794,5minRateRequestsPerSecond=0.0,15minRateRequestsPerSecond=0.0,avgTimePerRequest=0.201888,medianRequestTime=0.201888,75thPcRequestTime=0.201888,95thPcRequestTime=0.201888,99thPcRequestTime=0.201888,999thPcRequestTime=0.201888}},collection_queue={peektopn_wait2000={avgRequestsPerSecond=7.331174703154138,5minRateRequestsPerSecond=0.0,15minRateRequestsPerSecond=0.0,avgTimePerRequest=134.720206,medianRequestTime=134.720206,75thPcRequestTime=134.720206,95thPcRequestTime=134.720206,99thPcRequestTime=134.720206,999thPcRequestTime=134.720206}}}
   [junit4]   2> 234864 DEBUG (OverseerCollectionConfigSetProcessor-72271489285554184-127.0.0.1:38281_solr-n_0000000000) [n:127.0.0.1:38281_solr    ] o.a.s.c.ZkDistributedQueue Found child node with improper name: qnr-0000000000
   [junit4]   2> 234864 DEBUG (SyncThread:0) [    ] o.a.s.c.ZkTestServer Watch fired: children: /solr/overseer/collection-queue-work
   [junit4]   2> 234864 DEBUG (SyncThread:0) [    ] o.a.s.c.ZkTestServer Watch added: children: /solr/overseer/collection-queue-work
   [junit4]   2> 234865 INFO  (qtp143007212-2947) [n:127.0.0.1:33675_solr    ] o.a.s.s.HttpSolrCall [admin] webapp=null path=/admin/collections params={action=OVERSEERSTATUS&wt=javabin&version=2} status=0 QTime=5
   [junit4]   2> 234877 DEBUG (SyncThread:0) [    ] o.a.s.c.ZkTestServer Watch fired: children: /solr/overseer/queue
   [junit4]   2> 234878 DEBUG (SyncThread:0) [    ] o.a.s.c.ZkTestServer Watch added: children: /solr/overseer/queue
   [junit4]   2> 235130 WARN  (SUITE-MoveReplicaHDFSTest-seed#[621CEBD1EB2F0054]-worker) [    ] o.a.h.u.NativeCodeLoader Unable to load native-hadoop library for your platform... using builtin-java classes where applicable
   [junit4]   1> Formatting using clusterid: testClusterID
   [junit4]   2> 235541 WARN  (SUITE-MoveReplicaHDFSTest-seed#[621CEBD1EB2F0054]-worker) [    ] o.a.h.m.i.MetricsConfig Cannot locate configuration: tried hadoop-metrics2-namenode.properties,hadoop-metrics2.properties
   [junit4]   2> 235652 INFO  (SUITE-MoveReplicaHDFSTest-seed#[621CEBD1EB2F0054]-worker) [    ] o.m.log Logging to org.apache.logging.slf4j.Log4jLogger@6a859bd via org.mortbay.log.Slf4jLog
   [junit4]   2> 235665 WARN  (SUITE-MoveReplicaHDFSTest-seed#[621CEBD1EB2F0054]-worker) [    ] o.a.h.h.HttpRequestLog Jetty request log can only be enabled using Log4j
   [junit4]   2> 235743 DEBUG (ScheduledTrigger-1318-thread-3) [    ] o.a.s.c.a.NodeLostTrigger Running NodeLostTrigger: .auto_add_replicas with currently live nodes: 4
   [junit4]   2> 235790 INFO  (SUITE-MoveReplicaHDFSTest-seed#[621CEBD1EB2F0054]-worker) [    ] o.m.log jetty-6.1.x
   [junit4]   2> 235810 INFO  (SUITE-MoveReplicaHDFSTest-seed#[621CEBD1EB2F0054]-worker) [    ] o.m.log Extract jar:file:/home/jenkins/.ivy2/cache/org.apache.hadoop/hadoop-hdfs/tests/hadoop-hdfs-2.7.4-tests.jar!/webapps/hdfs to ./temp/Jetty_localhost_localdomain_45435_hdfs____.85rp2p/webapp
   [junit4]   2> 235922 INFO  (SUITE-MoveReplicaHDFSTest-seed#[621CEBD1EB2F0054]-worker) [    ] o.m.log Started HttpServer2$SelectChannelConnectorWithSafeStartup@localhost.localdomain:45435
   [junit4]   2> 236380 WARN  (SUITE-MoveReplicaHDFSTest-seed#[621CEBD1EB2F0054]-worker) [    ] o.a.h.h.HttpRequestLog Jetty request log can only be enabled using Log4j
   [junit4]   2> 236383 INFO  (SUITE-MoveReplicaHDFSTest-seed#[621CEBD1EB2F0054]-worker) [    ] o.m.log jetty-6.1.x
   [junit4]   2> 236387 INFO  (SUITE-MoveReplicaHDFSTest-seed#[621CEBD1EB2F0054]-worker) [    ] o.m.log Extract jar:file:/home/jenkins/.ivy2/cache/org.apache.hadoop/hadoop-hdfs/tests/hadoop-hdfs-2.7.4-tests.jar!/webapps/datanode to ./temp/Jetty_localhost_42983_datanode____.2v4j1f/webapp
   [junit4]   2> 236463 INFO  (SUITE-MoveReplicaHDFSTest-seed#[621CEBD1EB2F0054]-worker) [    ] o.m.log Started HttpServer2$SelectChannelConnectorWithSafeStartup@localhost:42983
   [junit4]   2> 236484 INFO  (SUITE-MoveReplicaHDFSTest-seed#[621CEBD1EB2F0054]-worker) [    ] i.n.u.i.PlatformDependent Your platform does not provide complete low-level API for accessing direct buffers reliably. Unless explicitly requested, heap buffer will always be preferred to avoid potential system unstability.
   [junit4]   2> 236621 WARN  (SUITE-MoveReplicaHDFSTest-seed#[621CEBD1EB2F0054]-worker) [    ] o.a.h.h.HttpRequestLog Jetty request log can only be enabled using Log4j
   [junit4]   2> 236622 INFO  (SUITE-MoveReplicaHDFSTest-seed#[621CEBD1EB2F0054]-worker) [    ] o.m.log jetty-6.1.x
   [junit4]   2> 236626 INFO  (SUITE-MoveReplicaHDFSTest-seed#[621CEBD1EB2F0054]-worker) [    ] o.m.log Extract jar:file:/home/jenkins/.ivy2/cache/org.apache.hadoop/hadoop-hdfs/tests/hadoop-hdfs-2.7.4-tests.jar!/webapps/datanode to ./temp/Jetty_localhost_33409_datanode____lhhqo4/webapp
   [junit4]   2> 236697 INFO  (SUITE-MoveReplicaHDFSTest-seed#[621CEBD1EB2F0054]-worker) [    ] o.m.log Started HttpServer2$SelectChannelConnectorWithSafeStartup@localhost:33409
   [junit4]   2> 236745 DEBUG (ScheduledTrigger-1318-thread-4) [    ] o.a.s.c.a.NodeLostTrigger Running NodeLostTrigger: .auto_add_replicas with currently live nodes: 4
   [junit4]   2> 236863 DEBUG (OverseerCollectionConfigSetProcessor-72271489285554184-127.0.0.1:38281_solr-n_0000000000) [n:127.0.0.1:38281_solr    ] o.a.s.c.OverseerTaskProcessor Got 0 tasks from work-queue : [[]]
   [junit4]   2> 236863 DEBUG (OverseerCollectionConfigSetProcessor-72271489285554184-127.0.0.1:38281_solr-n_0000000000) [n:127.0.0.1:38281_solr    ] o.a.s.c.OverseerTaskProcessor Cleaning up work-queue. #Running tasks: 0
   [junit4]   2> 236863 INFO  (OverseerCollectionConfigSetProcessor-72271489285554184-127.0.0.1:38281_solr-n_0000000000) [n:127.0.0.1:38281_solr    ] o.a.s.c.OverseerTaskQueue Response ZK path: /overseer/collection-queue-work/qnr-0000000000 doesn't exist.  Requestor may have disconnected from ZooKeeper
   [junit4]   2> 236864 DEBUG (OverseerCollectionConfigSetProcessor-72271489285554184-127.0.0.1:38281_solr-n_0000000000) [n:127.0.0.1:38281_solr    ] o.a.s.c.OverseerTaskProcessor RunningTasks: []
   [junit4]   2> 236864 DEBUG (OverseerCollectionConfigSetProcessor-72271489285554184-127.0.0.1:38281_solr-n_0000000000) [n:127.0.0.1:38281_solr    ] o.a.s.c.OverseerTaskProcessor BlockedTasks: []
   [junit4]   2> 236864 DEBUG (OverseerCollectionConfigSetProcessor-72271489285554184-127.0.0.1:38281_solr-n_0000000000) [n:127.0.0.1:38281_solr    ] o.a.s.c.OverseerTaskProcessor CompletedTasks: []
   [junit4]   2> 236864 DEBUG (OverseerCollectionConfigSetProcessor-72271489285554184-127.0.0.1:38281_solr-n_0000000000) [n:127.0.0.1:38281_solr    ] o.a.s.c.OverseerTaskProcessor RunningZKTasks: []
   [junit4]   2> 236864 DEBUG (OverseerCollectionConfigSetProcessor-72271489285554184-127.0.0.1:38281_solr-n_0000000000) [n:127.0.0.1:38281_solr    ] o.a.s.c.OverseerTaskQueue Peeking for top 100 elements. ExcludeSet: []
   [junit4]   2> 237217 ERROR (DataNode: [[[DISK]file:/home/jenkins/workspace/Lucene-Solr-master-Linux/solr/build/solr-core/test/J0/temp/solr.cloud.MoveReplicaHDFSTest_621CEBD1EB2F0054-001/tempDir-002/hdfsBaseDir/data/data3/, [DISK]file:/home/jenkins/workspace/Lucene-Solr-master-Linux/solr/build/solr-core/test/J0/temp/solr.cloud.MoveReplicaHDFSTest_621CEBD1EB2F0054-001/tempDir-002/hdfsBaseDir/data/data4/]]  heartbeating to localhost.localdomain/127.0.0.1:42437) [    ] o.a.h.h.s.d.DirectoryScanner dfs.datanode.directoryscan.throttle.limit.ms.per.sec set to value below 1 ms/sec. Assuming default value of 1000
   [junit4]   2> 237217 ERROR (DataNode: [[[DISK]file:/home/jenkins/workspace/Lucene-Solr-master-Linux/solr/build/solr-core/test/J0/temp/solr.cloud.MoveReplicaHDFSTest_621CEBD1EB2F0054-001/tempDir-002/hdfsBaseDir/data/data1/, [DISK]file:/home/jenkins/workspace/Lucene-Solr-master-Linux/solr/build/solr-core/test/J0/temp/solr.cloud.MoveReplicaHDFSTest_621CEBD1EB2F0054-001/tempDir-002/hdfsBaseDir/data/data2/]]  heartbeating to localhost.localdomain/127.0.0.1:42437) [    ] o.a.h.h.s.d.DirectoryScanner dfs.datanode.directoryscan.throttle.limit.ms.per.sec set to value below 1 ms/sec. Assuming default value of 1000
   [junit4]   2> 237265 INFO  (Block report processor) [    ] BlockStateChange BLOCK* processReport 0xb98653858b012: from storage DS-d2520483-c0a1-40da-9a98-bf5011055bd1 node DatanodeRegistration(127.0.0.1:36341, datanodeUuid=761e4a87-63de-452f-a6d8-2c3b0da63948, infoPort=45937, infoSecurePort=0, ipcPort=46061, storageInfo=lv=-56;cid=testClusterID;nsid=1124728883;c=0), blocks: 0, hasStaleStorage: true, processing time: 1 msecs
   [junit4]   2> 237265 INFO  (Block report processor) [    ] BlockStateChange BLOCK* processReport 0xb98653858b041: from storage DS-ebba4044-0633-4c7c-9485-ac8de5a6de39 node DatanodeRegistration(127.0.0.1:37367, datanodeUuid=703d43fe-beb8-4961-81b0-5da7e6f0bed3, infoPort=33945, infoSecurePort=0, ipcPort=43217, storageInfo=lv=-56;cid=testClusterID;nsid=1124728883;c=0), blocks: 0, hasStaleStorage: true, processing time: 0 msecs
   [junit4]   2> 237265 INFO  (Block report processor) [    ] BlockStateChange BLOCK* processReport 0xb98653858b012: from storage DS-9388d3a6-c0ce-4d64-8b68-14e0f7072bf4 node DatanodeRegistration(127.0.0.1:36341, datanodeUuid=761e4a87-63de-452f-a6d8-2c3b0da63948, infoPort=45937, infoSecurePort=0, ipcPort=46061, storageInfo=lv=-56;cid=testClusterID;nsid=1124728883;c=0), blocks: 0, hasStaleStorage: false, processing time: 0 msecs
   [junit4]   2> 237265 INFO  (Block report processor) [    ] BlockStateChange BLOCK* processReport 0xb98653858b041: from storage DS-3513d74c-6896-4075-8e19-8e35224b77b2 node DatanodeRegistration(127.0.0.1:37367, datanodeUuid=703d43fe-beb8-4961-81b0-5da7e6f0bed3, infoPort=33945, infoSecurePort=0, ipcPort=43217, storageInfo=lv=-56;cid=testClusterID;nsid=1124728883;c=0), blocks: 0, hasStaleStorage: false, processing time: 0 msecs
   [junit4]   2> 237443 INFO  (TEST-MoveReplicaHDFSTest.test-seed#[621CEBD1EB2F0054]) [    ] o.a.s.SolrTestCaseJ4 ###Starting test
   [junit4]   2> 237444 DEBUG (SyncThread:0) [    ] o.a.s.c.ZkTestServer Watch added: create/delete: /solr/clusterprops.json
   [junit4]   2> 237444 DEBUG (SyncThread:0) [    ] o.a.s.c.ZkTestServer Watch added: children: /solr/live_nodes
   [junit4]   2> 237444 INFO  (TEST-MoveReplicaHDFSTest.test-seed#[621CEBD1EB2F0054]) [    ] o.a.s.c.c.ZkStateReader Updated live nodes from ZooKeeper... (0) -> (4)
   [junit4]   2> 237444 DEBUG (SyncThread:0) [    ] o.a.s.c.ZkTestServer Watch added: data: /solr/clusterstate.json
   [junit4]   2> 237444 DEBUG (SyncThread:0) [    ] o.a.s.c.ZkTestServer Watch added: children: /solr/collections
   [junit4]   2> 237444 DEBUG (SyncThread:0) [    ] o.a.s.c.ZkTestServer Watch added: create/delete: /solr/aliases.json
   [junit4]   2> 237445 DEBUG (SyncThread:0) [    ] o.a.s.c.ZkTestServer Watch fired: data: /solr/aliases.json
   [junit4]   2> 237445 DEBUG (SyncThread:0) [    ] o.a.s.c.ZkTestServer Watch fired: data: /solr/aliases.json
   [junit4]   2> 237445 DEBUG (SyncThread:0) [    ] o.a.s.c.ZkTestServer Watch fired: data: /solr/aliases.json
   [junit4]   2> 237445 DEBUG (SyncThread:0) [    ] o.a.s.c.ZkTestServer Watch fired: data: /solr/aliases.json
   [junit4]   2> 237445 DEBUG (SyncThread:0) [    ] o.a.s.c.ZkTestServer Watch fired: data: /solr/aliases.json
   [junit4]   2> 237445 DEBUG (SyncThread:0) [    ] o.a.s.c.ZkTestServer Watch fired: data: /solr/aliases.json
   [junit4]   2> 237445 DEBUG (SyncThread:0) [    ] o.a.s.c.ZkTestServer Watch fired: data: /solr/aliases.json
   [junit4]   2> 237445 DEBUG (SyncThread:0) [    ] o.a.s.c.ZkTestServer Watch fired: data: /solr/aliases.json
   [junit4]   2> 237445 DEBUG (SyncThread:0) [    ] o.a.s.c.ZkTestServer Watch fired: data: /solr/aliases.json
   [junit4]   2> 237445 DEBUG (SyncThread:0) [    ] o.a.s.c.ZkTestServer Watch added: data: /solr/aliases.json
   [junit4]   2> 237445 DEBUG (SyncThread:0) [    ] o.a.s.c.ZkTestServer Watch added: data: /solr/aliases.json
   [junit4]   2> 237445 DEBUG (SyncThread:0) [    ] o.a.s.c.ZkTestServer Watch added: data: /solr/aliases.json
   [junit4]   2> 237445 DEBUG (SyncThread:0) [    ] o.a.s.c.ZkTestServer Watch added: data: /solr/aliases.json
   [junit4]   2> 237445 DEBUG (SyncThread:0) [    ] o.a.s.c.ZkTestServer Watch added: data: /solr/aliases.json
   [junit4]   2> 237445 DEBUG (SyncThread:0) [    ] o.a.s.c.ZkTestServer Watch added: data: /solr/aliases.json
   [junit4]   2> 237445 DEBUG (SyncThread:0) [    ] o.a.s.c.ZkTestServer Watch added: data: /solr/aliases.json
   [junit4]   2> 237445 DEBUG (SyncThread:0) [    ] o.a.s.c.ZkTestServer Watch added: data: /solr/aliases.json
   [junit4]   2> 237445 DEBUG (SyncThread:0) [    ] o.a.s.c.ZkTestServer Watch added: data: /solr/aliases.json
   [junit4]   2> 237446 INFO  (TEST-MoveReplicaHDFSTest.test-seed#[621CEBD1EB2F0054]) [    ] o.e.j.s.Server jetty-9.4.11.v20180605; built: 2018-06-05T18:24:03.829Z; git: d5fc0523cfa96bfebfbda19606cad384d772f04c; jvm 9.0.4+11
   [junit4]   2> 237447 DEBUG (SyncThread:0) [    ] o.a.s.c.ZkTestServer Watch added: data: /solr/aliases.json
   [junit4]   2> 237447 INFO  (TEST-MoveReplicaHDFSTest.test-seed#[621CEBD1EB2F0054]) [    ] o.e.j.s.session DefaultSessionIdManager workerName=node0
   [junit4]   2> 237447 INFO  (TEST-MoveReplicaHDFSTest.test-seed#[621CEBD1EB2F0054]) [    ] o.e.j.s.session No SessionScavenger set, using defaults
   [junit4]   2> 237447 INFO  (TEST-MoveReplicaHDFSTest.test-seed#[621CEBD1EB2F0054]) [    ] o.e.j.s.session node0 Scavenging every 600000ms
   [junit4]   2> 237447 INFO  (TEST-MoveReplicaHDFSTest.test-seed#[621CEBD1EB2F0054]) [    ] o.e.j.s.h.ContextHandler Started o.e.j.s.ServletContextHandler@35a42f06{/solr,null,AVAILABLE}
   [junit4]   2> 237448 INFO  (TEST-MoveReplicaHDFSTest.test-seed#[621CEBD1EB2F0054]) [    ] o.e.j.s.AbstractConnector Started ServerConnector@720763e2{HTTP/1.1,[http/1.1]}{127.0.0.1:33025}
   [junit4]   2> 237448 INFO  (TEST-MoveReplicaHDFSTest.test-seed#[621CEBD1EB2F0054]) [    ] o.e.j.s.Server Started @237504ms
   [junit4]   2> 237448 INFO  (TEST-MoveReplicaHDFSTest.test-seed#[621CEBD1EB2F0054]) [    ] o.a.s.c.s.e.JettySolrRunner Jetty properties: {hostContext=/solr, hostPort=33025}
   [junit4]   2> 237448 ERROR (TEST-MoveReplicaHDFSTest.test-seed#[621CEBD1EB2F0054]) [    ] o.a.s.u.StartupLoggingUtils Missing Java Option solr.log.dir. Logging may be missing or incomplete.
   [junit4]   2> 237448 INFO  (TEST-MoveReplicaHDFSTest.test-seed#[621CEBD1EB2F0054]) [    ] o.a.s.s.SolrDispatchFilter Using logger factory org.apache.logging.slf4j.Log4jLoggerFactory
   [junit4]   2> 237448 INFO  (TEST-MoveReplicaHDFSTest.test-seed#[621CEBD1EB2F0054]) [    ] o.a.s.s.SolrDispatchFilter  ___      _       Welcome to Apache Solr? version 8.0.0
   [junit4]   2> 237448 INFO  (TEST-MoveReplicaHDFSTest.test-seed#[621CEBD1EB2F0054]) [    ] o.a.s.s.SolrDispatchFilter / __| ___| |_ _   Starting in cloud mode on port null
   [junit4]   2> 237448 INFO  (TEST-MoveReplicaHDFSTest.test-seed#[621CEBD1EB2F0054]) [    ] o.a.s.s.SolrDispatchFilter \__ \/ _ \ | '_|  Install dir: null
   [junit4]   2> 237448 INFO  (TEST-MoveReplicaHDFSTest.test-seed#[621CEBD1EB2F0054]) [    ] o.a.s.s.SolrDispatchFilter |___/\___/_|_|    Start time: 2018-09-23T02:01:47.810618Z
   [junit4]   2> 237452 INFO  (zkConnectionManagerCallback-841-thread-1) [    ] o.a.s.c.c.ConnectionManager zkClient has connected
   [junit4]   2> 237452 INFO  (TEST-MoveReplicaHDFSTest.test-seed#[621CEBD1EB2F0054]) [    ] o.a.s.s.SolrDispatchFilter solr.xml found in ZooKeeper. Loading...
   [junit4]   2> 237512 INFO  (TEST-MoveReplicaHDFSTest.test-seed#[621CEBD1EB2F0054]) [    ] o.a.s.c.ZkContainer Zookeeper client=127.0.0.1:42707/solr
   [junit4]   2> 237516 INFO  (zkConnectionManagerCallback-845-thread-1) [    ] o.a.s.c.c.ConnectionManager zkClient has connected
   [junit4]   2> 237517 DEBUG (TEST-MoveReplicaHDFSTest.test-seed#[621CEBD1EB2F0054]) [n:127.0.0.1:33025_solr    ] o.a.s.c.ZkController Added new OnReconnect listener org.apache.solr.cloud.ZkController$$Lambda$196/520537219@5c304ea6
   [junit4]   2> 237518 INFO  (zkConnectionManagerCallback-847-thread-1) [    ] o.a.s.c.c.ConnectionManager zkClient has connected
   [junit4]   2> 237521 DEBUG (SyncThread:0) [    ] o.a.s.c.ZkTestServer Watch added: create/delete: /solr/clusterprops.json
   [junit4]   2> 237521 DEBUG (SyncThread:0) [    ] o.a.s.c.ZkTestServer Watch added: children: /solr/live_nodes
   [junit4]   2> 237521 INFO  (TEST-MoveReplicaHDFSTest.test-seed#[621CEBD1EB2F0054]) [n:127.0.0.1:33025_solr    ] o.a.s.c.c.ZkStateReader Updated live nodes from ZooKeeper... (0) -> (4)
   [junit4]   2> 237521 DEBUG (SyncThread:0) [    ] o.a.s.c.ZkTestServer Watch added: data: /solr/clusterstate.json
   [junit4]   2> 237525 DEBUG (SyncThread:0) [    ] o.a.s.c.ZkTestServer Watch added: children: /solr/collections
   [junit4]   2> 237526 DEBUG (SyncThread:0) [    ] o.a.s.c.ZkTestServer Watch added: create/delete: /solr/aliases.json
   [junit4]   2> 237526 DEBUG (SyncThread:0) [    ] o.a.s.c.ZkTestServer Watch added: create/delete: /solr/security.json
   [junit4]   2> 237527 DEBUG (TEST-MoveReplicaHDFSTest.test-seed#[621CEBD1EB2F0054]) [n:127.0.0.1:33025_solr    ] o.a.s.c.LeaderElector Joined leadership election with path: /overseer_elect/election/72271489285554197-127.0.0.1:33025_solr-n_0000000004
   [junit4]   2> 237527 DEBUG (SyncThread:0) [    ] o.a.s.c.ZkTestServer Watch added: data: /solr/overseer_elect/election/72271489285554191-127.0.0.1:45297_solr-n_0000000003
   [junit4]   2> 237527 DEBUG (TEST-MoveReplicaHDFSTest.test-seed#[621CEBD1EB2F0054]) [n:127.0.0.1:33025_solr    ] o.a.s.c.LeaderElector Watching path /overseer_elect/election/72271489285554191-127.0.0.1:45297_solr-n_0000000003 to know if I could be the leader
   [junit4]   2> 237527 DEBUG (TEST-MoveReplicaHDFSTest.test-seed#[621CEBD1EB2F0054]) [n:127.0.0.1:33025_solr    ] o.a.s.c.ZkController Publish node=127.0.0.1:33025_solr as DOWN
   [junit4]   2> 237528 DEBUG (SyncThread:0) [    ] o.a.s.c.ZkTestServer Watch fired: children: /solr/overseer/queue
   [junit4]   2> 237528 INFO  (TEST-MoveReplicaHDFSTest.test-seed#[621CEBD1EB2F0054]) [n:127.0.0.1:33025_solr    ] o.a.s.c.TransientSolrCoreCacheDefault Allocating transient cache for 2147483647 transient cores
   [junit4]   2> 237528 INFO  (TEST-MoveReplicaHDFSTest.test-seed#[621CEBD1EB2F0054]) [n:127.0.0.1:33025_solr    ] o.a.s.c.ZkController Register node as live in ZooKeeper:/live_nodes/127.0.0.1:33025_solr
   [junit4]   2> 237528 DEBUG (SyncThread:0) [    ] o.a.s.c.ZkTestServer Watch added: children: /solr/overseer/queue
   [junit4]   2> 237529 DEBUG (SyncThread:0) [    ] o.a.s.c.ZkTestServer Watch fired: children: /solr/live_nodes
   [junit4]   2> 237529 DEBUG (SyncThread:0) [    ] o.a.s.c.ZkTestServer Watch fired: children: /solr/live_nodes
   [junit4]   2> 237529 DEBUG (SyncThread:0) [    ] o.a.s.c.ZkTestServer Watch fired: children: /solr/live_nodes
   [junit4]   2> 237529 DEBUG (SyncThread:0) [    ] o.a.s.c.ZkTestServer Watch fired: children: /solr/live_nodes
   [junit4]   2> 237529 DEBUG (SyncThread:0) [    ] o.a.s.c.ZkTestServer Watch fired: children: /solr/live_nodes
   [junit4]   2> 237529 DEBUG (SyncThread:0) [    ] o.a.s.c.ZkTestServer Watch fired: children: /solr/live_nodes
   [junit4]   2> 237529 DEBUG (SyncThread:0) [    ] o.a.s.c.ZkTestServer Watch fired: children: /solr/live_nodes
   [junit4]   2> 237529 DEBUG (SyncThread:0) [    ] o.a.s.c.ZkTestServer Watch fired: children: /solr/live_nodes
   [junit4]   2> 237529 DEBUG (SyncThread:0) [    ] o.a.s.c.ZkTestServer Watch fired: children: /solr/live_nodes
   [junit4]   2> 237529 DEBUG (SyncThread:0) [    ] o.a.s.c.ZkTestServer Watch fired: children: /solr/live_nodes
   [junit4]   2> 237529 DEBUG (SyncThread:0) [    ] o.a.s.c.ZkTestServer Watch added: children: /solr/live_nodes
   [junit4]   2> 237529 DEBUG (SyncThread:0) [    ] o.a.s.c.ZkTestServer Watch added: children: /solr/live_nodes
   [junit4]   2> 237529 DEBUG (SyncThread:0) [    ] o.a.s.c.ZkTestServer Watch added: children: /solr/live_nodes
   [junit4]   2> 237529 DEBUG (SyncThread:0) [    ] o.a.s.c.ZkTestServer Watch added: children: /solr/live_nodes
   [junit4]   2> 237529 INFO  (zkCallback-813-thread-1) [    ] o.a.s.c.c.ZkStateReader Updated live nodes from ZooKeeper... (4) -> (5)
   [junit4]   2> 237529 INFO  (zkCallback-779-thread-1) [    ] o.a.s.c.c.ZkStateReader Updated live nodes from ZooKeeper... (4) -> (5)
   [junit4]   2> 237529 INFO  (zkCallback-800-thread-1) [    ] o.a.s.c.c.ZkStateReader Updated live nodes from ZooKeeper... (4) -> (5)
   [junit4]   2> 237529 DEBUG (SyncThread:0) [    ] o.a.s.c.ZkTestServer Watch added: children: /solr/live_nodes
   [junit4]   2> 237530 INFO  (zkCallback-828-thread-1) [    ] o.a.s.c.c.ZkStateReader Updated live nodes from ZooKeeper... (4) -> (5)
   [junit4]   2> 237530 INFO  (zkCallback-805-thread-1) [    ] o.a.s.c.c.ZkStateReader Updated live nodes from ZooKeeper... (4) -> (5)
   [junit4]   2> 237530 DEBUG (SyncThread:0) [    ] o.a.s.c.ZkTestServer Watch added: children: /solr/live_nodes
   [junit4]   2> 237530 INFO  (zkCallback-846-thread-1) [    ] o.a.s.c.c.ZkStateReader Updated live nodes from ZooKeeper... (4) -> (5)
   [junit4]   2> 237530 DEBUG (SyncThread:0) [    ] o.a.s.c.ZkTestServer Watch added: children: /solr/live_nodes
   [junit4]   2> 237530 DEBUG (SyncThread:0) [    ] o.a.s.c.ZkTestServer Watch added: children: /solr/live_nodes
   [junit4]   2> 237530 INFO  (zkCallback-795-thread-1) [    ] o.a.s.c.c.ZkStateReader Updated live nodes from ZooKeeper... (4) -> (5)
   [junit4]   2> 237530 DEBUG (SyncThread:0) [    ] o.a.s.c.ZkTestServer Watch added: children: /solr/live_nodes
   [junit4]   2> 237530 INFO  (zkCallback-787-thread-2) [    ] o.a.s.c.c.ZkStateReader Updated live nodes from ZooKeeper... (4) -> (5)
   [junit4]   2> 237530 DEBUG (SyncThread:0) [    ] o.a.s.c.ZkTestServer Watch added: children: /solr/live_nodes
   [junit4]   2> 237530 INFO  (zkCallback-820-thread-1) [    ] o.a.s.c.c.ZkStateReader Updated live nodes from ZooKeeper... (4) -> (5)
   [junit4]   2> 237530 DEBUG (SyncThread:0) [    ] o.a.s.c.ZkTestServer Watch added: children: /solr/live_nodes
   [junit4]   2> 237530 INFO  (zkCallback-836-thread-1) [    ] o.a.s.c.c.ZkStateReader Updated live nodes from ZooKeeper... (4) -> (5)
   [junit4]   2> 237531 INFO  (zkCallback-836-thread-2) [    ] o.a.s.c.c.ZkStateReader Updated live nodes from ZooKeeper... (4) -> (5)
   [junit4]   2> 237549 INFO  (zkConnectionManagerCallback-854-thread-1) [    ] o.a.s.c.c.ConnectionManager zkClient has connected
   [junit4]   2> 237550 DEBUG (SyncThread:0) [    ] o.a.s.c.ZkTestServer Watch added: create/delete: /solr/clusterprops.json
   [junit4]   2> 237550 DEBUG (SyncThread:0) [    ] o.a.s.c.ZkTestServer Watch added: children: /solr/live_nodes
   [junit4]   2> 237550 INFO  (TEST-MoveReplicaHDFSTest.test-seed#[621CEBD1EB2F0054]) [n:127.0.0.1:33025_solr    ] o.a.s.c.c.ZkStateReader Updated live nodes from ZooKeeper... (0) -> (5)
   [junit4]   2> 237550 DEBUG (SyncThread:0) [    ] o.a.s.c.ZkTestServer Watch added: data: /solr/clusterstate.json
   

[...truncated too long message...]

O  (jetty-closer-130-thread-4) [    ] o.e.j.s.h.ContextHandler Stopped o.e.j.s.ServletContextHandler@672f4c7f{/solr,null,UNAVAILABLE}
   [junit4]   2> 157197 INFO  (jetty-closer-130-thread-4) [    ] o.e.j.s.session node0 Stopped scavenging
   [junit4]   2> 157197 INFO  (jetty-closer-130-thread-1) [    ] o.e.j.s.h.ContextHandler Stopped o.e.j.s.ServletContextHandler@32b3c0a6{/solr,null,UNAVAILABLE}
   [junit4]   2> 157197 INFO  (jetty-closer-130-thread-1) [    ] o.e.j.s.session node0 Stopped scavenging
   [junit4]   2> 157197 INFO  (jetty-closer-130-thread-2) [    ] o.e.j.s.h.ContextHandler Stopped o.e.j.s.ServletContextHandler@c03f222{/solr,null,UNAVAILABLE}
   [junit4]   2> 157198 INFO  (jetty-closer-130-thread-2) [    ] o.e.j.s.session node0 Stopped scavenging
   [junit4]   2> 157199 ERROR (SUITE-MoveReplicaHDFSTest-seed#[621CEBD1EB2F0054]-worker) [    ] o.a.z.s.ZooKeeperServer ZKShutdownHandler is not registered, so ZooKeeper server won't take any action on ERROR or SHUTDOWN server state changes
   [junit4]   2> 157199 INFO  (SUITE-MoveReplicaHDFSTest-seed#[621CEBD1EB2F0054]-worker) [    ] o.a.s.c.ZkTestServer connecting to 127.0.0.1:34849 34849
   [junit4]   2> 158567 INFO  (Thread-2111) [    ] o.a.s.c.ZkTestServer connecting to 127.0.0.1:34849 34849
   [junit4]   2> 158569 WARN  (Thread-2111) [    ] o.a.s.c.ZkTestServer Watch limit violations: 
   [junit4]   2> Maximum concurrent create/delete watches above limit:
   [junit4]   2> 
   [junit4]   2> 	34	/solr/collections/MoveReplicaHDFSTest_coll_false/terms/shard2
   [junit4]   2> 	28	/solr/collections/MoveReplicaHDFSTest_coll_true/terms/shard1
   [junit4]   2> 	19	/solr/configs/conf1
   [junit4]   2> 	17	/solr/aliases.json
   [junit4]   2> 	17	/solr/clusterprops.json
   [junit4]   2> 	10	/solr/collections/MoveReplicaHDFSTest_failed_coll_true/terms/shard2
   [junit4]   2> 	10	/solr/collections/MoveReplicaHDFSTest_coll_false/terms/shard1
   [junit4]   2> 	10	/solr/collections/MoveReplicaHDFSTest_coll_true/terms/shard2
   [junit4]   2> 	9	/solr/collections/MoveReplicaHDFSTest_failed_coll_true/terms/shard1
   [junit4]   2> 	7	/solr/collections/MoveReplicaHDFSTest_failed_coll_false/terms/shard2
   [junit4]   2> 	7	/solr/collections/MoveReplicaHDFSTest_failed_coll_false/terms/shard1
   [junit4]   2> 	6	/solr/security.json
   [junit4]   2> 
   [junit4]   2> Maximum concurrent data watches above limit:
   [junit4]   2> 
   [junit4]   2> 	17	/solr/clusterstate.json
   [junit4]   2> 	11	/solr/collections/MoveReplicaHDFSTest_coll_true/state.json
   [junit4]   2> 	10	/solr/aliases.json
   [junit4]   2> 	7	/solr/collections/MoveReplicaHDFSTest_coll_false/state.json
   [junit4]   2> 	4	/solr/collections/MoveReplicaHDFSTest_failed_coll_false/state.json
   [junit4]   2> 	4	/solr/collections/MoveReplicaHDFSTest_failed_coll_true/state.json
   [junit4]   2> 	3	/solr/collections/MoveReplicaHDFSTest_coll_true/leader_elect/shard1/election/72271739630977039-core_node3-n_0000000000
   [junit4]   2> 	2	/solr/collections/MoveReplicaHDFSTest_coll_false/leader_elect/shard2/election/72271739630977032-core_node7-n_0000000001
   [junit4]   2> 	2	/solr/overseer_elect/election/72271739630977039-127.0.0.1:34933_solr-n_0000000003
   [junit4]   2> 	2	/solr/overseer_elect/election/72271739630977032-127.0.0.1:33317_solr-n_0000000001
   [junit4]   2> 
   [junit4]   2> Maximum concurrent children watches above limit:
   [junit4]   2> 
   [junit4]   2> 	32	/solr/collections
   [junit4]   2> 	29	/solr/live_nodes
   [junit4]   2> 
   [junit4]   2> 158570 WARN  (SUITE-MoveReplicaHDFSTest-seed#[621CEBD1EB2F0054]-worker) [    ] o.a.h.h.s.d.DirectoryScanner DirectoryScanner: shutdown has been called
   [junit4]   2> 158661 INFO  (SUITE-MoveReplicaHDFSTest-seed#[621CEBD1EB2F0054]-worker) [    ] o.m.log Stopped HttpServer2$SelectChannelConnectorWithSafeStartup@localhost:0
   [junit4]   2> 158762 WARN  (DataNode: [[[DISK]file:/home/jenkins/workspace/Lucene-Solr-master-Linux/solr/build/solr-core/test/J0/temp/solr.cloud.MoveReplicaHDFSTest_621CEBD1EB2F0054-002/tempDir-002/hdfsBaseDir/data/data3/, [DISK]file:/home/jenkins/workspace/Lucene-Solr-master-Linux/solr/build/solr-core/test/J0/temp/solr.cloud.MoveReplicaHDFSTest_621CEBD1EB2F0054-002/tempDir-002/hdfsBaseDir/data/data4/]]  heartbeating to localhost.localdomain/127.0.0.1:44411) [    ] o.a.h.h.s.d.IncrementalBlockReportManager IncrementalBlockReportManager interrupted
   [junit4]   2> 158762 WARN  (DataNode: [[[DISK]file:/home/jenkins/workspace/Lucene-Solr-master-Linux/solr/build/solr-core/test/J0/temp/solr.cloud.MoveReplicaHDFSTest_621CEBD1EB2F0054-002/tempDir-002/hdfsBaseDir/data/data3/, [DISK]file:/home/jenkins/workspace/Lucene-Solr-master-Linux/solr/build/solr-core/test/J0/temp/solr.cloud.MoveReplicaHDFSTest_621CEBD1EB2F0054-002/tempDir-002/hdfsBaseDir/data/data4/]]  heartbeating to localhost.localdomain/127.0.0.1:44411) [    ] o.a.h.h.s.d.DataNode Ending block pool service for: Block pool BP-1935325669-88.99.242.108-1537671925777 (Datanode Uuid bd077710-81f0-44cf-a068-b78c1aa1ea31) service to localhost.localdomain/127.0.0.1:44411
   [junit4]   2> 158765 WARN  (SUITE-MoveReplicaHDFSTest-seed#[621CEBD1EB2F0054]-worker) [    ] o.a.h.h.s.d.DirectoryScanner DirectoryScanner: shutdown has been called
   [junit4]   2> 158769 INFO  (SUITE-MoveReplicaHDFSTest-seed#[621CEBD1EB2F0054]-worker) [    ] o.m.log Stopped HttpServer2$SelectChannelConnectorWithSafeStartup@localhost:0
   [junit4]   2> 158871 WARN  (DataNode: [[[DISK]file:/home/jenkins/workspace/Lucene-Solr-master-Linux/solr/build/solr-core/test/J0/temp/solr.cloud.MoveReplicaHDFSTest_621CEBD1EB2F0054-002/tempDir-002/hdfsBaseDir/data/data1/, [DISK]file:/home/jenkins/workspace/Lucene-Solr-master-Linux/solr/build/solr-core/test/J0/temp/solr.cloud.MoveReplicaHDFSTest_621CEBD1EB2F0054-002/tempDir-002/hdfsBaseDir/data/data2/]]  heartbeating to localhost.localdomain/127.0.0.1:44411) [    ] o.a.h.h.s.d.IncrementalBlockReportManager IncrementalBlockReportManager interrupted
   [junit4]   2> 158871 WARN  (DataNode: [[[DISK]file:/home/jenkins/workspace/Lucene-Solr-master-Linux/solr/build/solr-core/test/J0/temp/solr.cloud.MoveReplicaHDFSTest_621CEBD1EB2F0054-002/tempDir-002/hdfsBaseDir/data/data1/, [DISK]file:/home/jenkins/workspace/Lucene-Solr-master-Linux/solr/build/solr-core/test/J0/temp/solr.cloud.MoveReplicaHDFSTest_621CEBD1EB2F0054-002/tempDir-002/hdfsBaseDir/data/data2/]]  heartbeating to localhost.localdomain/127.0.0.1:44411) [    ] o.a.h.h.s.d.DataNode Ending block pool service for: Block pool BP-1935325669-88.99.242.108-1537671925777 (Datanode Uuid fbe9b372-bfa9-44b9-b759-ee9b10e1adab) service to localhost.localdomain/127.0.0.1:44411
   [junit4]   2> 158875 INFO  (SUITE-MoveReplicaHDFSTest-seed#[621CEBD1EB2F0054]-worker) [    ] o.m.log Stopped HttpServer2$SelectChannelConnectorWithSafeStartup@localhost.localdomain:0
   [junit4]   2> 158985 INFO  (SUITE-MoveReplicaHDFSTest-seed#[621CEBD1EB2F0054]-worker) [    ] o.a.s.c.ZkTestServer connecting to 127.0.0.1:34849 34849
   [junit4]   2> NOTE: leaving temporary files on disk at: /home/jenkins/workspace/Lucene-Solr-master-Linux/solr/build/solr-core/test/J0/temp/solr.cloud.MoveReplicaHDFSTest_621CEBD1EB2F0054-002
   [junit4]   2> Sep 23, 2018 3:06:31 AM com.carrotsearch.randomizedtesting.ThreadLeakControl checkThreadLeaks
   [junit4]   2> WARNING: Will linger awaiting termination of 66 leaked thread(s).
   [junit4]   2> NOTE: test params are: codec=Asserting(Lucene80): {id=PostingsFormat(name=LuceneFixedGap)}, docValues:{_version_=DocValuesFormat(name=Lucene70)}, maxPointsInLeafNode=1203, maxMBSortInHeap=6.796159005671457, sim=Asserting(org.apache.lucene.search.similarities.AssertingSimilarity@8cb2c1b), locale=mn-MN, timezone=Asia/Anadyr
   [junit4]   2> NOTE: Linux 4.15.0-32-generic amd64/Oracle Corporation 9.0.4 (64-bit)/cpus=8,threads=2,free=144801904,total=536870912
   [junit4]   2> NOTE: All tests run in this JVM: [MoveReplicaHDFSTest, MoveReplicaHDFSTest]
   [junit4] Completed [5/5 (2!)] on J0 in 77.00s, 4 tests, 1 error <<< FAILURES!

[...truncated 12 lines...]
BUILD FAILED
/home/jenkins/workspace/Lucene-Solr-master-Linux/lucene/common-build.xml:1567: The following error occurred while executing this line:
/home/jenkins/workspace/Lucene-Solr-master-Linux/lucene/common-build.xml:1092: There were test failures: 5 suites, 20 tests, 2 errors [seed: 621CEBD1EB2F0054]

Total time: 2 minutes 51 seconds

[repro] Setting last failure code to 256

[repro] Failures:
[repro]   2/5 failed: org.apache.solr.cloud.MoveReplicaHDFSTest
[repro] Exiting with code 256
+ mv lucene/build lucene/build.repro
+ mv solr/build solr/build.repro
+ mv lucene/build.orig lucene/build
+ mv solr/build.orig solr/build
Archiving artifacts
Setting ANT_1_8_2_HOME=/var/lib/jenkins/tools/hudson.tasks.Ant_AntInstallation/ANT_1.8.2
[WARNINGS] Parsing warnings in console log with parser Java Compiler (javac)
Setting ANT_1_8_2_HOME=/var/lib/jenkins/tools/hudson.tasks.Ant_AntInstallation/ANT_1.8.2
Setting ANT_1_8_2_HOME=/var/lib/jenkins/tools/hudson.tasks.Ant_AntInstallation/ANT_1.8.2
<Git Blamer> Using GitBlamer to create author and commit information for all warnings.
<Git Blamer> GIT_COMMIT=4ccf0fb8f6ce269de8b4501fca201f5b4763cfe7, workspace=/var/lib/jenkins/workspace/Lucene-Solr-master-Linux
[WARNINGS] Computing warning deltas based on reference build #22905
Recording test results
Setting ANT_1_8_2_HOME=/var/lib/jenkins/tools/hudson.tasks.Ant_AntInstallation/ANT_1.8.2
Build step 'Publish JUnit test result report' changed build result to UNSTABLE
Email was triggered for: Unstable (Test Failures)
Sending email for trigger: Unstable (Test Failures)
Setting ANT_1_8_2_HOME=/var/lib/jenkins/tools/hudson.tasks.Ant_AntInstallation/ANT_1.8.2
Setting ANT_1_8_2_HOME=/var/lib/jenkins/tools/hudson.tasks.Ant_AntInstallation/ANT_1.8.2
Setting ANT_1_8_2_HOME=/var/lib/jenkins/tools/hudson.tasks.Ant_AntInstallation/ANT_1.8.2
Setting ANT_1_8_2_HOME=/var/lib/jenkins/tools/hudson.tasks.Ant_AntInstallation/ANT_1.8.2

Mime
View raw message