lucene-dev mailing list archives

Site index · List index
Message view « Date » · « Thread »
Top « Date » · « Thread »
From Policeman Jenkins Server <jenk...@thetaphi.de>
Subject [JENKINS] Lucene-Solr-master-Linux (64bit/jdk1.8.0_172) - Build # 22788 - Still Unstable!
Date Sun, 02 Sep 2018 14:17:28 GMT
Build: https://jenkins.thetaphi.de/job/Lucene-Solr-master-Linux/22788/
Java: 64bit/jdk1.8.0_172 -XX:+UseCompressedOops -XX:+UseG1GC

3 tests failed.
FAILED:  org.apache.solr.cloud.autoscaling.NodeLostTriggerTest.testListenerAcceptance

Error Message:
expected:<1> but was:<0>

Stack Trace:
java.lang.AssertionError: expected:<1> but was:<0>
	at __randomizedtesting.SeedInfo.seed([D02F7287FD10F151:C19B28604499E5A7]:0)
	at org.junit.Assert.fail(Assert.java:93)
	at org.junit.Assert.failNotEquals(Assert.java:647)
	at org.junit.Assert.assertEquals(Assert.java:128)
	at org.junit.Assert.assertEquals(Assert.java:472)
	at org.junit.Assert.assertEquals(Assert.java:456)
	at org.apache.solr.cloud.autoscaling.NodeLostTriggerTest.testListenerAcceptance(NodeLostTriggerTest.java:265)
	at sun.reflect.NativeMethodAccessorImpl.invoke0(Native Method)
	at sun.reflect.NativeMethodAccessorImpl.invoke(NativeMethodAccessorImpl.java:62)
	at sun.reflect.DelegatingMethodAccessorImpl.invoke(DelegatingMethodAccessorImpl.java:43)
	at java.lang.reflect.Method.invoke(Method.java:498)
	at com.carrotsearch.randomizedtesting.RandomizedRunner.invoke(RandomizedRunner.java:1737)
	at com.carrotsearch.randomizedtesting.RandomizedRunner$8.evaluate(RandomizedRunner.java:934)
	at com.carrotsearch.randomizedtesting.RandomizedRunner$9.evaluate(RandomizedRunner.java:970)
	at com.carrotsearch.randomizedtesting.RandomizedRunner$10.evaluate(RandomizedRunner.java:984)
	at com.carrotsearch.randomizedtesting.rules.SystemPropertiesRestoreRule$1.evaluate(SystemPropertiesRestoreRule.java:57)
	at org.apache.lucene.util.TestRuleSetupTeardownChained$1.evaluate(TestRuleSetupTeardownChained.java:49)
	at org.apache.lucene.util.AbstractBeforeAfterRule$1.evaluate(AbstractBeforeAfterRule.java:45)
	at org.apache.lucene.util.TestRuleThreadAndTestName$1.evaluate(TestRuleThreadAndTestName.java:48)
	at org.apache.lucene.util.TestRuleIgnoreAfterMaxFailures$1.evaluate(TestRuleIgnoreAfterMaxFailures.java:64)
	at org.apache.lucene.util.TestRuleMarkFailure$1.evaluate(TestRuleMarkFailure.java:47)
	at com.carrotsearch.randomizedtesting.rules.StatementAdapter.evaluate(StatementAdapter.java:36)
	at com.carrotsearch.randomizedtesting.ThreadLeakControl$StatementRunner.run(ThreadLeakControl.java:368)
	at com.carrotsearch.randomizedtesting.ThreadLeakControl.forkTimeoutingTask(ThreadLeakControl.java:817)
	at com.carrotsearch.randomizedtesting.ThreadLeakControl$3.evaluate(ThreadLeakControl.java:468)
	at com.carrotsearch.randomizedtesting.RandomizedRunner.runSingleTest(RandomizedRunner.java:943)
	at com.carrotsearch.randomizedtesting.RandomizedRunner$5.evaluate(RandomizedRunner.java:829)
	at com.carrotsearch.randomizedtesting.RandomizedRunner$6.evaluate(RandomizedRunner.java:879)
	at com.carrotsearch.randomizedtesting.RandomizedRunner$7.evaluate(RandomizedRunner.java:890)
	at com.carrotsearch.randomizedtesting.rules.StatementAdapter.evaluate(StatementAdapter.java:36)
	at com.carrotsearch.randomizedtesting.rules.SystemPropertiesRestoreRule$1.evaluate(SystemPropertiesRestoreRule.java:57)
	at org.apache.lucene.util.AbstractBeforeAfterRule$1.evaluate(AbstractBeforeAfterRule.java:45)
	at com.carrotsearch.randomizedtesting.rules.StatementAdapter.evaluate(StatementAdapter.java:36)
	at org.apache.lucene.util.TestRuleStoreClassName$1.evaluate(TestRuleStoreClassName.java:41)
	at com.carrotsearch.randomizedtesting.rules.NoShadowingOrOverridesOnMethodsRule$1.evaluate(NoShadowingOrOverridesOnMethodsRule.java:40)
	at com.carrotsearch.randomizedtesting.rules.NoShadowingOrOverridesOnMethodsRule$1.evaluate(NoShadowingOrOverridesOnMethodsRule.java:40)
	at com.carrotsearch.randomizedtesting.rules.StatementAdapter.evaluate(StatementAdapter.java:36)
	at com.carrotsearch.randomizedtesting.rules.StatementAdapter.evaluate(StatementAdapter.java:36)
	at com.carrotsearch.randomizedtesting.rules.StatementAdapter.evaluate(StatementAdapter.java:36)
	at org.apache.lucene.util.TestRuleAssertionsRequired$1.evaluate(TestRuleAssertionsRequired.java:53)
	at org.apache.lucene.util.TestRuleMarkFailure$1.evaluate(TestRuleMarkFailure.java:47)
	at org.apache.lucene.util.TestRuleIgnoreAfterMaxFailures$1.evaluate(TestRuleIgnoreAfterMaxFailures.java:64)
	at org.apache.lucene.util.TestRuleIgnoreTestSuites$1.evaluate(TestRuleIgnoreTestSuites.java:54)
	at com.carrotsearch.randomizedtesting.rules.StatementAdapter.evaluate(StatementAdapter.java:36)
	at com.carrotsearch.randomizedtesting.ThreadLeakControl$StatementRunner.run(ThreadLeakControl.java:368)
	at java.lang.Thread.run(Thread.java:748)


FAILED:  org.apache.solr.handler.RequestLoggingTest.testLogBeforeExecuteWithCoreLogger

Error Message:


Stack Trace:
java.lang.AssertionError
	at __randomizedtesting.SeedInfo.seed([D02F7287FD10F151:1CA9720903D99AC7]:0)
	at org.junit.Assert.fail(Assert.java:92)
	at org.junit.Assert.assertTrue(Assert.java:43)
	at org.junit.Assert.assertTrue(Assert.java:54)
	at org.apache.solr.handler.RequestLoggingTest.testLogBeforeExecute(RequestLoggingTest.java:88)
	at org.apache.solr.handler.RequestLoggingTest.testLogBeforeExecuteWithCoreLogger(RequestLoggingTest.java:65)
	at sun.reflect.NativeMethodAccessorImpl.invoke0(Native Method)
	at sun.reflect.NativeMethodAccessorImpl.invoke(NativeMethodAccessorImpl.java:62)
	at sun.reflect.DelegatingMethodAccessorImpl.invoke(DelegatingMethodAccessorImpl.java:43)
	at java.lang.reflect.Method.invoke(Method.java:498)
	at com.carrotsearch.randomizedtesting.RandomizedRunner.invoke(RandomizedRunner.java:1737)
	at com.carrotsearch.randomizedtesting.RandomizedRunner$8.evaluate(RandomizedRunner.java:934)
	at com.carrotsearch.randomizedtesting.RandomizedRunner$9.evaluate(RandomizedRunner.java:970)
	at com.carrotsearch.randomizedtesting.RandomizedRunner$10.evaluate(RandomizedRunner.java:984)
	at com.carrotsearch.randomizedtesting.rules.SystemPropertiesRestoreRule$1.evaluate(SystemPropertiesRestoreRule.java:57)
	at org.apache.lucene.util.TestRuleSetupTeardownChained$1.evaluate(TestRuleSetupTeardownChained.java:49)
	at org.apache.lucene.util.AbstractBeforeAfterRule$1.evaluate(AbstractBeforeAfterRule.java:45)
	at org.apache.lucene.util.TestRuleThreadAndTestName$1.evaluate(TestRuleThreadAndTestName.java:48)
	at org.apache.lucene.util.TestRuleIgnoreAfterMaxFailures$1.evaluate(TestRuleIgnoreAfterMaxFailures.java:64)
	at org.apache.lucene.util.TestRuleMarkFailure$1.evaluate(TestRuleMarkFailure.java:47)
	at com.carrotsearch.randomizedtesting.rules.StatementAdapter.evaluate(StatementAdapter.java:36)
	at com.carrotsearch.randomizedtesting.ThreadLeakControl$StatementRunner.run(ThreadLeakControl.java:368)
	at com.carrotsearch.randomizedtesting.ThreadLeakControl.forkTimeoutingTask(ThreadLeakControl.java:817)
	at com.carrotsearch.randomizedtesting.ThreadLeakControl$3.evaluate(ThreadLeakControl.java:468)
	at com.carrotsearch.randomizedtesting.RandomizedRunner.runSingleTest(RandomizedRunner.java:943)
	at com.carrotsearch.randomizedtesting.RandomizedRunner$5.evaluate(RandomizedRunner.java:829)
	at com.carrotsearch.randomizedtesting.RandomizedRunner$6.evaluate(RandomizedRunner.java:879)
	at com.carrotsearch.randomizedtesting.RandomizedRunner$7.evaluate(RandomizedRunner.java:890)
	at com.carrotsearch.randomizedtesting.rules.StatementAdapter.evaluate(StatementAdapter.java:36)
	at com.carrotsearch.randomizedtesting.rules.SystemPropertiesRestoreRule$1.evaluate(SystemPropertiesRestoreRule.java:57)
	at org.apache.lucene.util.AbstractBeforeAfterRule$1.evaluate(AbstractBeforeAfterRule.java:45)
	at com.carrotsearch.randomizedtesting.rules.StatementAdapter.evaluate(StatementAdapter.java:36)
	at org.apache.lucene.util.TestRuleStoreClassName$1.evaluate(TestRuleStoreClassName.java:41)
	at com.carrotsearch.randomizedtesting.rules.NoShadowingOrOverridesOnMethodsRule$1.evaluate(NoShadowingOrOverridesOnMethodsRule.java:40)
	at com.carrotsearch.randomizedtesting.rules.NoShadowingOrOverridesOnMethodsRule$1.evaluate(NoShadowingOrOverridesOnMethodsRule.java:40)
	at com.carrotsearch.randomizedtesting.rules.StatementAdapter.evaluate(StatementAdapter.java:36)
	at com.carrotsearch.randomizedtesting.rules.StatementAdapter.evaluate(StatementAdapter.java:36)
	at com.carrotsearch.randomizedtesting.rules.StatementAdapter.evaluate(StatementAdapter.java:36)
	at org.apache.lucene.util.TestRuleAssertionsRequired$1.evaluate(TestRuleAssertionsRequired.java:53)
	at org.apache.lucene.util.TestRuleMarkFailure$1.evaluate(TestRuleMarkFailure.java:47)
	at org.apache.lucene.util.TestRuleIgnoreAfterMaxFailures$1.evaluate(TestRuleIgnoreAfterMaxFailures.java:64)
	at org.apache.lucene.util.TestRuleIgnoreTestSuites$1.evaluate(TestRuleIgnoreTestSuites.java:54)
	at com.carrotsearch.randomizedtesting.rules.StatementAdapter.evaluate(StatementAdapter.java:36)
	at com.carrotsearch.randomizedtesting.ThreadLeakControl$StatementRunner.run(ThreadLeakControl.java:368)
	at java.lang.Thread.run(Thread.java:748)


FAILED:  org.apache.solr.handler.RequestLoggingTest.testLogBeforeExecuteWithRequestLogger

Error Message:


Stack Trace:
java.lang.AssertionError
	at __randomizedtesting.SeedInfo.seed([D02F7287FD10F151:6146528850E6491F]:0)
	at org.junit.Assert.fail(Assert.java:92)
	at org.junit.Assert.assertTrue(Assert.java:43)
	at org.junit.Assert.assertTrue(Assert.java:54)
	at org.apache.solr.handler.RequestLoggingTest.testLogBeforeExecute(RequestLoggingTest.java:88)
	at org.apache.solr.handler.RequestLoggingTest.testLogBeforeExecuteWithRequestLogger(RequestLoggingTest.java:71)
	at sun.reflect.NativeMethodAccessorImpl.invoke0(Native Method)
	at sun.reflect.NativeMethodAccessorImpl.invoke(NativeMethodAccessorImpl.java:62)
	at sun.reflect.DelegatingMethodAccessorImpl.invoke(DelegatingMethodAccessorImpl.java:43)
	at java.lang.reflect.Method.invoke(Method.java:498)
	at com.carrotsearch.randomizedtesting.RandomizedRunner.invoke(RandomizedRunner.java:1737)
	at com.carrotsearch.randomizedtesting.RandomizedRunner$8.evaluate(RandomizedRunner.java:934)
	at com.carrotsearch.randomizedtesting.RandomizedRunner$9.evaluate(RandomizedRunner.java:970)
	at com.carrotsearch.randomizedtesting.RandomizedRunner$10.evaluate(RandomizedRunner.java:984)
	at com.carrotsearch.randomizedtesting.rules.SystemPropertiesRestoreRule$1.evaluate(SystemPropertiesRestoreRule.java:57)
	at org.apache.lucene.util.TestRuleSetupTeardownChained$1.evaluate(TestRuleSetupTeardownChained.java:49)
	at org.apache.lucene.util.AbstractBeforeAfterRule$1.evaluate(AbstractBeforeAfterRule.java:45)
	at org.apache.lucene.util.TestRuleThreadAndTestName$1.evaluate(TestRuleThreadAndTestName.java:48)
	at org.apache.lucene.util.TestRuleIgnoreAfterMaxFailures$1.evaluate(TestRuleIgnoreAfterMaxFailures.java:64)
	at org.apache.lucene.util.TestRuleMarkFailure$1.evaluate(TestRuleMarkFailure.java:47)
	at com.carrotsearch.randomizedtesting.rules.StatementAdapter.evaluate(StatementAdapter.java:36)
	at com.carrotsearch.randomizedtesting.ThreadLeakControl$StatementRunner.run(ThreadLeakControl.java:368)
	at com.carrotsearch.randomizedtesting.ThreadLeakControl.forkTimeoutingTask(ThreadLeakControl.java:817)
	at com.carrotsearch.randomizedtesting.ThreadLeakControl$3.evaluate(ThreadLeakControl.java:468)
	at com.carrotsearch.randomizedtesting.RandomizedRunner.runSingleTest(RandomizedRunner.java:943)
	at com.carrotsearch.randomizedtesting.RandomizedRunner$5.evaluate(RandomizedRunner.java:829)
	at com.carrotsearch.randomizedtesting.RandomizedRunner$6.evaluate(RandomizedRunner.java:879)
	at com.carrotsearch.randomizedtesting.RandomizedRunner$7.evaluate(RandomizedRunner.java:890)
	at com.carrotsearch.randomizedtesting.rules.StatementAdapter.evaluate(StatementAdapter.java:36)
	at com.carrotsearch.randomizedtesting.rules.SystemPropertiesRestoreRule$1.evaluate(SystemPropertiesRestoreRule.java:57)
	at org.apache.lucene.util.AbstractBeforeAfterRule$1.evaluate(AbstractBeforeAfterRule.java:45)
	at com.carrotsearch.randomizedtesting.rules.StatementAdapter.evaluate(StatementAdapter.java:36)
	at org.apache.lucene.util.TestRuleStoreClassName$1.evaluate(TestRuleStoreClassName.java:41)
	at com.carrotsearch.randomizedtesting.rules.NoShadowingOrOverridesOnMethodsRule$1.evaluate(NoShadowingOrOverridesOnMethodsRule.java:40)
	at com.carrotsearch.randomizedtesting.rules.NoShadowingOrOverridesOnMethodsRule$1.evaluate(NoShadowingOrOverridesOnMethodsRule.java:40)
	at com.carrotsearch.randomizedtesting.rules.StatementAdapter.evaluate(StatementAdapter.java:36)
	at com.carrotsearch.randomizedtesting.rules.StatementAdapter.evaluate(StatementAdapter.java:36)
	at com.carrotsearch.randomizedtesting.rules.StatementAdapter.evaluate(StatementAdapter.java:36)
	at org.apache.lucene.util.TestRuleAssertionsRequired$1.evaluate(TestRuleAssertionsRequired.java:53)
	at org.apache.lucene.util.TestRuleMarkFailure$1.evaluate(TestRuleMarkFailure.java:47)
	at org.apache.lucene.util.TestRuleIgnoreAfterMaxFailures$1.evaluate(TestRuleIgnoreAfterMaxFailures.java:64)
	at org.apache.lucene.util.TestRuleIgnoreTestSuites$1.evaluate(TestRuleIgnoreTestSuites.java:54)
	at com.carrotsearch.randomizedtesting.rules.StatementAdapter.evaluate(StatementAdapter.java:36)
	at com.carrotsearch.randomizedtesting.ThreadLeakControl$StatementRunner.run(ThreadLeakControl.java:368)
	at java.lang.Thread.run(Thread.java:748)




Build Log:
[...truncated 14122 lines...]
   [junit4] Suite: org.apache.solr.cloud.autoscaling.NodeLostTriggerTest
   [junit4]   2> Creating dataDir: /home/jenkins/workspace/Lucene-Solr-master-Linux/solr/build/solr-core/test/J0/temp/solr.cloud.autoscaling.NodeLostTriggerTest_D02F7287FD10F151-001/init-core-data-001
   [junit4]   2> 1927545 INFO  (SUITE-NodeLostTriggerTest-seed#[D02F7287FD10F151]-worker) [    ] o.a.s.SolrTestCaseJ4 Using PointFields (NUMERIC_POINTS_SYSPROP=true) w/NUMERIC_DOCVALUES_SYSPROP=true
   [junit4]   2> 1927547 INFO  (SUITE-NodeLostTriggerTest-seed#[D02F7287FD10F151]-worker) [    ] o.a.s.SolrTestCaseJ4 Randomized ssl (true) and clientAuth (true) via: @org.apache.solr.util.RandomizeSSL(reason=, ssl=NaN, value=NaN, clientAuth=NaN)
   [junit4]   2> 1927547 INFO  (SUITE-NodeLostTriggerTest-seed#[D02F7287FD10F151]-worker) [    ] o.a.s.SolrTestCaseJ4 SecureRandom sanity checks: test.solr.allowed.securerandom=null & java.security.egd=file:/dev/./urandom
   [junit4]   2> 1927547 INFO  (SUITE-NodeLostTriggerTest-seed#[D02F7287FD10F151]-worker) [    ] o.a.s.c.MiniSolrCloudCluster Starting cluster of 5 servers in /home/jenkins/workspace/Lucene-Solr-master-Linux/solr/build/solr-core/test/J0/temp/solr.cloud.autoscaling.NodeLostTriggerTest_D02F7287FD10F151-001/tempDir-001
   [junit4]   2> 1927547 INFO  (SUITE-NodeLostTriggerTest-seed#[D02F7287FD10F151]-worker) [    ] o.a.s.c.ZkTestServer STARTING ZK TEST SERVER
   [junit4]   2> 1927548 INFO  (Thread-6748) [    ] o.a.s.c.ZkTestServer client port:0.0.0.0/0.0.0.0:0
   [junit4]   2> 1927548 INFO  (Thread-6748) [    ] o.a.s.c.ZkTestServer Starting server
   [junit4]   2> 1927549 ERROR (Thread-6748) [    ] o.a.z.s.ZooKeeperServer ZKShutdownHandler is not registered, so ZooKeeper server won't take any action on ERROR or SHUTDOWN server state changes
   [junit4]   2> 1927648 INFO  (SUITE-NodeLostTriggerTest-seed#[D02F7287FD10F151]-worker) [    ] o.a.s.c.ZkTestServer start zk server on port:46007
   [junit4]   2> 1927650 INFO  (zkConnectionManagerCallback-6784-thread-1) [    ] o.a.s.c.c.ConnectionManager zkClient has connected
   [junit4]   2> 1927654 INFO  (jetty-launcher-6781-thread-1) [    ] o.e.j.s.Server jetty-9.4.11.v20180605; built: 2018-06-05T18:24:03.829Z; git: d5fc0523cfa96bfebfbda19606cad384d772f04c; jvm 1.8.0_172-b11
   [junit4]   2> 1927654 INFO  (jetty-launcher-6781-thread-2) [    ] o.e.j.s.Server jetty-9.4.11.v20180605; built: 2018-06-05T18:24:03.829Z; git: d5fc0523cfa96bfebfbda19606cad384d772f04c; jvm 1.8.0_172-b11
   [junit4]   2> 1927655 INFO  (jetty-launcher-6781-thread-3) [    ] o.e.j.s.Server jetty-9.4.11.v20180605; built: 2018-06-05T18:24:03.829Z; git: d5fc0523cfa96bfebfbda19606cad384d772f04c; jvm 1.8.0_172-b11
   [junit4]   2> 1927655 INFO  (jetty-launcher-6781-thread-4) [    ] o.e.j.s.Server jetty-9.4.11.v20180605; built: 2018-06-05T18:24:03.829Z; git: d5fc0523cfa96bfebfbda19606cad384d772f04c; jvm 1.8.0_172-b11
   [junit4]   2> 1927655 INFO  (jetty-launcher-6781-thread-5) [    ] o.e.j.s.Server jetty-9.4.11.v20180605; built: 2018-06-05T18:24:03.829Z; git: d5fc0523cfa96bfebfbda19606cad384d772f04c; jvm 1.8.0_172-b11
   [junit4]   2> 1927656 INFO  (jetty-launcher-6781-thread-2) [    ] o.e.j.s.session DefaultSessionIdManager workerName=node0
   [junit4]   2> 1927656 INFO  (jetty-launcher-6781-thread-2) [    ] o.e.j.s.session No SessionScavenger set, using defaults
   [junit4]   2> 1927656 INFO  (jetty-launcher-6781-thread-2) [    ] o.e.j.s.session node0 Scavenging every 600000ms
   [junit4]   2> 1927656 INFO  (jetty-launcher-6781-thread-2) [    ] o.e.j.s.h.ContextHandler Started o.e.j.s.ServletContextHandler@4c368f87{/solr,null,AVAILABLE}
   [junit4]   2> 1927662 INFO  (jetty-launcher-6781-thread-2) [    ] o.e.j.s.AbstractConnector Started ServerConnector@50508f57{SSL,[ssl, http/1.1]}{127.0.0.1:32877}
   [junit4]   2> 1927663 INFO  (jetty-launcher-6781-thread-2) [    ] o.e.j.s.Server Started @1927701ms
   [junit4]   2> 1927663 INFO  (jetty-launcher-6781-thread-2) [    ] o.a.s.c.s.e.JettySolrRunner Jetty properties: {hostContext=/solr, hostPort=32877}
   [junit4]   2> 1927663 ERROR (jetty-launcher-6781-thread-2) [    ] o.a.s.u.StartupLoggingUtils Missing Java Option solr.log.dir. Logging may be missing or incomplete.
   [junit4]   2> 1927663 INFO  (jetty-launcher-6781-thread-2) [    ] o.a.s.s.SolrDispatchFilter Using logger factory org.apache.logging.slf4j.Log4jLoggerFactory
   [junit4]   2> 1927663 INFO  (jetty-launcher-6781-thread-2) [    ] o.a.s.s.SolrDispatchFilter  ___      _       Welcome to Apache Solr? version 8.0.0
   [junit4]   2> 1927663 INFO  (jetty-launcher-6781-thread-2) [    ] o.a.s.s.SolrDispatchFilter / __| ___| |_ _   Starting in cloud mode on port null
   [junit4]   2> 1927663 INFO  (jetty-launcher-6781-thread-2) [    ] o.a.s.s.SolrDispatchFilter \__ \/ _ \ | '_|  Install dir: null
   [junit4]   2> 1927663 INFO  (jetty-launcher-6781-thread-2) [    ] o.a.s.s.SolrDispatchFilter |___/\___/_|_|    Start time: 2018-09-02T13:41:33.848Z
   [junit4]   2> 1927666 INFO  (jetty-launcher-6781-thread-1) [    ] o.e.j.s.session DefaultSessionIdManager workerName=node0
   [junit4]   2> 1927666 INFO  (jetty-launcher-6781-thread-1) [    ] o.e.j.s.session No SessionScavenger set, using defaults
   [junit4]   2> 1927666 INFO  (jetty-launcher-6781-thread-1) [    ] o.e.j.s.session node0 Scavenging every 600000ms
   [junit4]   2> 1927669 INFO  (jetty-launcher-6781-thread-3) [    ] o.e.j.s.session DefaultSessionIdManager workerName=node0
   [junit4]   2> 1927669 INFO  (jetty-launcher-6781-thread-3) [    ] o.e.j.s.session No SessionScavenger set, using defaults
   [junit4]   2> 1927669 INFO  (jetty-launcher-6781-thread-3) [    ] o.e.j.s.session node0 Scavenging every 660000ms
   [junit4]   2> 1927675 INFO  (jetty-launcher-6781-thread-1) [    ] o.e.j.s.h.ContextHandler Started o.e.j.s.ServletContextHandler@277e44d2{/solr,null,AVAILABLE}
   [junit4]   2> 1927675 INFO  (jetty-launcher-6781-thread-4) [    ] o.e.j.s.session DefaultSessionIdManager workerName=node0
   [junit4]   2> 1927675 INFO  (jetty-launcher-6781-thread-4) [    ] o.e.j.s.session No SessionScavenger set, using defaults
   [junit4]   2> 1927675 INFO  (jetty-launcher-6781-thread-4) [    ] o.e.j.s.session node0 Scavenging every 660000ms
   [junit4]   2> 1927675 INFO  (jetty-launcher-6781-thread-3) [    ] o.e.j.s.h.ContextHandler Started o.e.j.s.ServletContextHandler@7e72a5cc{/solr,null,AVAILABLE}
   [junit4]   2> 1927675 INFO  (jetty-launcher-6781-thread-5) [    ] o.e.j.s.session DefaultSessionIdManager workerName=node0
   [junit4]   2> 1927675 INFO  (jetty-launcher-6781-thread-5) [    ] o.e.j.s.session No SessionScavenger set, using defaults
   [junit4]   2> 1927675 INFO  (jetty-launcher-6781-thread-5) [    ] o.e.j.s.session node0 Scavenging every 660000ms
   [junit4]   2> 1927675 INFO  (jetty-launcher-6781-thread-1) [    ] o.e.j.s.AbstractConnector Started ServerConnector@3d97b47c{SSL,[ssl, http/1.1]}{127.0.0.1:36539}
   [junit4]   2> 1927675 INFO  (jetty-launcher-6781-thread-1) [    ] o.e.j.s.Server Started @1927714ms
   [junit4]   2> 1927675 INFO  (jetty-launcher-6781-thread-1) [    ] o.a.s.c.s.e.JettySolrRunner Jetty properties: {hostContext=/solr, hostPort=36539}
   [junit4]   2> 1927675 ERROR (jetty-launcher-6781-thread-1) [    ] o.a.s.u.StartupLoggingUtils Missing Java Option solr.log.dir. Logging may be missing or incomplete.
   [junit4]   2> 1927675 INFO  (jetty-launcher-6781-thread-1) [    ] o.a.s.s.SolrDispatchFilter Using logger factory org.apache.logging.slf4j.Log4jLoggerFactory
   [junit4]   2> 1927676 INFO  (jetty-launcher-6781-thread-1) [    ] o.a.s.s.SolrDispatchFilter  ___      _       Welcome to Apache Solr? version 8.0.0
   [junit4]   2> 1927676 INFO  (jetty-launcher-6781-thread-1) [    ] o.a.s.s.SolrDispatchFilter / __| ___| |_ _   Starting in cloud mode on port null
   [junit4]   2> 1927676 INFO  (jetty-launcher-6781-thread-1) [    ] o.a.s.s.SolrDispatchFilter \__ \/ _ \ | '_|  Install dir: null
   [junit4]   2> 1927676 INFO  (jetty-launcher-6781-thread-1) [    ] o.a.s.s.SolrDispatchFilter |___/\___/_|_|    Start time: 2018-09-02T13:41:33.861Z
   [junit4]   2> 1927678 INFO  (zkConnectionManagerCallback-6786-thread-1) [    ] o.a.s.c.c.ConnectionManager zkClient has connected
   [junit4]   2> 1927678 INFO  (jetty-launcher-6781-thread-4) [    ] o.e.j.s.h.ContextHandler Started o.e.j.s.ServletContextHandler@152416ba{/solr,null,AVAILABLE}
   [junit4]   2> 1927679 INFO  (jetty-launcher-6781-thread-3) [    ] o.e.j.s.AbstractConnector Started ServerConnector@3760467a{SSL,[ssl, http/1.1]}{127.0.0.1:37375}
   [junit4]   2> 1927679 INFO  (jetty-launcher-6781-thread-3) [    ] o.e.j.s.Server Started @1927718ms
   [junit4]   2> 1927679 INFO  (jetty-launcher-6781-thread-3) [    ] o.a.s.c.s.e.JettySolrRunner Jetty properties: {hostContext=/solr, hostPort=37375}
   [junit4]   2> 1927679 INFO  (jetty-launcher-6781-thread-4) [    ] o.e.j.s.AbstractConnector Started ServerConnector@6dcb8792{SSL,[ssl, http/1.1]}{127.0.0.1:38257}
   [junit4]   2> 1927679 INFO  (jetty-launcher-6781-thread-4) [    ] o.e.j.s.Server Started @1927718ms
   [junit4]   2> 1927679 INFO  (jetty-launcher-6781-thread-4) [    ] o.a.s.c.s.e.JettySolrRunner Jetty properties: {hostContext=/solr, hostPort=38257}
   [junit4]   2> 1927679 INFO  (jetty-launcher-6781-thread-2) [    ] o.a.s.s.SolrDispatchFilter solr.xml found in ZooKeeper. Loading...
   [junit4]   2> 1927679 ERROR (jetty-launcher-6781-thread-3) [    ] o.a.s.u.StartupLoggingUtils Missing Java Option solr.log.dir. Logging may be missing or incomplete.
   [junit4]   2> 1927679 INFO  (jetty-launcher-6781-thread-3) [    ] o.a.s.s.SolrDispatchFilter Using logger factory org.apache.logging.slf4j.Log4jLoggerFactory
   [junit4]   2> 1927679 ERROR (jetty-launcher-6781-thread-4) [    ] o.a.s.u.StartupLoggingUtils Missing Java Option solr.log.dir. Logging may be missing or incomplete.
   [junit4]   2> 1927679 INFO  (jetty-launcher-6781-thread-4) [    ] o.a.s.s.SolrDispatchFilter Using logger factory org.apache.logging.slf4j.Log4jLoggerFactory
   [junit4]   2> 1927679 INFO  (jetty-launcher-6781-thread-4) [    ] o.a.s.s.SolrDispatchFilter  ___      _       Welcome to Apache Solr? version 8.0.0
   [junit4]   2> 1927679 INFO  (jetty-launcher-6781-thread-3) [    ] o.a.s.s.SolrDispatchFilter  ___      _       Welcome to Apache Solr? version 8.0.0
   [junit4]   2> 1927679 INFO  (jetty-launcher-6781-thread-4) [    ] o.a.s.s.SolrDispatchFilter / __| ___| |_ _   Starting in cloud mode on port null
   [junit4]   2> 1927679 INFO  (jetty-launcher-6781-thread-3) [    ] o.a.s.s.SolrDispatchFilter / __| ___| |_ _   Starting in cloud mode on port null
   [junit4]   2> 1927679 INFO  (jetty-launcher-6781-thread-4) [    ] o.a.s.s.SolrDispatchFilter \__ \/ _ \ | '_|  Install dir: null
   [junit4]   2> 1927679 INFO  (jetty-launcher-6781-thread-3) [    ] o.a.s.s.SolrDispatchFilter \__ \/ _ \ | '_|  Install dir: null
   [junit4]   2> 1927679 INFO  (jetty-launcher-6781-thread-3) [    ] o.a.s.s.SolrDispatchFilter |___/\___/_|_|    Start time: 2018-09-02T13:41:33.864Z
   [junit4]   2> 1927679 INFO  (jetty-launcher-6781-thread-4) [    ] o.a.s.s.SolrDispatchFilter |___/\___/_|_|    Start time: 2018-09-02T13:41:33.864Z
   [junit4]   2> 1927680 INFO  (jetty-launcher-6781-thread-5) [    ] o.e.j.s.h.ContextHandler Started o.e.j.s.ServletContextHandler@1d358032{/solr,null,AVAILABLE}
   [junit4]   2> 1927681 INFO  (zkConnectionManagerCallback-6788-thread-1) [    ] o.a.s.c.c.ConnectionManager zkClient has connected
   [junit4]   2> 1927681 INFO  (zkConnectionManagerCallback-6791-thread-1) [    ] o.a.s.c.c.ConnectionManager zkClient has connected
   [junit4]   2> 1927681 INFO  (zkConnectionManagerCallback-6792-thread-1) [    ] o.a.s.c.c.ConnectionManager zkClient has connected
   [junit4]   2> 1927681 INFO  (jetty-launcher-6781-thread-4) [    ] o.a.s.s.SolrDispatchFilter solr.xml found in ZooKeeper. Loading...
   [junit4]   2> 1927681 INFO  (jetty-launcher-6781-thread-5) [    ] o.e.j.s.AbstractConnector Started ServerConnector@2cfb0842{SSL,[ssl, http/1.1]}{127.0.0.1:38223}
   [junit4]   2> 1927681 INFO  (jetty-launcher-6781-thread-5) [    ] o.e.j.s.Server Started @1927720ms
   [junit4]   2> 1927681 INFO  (jetty-launcher-6781-thread-5) [    ] o.a.s.c.s.e.JettySolrRunner Jetty properties: {hostContext=/solr, hostPort=38223}
   [junit4]   2> 1927682 ERROR (jetty-launcher-6781-thread-5) [    ] o.a.s.u.StartupLoggingUtils Missing Java Option solr.log.dir. Logging may be missing or incomplete.
   [junit4]   2> 1927682 INFO  (jetty-launcher-6781-thread-5) [    ] o.a.s.s.SolrDispatchFilter Using logger factory org.apache.logging.slf4j.Log4jLoggerFactory
   [junit4]   2> 1927682 INFO  (jetty-launcher-6781-thread-5) [    ] o.a.s.s.SolrDispatchFilter  ___      _       Welcome to Apache Solr? version 8.0.0
   [junit4]   2> 1927682 INFO  (jetty-launcher-6781-thread-5) [    ] o.a.s.s.SolrDispatchFilter / __| ___| |_ _   Starting in cloud mode on port null
   [junit4]   2> 1927682 INFO  (jetty-launcher-6781-thread-5) [    ] o.a.s.s.SolrDispatchFilter \__ \/ _ \ | '_|  Install dir: null
   [junit4]   2> 1927682 INFO  (jetty-launcher-6781-thread-5) [    ] o.a.s.s.SolrDispatchFilter |___/\___/_|_|    Start time: 2018-09-02T13:41:33.867Z
   [junit4]   2> 1927682 INFO  (jetty-launcher-6781-thread-1) [    ] o.a.s.s.SolrDispatchFilter solr.xml found in ZooKeeper. Loading...
   [junit4]   2> 1927682 INFO  (jetty-launcher-6781-thread-3) [    ] o.a.s.s.SolrDispatchFilter solr.xml found in ZooKeeper. Loading...
   [junit4]   2> 1927686 WARN  (NIOServerCxn.Factory:0.0.0.0/0.0.0.0:0) [    ] o.a.z.s.NIOServerCnxn Unable to read additional data from client sessionid 0x10058e485620003, likely client has closed socket
   [junit4]   2> 1927690 INFO  (zkConnectionManagerCallback-6794-thread-1) [    ] o.a.s.c.c.ConnectionManager zkClient has connected
   [junit4]   2> 1927690 INFO  (jetty-launcher-6781-thread-5) [    ] o.a.s.s.SolrDispatchFilter solr.xml found in ZooKeeper. Loading...
   [junit4]   2> 1927788 INFO  (jetty-launcher-6781-thread-1) [    ] o.a.s.c.ZkContainer Zookeeper client=127.0.0.1:46007/solr
   [junit4]   2> 1927801 INFO  (zkConnectionManagerCallback-6798-thread-1) [    ] o.a.s.c.c.ConnectionManager zkClient has connected
   [junit4]   2> 1927807 INFO  (zkConnectionManagerCallback-6800-thread-1) [    ] o.a.s.c.c.ConnectionManager zkClient has connected
   [junit4]   2> 1927811 INFO  (jetty-launcher-6781-thread-5) [    ] o.a.s.c.ZkContainer Zookeeper client=127.0.0.1:46007/solr
   [junit4]   2> 1927815 INFO  (zkConnectionManagerCallback-6804-thread-1) [    ] o.a.s.c.c.ConnectionManager zkClient has connected
   [junit4]   2> 1927857 INFO  (jetty-launcher-6781-thread-4) [    ] o.a.s.c.ZkContainer Zookeeper client=127.0.0.1:46007/solr
   [junit4]   2> 1927857 INFO  (zkConnectionManagerCallback-6812-thread-1) [    ] o.a.s.c.c.ConnectionManager zkClient has connected
   [junit4]   2> 1927858 INFO  (zkConnectionManagerCallback-6808-thread-1) [    ] o.a.s.c.c.ConnectionManager zkClient has connected
   [junit4]   2> 1927865 INFO  (jetty-launcher-6781-thread-5) [n:127.0.0.1:38223_solr    ] o.a.s.c.OverseerElectionContext I am going to be the leader 127.0.0.1:38223_solr
   [junit4]   2> 1927865 INFO  (jetty-launcher-6781-thread-5) [n:127.0.0.1:38223_solr    ] o.a.s.c.Overseer Overseer (id=72155332551507977-127.0.0.1:38223_solr-n_0000000000) starting
   [junit4]   2> 1927871 INFO  (jetty-launcher-6781-thread-1) [n:127.0.0.1:36539_solr    ] o.a.s.c.ZkController Register node as live in ZooKeeper:/live_nodes/127.0.0.1:36539_solr
   [junit4]   2> 1927883 INFO  (zkCallback-6799-thread-1) [    ] o.a.s.c.c.ZkStateReader Updated live nodes from ZooKeeper... (0) -> (1)
   [junit4]   2> 1927888 INFO  (zkCallback-6807-thread-1) [    ] o.a.s.c.c.ZkStateReader Updated live nodes from ZooKeeper... (0) -> (1)
   [junit4]   2> 1927890 INFO  (zkConnectionManagerCallback-6814-thread-1) [    ] o.a.s.c.c.ConnectionManager zkClient has connected
   [junit4]   2> 1927891 INFO  (zkConnectionManagerCallback-6822-thread-1) [    ] o.a.s.c.c.ConnectionManager zkClient has connected
   [junit4]   2> 1927892 INFO  (jetty-launcher-6781-thread-5) [n:127.0.0.1:38223_solr    ] o.a.s.c.c.ZkStateReader Updated live nodes from ZooKeeper... (0) -> (1)
   [junit4]   2> 1927892 INFO  (jetty-launcher-6781-thread-2) [    ] o.a.s.c.ZkContainer Zookeeper client=127.0.0.1:46007/solr
   [junit4]   2> 1927892 INFO  (jetty-launcher-6781-thread-5) [n:127.0.0.1:38223_solr    ] o.a.s.c.s.i.ZkClientClusterStateProvider Cluster at 127.0.0.1:46007/solr ready
   [junit4]   2> 1927893 INFO  (OverseerStateUpdate-72155332551507977-127.0.0.1:38223_solr-n_0000000000) [n:127.0.0.1:38223_solr    ] o.a.s.c.Overseer Starting to work on the main queue : 127.0.0.1:38223_solr
   [junit4]   2> 1927894 INFO  (jetty-launcher-6781-thread-4) [n:127.0.0.1:38257_solr    ] o.a.s.c.c.ZkStateReader Updated live nodes from ZooKeeper... (0) -> (1)
   [junit4]   2> 1927894 INFO  (zkConnectionManagerCallback-6825-thread-1) [    ] o.a.s.c.c.ConnectionManager zkClient has connected
   [junit4]   2> 1927895 INFO  (jetty-launcher-6781-thread-5) [n:127.0.0.1:38223_solr    ] o.a.s.c.TransientSolrCoreCacheDefault Allocating transient cache for 2147483647 transient cores
   [junit4]   2> 1927895 INFO  (jetty-launcher-6781-thread-5) [n:127.0.0.1:38223_solr    ] o.a.s.c.ZkController Register node as live in ZooKeeper:/live_nodes/127.0.0.1:38223_solr
   [junit4]   2> 1927902 INFO  (zkConnectionManagerCallback-6832-thread-1) [    ] o.a.s.c.c.ConnectionManager zkClient has connected
   [junit4]   2> 1927902 INFO  (zkCallback-6799-thread-1) [    ] o.a.s.c.c.ZkStateReader Updated live nodes from ZooKeeper... (1) -> (2)
   [junit4]   2> 1927902 INFO  (zkCallback-6821-thread-1) [    ] o.a.s.c.c.ZkStateReader Updated live nodes from ZooKeeper... (1) -> (2)
   [junit4]   2> 1927902 INFO  (zkCallback-6807-thread-2) [    ] o.a.s.c.c.ZkStateReader Updated live nodes from ZooKeeper... (1) -> (2)
   [junit4]   2> 1927903 INFO  (jetty-launcher-6781-thread-1) [n:127.0.0.1:36539_solr    ] o.a.s.c.c.ZkStateReader Updated live nodes from ZooKeeper... (0) -> (2)
   [junit4]   2> 1927903 INFO  (jetty-launcher-6781-thread-1) [n:127.0.0.1:36539_solr    ] o.a.s.c.s.i.ZkClientClusterStateProvider Cluster at 127.0.0.1:46007/solr ready
   [junit4]   2> 1927904 INFO  (jetty-launcher-6781-thread-4) [n:127.0.0.1:38257_solr    ] o.a.s.c.TransientSolrCoreCacheDefault Allocating transient cache for 2147483647 transient cores
   [junit4]   2> 1927904 INFO  (jetty-launcher-6781-thread-4) [n:127.0.0.1:38257_solr    ] o.a.s.c.ZkController Register node as live in ZooKeeper:/live_nodes/127.0.0.1:38257_solr
   [junit4]   2> 1927906 INFO  (zkCallback-6799-thread-1) [    ] o.a.s.c.c.ZkStateReader Updated live nodes from ZooKeeper... (2) -> (3)
   [junit4]   2> 1927910 INFO  (zkCallback-6821-thread-1) [    ] o.a.s.c.c.ZkStateReader Updated live nodes from ZooKeeper... (2) -> (3)
   [junit4]   2> 1927910 INFO  (zkCallback-6813-thread-1) [    ] o.a.s.c.c.ZkStateReader Updated live nodes from ZooKeeper... (1) -> (3)
   [junit4]   2> 1927914 INFO  (zkCallback-6807-thread-2) [    ] o.a.s.c.c.ZkStateReader Updated live nodes from ZooKeeper... (2) -> (3)
   [junit4]   2> 1927915 INFO  (jetty-launcher-6781-thread-1) [n:127.0.0.1:36539_solr    ] o.a.s.h.a.MetricsHistoryHandler No .system collection, keeping metrics history in memory.
   [junit4]   2> 1927918 INFO  (jetty-launcher-6781-thread-5) [n:127.0.0.1:38223_solr    ] o.a.s.h.a.MetricsHistoryHandler No .system collection, keeping metrics history in memory.
   [junit4]   2> 1927922 INFO  (zkCallback-6831-thread-1) [    ] o.a.s.c.c.ZkStateReader Updated live nodes from ZooKeeper... (2) -> (3)
   [junit4]   2> 1927931 INFO  (zkConnectionManagerCallback-6834-thread-1) [    ] o.a.s.c.c.ConnectionManager zkClient has connected
   [junit4]   2> 1927934 INFO  (zkConnectionManagerCallback-6841-thread-1) [    ] o.a.s.c.c.ConnectionManager zkClient has connected
   [junit4]   2> 1927935 INFO  (jetty-launcher-6781-thread-4) [n:127.0.0.1:38257_solr    ] o.a.s.c.c.ZkStateReader Updated live nodes from ZooKeeper... (0) -> (3)
   [junit4]   2> 1927936 INFO  (jetty-launcher-6781-thread-4) [n:127.0.0.1:38257_solr    ] o.a.s.c.s.i.ZkClientClusterStateProvider Cluster at 127.0.0.1:46007/solr ready
   [junit4]   2> 1927936 INFO  (jetty-launcher-6781-thread-4) [n:127.0.0.1:38257_solr    ] o.a.s.h.a.MetricsHistoryHandler No .system collection, keeping metrics history in memory.
   [junit4]   2> 1927939 INFO  (jetty-launcher-6781-thread-1) [n:127.0.0.1:36539_solr    ] o.a.s.m.r.SolrJmxReporter JMX monitoring for 'solr_36539.solr.node' (registry 'solr.node') enabled at server: com.sun.jmx.mbeanserver.JmxMBeanServer@442b7fef
   [junit4]   2> 1927944 INFO  (jetty-launcher-6781-thread-2) [n:127.0.0.1:32877_solr    ] o.a.s.c.c.ZkStateReader Updated live nodes from ZooKeeper... (0) -> (3)
   [junit4]   2> 1927947 INFO  (jetty-launcher-6781-thread-5) [n:127.0.0.1:38223_solr    ] o.a.s.m.r.SolrJmxReporter JMX monitoring for 'solr_38223.solr.node' (registry 'solr.node') enabled at server: com.sun.jmx.mbeanserver.JmxMBeanServer@442b7fef
   [junit4]   2> 1927950 INFO  (jetty-launcher-6781-thread-2) [n:127.0.0.1:32877_solr    ] o.a.s.c.TransientSolrCoreCacheDefault Allocating transient cache for 2147483647 transient cores
   [junit4]   2> 1927950 INFO  (jetty-launcher-6781-thread-2) [n:127.0.0.1:32877_solr    ] o.a.s.c.ZkController Register node as live in ZooKeeper:/live_nodes/127.0.0.1:32877_solr
   [junit4]   2> 1927951 INFO  (jetty-launcher-6781-thread-1) [n:127.0.0.1:36539_solr    ] o.a.s.m.r.SolrJmxReporter JMX monitoring for 'solr_36539.solr.jvm' (registry 'solr.jvm') enabled at server: com.sun.jmx.mbeanserver.JmxMBeanServer@442b7fef
   [junit4]   2> 1927951 INFO  (jetty-launcher-6781-thread-1) [n:127.0.0.1:36539_solr    ] o.a.s.m.r.SolrJmxReporter JMX monitoring for 'solr_36539.solr.jetty' (registry 'solr.jetty') enabled at server: com.sun.jmx.mbeanserver.JmxMBeanServer@442b7fef
   [junit4]   2> 1927951 INFO  (zkCallback-6807-thread-2) [    ] o.a.s.c.c.ZkStateReader Updated live nodes from ZooKeeper... (3) -> (4)
   [junit4]   2> 1927951 INFO  (zkCallback-6821-thread-1) [    ] o.a.s.c.c.ZkStateReader Updated live nodes from ZooKeeper... (3) -> (4)
   [junit4]   2> 1927951 INFO  (zkCallback-6799-thread-1) [    ] o.a.s.c.c.ZkStateReader Updated live nodes from ZooKeeper... (3) -> (4)
   [junit4]   2> 1927952 INFO  (jetty-launcher-6781-thread-1) [n:127.0.0.1:36539_solr    ] o.a.s.c.CorePropertiesLocator Found 0 core definitions underneath /home/jenkins/workspace/Lucene-Solr-master-Linux/solr/build/solr-core/test/J0/temp/solr.cloud.autoscaling.NodeLostTriggerTest_D02F7287FD10F151-001/tempDir-001/node1/.
   [junit4]   2> 1927953 INFO  (jetty-launcher-6781-thread-4) [n:127.0.0.1:38257_solr    ] o.a.s.m.r.SolrJmxReporter JMX monitoring for 'solr_38257.solr.node' (registry 'solr.node') enabled at server: com.sun.jmx.mbeanserver.JmxMBeanServer@442b7fef
   [junit4]   2> 1927954 INFO  (jetty-launcher-6781-thread-5) [n:127.0.0.1:38223_solr    ] o.a.s.m.r.SolrJmxReporter JMX monitoring for 'solr_38223.solr.jvm' (registry 'solr.jvm') enabled at server: com.sun.jmx.mbeanserver.JmxMBeanServer@442b7fef
   [junit4]   2> 1927954 INFO  (jetty-launcher-6781-thread-5) [n:127.0.0.1:38223_solr    ] o.a.s.m.r.SolrJmxReporter JMX monitoring for 'solr_38223.solr.jetty' (registry 'solr.jetty') enabled at server: com.sun.jmx.mbeanserver.JmxMBeanServer@442b7fef
   [junit4]   2> 1927954 INFO  (zkCallback-6840-thread-1) [    ] o.a.s.c.c.ZkStateReader Updated live nodes from ZooKeeper... (3) -> (4)
   [junit4]   2> 1927955 INFO  (jetty-launcher-6781-thread-5) [n:127.0.0.1:38223_solr    ] o.a.s.c.CorePropertiesLocator Found 0 core definitions underneath /home/jenkins/workspace/Lucene-Solr-master-Linux/solr/build/solr-core/test/J0/temp/solr.cloud.autoscaling.NodeLostTriggerTest_D02F7287FD10F151-001/tempDir-001/node5/.
   [junit4]   2> 1927959 INFO  (zkCallback-6813-thread-1) [    ] o.a.s.c.c.ZkStateReader Updated live nodes from ZooKeeper... (3) -> (4)
   [junit4]   2> 1927959 INFO  (zkCallback-6831-thread-1) [    ] o.a.s.c.c.ZkStateReader Updated live nodes from ZooKeeper... (3) -> (4)
   [junit4]   2> 1927959 INFO  (jetty-launcher-6781-thread-4) [n:127.0.0.1:38257_solr    ] o.a.s.m.r.SolrJmxReporter JMX monitoring for 'solr_38257.solr.jvm' (registry 'solr.jvm') enabled at server: com.sun.jmx.mbeanserver.JmxMBeanServer@442b7fef
   [junit4]   2> 1927959 INFO  (jetty-launcher-6781-thread-4) [n:127.0.0.1:38257_solr    ] o.a.s.m.r.SolrJmxReporter JMX monitoring for 'solr_38257.solr.jetty' (registry 'solr.jetty') enabled at server: com.sun.jmx.mbeanserver.JmxMBeanServer@442b7fef
   [junit4]   2> 1927960 INFO  (jetty-launcher-6781-thread-4) [n:127.0.0.1:38257_solr    ] o.a.s.c.CorePropertiesLocator Found 0 core definitions underneath /home/jenkins/workspace/Lucene-Solr-master-Linux/solr/build/solr-core/test/J0/temp/solr.cloud.autoscaling.NodeLostTriggerTest_D02F7287FD10F151-001/tempDir-001/node4/.
   [junit4]   2> 1927963 INFO  (zkCallback-6833-thread-1) [    ] o.a.s.c.c.ZkStateReader Updated live nodes from ZooKeeper... (3) -> (4)
   [junit4]   2> 1927969 INFO  (zkConnectionManagerCallback-6849-thread-1) [    ] o.a.s.c.c.ConnectionManager zkClient has connected
   [junit4]   2> 1927970 INFO  (jetty-launcher-6781-thread-2) [n:127.0.0.1:32877_solr    ] o.a.s.c.c.ZkStateReader Updated live nodes from ZooKeeper... (0) -> (4)
   [junit4]   2> 1927970 INFO  (jetty-launcher-6781-thread-2) [n:127.0.0.1:32877_solr    ] o.a.s.c.s.i.ZkClientClusterStateProvider Cluster at 127.0.0.1:46007/solr ready
   [junit4]   2> 1927974 INFO  (jetty-launcher-6781-thread-2) [n:127.0.0.1:32877_solr    ] o.a.s.h.a.MetricsHistoryHandler No .system collection, keeping metrics history in memory.
   [junit4]   2> 1927989 INFO  (jetty-launcher-6781-thread-2) [n:127.0.0.1:32877_solr    ] o.a.s.m.r.SolrJmxReporter JMX monitoring for 'solr_32877.solr.node' (registry 'solr.node') enabled at server: com.sun.jmx.mbeanserver.JmxMBeanServer@442b7fef
   [junit4]   2> 1927996 INFO  (jetty-launcher-6781-thread-2) [n:127.0.0.1:32877_solr    ] o.a.s.m.r.SolrJmxReporter JMX monitoring for 'solr_32877.solr.jvm' (registry 'solr.jvm') enabled at server: com.sun.jmx.mbeanserver.JmxMBeanServer@442b7fef
   [junit4]   2> 1927996 INFO  (jetty-launcher-6781-thread-2) [n:127.0.0.1:32877_solr    ] o.a.s.m.r.SolrJmxReporter JMX monitoring for 'solr_32877.solr.jetty' (registry 'solr.jetty') enabled at server: com.sun.jmx.mbeanserver.JmxMBeanServer@442b7fef
   [junit4]   2> 1927997 INFO  (jetty-launcher-6781-thread-2) [n:127.0.0.1:32877_solr    ] o.a.s.c.CorePropertiesLocator Found 0 core definitions underneath /home/jenkins/workspace/Lucene-Solr-master-Linux/solr/build/solr-core/test/J0/temp/solr.cloud.autoscaling.NodeLostTriggerTest_D02F7287FD10F151-001/tempDir-001/node2/.
   [junit4]   2> 1928104 INFO  (jetty-launcher-6781-thread-3) [    ] o.a.s.c.ZkContainer Zookeeper client=127.0.0.1:46007/solr
   [junit4]   2> 1928106 INFO  (zkConnectionManagerCallback-6854-thread-1) [    ] o.a.s.c.c.ConnectionManager zkClient has connected
   [junit4]   2> 1928119 INFO  (zkConnectionManagerCallback-6856-thread-1) [    ] o.a.s.c.c.ConnectionManager zkClient has connected
   [junit4]   2> 1928128 INFO  (jetty-launcher-6781-thread-3) [n:127.0.0.1:37375_solr    ] o.a.s.c.c.ZkStateReader Updated live nodes from ZooKeeper... (0) -> (4)
   [junit4]   2> 1928130 INFO  (jetty-launcher-6781-thread-3) [n:127.0.0.1:37375_solr    ] o.a.s.c.TransientSolrCoreCacheDefault Allocating transient cache for 2147483647 transient cores
   [junit4]   2> 1928130 INFO  (jetty-launcher-6781-thread-3) [n:127.0.0.1:37375_solr    ] o.a.s.c.ZkController Register node as live in ZooKeeper:/live_nodes/127.0.0.1:37375_solr
   [junit4]   2> 1928131 INFO  (zkCallback-6840-thread-1) [    ] o.a.s.c.c.ZkStateReader Updated live nodes from ZooKeeper... (4) -> (5)
   [junit4]   2> 1928131 INFO  (zkCallback-6833-thread-1) [    ] o.a.s.c.c.ZkStateReader Updated live nodes from ZooKeeper... (4) -> (5)
   [junit4]   2> 1928131 INFO  (zkCallback-6831-thread-1) [    ] o.a.s.c.c.ZkStateReader Updated live nodes from ZooKeeper... (4) -> (5)
   [junit4]   2> 1928131 INFO  (zkCallback-6807-thread-2) [    ] o.a.s.c.c.ZkStateReader Updated live nodes from ZooKeeper... (4) -> (5)
   [junit4]   2> 1928131 INFO  (zkCallback-6813-thread-1) [    ] o.a.s.c.c.ZkStateReader Updated live nodes from ZooKeeper... (4) -> (5)
   [junit4]   2> 1928131 INFO  (zkCallback-6799-thread-1) [    ] o.a.s.c.c.ZkStateReader Updated live nodes from ZooKeeper... (4) -> (5)
   [junit4]   2> 1928131 INFO  (zkCallback-6855-thread-1) [    ] o.a.s.c.c.ZkStateReader Updated live nodes from ZooKeeper... (4) -> (5)
   [junit4]   2> 1928133 INFO  (zkCallback-6848-thread-1) [    ] o.a.s.c.c.ZkStateReader Updated live nodes from ZooKeeper... (4) -> (5)
   [junit4]   2> 1928134 INFO  (zkCallback-6821-thread-1) [    ] o.a.s.c.c.ZkStateReader Updated live nodes from ZooKeeper... (4) -> (5)
   [junit4]   2> 1928149 INFO  (zkConnectionManagerCallback-6863-thread-1) [    ] o.a.s.c.c.ConnectionManager zkClient has connected
   [junit4]   2> 1928150 INFO  (jetty-launcher-6781-thread-3) [n:127.0.0.1:37375_solr    ] o.a.s.c.c.ZkStateReader Updated live nodes from ZooKeeper... (0) -> (5)
   [junit4]   2> 1928150 INFO  (jetty-launcher-6781-thread-3) [n:127.0.0.1:37375_solr    ] o.a.s.c.s.i.ZkClientClusterStateProvider Cluster at 127.0.0.1:46007/solr ready
   [junit4]   2> 1928151 INFO  (jetty-launcher-6781-thread-3) [n:127.0.0.1:37375_solr    ] o.a.s.h.a.MetricsHistoryHandler No .system collection, keeping metrics history in memory.
   [junit4]   2> 1928165 INFO  (jetty-launcher-6781-thread-3) [n:127.0.0.1:37375_solr    ] o.a.s.m.r.SolrJmxReporter JMX monitoring for 'solr_37375.solr.node' (registry 'solr.node') enabled at server: com.sun.jmx.mbeanserver.JmxMBeanServer@442b7fef
   [junit4]   2> 1928199 INFO  (jetty-launcher-6781-thread-3) [n:127.0.0.1:37375_solr    ] o.a.s.m.r.SolrJmxReporter JMX monitoring for 'solr_37375.solr.jvm' (registry 'solr.jvm') enabled at server: com.sun.jmx.mbeanserver.JmxMBeanServer@442b7fef
   [junit4]   2> 1928199 INFO  (jetty-launcher-6781-thread-3) [n:127.0.0.1:37375_solr    ] o.a.s.m.r.SolrJmxReporter JMX monitoring for 'solr_37375.solr.jetty' (registry 'solr.jetty') enabled at server: com.sun.jmx.mbeanserver.JmxMBeanServer@442b7fef
   [junit4]   2> 1928200 INFO  (jetty-launcher-6781-thread-3) [n:127.0.0.1:37375_solr    ] o.a.s.c.CorePropertiesLocator Found 0 core definitions underneath /home/jenkins/workspace/Lucene-Solr-master-Linux/solr/build/solr-core/test/J0/temp/solr.cloud.autoscaling.NodeLostTriggerTest_D02F7287FD10F151-001/tempDir-001/node3/.
   [junit4]   2> 1928239 INFO  (zkConnectionManagerCallback-6866-thread-1) [    ] o.a.s.c.c.ConnectionManager zkClient has connected
   [junit4]   2> 1928242 INFO  (zkConnectionManagerCallback-6871-thread-1) [    ] o.a.s.c.c.ConnectionManager zkClient has connected
   [junit4]   2> 1928243 INFO  (SUITE-NodeLostTriggerTest-seed#[D02F7287FD10F151]-worker) [    ] o.a.s.c.c.ZkStateReader Updated live nodes from ZooKeeper... (0) -> (5)
   [junit4]   2> 1928243 INFO  (SUITE-NodeLostTriggerTest-seed#[D02F7287FD10F151]-worker) [    ] o.a.s.c.s.i.ZkClientClusterStateProvider Cluster at 127.0.0.1:46007/solr ready
   [junit4]   2> 1928394 INFO  (TEST-NodeLostTriggerTest.testRestoreState-seed#[D02F7287FD10F151]) [    ] o.a.s.SolrTestCaseJ4 ###Starting testRestoreState
   [junit4]   2> 1928395 INFO  (TEST-NodeLostTriggerTest.testRestoreState-seed#[D02F7287FD10F151]) [    ] o.e.j.s.Server jetty-9.4.11.v20180605; built: 2018-06-05T18:24:03.829Z; git: d5fc0523cfa96bfebfbda19606cad384d772f04c; jvm 1.8.0_172-b11
   [junit4]   2> 1928396 INFO  (TEST-NodeLostTriggerTest.testRestoreState-seed#[D02F7287FD10F151]) [    ] o.e.j.s.session DefaultSessionIdManager workerName=node0
   [junit4]   2> 1928396 INFO  (TEST-NodeLostTriggerTest.testRestoreState-seed#[D02F7287FD10F151]) [    ] o.e.j.s.session No SessionScavenger set, using defaults
   [junit4]   2> 1928396 INFO  (TEST-NodeLostTriggerTest.testRestoreState-seed#[D02F7287FD10F151]) [    ] o.e.j.s.session node0 Scavenging every 600000ms
   [junit4]   2> 1928397 INFO  (TEST-NodeLostTriggerTest.testRestoreState-seed#[D02F7287FD10F151]) [    ] o.e.j.s.h.ContextHandler Started o.e.j.s.ServletContextHandler@6fa4a995{/solr,null,AVAILABLE}
   [junit4]   2> 1928397 INFO  (TEST-NodeLostTriggerTest.testRestoreState-seed#[D02F7287FD10F151]) [    ] o.e.j.s.AbstractConnector Started ServerConnector@3e4c6b6d{SSL,[ssl, http/1.1]}{127.0.0.1:43801}
   [junit4]   2> 1928397 INFO  (TEST-NodeLostTriggerTest.testRestoreState-seed#[D02F7287FD10F151]) [    ] o.e.j.s.Server Started @1928436ms
   [junit4]   2> 1928397 INFO  (TEST-NodeLostTriggerTest.testRestoreState-seed#[D02F7287FD10F151]) [    ] o.a.s.c.s.e.JettySolrRunner Jetty properties: {hostContext=/solr, hostPort=43801}
   [junit4]   2> 1928397 ERROR (TEST-NodeLostTriggerTest.testRestoreState-seed#[D02F7287FD10F151]) [    ] o.a.s.u.StartupLoggingUtils Missing Java Option solr.log.dir. Logging may be missing or incomplete.
   [junit4]   2> 1928397 INFO  (TEST-NodeLostTriggerTest.testRestoreState-seed#[D02F7287FD10F151]) [    ] o.a.s.s.SolrDispatchFilter Using logger factory org.apache.logging.slf4j.Log4jLoggerFactory
   [junit4]   2> 1928397 INFO  (TEST-NodeLostTriggerTest.testRestoreState-seed#[D02F7287FD10F151]) [    ] o.a.s.s.SolrDispatchFilter  ___      _       Welcome to Apache Solr? version 8.0.0
   [junit4]   2> 1928397 INFO  (TEST-NodeLostTriggerTest.testRestoreState-seed#[D02F7287FD10F151]) [    ] o.a.s.s.SolrDispatchFilter / __| ___| |_ _   Starting in cloud mode on port null
   [junit4]   2> 1928397 INFO  (TEST-NodeLostTriggerTest.testRestoreState-seed#[D02F7287FD10F151]) [    ] o.a.s.s.SolrDispatchFilter \__ \/ _ \ | '_|  Install dir: null
   [junit4]   2> 1928397 INFO  (TEST-NodeLostTriggerTest.testRestoreState-seed#[D02F7287FD10F151]) [    ] o.a.s.s.SolrDispatchFilter |___/\___/_|_|    Start time: 2018-09-02T13:41:34.582Z
   [junit4]   2> 1928402 INFO  (zkConnectionManagerCallback-6873-thread-1) [    ] o.a.s.c.c.ConnectionManager zkClient has connected
   [junit4]   2> 1928403 INFO  (TEST-NodeLostTriggerTest.testRestoreState-seed#[D02F7287FD10F151]) [    ] o.a.s.s.SolrDispatchFilter solr.xml found in ZooKeeper. Loading...
   [junit4]   2> 1928578 INFO  (TEST-NodeLostTriggerTest.testRestoreState-seed#[D02F7287FD10F151]) [    ] o.a.s.c.ZkContainer Zookeeper client=127.0.0.1:46007/solr
   [junit4]   2> 1928585 INFO  (zkConnectionManagerCallback-6877-thread-1) [    ] o.a.s.c.c.ConnectionManager zkClient has connected
   [junit4]   2> 1928593 INFO  (zkConnectionManagerCallback-6879-thread-1) [    ] o.a.s.c.c.ConnectionManager zkClient has connected
   [junit4]   2> 1928600 INFO  (TEST-NodeLostTriggerTest.testRestoreState-seed#[D02F7287FD10F151]) [n:127.0.0.1:43801_solr    ] o.a.s.c.c.ZkStateReader Updated live nodes from ZooKeeper... (0) -> (5)
   [junit4]   2> 1928602 INFO  (TEST-NodeLostTriggerTest.testRestoreState-seed#[D02F7287FD10F151]) [n:127.0.0.1:43801_solr    ] o.a.s.c.TransientSolrCoreCacheDefault Allocating transient cache for 2147483647 transient cores
   [junit4]   2> 1928602 INFO  (TEST-NodeLostTriggerTest.testRestoreState-seed#[D02F7287FD10F151]) [n:127.0.0.1:43801_solr    ] o.a.s.c.ZkController Register node as live in ZooKeeper:/live_nodes/127.0.0.1:43801_solr
   [junit4]   2> 1928604 INFO  (zkCallback-6807-thread-2) [    ] o.a.s.c.c.ZkStateReader Updated live nodes from ZooKeeper... (5) -> (6)
   [junit4]   2> 1928604 INFO  (zkCallback-6821-thread-1) [    ] o.a.s.c.c.ZkStateReader Updated live nodes from ZooKeeper... (5) -> (6)
   [junit4]   2> 1928604 INFO  (zkCallback-6833-thread-1) [    ] o.a.s.c.c.ZkStateReader Updated live nodes from ZooKeeper... (5) -> (6)
   [junit4]   2> 1928604 INFO  (zkCallback-6813-thread-1) [    ] o.a.s.c.c.ZkStateReader Updated live nodes from ZooKeeper... (5) -> (6)
   [junit4]   2> 1928604 INFO  (zkCallback-6840-thread-1) [    ] o.a.s.c.c.ZkStateReader Updated live nodes from ZooKeeper... (5) -> (6)
   [junit4]   2> 1928604 INFO  (zkCallback-6831-thread-1) [    ] o.a.s.c.c.ZkStateReader Updated live nodes from ZooKeeper... (5) -> (6)
   [junit4]   2> 1928610 INFO  (zkCallback-6799-thread-1) [    ] o.a.s.c.c.ZkStateReader Updated live nodes from ZooKeeper... (5) -> (6)
   [junit4]   2> 1928623 INFO  (zkCallback-6862-thread-1) [    ] o.a.s.c.c.ZkStateReader Updated live nodes from ZooKeeper... (5) -> (6)
   [junit4]   2> 1928624 INFO  (zkCallback-6878-thread-1) [    ] o.a.s.c.c.ZkStateReader Updated live nodes from ZooKeeper... (5) -> (6)
   [junit4]   2> 1928638 INFO  (zkCallback-6870-thread-1) [    ] o.a.s.c.c.ZkStateReader Updated live nodes from ZooKeeper... (5) -> (6)
   [junit4]   2> 1928638 INFO  (zkCallback-6848-thread-1) [    ] o.a.s.c.c.ZkStateReader Updated live nodes from ZooKeeper... (5) -> (6)
   [junit4]   2> 1928639 INFO  (zkCallback-6855-thread-1) [    ] o.a.s.c.c.ZkStateReader Updated live nodes from ZooKeeper... (5) -> (6)
   [junit4]   2> 1928640 INFO  (zkConnectionManagerCallback-6886-thread-1) [    ] o.a.s.c.c.ConnectionManager zkClient has connected
   [junit4]   2> 1928640 INFO  (TEST-NodeLostTriggerTest.testRestoreState-seed#[D02F7287FD10F151]) [n:127.0.0.1:43801_solr    ] o.a.s.c.c.ZkStateReader Updated live nodes from ZooKeeper... (0) -> (6)
   [junit4]   2> 1928641 INFO  (TEST-NodeLostTriggerTest.testRestoreState-seed#[D02F7287FD10F151]) [n:127.0.0.1:43801_solr    ] o.a.s.c.s.i.ZkClientClusterStateProvider Cluster at 127.0.0.1:46007/solr ready
   [junit4]   2> 1928641 INFO  (TEST-NodeLostTriggerTest.testRestoreState-seed#[D02F7287FD10F151]) [n:127.0.0.1:43801_solr    ] o.a.s.h.a.MetricsHistoryHandler No .system collection, keeping metrics history in memory.
   [junit4]   2> 1928655 INFO  (TEST-NodeLostTriggerTest.testRestoreState-seed#[D02F7287FD10F151]) [n:127.0.0.1:43801_solr    ] o.a.s.m.r.SolrJmxReporter JMX monitoring for 'solr_43801.solr.node' (registry 'solr.node') enabled at server: com.sun.jmx.mbeanserver.JmxMBeanServer@442b7fef
   [junit4]   2> 1928662 INFO  (TEST-NodeLostTriggerTest.testRestoreState-seed#[D02F7287FD10F151]) [n:127.0.0.1:43801_solr    ] o.a.s.m.r.SolrJmxReporter JMX monitoring for 'solr_43801.solr.jvm' (registry 'solr.jvm') enabled at server: com.sun.jmx.mbeanserver.JmxMBeanServer@442b7fef
   [junit4]   2> 1928662 INFO  (TEST-NodeLostTriggerTest.testRestoreState-seed#[D02F7287FD10F151]) [n:127.0.0.1:43801_solr    ] o.a.s.m.r.SolrJmxReporter JMX monitoring for 'solr_43801.solr.jetty' (registry 'solr.jetty') enabled at server: com.sun.jmx.mbeanserver.JmxMBeanServer@442b7fef
   [junit4]   2> 1928663 INFO  (TEST-NodeLostTriggerTest.testRestoreState-seed#[D02F7287FD10F151]) [n:127.0.0.1:43801_solr    ] o.a.s.c.CorePropertiesLocator Found 0 core definitions underneath /home/jenkins/workspace/Lucene-Solr-master-Linux/solr/build/solr-core/test/J0/temp/solr.cloud.autoscaling.NodeLostTriggerTest_D02F7287FD10F151-001/tempDir-001/node6/.
   [junit4]   2> 1928709 INFO  (TEST-NodeLostTriggerTest.testRestoreState-seed#[D02F7287FD10F151]) [    ] o.e.j.s.AbstractConnector Stopped ServerConnector@3e4c6b6d{SSL,[ssl, http/1.1]}{127.0.0.1:0}
   [junit4]   2> 1928709 INFO  (TEST-NodeLostTriggerTest.testRestoreState-seed#[D02F7287FD10F151]) [    ] o.a.s.c.CoreContainer Shutting down CoreContainer instance=791009477
   [junit4]   2> 1928709 INFO  (TEST-NodeLostTriggerTest.testRestoreState-seed#[D02F7287FD10F151]) [    ] o.a.s.m.SolrMetricManager Closing metric reporters for registry=solr.node, tag=null
   [junit4]   2> 1928709 INFO  (TEST-NodeLostTriggerTest.testRestoreState-seed#[D02F7287FD10F151]) [    ] o.a.s.m.r.SolrJmxReporter Closing reporter [org.apache.solr.metrics.reporters.SolrJmxReporter@6891868d: rootName = solr_43801, domain = solr.node, service url = null, agent id = null] for registry solr.node / com.codahale.metrics.MetricRegistry@1e9857a7
   [junit4]   2> 1928715 INFO  (TEST-NodeLostTriggerTest.testRestoreState-seed#[D02F7287FD10F151]) [    ] o.a.s.m.SolrMetricManager Closing metric reporters for registry=solr.jvm, tag=null
   [junit4]   2> 1928715 INFO  (TEST-NodeLostTriggerTest.testRestoreState-seed#[D02F7287FD10F151]) [    ] o.a.s.m.r.SolrJmxReporter Closing reporter [org.apache.solr.metrics.reporters.SolrJmxReporter@267a9f58: rootName = solr_43801, domain = solr.jvm, service url = null, agent id = null] for registry solr.jvm / com.codahale.metrics.MetricRegistry@e611bd1
   [junit4]   2> 1928718 INFO  (TEST-NodeLostTriggerTest.testRestoreState-seed#[D02F7287FD10F151]) [    ] o.a.s.m.SolrMetricManager Closing metric reporters for registry=solr.jetty, tag=null
   [junit4]   2> 1928718 INFO  (TEST-NodeLostTriggerTest.testRestoreState-seed#[D02F7287FD10F151]) [    ] o.a.s.m.r.SolrJmxReporter Closing reporter [org.apache.solr.metrics.reporters.SolrJmxReporter@4d71a81e: rootName = solr_43801, domain = solr.jetty, service url = null, agent id = null] for registry solr.jetty / com.codahale.metrics.MetricRegistry@3fe0785b
   [junit4]   2> 1928718 INFO  (TEST-NodeLostTriggerTest.testRestoreState-seed#[D02F7287FD10F151]) [    ] o.a.s.c.ZkController Remove node as live in ZooKeeper:/live_nodes/127.0.0.1:43801_solr
   [junit4]   2> 1928719 INFO  (zkCallback-6833-thread-1) [    ] o.a.s.c.c.ZkStateReader Updated live nodes from ZooKeeper... (6) -> (5)
   [junit4]   2> 1928719 INFO  (zkCallback-6813-thread-1) [    ] o.a.s.c.c.ZkStateReader Updated live nodes from ZooKeeper... (6) -> (5)
   [junit4]   2> 1928719 INFO  (TEST-NodeLostTriggerTest.testRestoreState-seed#[D02F7287FD10F151]) [    ] o.a.s.m.SolrMetricManager Closing metric reporters for registry=solr.cluster, tag=null
   [junit4]   2> 1928719 INFO  (zkCallback-6870-thread-1) [    ] o.a.s.c.c.ZkStateReader Updated live nodes from ZooKeeper... (6) -> (5)
   [junit4]   2> 1928719 INFO  (zkCallback-6799-thread-1) [    ] o.a.s.c.c.ZkStateReader Updated live nodes from ZooKeeper... (6) -> (5)
   [junit4]   2> 1928719 INFO  (zkCallback-6807-thread-2) [    ] o.a.s.c.c.ZkStateReader Updated live nodes from ZooKeeper... (6) -> (5)
   [junit4]   2> 1928719 INFO  (zkCallback-6821-thread-1) [    ] o.a.s.c.c.ZkStateReader Updated live nodes from ZooKeeper... (6) -> (5)
   [junit4]   2> 1928719 INFO  (zkCallback-6855-thread-1) [    ] o.a.s.c.c.ZkStateReader Updated live nodes from ZooKeeper... (6) -> (5)
   [junit4]   2> 1928719 INFO  (zkCallback-6878-thread-1) [    ] o.a.s.c.c.ZkStateReader Updated live nodes from ZooKeeper... (6) -> (5)
   [junit4]   2> 1928719 INFO  (zkCallback-6831-thread-1) [    ] o.a.s.c.c.ZkStateReader Updated live nodes from ZooKeeper... (6) -> (5)
   [junit4]   2> 1928719 INFO  (zkCallback-6848-thread-1) [    ] o.a.s.c.c.ZkStateReader Updated live nodes from ZooKeeper... (6) -> (5)
   [junit4]   2> 1928719 INFO  (zkCallback-6840-thread-1) [    ] o.a.s.c.c.ZkStateReader Updated live nodes from ZooKeeper... (6) -> (5)
   [junit4]   2> 1928720 INFO  (zkCallback-6862-thread-1) [    ] o.a.s.c.c.ZkStateReader Updated live nodes from ZooKeeper... (6) -> (5)
   [junit4]   2> 1928720 INFO  (zkCallback-6885-thread-1) [    ] o.a.s.c.c.ZkStateReader Updated live nodes from ZooKeeper... (6) -> (5)
   [junit4]   2> 1928720 WARN  (NIOServerCxn.Factory:0.0.0.0/0.0.0.0:0) [    ] o.a.z.s.NIOServerCnxn Unable to read additional data from client sessionid 0x10058e48562001a, likely client has closed socket
   [junit4]   2> 1928721 INFO  (TEST-NodeLostTriggerTest.testRestoreState-seed#[D02F7287FD10F151]) [    ] o.e.j.s.h.ContextHandler Stopped o.e.j.s.ServletContextHandler@6fa4a995{/solr,null,UNAVAILABLE}
   [junit4]   2> 1928721 INFO  (TEST-NodeLostTriggerTest.testRestoreState-seed#[D02F7287FD10F151]) [    ] o.e.j.s.session node0 Stopped scavenging
   [junit4]   2> 1933726 INFO  (TEST-NodeLostTriggerTest.testRestoreState-seed#[D02F7287FD10F151]) [    ] o.a.s.SolrTestCaseJ4 ###Ending testRestoreState
   [junit4]   2> 1933854 INFO  (TEST-NodeLostTriggerTest.testListenerAcceptance-seed#[D02F7287FD10F151]) [    ] o.a.s.SolrTestCaseJ4 ###Starting testListenerAcceptance
   [junit4]   2> 1933856 INFO  (TEST-NodeLostTriggerTest.testListenerAcceptance-seed#[D02F7287FD10F151]) [    ] o.e.j.s.Server jetty-9.4.11.v20180605; built: 2018-06-05T18:24:03.829Z; git: d5fc0523cfa96bfebfbda19606cad384d772f04c; jvm 1.8.0_172-b11
   [junit4]   2> 1933856 INFO  (TEST-NodeLostTriggerTest.testListenerAcceptance-seed#[D02F7287FD10F151]) [    ] o.e.j.s.session DefaultSessionIdManager workerName=node0
   [junit4]   2> 1933856 INFO  (TEST-NodeLostTriggerTest.testListenerAcceptance-seed#[D02F7287FD10F151]) [    ] o.e.j.s.session No SessionScavenger set, using defaults
   [junit4]   2> 1933856 INFO  (TEST-NodeLostTriggerTest.testListenerAcceptance-seed#[D02F7287FD10F151]) [    ] o.e.j.s.session node0 Scavenging every 600000ms
   [junit4]   2> 1933857 INFO  (TEST-NodeLostTriggerTest.testListenerAcceptance-seed#[D02F7287FD10F151]) [    ] o.e.j.s.h.ContextHandler Started o.e.j.s.ServletContextHandler@50c38272{/solr,null,AVAILABLE}
   [junit4]   2> 1933857 INFO  (TEST-NodeLostTriggerTest.testListenerAcceptance-seed#[D02F7287FD10F151]) [    ] o.e.j.s.AbstractConnector Started ServerConnector@37c33021{SSL,[ssl, http/1.1]}{127.0.0.1:43461}
   [junit4]   2> 1933857 INFO  (TEST-NodeLostTriggerTest.testListenerAcceptance-seed#[D02F7287FD10F151]) [    ] o.e.j.s.Server Started @1933896ms
   [junit4]   2> 1933857 INFO  (TEST-NodeLostTriggerTest.testListenerAcceptance-seed#[D02F7287FD10F151]) [    ] o.a.s.c.s.e.JettySolrRunner Jetty properties: {hostContext=/solr, hostPort=43461}
   [junit4]   2> 1933857 ERROR (TEST-NodeLostTriggerTest.testListenerAcceptance-seed#[D02F7287FD10F151]) [    ] o.a.s.u.StartupLoggingUtils Missing Java Option solr.log.dir. Logging may be missing or incomplete.
   [junit4]   2> 1933857 INFO  (TEST-NodeLostTriggerTest.testListenerAcceptance-seed#[D02F7287FD10F151]) [    ] o.a.s.s.SolrDispatchFilter Using logger factory org.apache.logging.slf4j.Log4jLoggerFactory
   [junit4]   2> 1933857 INFO  (TEST-NodeLostTriggerTest.testListenerAcceptance-seed#[D02F7287FD10F151]) [    ] o.a.s.s.SolrDispatchFilter  ___      _       Welcome to Apache Solr? version 8.0.0
   [junit4]   2> 1933857 INFO  (TEST-NodeLostTriggerTest.testListenerAcceptance-seed#[D02F7287FD10F151]) [    ] o.a.s.s.SolrDispatchFilter / __| ___| |_ _   Starting in cloud mode on port null
   [junit4]   2> 1933858 INFO  (TEST-NodeLostTriggerTest.testListenerAcceptance-seed#[D02F7287FD10F151]) [    ] o.a.s.s.SolrDispatchFilter \__ \/ _ \ | '_|  Install dir: null
   [junit4]   2> 1933858 INFO  (TEST-NodeLostTriggerTest.testListenerAcceptance-seed#[D02F7287FD10F151]) [    ] o.a.s.s.SolrDispatchFilter |___/\___/_|_|    Start time: 2018-09-02T13:41:40.043Z
   [junit4]   2> 1933859 INFO  (zkConnectionManagerCallback-6889-thread-1) [    ] o.a.s.c.c.ConnectionManager zkClient has connected
   [junit4]   2> 1933859 INFO  (TEST-NodeLostTriggerTest.testListenerAcceptance-seed#[D02F7287FD10F151]) [    ] o.a.s.s.SolrDispatchFilter solr.xml found in ZooKeeper. Loading...
   [junit4]   2> 1933890 INFO  (TEST-NodeLostTriggerTest.testListenerAcceptance-seed#[D02F7287FD10F151]) [    ] o.a.s.c.ZkContainer Zookeeper client=127.0.0.1:46007/solr
   [junit4]   2> 1933891 INFO  (zkConnectionManagerCallback-6893-thread-1) [    ] o.a.s.c.c.ConnectionManager zkClient has connected
   [junit4]   2> 1933893 INFO  (zkConnectionManagerCallback-6895-thread-1) [    ] o.a.s.c.c.ConnectionManager zkClient has connected
   [junit4]   2> 1933895 INFO  (TEST-NodeLostTriggerTest.testListenerAcceptance-seed#[D02F7287FD10F151]) [    ] o.a.s.c.c.ZkStateReader Updated live nodes from ZooKeeper... (0) -> (5)
   [junit4]   2> 1933897 INFO  (TEST-NodeLostTriggerTest.testListenerAcceptance-seed#[D02F7287FD10F151]) [    ] o.a.s.c.TransientSolrCoreCacheDefault Allocating transient cache for 2147483647 transient cores
   [junit4]   2> 1933897 INFO  (TEST-NodeLostTriggerTest.testListenerAcceptance-seed#[D02F7287FD10F151]) [    ] o.a.s.c.ZkController Register node as live in ZooKeeper:/live_nodes/127.0.0.1:43461_solr
   [junit4]   2> 1933898 INFO  (zkCallback-6813-thread-1) [    ] o.a.s.c.c.ZkStateReader Updated live nodes from ZooKeeper... (5) -> (6)
   [junit4]   2> 1933898 INFO  (zkCallback-6848-thread-1) [    ] o.a.s.c.c.ZkStateReader Updated live nodes from ZooKeeper... (5) -> (6)
   [junit4]   2> 1933898 INFO  (zkCallback-6870-thread-1) [    ] o.a.s.c.c.ZkStateReader Updated live nodes from ZooKeeper... (5) -> (6)
   [junit4]   2> 1933898 INFO  (zkCallback-6862-thread-1) [    ] o.a.s.c.c.ZkStateReader Updated live nodes from ZooKeeper... (5) -> (6)
   [junit4]   2> 1933898 INFO  (zkCallback-6840-thread-1) [    ] o.a.s.c.c.ZkStateReader Updated live nodes from ZooKeeper... (5) -> (6)
   [junit4]   2> 1933898 INFO  (zkCallback-6807-thread-2) [    ] o.a.s.c.c.ZkStateReader Updated live nodes from ZooKeeper... (5) -> (6)
   [junit4]   2> 1933898 INFO  (zkCallback-6833-thread-1) [    ] o.a.s.c.c.ZkStateReader Updated live nodes from ZooKeeper... (5) -> (6)
   [junit4]   2> 1933898 INFO  (zkCallback-6855-thread-1) [    ] o.a.s.c.c.ZkStateReader Updated live nodes from ZooKeeper... (5) -> (6)
   [junit4]   2> 1933898 INFO  (zkCallback-6821-thread-1) [    ] o.a.s.c.c.ZkStateReader Updated live nodes from ZooKeeper... (5) -> (6)
   [junit4]   2> 1933898 INFO  (zkCallback-6831-thread-1) [    ] o.a.s.c.c.ZkStateReader Updated live nodes from ZooKeeper... (5) -> (6)
   [junit4]   2> 1933898 INFO  (zkCallback-6799-thread-1) [    ] o.a.s.c.c.ZkStateReader Updated live nodes from ZooKeeper... (5) -> (6)
   [junit4]   2> 1933898 INFO  (zkCallback-6894-thread-1) [    ] o.a.s.c.c.ZkStateReader Updated live nodes from ZooKeeper... (5) -> (6)
   [junit4]   2> 1933914 INFO  (zkConnectionManagerCallback-6902-thread-1) [    ] o.a.s.c.c.ConnectionManager zkClient has connected
   [junit4]   2> 1933915 INFO  (TEST-NodeLostTriggerTest.testListenerAcceptance-seed#[D02F7287FD10F151]) [    ] o.a.s.c.c.ZkStateReader Updated live nodes from ZooKeeper... (0) -> (6)
   [junit4]   2> 1933915 INFO  (TEST-NodeLostTriggerTest.testListenerAcceptance-seed#[D02F7287FD10F151]) [    ] o.a.s.c.s.i.ZkClientClusterStateProvider Cluster at 127.0.0.1:46007/solr ready
   [junit4]   2> 1933916 INFO  (TEST-NodeLostTriggerTest.testListenerAcceptance-seed#[D02F7287FD10F151]) [    ] o.a.s.h.a.MetricsHistoryHandler No .system collection, keeping metrics history in memory.
   [junit4]   2> 1933933 INFO  (TEST-NodeLostTriggerTest.testListenerAcceptance-seed#[D02F7287FD10F151]) [    ] o.a.s.m.r.SolrJmxReporter JMX monitoring for 'solr_43461.solr.node' (registry 'solr.node') enabled at server: com.sun.jmx.mbeanserver.JmxMBeanServer@442b7fef
   [junit4]   2> 1933942 INFO  (TEST-NodeLostTriggerTest.testListenerAcceptance-seed#[D02F7287FD10F151]) [    ] o.a.s.m.r.SolrJmxReporter JMX monitoring for 'solr_43461.solr.jvm' (registry 'solr.jvm') enabled at server: com.sun.jmx.mbeanserver.JmxMBeanServer@442b7fef
   [junit4]   2> 1933942 INFO  (TEST-NodeLostTriggerTest.testListenerAcceptance-seed#[D02F7287FD10F151]) [    ] o.a.s.m.r.SolrJmxReporter JMX monitoring for 'solr_43461.solr.jetty' (registry 'solr.jetty') enabled at server: com.sun.jmx.mbeanserver.JmxMBeanServer@442b7fef
   [junit4]   2> 1933943 INFO  (TEST-NodeLostTriggerTest.testListenerAcceptance-seed#[D02F7287FD10F151]) [    ] o.a.s.c.CorePropertiesLocator Found 0 core definitions underneath /home/jenkins/workspace/Lucene-Solr-master-Linux/solr/build/solr-core/test/J0/temp/solr.cloud.autoscaling.NodeLostTriggerTest_D02F7287FD10F151-001/tempDir-001/node7/.
   [junit4]   2> 1934007 INFO  (zkConnectionManagerCallback-6905-thread-1) [    ] o.a.s.c.c.ConnectionManager zkClient has connected
   [junit4]   2> 1934008 INFO  (TEST-NodeLostTriggerTest.testListenerAcceptance-seed#[D02F7287FD10F151]) [    ] o.e.j.s.AbstractConnector Stopped ServerConnector@37c33021{SSL,[ssl, http/1.1]}{127.0.0.1:0}
   [junit4]   2> 1934009 INFO  (TEST-NodeLostTriggerTest.testListenerAcceptance-seed#[D02F7287FD10F151]) [    ] o.a.s.c.CoreContainer Shutting down CoreContainer instance=1182821046
   [junit4]   2> 1934009 INFO  (TEST-NodeLostTriggerTest.testListenerAcceptance-seed#[D02F7287FD10F151]) [    ] o.a.s.m.SolrMetricManager Closing metric reporters for registry=solr.node, tag=null
   [junit4]   2> 1934009 INFO  (TEST-NodeLostTriggerTest.testListenerAcceptance-seed#[D02F7287FD10F151]) [    ] o.a.s.m.r.SolrJmxReporter Closing reporter [org.apache.solr.metrics.reporters.SolrJmxReporter@e68021: rootName = solr_43461, domain = solr.node, service url = null, agent id = null] for registry solr.node / com.codahale.metrics.MetricRegistry@33243d44
   [junit4]   2> 1934014 INFO  (TEST-NodeLostTriggerTest.testListenerAcceptance-seed#[D02F7287FD10F151]) [    ] o.a.s.m.SolrMetricManager Closing metric reporters for registry=solr.jvm, tag=null
   [junit4]   2> 1934014 INFO  (TEST-NodeLostTriggerTest.testListenerAcceptance-seed#[D02F7287FD10F151]) [    ] o.a.s.m.r.SolrJmxReporter Closing reporter [org.apache.solr.metrics.reporters.SolrJmxReporter@2991cd06: rootName = solr_43461, domain = solr.jvm, service url = null, agent id = null] for registry solr.jvm / com.codahale.metrics.MetricRegistry@e611bd1
   [junit4]   2> 1934017 INFO  (TEST-NodeLostTriggerTest.testListenerAcceptance-seed#[D02F7287FD10F151]) [    ] o.a.s.m.SolrMetricManager Closing metric reporters for registry=solr.jetty, tag=null
   [junit4]   2> 1934017 INFO  (TEST-NodeLostTriggerTest.testListenerAcceptance-seed#[D02F7287FD10F151]) [    ] o.a.s.m.r.SolrJmxReporter Closing reporter [org.apache.solr.metrics.reporters.SolrJmxReporter@5537b26c: rootName = solr_43461, domain = solr.jetty, service url = null, agent id = null] for registry solr.jetty / com.codahale.metrics.MetricRegistry@3fe0785b
   [junit4]   2> 1934018 INFO  (TEST-NodeLostTriggerTest.testListenerAcceptance-seed#[D02F7287FD10F151]) [    ] o.a.s.c.ZkController Remove node as live in ZooKeeper:/live_nodes/127.0.0.1:43461_solr
   [junit4]   2> 1934019 INFO  (zkCallback-6813-thread-1) [    ] o.a.s.c.c.ZkStateReader Updated live nodes from ZooKeeper... (6) -> (5)
   [junit4]   2> 1934019 INFO  (zkCallback-6848-thread-1) [    ] o.a.s.c.c.ZkStateReader Updated live nodes from ZooKeeper... (6) -> (5)
   [junit4]   2> 1934019 INFO  (zkCallback-6821-thread-1) [    ] o.a.s.c.c.ZkStateReader Updated live nodes from ZooKeeper... (6) -> (5)
   [junit4]   2> 1934019 INFO  (zkCallback-6894-thread-1) [    ] o.a.s.c.c.ZkStateReader Updated live nodes from ZooKeeper... (6) -> (5)
   [junit4]   2> 1934019 INFO  (TEST-NodeLostTriggerTest.testListenerAcceptance-seed#[D02F7287FD10F151]) [    ] o.a.s.m.SolrMetricManager Closing metric reporters for registry=solr.cluster, tag=null
   [junit4]   2> 1934019 INFO  (zkCallback-6831-thread-1) [    ] o.a.s.c.c.ZkStateReader Updated live nodes from ZooKeeper... (6) -> (5)
   [junit4]   2> 1934019 INFO  (zkCallback-6862-thread-1) [    ] o.a.s.c.c.ZkStateReader Updated live nodes from ZooKeeper... (6) -> (5)
   [junit4]   2> 1934019 INFO  (zkCallback-6833-thread-1) [    ] o.a.s.c.c.ZkStateReader Updated live nodes from ZooKeeper... (6) -> (5)
   [junit4]   2> 1934019 INFO  (zkCallback-6799-thread-1) [    ] o.a.s.c.c.ZkStateReader Updated live nodes from ZooKeeper... (6) -> (5)
   [junit4]   2> 1934019 INFO  (zkCallback-6855-thread-1) [    ] o.a.s.c.c.ZkStateReader Updated live nodes from ZooKeeper... (6) -> (5)
   [junit4]   2> 1934019 INFO  (zkCallback-6901-thread-1) [    ] o.a.s.c.c.ZkStateReader Updated live nodes from ZooKeeper... (6) -> (5)
   [junit4]   2> 1934019 INFO  (zkCallback-6807-thread-2) [    ] o.a.s.c.c.ZkStateReader Updated live nodes from ZooKeeper... (6) -> (5)
   [junit4]   2> 1934020 INFO  (TEST-NodeLostTriggerTest.testListenerAcceptance-seed#[D02F7287FD10F151]) [    ] o.e.j.s.h.ContextHandler Stopped o.e.j.s.ServletContextHandler@50c38272{/solr,null,UNAVAILABLE}
   [junit4]   2> 1934020 INFO  (TEST-NodeLostTriggerTest.testListenerAcceptance-seed#[D02F7287FD10F151]) [    ] o.e.j.s.session node0 Stopped scavenging
   [junit4]   2> 1934021 INFO  (zkConnectionManagerCallback-6907-thread-1) [    ] o.a.s.c.c.ConnectionManager zkClient has connected
   [junit4]   2> 1934022 INFO  (TEST-NodeLostTriggerTest.testListenerAcceptance-seed#[D02F7287FD10F151]) [    ] o.a.s.SolrTestCaseJ4 ###Ending testListenerAcceptance
   [junit4]   2> 1934022 INFO  (zkCallback-6870-thread-1) [    ] o.a.s.c.c.ZkStateReader Updated live nodes from ZooKeeper... (6) -> (5)
   [junit4]   2> 1934022 INFO  (zkCallback-6840-thread-1) [    ] o.a.s.c.c.ZkStateReader Updated live nodes from ZooKeeper... (6) -> (5)
   [junit4]   2> NOTE: reproduce with: ant test  -Dtestcase=NodeLostTriggerTest -Dtests.method=testListenerAcceptance -Dtests.seed=D02F7287FD10F151 -Dtests.multiplier=3 -Dtests.slow=true -Dtests.locale=sr-Latn-ME -Dtests.timezone=Iceland -Dtests.asserts=true -Dtests.file.encoding=US-ASCII
   [junit4] FAILURE 0.30s J0 | NodeLostTriggerTest.testListenerAcceptance <<<
   [junit4]    > Throwable #1: java.lang.AssertionError: expected:<1> but was:<0>
   [junit4]    > 	at __randomizedtesting.SeedInfo.seed([D02F7287FD10F151:C19B28604499E5A7]:0)
   [junit4]    > 	at org.apache.solr.cloud.autoscaling.NodeLostTriggerTest.testListenerAcceptance(NodeLostTriggerTest.java:265)
   [junit4]    > 	at java.lang.Thread.run(Thread.java:748)
   [junit4]   2> 1934143 INFO  (TEST-NodeLostTriggerTest.testActionLifecycle-seed#[D02F7287FD10F151]) [    ] o.a.s.SolrTestCaseJ4 ###Starting testActionLifecycle
   [junit4]   2> 1934145 INFO  (TEST-NodeLostTriggerTest.testActionLifecycle-seed#[D02F7287FD10F151]) [    ] o.a.s.SolrTestCaseJ4 ###Ending testActionLifecycle
   [junit4]   2> 1934266 INFO  (TEST-NodeLostTriggerTest.testTrigger-seed#[D02F7287FD10F151]) [    ] o.a.s.SolrTestCaseJ4 ###Starting testTrigger
   [junit4]   2> 1934269 INFO  (TEST-NodeLostTriggerTest.testTrigger-seed#[D02F7287FD10F151]) [    ] o.e.j.s.AbstractConnector Stopped ServerConnector@3d97b47c{SSL,[ssl, http/1.1]}{127.0.0.1:0}
   [junit4]   2> 1934271 INFO  (TEST-NodeLostTriggerTest.testTrigger-seed#[D02F7287FD10F151]) [    ] o.a.s.c.CoreContainer Shutting down CoreContainer instance=17673671
   [junit4]   2> 1934271 INFO  (TEST-NodeLostTriggerTest.testTrigger-seed#[D02F7287FD10F151]) [    ] o.a.s.m.SolrMetricManager Closing metric reporters for registry=solr.node, tag=null
   [junit4]   2> 1934271 INFO  (TEST-NodeLostTriggerTest.testTrigger-seed#[D02F7287FD10F151]) [    ] o.a.s.m.r.SolrJmxReporter Closing reporter [org.apache.solr.metrics.reporters.SolrJmxReporter@65cdb1bf: rootName = solr_36539, domain = solr.node, service url = null, agent id = null] for registry solr.node / com.codahale.metrics.MetricRegistry@7cb3abfb
   [junit4]   2> 1934277 INFO  (TEST-NodeLostTriggerTest.testTrigger-seed#[D02F7287FD10F151]) [    ] o.a.s.m.SolrMetricManager Closing metric reporters for registry=solr.jvm, tag=null
   [junit4]   2> 1934277 INFO  (TEST-NodeLostTriggerTest.testTrigger-seed#[D02F7287FD10F151]) [    ] o.a.s.m.r.SolrJmxReporter Closing reporter [org.apache.solr.metrics.reporters.SolrJmxReporter@321a637e: rootName = solr_36539, domain = solr.jvm, service url = null, agent id = null] for registry solr.jvm / com.codahale.metrics.MetricRegistry@e611bd1
   [junit4]   2> 1934280 INFO  (TEST-NodeLostTriggerTest.testTrigger-seed#[D02F7287FD10F151]) [    ] o.a.s.m.SolrMetricManager Closing metric reporters for registry=solr.jetty, tag=null
   [junit4]   2> 1934280 INFO  (TEST-NodeLostTriggerTest.testTrigger-seed#[D02F7287FD10F151]) [    ] o.a.s.m.r.SolrJmxReporter Closing reporter [org.apache.solr.metrics.reporters.SolrJmxReporter@1ee3bdbd: rootName = solr_36539, domain = solr.jetty, service url = null, agent id = null] for registry solr.jetty / com.codahale.metrics.MetricRegistry@3fe0785b
   [junit4]   2> 1934282 INFO  (TEST-NodeLostTriggerTest.testTrigger-seed#[D02F7287FD10F151]) [    ] o.a.s.c.ZkController Remove node as live in ZooKeeper:/live_nodes/127.0.0.1:36539_solr
   [junit4]   2> 1934282 INFO  (TEST-NodeLostTriggerTest.testTrigger-seed#[D02F7287FD10F151]) [    ] o.a.s.m.SolrMetricManager Closing metric reporters for registry=solr.cluster, tag=null
   [junit4]   2> 1934282 INFO  (zkCallback-6862-thread-1) [    ] o.a.s.c.c.ZkStateReader Updated live nodes from ZooKeeper... (5) -> (4)
   [junit4]   2> 1934283 INFO  (zkCallback-6831-thread-1) [    ] o.a.s.c.c.ZkStateReader Updated live nodes from ZooKeeper... (5) -> (4)
   [junit4]   2> 1934283 INFO  (zkCallback-6833-thread-1) [    ] o.a.s.c.c.ZkStateReader Updated live nodes from ZooKeeper... (5) -> (4)
   [junit4]   2> 1934283 INFO  (zkCallback-6848-thread-1) [    ] o.a.s.c.c.ZkStateReader Updated live nodes from ZooKeeper... (5) -> (4)
   [junit4]   2> 1934283 INFO  (zkCallback-6813-thread-1) [    ] o.a.s.c.c.ZkStateReader Updated live nodes from ZooKeeper... (5) -> (4)
   [junit4]   2> 1934283 INFO  (TEST-NodeLostTriggerTest.testTrigger-seed#[D02F7287FD10F151]) [    ] o.a.s.c.TransientSolrCoreCacheDefault Allocating transient cache for 2147483647 transient cores
   [junit4]   2> 1934283 INFO  (zkCallback-6807-thread-2) [    ] o.a.s.c.c.ZkStateReader Updated live nodes from ZooKeeper... (5) -> (4)
   [junit4]   2> 1934285 INFO  (zkCallback-6799-thread-1) [    ] o.a.s.c.c.ZkStateReader Updated live nodes from ZooKeeper... (5) -> (4)
   [junit4]   2> 1934285 INFO  (zkCallback-6855-thread-1) [    ] o.a.s.c.c.ZkStateReader Updated live nodes from ZooKeeper... (5) -> (4)
   [junit4]   2> 1934285 WARN  (NIOServerCxn.Factory:0.0.0.0/0.0.0.0:0) [    ] o.a.z.s.NIOServerCnxn Unable to read additional data from client sessionid 0x10058e485620007, likely client has closed socket
   [junit4]   2> 1934287 INFO  (TEST-NodeLostTriggerTest.testTrigger-seed#[D02F7287FD10F151]) [    ] o.e.j.s.h.ContextHandler Stopped o.e.j.s.ServletContextHandler@277e44d2{/solr,null,UNAVAILABLE}
   [junit4]   2> 1934287 INFO  (TEST-NodeLostTriggerTest.testTrigger-seed#[D02F7287FD10F151]) [    ] o.e.j.s.session node0 Stopped scavenging
   [junit4]   2> 1934288 INFO  (zkCallback-6870-thread-1) [    ] o.a.s.c.c.ZkStateReader Updated live nodes from ZooKeeper... (5) -> (4)
   [junit4]   2> 1934288 INFO  (zkCallback-6821-thread-1) [    ] o.a.s.c.c.ZkStateReader Updated live nodes from ZooKeeper... (5) -> (4)
   [junit4]   2> 1934288 INFO  (zkCallback-6840-thread-1) [    ] o.a.s.c.c.ZkStateReader Updated live nodes from ZooKeeper... (5) -> (4)
   [junit4]   2> 1934288 INFO  (TEST-NodeLostTriggerTest.testTrigger-seed#[D02F7287FD10F151]) [    ] o.e.j.s.AbstractConnector Stopped ServerConnector@2cfb0842{SSL,[ssl, http/1.1]}{127.0.0.1:0}
   [junit4]   2> 1934289 INFO  (TEST-NodeLostTriggerTest.testTrigger-seed#[D02F7287FD10F151]) [    ] o.a.s.c.CoreContainer Shutting down CoreContainer instance=1226257352
   [junit4]   2> 1934289 INFO  (TEST-NodeLostTriggerTest.testTrigger-seed#[D02F7287FD10F151]) [    ] o.a.s.m.SolrMetricManager Closing metric reporters for registry=solr.node, tag=null
   [junit4]   2> 1934289 INFO  (TEST-NodeLostTriggerTest.testTrigger-seed#[D02F7287FD10F151]) [    ] o.a.s.m.r.SolrJmxReporter Closing reporter [org.apache.solr.metrics.reporters.SolrJmxReporter@6ac16b93: rootName = solr_38223, domain = solr.node, service url = null, agent id = null] for registry solr.node / com.codahale.metrics.MetricRegistry@4cececb
   [junit4]   2> 1934295 INFO  (TEST-NodeLostTriggerTest.testTrigger-seed#[D02F7287FD10F151]) [    ] o.a.s.m.SolrMetricManager Closing metric reporters for registry=solr.jvm, tag=null
   [junit4]   2> 1934295 INFO  (TEST-NodeLostTriggerTest.testTrigger-seed#[D02F7287FD10F151]) [    ] o.a.s.m.r.SolrJmxReporter Closing reporter [org.apache.solr.metrics.reporters.SolrJmxReporter@727ab4ee: rootName = solr_38223, domain = solr.jvm, service url = null, agent id = null] for registry solr.jvm / com.codahale.metrics.MetricRegistry@e611bd1
   [junit4]   2> 1934298 INFO  (TEST-NodeLostTriggerTest.testTrigger-seed#[D02F7287FD10F151]) [    ] o.a.s.m.SolrMetricManager Closing metric reporters for registry=solr.jetty, tag=null
   [junit4]   2> 1934298 INFO  (TEST-NodeLostTriggerTest.testTrigger-seed#[D02F7287FD10F151]) [    ] o.a.s.m.r.SolrJmxReporter Closing reporter [org.apache.solr.metrics.reporters.SolrJmxReporter@22ba359: rootName = solr_38223, domain = solr.jetty, service url = null, agent id = null] for registry solr.jetty / com.codahale.metrics.MetricRegistry@3fe0785b
   [junit4]   2> 1934299 INFO  (TEST-NodeLostTriggerTest.testTrigger-seed#[D02F7287FD10F151]) [    ] o.a.s.c.ZkController Remove node as live in ZooKeeper:/live_nodes/127.0.0.1:38223_solr
   [junit4]   2> 1934300 INFO  (zkCallback-6870-thread-1) [    ] o.a.s.c.c.ZkStateReader Updated live nodes from ZooKeeper... (4) -> (3)
   [junit4]   2> 1934300 INFO  (zkCallback-6848-thread-1) [    ] o.a.s.c.c.ZkStateReader Updated live nodes from ZooKeeper... (4) -> (3)
   [junit4]   2> 1934300 INFO  (zkCallback-6821-thread-1) [    ] o.a.s.c.c.ZkStateReader Updated live nodes from ZooKeeper... (4) -> (3)
   [junit4]   2> 1934300 INFO  (TEST-NodeLostTriggerTest.testTrigger-seed#[D02F7287FD10F151]) [    ] o.a.s.m.SolrMetricManager Closing metric reporters for registry=solr.cluster, tag=null
   [junit4]   2> 1934301 INFO  (zkCallback-6833-thread-1) [    ] o.a.s.c.c.ZkStateReader Updated live nodes from ZooKeeper... (4) -> (3)
   [junit4]   2> 1934301 INFO  (zkCallback-6862-thread-1) [    ] o.a.s.c.c.ZkStateReader Updated live nodes from ZooKeeper... (4) -> (3)
   [junit4]   2> 1934301 INFO  (zkCallback-6855-thread-1) [    ] o.a.s.c.c.ZkStateReader Updated live nodes from ZooKeeper... (4) -> (3)
   [junit4]   2> 1934302 INFO  (zkCallback-6813-thread-1) [    ] o.a.s.c.c.ZkStateReader Updated live nodes from ZooKeeper... (4) -> (3)
   [junit4]   2> 1934302 INFO  (TEST-NodeLostTriggerTest.testTrigger-seed#[D02F7287FD10F151]) [    ] o.a.s.c.Overseer Overseer (id=72155332551507977-127.0.0.1:38223_solr-n_0000000000) closing
   [junit4]   2> 1934302 INFO  (OverseerStateUpdate-72155332551507977-127.0.0.1:38223_solr-n_0000000000) [n:127.0.0.1:38223_solr    ] o.a.s.c.Overseer Overseer Loop exiting : 127.0.0.1:38223_solr
   [junit4]   2> 1934302 INFO  (zkCallback-6807-thread-2) [    ] o.a.s.c.c.ZkStateReader Updated live nodes from ZooKeeper... (4) -> (3)
   [junit4]   2> 1934303 WARN  (OverseerAutoScalingTriggerThread-72155332551507977-127.0.0.1:38223_solr-n_0000000000) [    ] o.a.s.c.a.OverseerTriggerThread OverseerTriggerThread woken up but we are closed, exiting.
   [junit4]   2> 1934303 INFO  (zkCallback-6840-thread-1) [    ] o.a.s.c.c.ZkStateReader Updated live nodes from ZooKeeper... (4) -> (3)
   [junit4]   2> 1934304 WARN  (NIOServerCxn.Factory:0.0.0.0/0.0.0.0:0) [    ] o.a.z.s.NIOServerCnxn Unable to read additional data from client sessionid 0x10058e48562000c, likely client has closed socket
   [junit4]   2> 1934305 INFO  (zkCallback-6813-thread-1) [    ] o.a.s.c.OverseerElectionContext I am going to be the leader 127.0.0.1:38257_solr
   [junit4]   2> 1934305 INFO  (TEST-NodeLostTriggerTest.testTrigger-seed#[D02F7287FD10F151]) [    ] o.e.j.s.h.ContextHandler Stopped o.e.j.s.ServletContextHandler@1d358032{/solr,null,UNAVAILABLE}
   [junit4]   2> 1934306 INFO  (TEST-NodeLostTriggerTest.testTrigger-seed#[D02F7287FD10F151]) [    ] o.e.j.s.session node0 Stopped scavenging
   [junit4]   2> 1934306 INFO  (zkCallback-6813-thread-1) [n:127.0.0.1:38257_solr    ] o.a.s.c.Overseer Overseer (id=72155332551507979-127.0.0.1:38257_solr-n_0000000002) starting
   [junit4]   2> 1934309 INFO  (OverseerStateUpdate-72155332551507979-127.0.0.1:38257_solr-n_0000000002) [n:127.0.0.1:38257_solr    ] o.a.s.c.Overseer Starting to work on the main queue : 127.0.0.1:38257_solr
   [junit4]   2> 1941309 INFO  (TEST-NodeLostTriggerTest.testTrigger-seed#[D02F7287FD10F151]) [    ] o.e.j.s.AbstractConnector Stopped ServerConnector@50508f57{SSL,[ssl, http/1.1]}{127.0.0.1:0}
   [junit4]   2> 1941310 INFO  (TEST-NodeLostTriggerTest.testTrigger-seed#[D02F7287FD10F151]) [    ] o.a.s.c.CoreContainer Shutting down CoreContainer instance=1281894812
   [junit4]   2> 1941310 INFO  (TEST-NodeLostTriggerTest.testTrigger-seed#[D02F7287FD10F151]) [    ] o.a.s.m.SolrMetricManager Closing metric reporters for registry=solr.node, tag=null
   [junit4]   2> 1941310 INFO  (TEST-NodeLostTriggerTest.testTrigger-seed#[D02F7287FD10F151]) [    ] o.a.s.m.r.SolrJmxReporter Closing reporter [org.apache.solr.metrics.reporters.SolrJmxReporter@422c39a9: rootName = solr_32877, domain = solr.node, service url = null, agent id = null] for registry solr.node / com.codahale.metrics.MetricRegistry@174dc4f6
   [junit4]   2> 1941315 INFO  (TEST-NodeLostTriggerTest.testTrigger-seed#[D02F7287FD10F151]) [    ] o.a.s.m.SolrMetricManager Closing metric reporters for registry=solr.jvm, tag=null
   [junit4]   2> 1941315 INFO  (TEST-NodeLostTriggerTest.testTrigger-seed#[D02F7287FD10F151]) [    ] o.a.s.m.r.SolrJmxReporter Closing reporter [org.apache.solr.metrics.reporters.SolrJmxReporter@2016b0c8: rootName = solr_32877, domain = solr.jvm, service url = null, agent id = null] for registry solr.jvm / com.codahale.metrics.MetricRegistry@e611bd1
   [junit4]   2> 1941318 INFO  (TEST-NodeLostTriggerTest.testTrigger-seed#[D02F7287FD10F151]) [    ] o.a.s.m.SolrMetricManager Closing metric reporters for registry=solr.jetty, tag=null
   [junit4]   2> 1941318 INFO  (TEST-NodeLostTriggerTest.testTrigger-seed#[D02F7287FD10F151]) [    ] o.a.s.m.r.SolrJmxReporter Closing reporter [org.apache.solr.metrics.reporters.SolrJmxReporter@58ef6100: rootName = solr_32877, domain = solr.jetty, service url = null, agent id = null] for registry solr.jetty / com.codahale.metrics.MetricRegistry@3fe0785b
   [junit4]   2> 1941319 INFO  (TEST-NodeLostTriggerTest.testTrigger-seed#[D02F7287FD10F151]) [    ] o.a.s.c.ZkController Remove node as live in ZooKeeper:/live_nodes/127.0.0.1:32877_solr
   [junit4]   2> 1941319 INFO  (TEST-NodeLostTriggerTest.testTrigger-seed#[D02F7287FD10F151]) [    ] o.a.s.m.SolrMetricManager Closing metric reporters for registry=solr.cluster, tag=null
   [junit4]   2> 1941321 INFO  (zkCallback-6870-thread-1) [    ] o.a.s.c.c.ZkStateReader Updated live nodes from ZooKeeper... (3) -> (2)
   [junit4]   2> 1941321 INFO  (zkCallback-6833-thread-1) [    ] o.a.s.c.c.ZkStateReader Updated live nodes from ZooKeeper... (3) -> (2)
   [junit4]   2> 1941321 INFO  (zkCallback-6813-thread-1) [    ] o.a.s.c.c.ZkStateReader Updated live nodes from ZooKeeper... (3) -> (2)
   [junit4]   2> 1941321 INFO  (zkCallback-6862-thread-1) [    ] o.a.s.c.c.ZkStateReader Updated live nodes from ZooKeeper... (3) -> (2)
   [junit4]   2> 1941322 INFO  (zkCallback-6855-thread-1) [    ] o.a.s.c.c.ZkStateReader Updated live nodes from ZooKeeper... (3) -> (2)
   [junit4]   2> 1941322 INFO  (zkCallback-6840-thread-1) [    ] o.a.s.c.c.ZkStateReader Updated live nodes from ZooKeeper... (3) -> (2)
   [junit4]   2> 1941322 INFO  (zkCallback-6848-thread-1) [    ] o.a.s.c.c.ZkStateReader Updated live nodes from ZooKeeper... (3) -> (2)
   [junit4]   2> 1941323 INFO  (TEST-NodeLostTriggerTest.testTrigger-seed#[D02F7287FD10F151]) [    ] o.e.j.s.h.ContextHandler Stopped o.e.j.s.ServletContextHandler@4c368f87{/solr,null,UNAVAILABLE}
   [junit4]   2> 1941324 INFO  (TEST-NodeLostTriggerTest.testTrigger-seed#[D02F7287FD10F151]) [    ] o.e.j.s.session node0 Stopped scavenging
   [junit4]   2> 1941325 INFO  (TEST-NodeLostTriggerTest.testTrigger-seed#[D02F7287FD10F151]) [    ] o.e.j.s.Server jetty-9.4.11.v20180605; built: 2018-06-05T18:24:03.829Z; git: d5fc0523cfa96bfebfbda19606cad384d772f04c; jvm 1.8.0_172-b11
   [junit4]   2> 1941326 INFO  (TEST-NodeLostTriggerTest.testTrigger-seed#[D02F7287FD10F151]) [    ] o.e.j.s.session DefaultSessionIdManager workerName=node0
   [junit4]   2> 1941326 INFO  (TEST-NodeLostTriggerTest.testTrigger-seed#[D02F7287FD10F151]) [    ] o.e.j.s.session No SessionScavenger set, using defaults
   [junit4]   2> 1941326 INFO  (TEST-NodeLostTriggerTest.testTrigger-seed#[D02F7287FD10F151]) [    ] o.e.j.s.session node0 Scavenging every 600000ms
   [junit4]   2> 1941326 INFO  (TEST-NodeLostTriggerTest.testTrigger-seed#[D02F7287FD10F151]) [    ] o.e.j.s.h.ContextHandler Started o.e.j.s.ServletContextHandler@7dc7ad81{/solr,null,AVAILABLE}
   [junit4]   2> 1941326 INFO  (TEST-NodeLostTriggerTest.testTrigger-seed#[D02F7287FD10F151]) [    ] o.e.j.s.AbstractConnector Started ServerConnector@9f786de{SSL,[ssl, http/1.1]}{127.0.0.1:32877}
   [junit4]   2> 1941326 INFO  (TEST-NodeLostTriggerTest.testTrigger-seed#[D02F7287FD10F151]) [    ] o.e.j.s.Server Started @1941365ms
   [junit4]   2> 1941326 INFO  (TEST-NodeLostTriggerTest.testTrigger-seed#[D02F7287FD10F151]) [    ] o.a.s.c.s.e.JettySolrRunner Jetty properties: {hostContext=/solr, hostPort=32877}
   [junit4]   2> 1941326 ERROR (TEST-NodeLostTriggerTest.testTrigger-seed#[D02F7287FD10F151]) [    ] o.a.s.u.StartupLoggingUtils Missing Java Option solr.log.dir. Logging may be missing or incomplete.
   [junit4]   2> 1941326 INFO  (TEST-NodeLostTriggerTest.testTrigger-seed#[D02F7287FD10F151]) [    ] o.a.s.s.SolrDispatchFilter Using logger factory org.apache.logging.slf4j.Log4jLoggerFactory
   [junit4]   2> 1941327 INFO  (TEST-NodeLostTriggerTest.testTrigger-seed#[D02F7287FD10F151]) [    ] o.a.s.s.SolrDispatchFilter  ___      _       Welcome to Apache Solr? version 8.0.0
   [junit4]   2> 1941327 INFO  (TEST-NodeLostTriggerTest.testTrigger-seed#[D02F7287FD10F151]) [    ] o.a.s.s.SolrDispatchFilter / __| ___| |_ _   Starting in cloud mode on port null
   [junit4]   2> 1941327 INFO  (TEST-NodeLostTriggerTest.testTrigger-seed#[D02F7287FD10F151]) [    ] o.a.s.s.SolrDispatchFilter \__ \/ _ \ | '_|  Install dir: null
   [junit4]   2> 1941327 INFO  (TEST-NodeLostTriggerTest.testTrigger-seed#[D02F7287FD10F151]) [    ] o.a.s.s.SolrDispatchFilter |___/\___/_|_|    Start time: 2018-09-02T13:41:47.512Z
   [junit4]   2> 1941327 INFO  (zkConnectionManagerCallback-6909-thread-1) [    ] o.a.s.c.c.ConnectionManager zkClient has connected
   [junit4]   2> 1941328 INFO  (TEST-NodeLostTriggerTest.testTrigger-seed#[D02F7287FD10F151]) [    ] o.a.s.s.SolrDispatchFilter solr.xml found in ZooKeeper. Loading...
   [junit4]   2> 1941393 INFO  (TEST-NodeLostTriggerTest.testTrigger-seed#[D02F7287FD10F151]) [    ] o.a.s.c.ZkContainer Zookeeper client=127.0.0.1:46007/solr
   [junit4]   2> 1941394 INFO  (zkConnectionManagerCallback-6913-thread-1) [    ] o.a.s.c.c.ConnectionManager zkClient has connected
   [junit4]   2> 1941395 INFO  (zkConnectionManagerCallback-6915-thread-1) [    ] o.a.s.c.c.ConnectionManager zkClient has connected
   [junit4]   2> 1941398 INFO  (TEST-NodeLostTriggerTest.testTrigger-seed#[D02F7287FD10F151]) [    ] o.a.s.c.c.ZkStateReader Updated live nodes from ZooKeeper... (0) -> (2)
   [junit4]   2> 1941400 INFO  (TEST-NodeLostTriggerTest.testTrigger-seed#[D02F7287FD10F151]) [    ] o.a.s.c.TransientSolrCoreCacheDefault Allocating transient cache for 2147483647 transient cores
   [junit4]   2> 1941400 INFO  (TEST-NodeLostTriggerTest.testTrigger-seed#[D02F7287FD10F151]) [    ] o.a.s.c.ZkController Register node as live in ZooKeeper:/live_nodes/127.0.0.1:32877_solr
   [junit4]   2> 1941400 INFO  (zkCallback-6870-thread-1) [    ] o.a.s.c.c.ZkStateReader Updated live nodes from ZooKeeper... (2) -> (3)
   [junit4]   2> 1941400 INFO  (zkCallback-6840-thread-1) [    ] o.a.s.c.c.ZkStateReader Updated live nodes from ZooKeeper... (2) -> (3)
   [junit4]   2> 1941400 INFO  (zkCallback-6855-thread-1) [    ] o.a.s.c.c.ZkStateReader Updated live nodes from ZooKeeper... (2) -> (3)
   [junit4]   2> 1941400 INFO  (zkCallback-6813-thread-1) [    ] o.a.s.c.c.ZkStateReader Updated live nodes from ZooKeeper... (2) -> (3)
   [junit4]   2> 1941400 INFO  (zkCallback-6862-thread-1) [    ] o.a.s.c.c.ZkStateReader Updated live nodes from ZooKeeper... (2) -> (3)
   [junit4]   2> 1941400 INFO  (zkCallback-6914-thread-1) [    ] o.a.s.c.c.ZkStateReader Updated live nodes from ZooKeeper... (2) -> (3)
   [junit4]   2> 1941416 INFO  (zkConnectionManagerCallback-6922-thread-1) [    ] o.a.s.c.c.ConnectionManager zkClient has connected
   [junit4]   2> 1941417 INFO  (TEST-NodeLostTriggerTest.testTrigger-seed#[D02F7287FD10F151]) [    ] o.a.s.c.c.ZkStateReader Updated live nodes from ZooKeeper... (0) -> (3)
   [junit4]   2> 1941417 INFO  (TEST-NodeLostTriggerTest.testTrigger-seed#[D02F7287FD10F151]) [    ] o.a.s.c.s.i.ZkClientClusterStateProvider Cluster at 127.0.0.1:46007/solr ready
   [junit4]   2> 1941417 INFO  (TEST-NodeLostTriggerTest.testTrigger-seed#[D02F7287FD10F151]) [    ] 

[...truncated too long message...]

ne/top-level-ivy-settings.xml

install-junit4-taskdef:

ivy-availability-check:
[loadresource] Do not set property disallowed.ivy.jars.list as its length is 0.

-ivy-fail-disallowed-ivy-version:

ivy-fail:

resolve-groovy:
[ivy:cachepath] :: resolving dependencies :: org.codehaus.groovy#groovy-all-caller;working
[ivy:cachepath] 	confs: [default]
[ivy:cachepath] 	found org.codehaus.groovy#groovy-all;2.4.15 in public
[ivy:cachepath] :: resolution report :: resolve 18ms :: artifacts dl 0ms
	---------------------------------------------------------------------
	|                  |            modules            ||   artifacts   |
	|       conf       | number| search|dwnlded|evicted|| number|dwnlded|
	---------------------------------------------------------------------
	|      default     |   1   |   0   |   0   |   0   ||   1   |   0   |
	---------------------------------------------------------------------

-init-totals:

-test:
    [mkdir] Created dir: /home/jenkins/workspace/Lucene-Solr-master-Linux/solr/build/solr-core/test
[junit4:pickseed] Seed property 'tests.seed' already defined: D02F7287FD10F151
    [mkdir] Created dir: /home/jenkins/workspace/Lucene-Solr-master-Linux/solr/build/solr-core/test/temp
   [junit4] <JUnit4> says g'day! Master seed: D02F7287FD10F151
   [junit4] Executing 10 suites with 3 JVMs.
   [junit4] 
   [junit4] Started J1 PID(7680@serv1.sd-datasolutions.de).
   [junit4] Started J0 PID(7678@serv1.sd-datasolutions.de).
   [junit4] Started J2 PID(7679@serv1.sd-datasolutions.de).
   [junit4] Suite: org.apache.solr.handler.RequestLoggingTest
   [junit4] OK      0.06s J2 | RequestLoggingTest.testLogBeforeExecuteWithCoreLogger
   [junit4] OK      0.01s J2 | RequestLoggingTest.testLogBeforeExecuteWithRequestLogger
   [junit4] Completed [1/10] on J2 in 7.39s, 2 tests
   [junit4] 
   [junit4] Suite: org.apache.solr.handler.RequestLoggingTest
   [junit4] OK      0.01s J2 | RequestLoggingTest.testLogBeforeExecuteWithCoreLogger
   [junit4] OK      0.00s J2 | RequestLoggingTest.testLogBeforeExecuteWithRequestLogger
   [junit4] Completed [2/10] on J2 in 0.79s, 2 tests
   [junit4] 
   [junit4] Duplicate suite name used with XML reports: org.apache.solr.handler.RequestLoggingTest. This may confuse tools that process XML reports. Set 'ignoreDuplicateSuites' to true to skip this message.
   [junit4] Suite: org.apache.solr.handler.RequestLoggingTest
   [junit4] OK      0.01s J2 | RequestLoggingTest.testLogBeforeExecuteWithCoreLogger
   [junit4] OK      0.01s J2 | RequestLoggingTest.testLogBeforeExecuteWithRequestLogger
   [junit4] Completed [3/10] on J2 in 0.67s, 2 tests
   [junit4] 
   [junit4] Suite: org.apache.solr.cloud.autoscaling.NodeLostTriggerTest
   [junit4] OK      5.78s J1 | NodeLostTriggerTest.testRestoreState
   [junit4] OK      0.25s J1 | NodeLostTriggerTest.testListenerAcceptance
   [junit4] OK      0.03s J1 | NodeLostTriggerTest.testActionLifecycle
   [junit4] OK      12.4s J1 | NodeLostTriggerTest.testTrigger
   [junit4] Completed [4/10] on J1 in 25.48s, 4 tests
   [junit4] 
   [junit4] Suite: org.apache.solr.cloud.autoscaling.NodeLostTriggerTest
   [junit4] OK      5.53s J0 | NodeLostTriggerTest.testRestoreState
   [junit4] OK      0.33s J0 | NodeLostTriggerTest.testListenerAcceptance
   [junit4] OK      0.02s J0 | NodeLostTriggerTest.testActionLifecycle
   [junit4] OK      12.3s J0 | NodeLostTriggerTest.testTrigger
   [junit4] Completed [5/10] on J0 in 26.99s, 4 tests
   [junit4] 
   [junit4] Duplicate suite name used with XML reports: org.apache.solr.cloud.autoscaling.NodeLostTriggerTest. This may confuse tools that process XML reports. Set 'ignoreDuplicateSuites' to true to skip this message.
   [junit4] Suite: org.apache.solr.cloud.autoscaling.NodeLostTriggerTest
   [junit4] OK      5.34s J2 | NodeLostTriggerTest.testRestoreState
   [junit4] OK      0.36s J2 | NodeLostTriggerTest.testListenerAcceptance
   [junit4] OK      0.02s J2 | NodeLostTriggerTest.testActionLifecycle
   [junit4] OK      12.3s J2 | NodeLostTriggerTest.testTrigger
   [junit4] Completed [6/10] on J2 in 20.75s, 4 tests
   [junit4] 
   [junit4] Suite: org.apache.solr.handler.RequestLoggingTest
   [junit4] OK      0.01s J2 | RequestLoggingTest.testLogBeforeExecuteWithCoreLogger
   [junit4] OK      0.00s J2 | RequestLoggingTest.testLogBeforeExecuteWithRequestLogger
   [junit4] Completed [7/10] on J2 in 0.75s, 2 tests
   [junit4] 
   [junit4] Suite: org.apache.solr.handler.RequestLoggingTest
   [junit4] OK      0.01s J2 | RequestLoggingTest.testLogBeforeExecuteWithCoreLogger
   [junit4] OK      0.00s J2 | RequestLoggingTest.testLogBeforeExecuteWithRequestLogger
   [junit4] Completed [8/10] on J2 in 0.59s, 2 tests
   [junit4] 
   [junit4] Suite: org.apache.solr.cloud.autoscaling.NodeLostTriggerTest
   [junit4] OK      6.87s J1 | NodeLostTriggerTest.testRestoreState
   [junit4] OK      0.60s J1 | NodeLostTriggerTest.testListenerAcceptance
   [junit4] OK      0.03s J1 | NodeLostTriggerTest.testActionLifecycle
   [junit4] OK      12.3s J1 | NodeLostTriggerTest.testTrigger
   [junit4] Completed [9/10] on J1 in 21.43s, 4 tests
   [junit4] 
   [junit4] Suite: org.apache.solr.cloud.autoscaling.NodeLostTriggerTest
   [junit4] OK      5.25s J0 | NodeLostTriggerTest.testRestoreState
   [junit4] OK      0.28s J0 | NodeLostTriggerTest.testListenerAcceptance
   [junit4] OK      0.03s J0 | NodeLostTriggerTest.testActionLifecycle
   [junit4] OK      12.3s J0 | NodeLostTriggerTest.testTrigger
   [junit4] Completed [10/10] on J0 in 20.85s, 4 tests
   [junit4] 
   [junit4] JVM J0:     0.40 ..    49.22 =    48.82s
   [junit4] JVM J1:     0.40 ..    48.24 =    47.84s
   [junit4] JVM J2:     0.40 ..    32.61 =    32.21s
   [junit4] Execution time total: 49 seconds
   [junit4] Tests summary: 10 suites, 30 tests
   [junit4] Could not remove temporary path: /home/jenkins/workspace/Lucene-Solr-master-Linux/solr/build/solr-core/test/J2 (java.nio.file.DirectoryNotEmptyException: Remaining files: [/home/jenkins/workspace/Lucene-Solr-master-Linux/solr/build/solr-core/test/J2/temp])
   [junit4] Could not remove temporary path: /home/jenkins/workspace/Lucene-Solr-master-Linux/solr/build/solr-core/test/J1 (java.nio.file.DirectoryNotEmptyException: Remaining files: [/home/jenkins/workspace/Lucene-Solr-master-Linux/solr/build/solr-core/test/J1/temp])
   [junit4] Could not remove temporary path: /home/jenkins/workspace/Lucene-Solr-master-Linux/solr/build/solr-core/test/J0 (java.nio.file.DirectoryNotEmptyException: Remaining files: [/home/jenkins/workspace/Lucene-Solr-master-Linux/solr/build/solr-core/test/J0/temp])
     [echo] 5 slowest tests:
[junit4:tophints] 753.71s | org.apache.solr.cloud.cdcr.CdcrWithNodesRestartsTest
[junit4:tophints] 565.12s | org.apache.solr.cloud.cdcr.CdcrOpsAndBoundariesTest
[junit4:tophints] 532.65s | org.apache.solr.cloud.api.collections.ShardSplitTest
[junit4:tophints] 116.40s | org.apache.solr.update.SoftAutoCommitTest
[junit4:tophints] 110.06s | org.apache.solr.cloud.ZkFailoverTest

-check-totals:

test-nocompile:

BUILD SUCCESSFUL
Total time: 51 seconds
[repro] Failures:
[repro]   0/5 failed: org.apache.solr.cloud.autoscaling.NodeLostTriggerTest
[repro]   0/5 failed: org.apache.solr.handler.RequestLoggingTest
[repro] Exiting with code 0
+ mv lucene/build lucene/build.repro
+ mv solr/build solr/build.repro
+ mv lucene/build.orig lucene/build
+ mv solr/build.orig solr/build
Archiving artifacts
Setting ANT_1_8_2_HOME=/var/lib/jenkins/tools/hudson.tasks.Ant_AntInstallation/ANT_1.8.2
java.lang.InterruptedException: no matches found within 10000
	at hudson.FilePath$ValidateAntFileMask.hasMatch(FilePath.java:2846)
	at hudson.FilePath$ValidateAntFileMask.invoke(FilePath.java:2725)
	at hudson.FilePath$ValidateAntFileMask.invoke(FilePath.java:2706)
	at hudson.FilePath.act(FilePath.java:1077)
	at hudson.FilePath.act(FilePath.java:1060)
	at hudson.FilePath.validateAntFileMask(FilePath.java:2704)
	at hudson.tasks.ArtifactArchiver.perform(ArtifactArchiver.java:243)
	at hudson.tasks.BuildStepCompatibilityLayer.perform(BuildStepCompatibilityLayer.java:81)
	at hudson.tasks.BuildStepMonitor$1.perform(BuildStepMonitor.java:20)
	at hudson.model.AbstractBuild$AbstractBuildExecution.perform(AbstractBuild.java:744)
	at hudson.model.AbstractBuild$AbstractBuildExecution.performAllBuildSteps(AbstractBuild.java:690)
	at hudson.model.Build$BuildExecution.post2(Build.java:186)
	at hudson.model.AbstractBuild$AbstractBuildExecution.post(AbstractBuild.java:635)
	at hudson.model.Run.execute(Run.java:1840)
	at hudson.model.FreeStyleBuild.run(FreeStyleBuild.java:43)
	at hudson.model.ResourceController.execute(ResourceController.java:97)
	at hudson.model.Executor.run(Executor.java:429)
No artifacts found that match the file pattern "**/*.events,heapdumps/**,**/*_pid*.log". Configuration error?
[WARNINGS] Parsing warnings in console log with parser Java Compiler (javac)
Setting ANT_1_8_2_HOME=/var/lib/jenkins/tools/hudson.tasks.Ant_AntInstallation/ANT_1.8.2
Setting ANT_1_8_2_HOME=/var/lib/jenkins/tools/hudson.tasks.Ant_AntInstallation/ANT_1.8.2
<Git Blamer> Using GitBlamer to create author and commit information for all warnings.
<Git Blamer> GIT_COMMIT=d93c46ea94dec612aa53e37d119fe34b5e8a828e, workspace=/var/lib/jenkins/workspace/Lucene-Solr-master-Linux
[WARNINGS] Computing warning deltas based on reference build #22787
Recording test results
Setting ANT_1_8_2_HOME=/var/lib/jenkins/tools/hudson.tasks.Ant_AntInstallation/ANT_1.8.2
Build step 'Publish JUnit test result report' changed build result to UNSTABLE
Email was triggered for: Unstable (Test Failures)
Sending email for trigger: Unstable (Test Failures)
Setting ANT_1_8_2_HOME=/var/lib/jenkins/tools/hudson.tasks.Ant_AntInstallation/ANT_1.8.2
Setting ANT_1_8_2_HOME=/var/lib/jenkins/tools/hudson.tasks.Ant_AntInstallation/ANT_1.8.2
Setting ANT_1_8_2_HOME=/var/lib/jenkins/tools/hudson.tasks.Ant_AntInstallation/ANT_1.8.2
Setting ANT_1_8_2_HOME=/var/lib/jenkins/tools/hudson.tasks.Ant_AntInstallation/ANT_1.8.2

Mime
View raw message