lucene-dev mailing list archives

Site index · List index
Message view « Date » · « Thread »
Top « Date » · « Thread »
From Policeman Jenkins Server <jenk...@thetaphi.de>
Subject [JENKINS] Lucene-Solr-master-Solaris (64bit/jdk1.8.0) - Build # 2040 - Unstable!
Date Sun, 02 Sep 2018 06:15:04 GMT
Build: https://jenkins.thetaphi.de/job/Lucene-Solr-master-Solaris/2040/
Java: 64bit/jdk1.8.0 -XX:-UseCompressedOops -XX:+UseParallelGC

3 tests failed.
FAILED:  org.apache.solr.cloud.TestWithCollection.testNodeAdded

Error Message:
No live SolrServers available to handle this request:[http://127.0.0.1:57266/solr]

Stack Trace:
org.apache.solr.client.solrj.SolrServerException: No live SolrServers available to handle this request:[http://127.0.0.1:57266/solr]
	at __randomizedtesting.SeedInfo.seed([3FADBE9FC211ED00:5A6EE8E860B24503]:0)
	at org.apache.solr.client.solrj.impl.LBHttpSolrClient.request(LBHttpSolrClient.java:462)
	at org.apache.solr.client.solrj.impl.CloudSolrClient.sendRequest(CloudSolrClient.java:1109)
	at org.apache.solr.client.solrj.impl.CloudSolrClient.requestWithRetryOnStaleState(CloudSolrClient.java:886)
	at org.apache.solr.client.solrj.impl.CloudSolrClient.request(CloudSolrClient.java:819)
	at org.apache.solr.client.solrj.SolrClient.request(SolrClient.java:1219)
	at org.apache.solr.cloud.TestWithCollection.testNodeAdded(TestWithCollection.java:427)
	at sun.reflect.NativeMethodAccessorImpl.invoke0(Native Method)
	at sun.reflect.NativeMethodAccessorImpl.invoke(NativeMethodAccessorImpl.java:62)
	at sun.reflect.DelegatingMethodAccessorImpl.invoke(DelegatingMethodAccessorImpl.java:43)
	at java.lang.reflect.Method.invoke(Method.java:498)
	at com.carrotsearch.randomizedtesting.RandomizedRunner.invoke(RandomizedRunner.java:1737)
	at com.carrotsearch.randomizedtesting.RandomizedRunner$8.evaluate(RandomizedRunner.java:934)
	at com.carrotsearch.randomizedtesting.RandomizedRunner$9.evaluate(RandomizedRunner.java:970)
	at com.carrotsearch.randomizedtesting.RandomizedRunner$10.evaluate(RandomizedRunner.java:984)
	at com.carrotsearch.randomizedtesting.rules.SystemPropertiesRestoreRule$1.evaluate(SystemPropertiesRestoreRule.java:57)
	at org.apache.lucene.util.TestRuleSetupTeardownChained$1.evaluate(TestRuleSetupTeardownChained.java:49)
	at org.apache.lucene.util.AbstractBeforeAfterRule$1.evaluate(AbstractBeforeAfterRule.java:45)
	at org.apache.lucene.util.TestRuleThreadAndTestName$1.evaluate(TestRuleThreadAndTestName.java:48)
	at org.apache.lucene.util.TestRuleIgnoreAfterMaxFailures$1.evaluate(TestRuleIgnoreAfterMaxFailures.java:64)
	at org.apache.lucene.util.TestRuleMarkFailure$1.evaluate(TestRuleMarkFailure.java:47)
	at com.carrotsearch.randomizedtesting.rules.StatementAdapter.evaluate(StatementAdapter.java:36)
	at com.carrotsearch.randomizedtesting.ThreadLeakControl$StatementRunner.run(ThreadLeakControl.java:368)
	at com.carrotsearch.randomizedtesting.ThreadLeakControl.forkTimeoutingTask(ThreadLeakControl.java:817)
	at com.carrotsearch.randomizedtesting.ThreadLeakControl$3.evaluate(ThreadLeakControl.java:468)
	at com.carrotsearch.randomizedtesting.RandomizedRunner.runSingleTest(RandomizedRunner.java:943)
	at com.carrotsearch.randomizedtesting.RandomizedRunner$5.evaluate(RandomizedRunner.java:829)
	at com.carrotsearch.randomizedtesting.RandomizedRunner$6.evaluate(RandomizedRunner.java:879)
	at com.carrotsearch.randomizedtesting.RandomizedRunner$7.evaluate(RandomizedRunner.java:890)
	at com.carrotsearch.randomizedtesting.rules.StatementAdapter.evaluate(StatementAdapter.java:36)
	at com.carrotsearch.randomizedtesting.rules.SystemPropertiesRestoreRule$1.evaluate(SystemPropertiesRestoreRule.java:57)
	at org.apache.lucene.util.AbstractBeforeAfterRule$1.evaluate(AbstractBeforeAfterRule.java:45)
	at com.carrotsearch.randomizedtesting.rules.StatementAdapter.evaluate(StatementAdapter.java:36)
	at org.apache.lucene.util.TestRuleStoreClassName$1.evaluate(TestRuleStoreClassName.java:41)
	at com.carrotsearch.randomizedtesting.rules.NoShadowingOrOverridesOnMethodsRule$1.evaluate(NoShadowingOrOverridesOnMethodsRule.java:40)
	at com.carrotsearch.randomizedtesting.rules.NoShadowingOrOverridesOnMethodsRule$1.evaluate(NoShadowingOrOverridesOnMethodsRule.java:40)
	at com.carrotsearch.randomizedtesting.rules.StatementAdapter.evaluate(StatementAdapter.java:36)
	at com.carrotsearch.randomizedtesting.rules.StatementAdapter.evaluate(StatementAdapter.java:36)
	at com.carrotsearch.randomizedtesting.rules.StatementAdapter.evaluate(StatementAdapter.java:36)
	at org.apache.lucene.util.TestRuleAssertionsRequired$1.evaluate(TestRuleAssertionsRequired.java:53)
	at org.apache.lucene.util.TestRuleMarkFailure$1.evaluate(TestRuleMarkFailure.java:47)
	at org.apache.lucene.util.TestRuleIgnoreAfterMaxFailures$1.evaluate(TestRuleIgnoreAfterMaxFailures.java:64)
	at org.apache.lucene.util.TestRuleIgnoreTestSuites$1.evaluate(TestRuleIgnoreTestSuites.java:54)
	at com.carrotsearch.randomizedtesting.rules.StatementAdapter.evaluate(StatementAdapter.java:36)
	at com.carrotsearch.randomizedtesting.ThreadLeakControl$StatementRunner.run(ThreadLeakControl.java:368)
	at java.lang.Thread.run(Thread.java:748)
Caused by: org.apache.solr.client.solrj.SolrServerException: Server refused connection at: http://127.0.0.1:57266/solr
	at org.apache.solr.client.solrj.impl.HttpSolrClient.executeMethod(HttpSolrClient.java:650)
	at org.apache.solr.client.solrj.impl.HttpSolrClient.request(HttpSolrClient.java:255)
	at org.apache.solr.client.solrj.impl.HttpSolrClient.request(HttpSolrClient.java:244)
	at org.apache.solr.client.solrj.impl.LBHttpSolrClient.doRequest(LBHttpSolrClient.java:483)
	at org.apache.solr.client.solrj.impl.LBHttpSolrClient.request(LBHttpSolrClient.java:413)
	... 44 more
Caused by: org.apache.http.conn.HttpHostConnectException: Connect to 127.0.0.1:57266 [/127.0.0.1] failed: Connection refused (Connection refused)
	at org.apache.http.impl.conn.DefaultHttpClientConnectionOperator.connect(DefaultHttpClientConnectionOperator.java:159)
	at org.apache.http.impl.conn.PoolingHttpClientConnectionManager.connect(PoolingHttpClientConnectionManager.java:359)
	at org.apache.http.impl.execchain.MainClientExec.establishRoute(MainClientExec.java:381)
	at org.apache.http.impl.execchain.MainClientExec.execute(MainClientExec.java:237)
	at org.apache.http.impl.execchain.ProtocolExec.execute(ProtocolExec.java:185)
	at org.apache.http.impl.execchain.RetryExec.execute(RetryExec.java:89)
	at org.apache.http.impl.execchain.RedirectExec.execute(RedirectExec.java:111)
	at org.apache.http.impl.client.InternalHttpClient.doExecute(InternalHttpClient.java:185)
	at org.apache.http.impl.client.CloseableHttpClient.execute(CloseableHttpClient.java:83)
	at org.apache.http.impl.client.CloseableHttpClient.execute(CloseableHttpClient.java:56)
	at org.apache.solr.client.solrj.impl.HttpSolrClient.executeMethod(HttpSolrClient.java:542)
	... 48 more
Caused by: java.net.ConnectException: Connection refused (Connection refused)
	at java.net.PlainSocketImpl.socketConnect(Native Method)
	at java.net.AbstractPlainSocketImpl.doConnect(AbstractPlainSocketImpl.java:350)
	at java.net.AbstractPlainSocketImpl.connectToAddress(AbstractPlainSocketImpl.java:206)
	at java.net.AbstractPlainSocketImpl.connect(AbstractPlainSocketImpl.java:188)
	at java.net.SocksSocketImpl.connect(SocksSocketImpl.java:392)
	at java.net.Socket.connect(Socket.java:589)
	at org.apache.http.conn.socket.PlainConnectionSocketFactory.connectSocket(PlainConnectionSocketFactory.java:75)
	at org.apache.http.impl.conn.DefaultHttpClientConnectionOperator.connect(DefaultHttpClientConnectionOperator.java:142)
	... 58 more


FAILED:  org.apache.solr.handler.RequestLoggingTest.testLogBeforeExecuteWithCoreLogger

Error Message:


Stack Trace:
java.lang.AssertionError
	at __randomizedtesting.SeedInfo.seed([3FADBE9FC211ED00:F32BBE113CD88696]:0)
	at org.junit.Assert.fail(Assert.java:92)
	at org.junit.Assert.assertTrue(Assert.java:43)
	at org.junit.Assert.assertTrue(Assert.java:54)
	at org.apache.solr.handler.RequestLoggingTest.testLogBeforeExecute(RequestLoggingTest.java:88)
	at org.apache.solr.handler.RequestLoggingTest.testLogBeforeExecuteWithCoreLogger(RequestLoggingTest.java:65)
	at sun.reflect.NativeMethodAccessorImpl.invoke0(Native Method)
	at sun.reflect.NativeMethodAccessorImpl.invoke(NativeMethodAccessorImpl.java:62)
	at sun.reflect.DelegatingMethodAccessorImpl.invoke(DelegatingMethodAccessorImpl.java:43)
	at java.lang.reflect.Method.invoke(Method.java:498)
	at com.carrotsearch.randomizedtesting.RandomizedRunner.invoke(RandomizedRunner.java:1737)
	at com.carrotsearch.randomizedtesting.RandomizedRunner$8.evaluate(RandomizedRunner.java:934)
	at com.carrotsearch.randomizedtesting.RandomizedRunner$9.evaluate(RandomizedRunner.java:970)
	at com.carrotsearch.randomizedtesting.RandomizedRunner$10.evaluate(RandomizedRunner.java:984)
	at com.carrotsearch.randomizedtesting.rules.SystemPropertiesRestoreRule$1.evaluate(SystemPropertiesRestoreRule.java:57)
	at org.apache.lucene.util.TestRuleSetupTeardownChained$1.evaluate(TestRuleSetupTeardownChained.java:49)
	at org.apache.lucene.util.AbstractBeforeAfterRule$1.evaluate(AbstractBeforeAfterRule.java:45)
	at org.apache.lucene.util.TestRuleThreadAndTestName$1.evaluate(TestRuleThreadAndTestName.java:48)
	at org.apache.lucene.util.TestRuleIgnoreAfterMaxFailures$1.evaluate(TestRuleIgnoreAfterMaxFailures.java:64)
	at org.apache.lucene.util.TestRuleMarkFailure$1.evaluate(TestRuleMarkFailure.java:47)
	at com.carrotsearch.randomizedtesting.rules.StatementAdapter.evaluate(StatementAdapter.java:36)
	at com.carrotsearch.randomizedtesting.ThreadLeakControl$StatementRunner.run(ThreadLeakControl.java:368)
	at com.carrotsearch.randomizedtesting.ThreadLeakControl.forkTimeoutingTask(ThreadLeakControl.java:817)
	at com.carrotsearch.randomizedtesting.ThreadLeakControl$3.evaluate(ThreadLeakControl.java:468)
	at com.carrotsearch.randomizedtesting.RandomizedRunner.runSingleTest(RandomizedRunner.java:943)
	at com.carrotsearch.randomizedtesting.RandomizedRunner$5.evaluate(RandomizedRunner.java:829)
	at com.carrotsearch.randomizedtesting.RandomizedRunner$6.evaluate(RandomizedRunner.java:879)
	at com.carrotsearch.randomizedtesting.RandomizedRunner$7.evaluate(RandomizedRunner.java:890)
	at com.carrotsearch.randomizedtesting.rules.StatementAdapter.evaluate(StatementAdapter.java:36)
	at com.carrotsearch.randomizedtesting.rules.SystemPropertiesRestoreRule$1.evaluate(SystemPropertiesRestoreRule.java:57)
	at org.apache.lucene.util.AbstractBeforeAfterRule$1.evaluate(AbstractBeforeAfterRule.java:45)
	at com.carrotsearch.randomizedtesting.rules.StatementAdapter.evaluate(StatementAdapter.java:36)
	at org.apache.lucene.util.TestRuleStoreClassName$1.evaluate(TestRuleStoreClassName.java:41)
	at com.carrotsearch.randomizedtesting.rules.NoShadowingOrOverridesOnMethodsRule$1.evaluate(NoShadowingOrOverridesOnMethodsRule.java:40)
	at com.carrotsearch.randomizedtesting.rules.NoShadowingOrOverridesOnMethodsRule$1.evaluate(NoShadowingOrOverridesOnMethodsRule.java:40)
	at com.carrotsearch.randomizedtesting.rules.StatementAdapter.evaluate(StatementAdapter.java:36)
	at com.carrotsearch.randomizedtesting.rules.StatementAdapter.evaluate(StatementAdapter.java:36)
	at com.carrotsearch.randomizedtesting.rules.StatementAdapter.evaluate(StatementAdapter.java:36)
	at org.apache.lucene.util.TestRuleAssertionsRequired$1.evaluate(TestRuleAssertionsRequired.java:53)
	at org.apache.lucene.util.TestRuleMarkFailure$1.evaluate(TestRuleMarkFailure.java:47)
	at org.apache.lucene.util.TestRuleIgnoreAfterMaxFailures$1.evaluate(TestRuleIgnoreAfterMaxFailures.java:64)
	at org.apache.lucene.util.TestRuleIgnoreTestSuites$1.evaluate(TestRuleIgnoreTestSuites.java:54)
	at com.carrotsearch.randomizedtesting.rules.StatementAdapter.evaluate(StatementAdapter.java:36)
	at com.carrotsearch.randomizedtesting.ThreadLeakControl$StatementRunner.run(ThreadLeakControl.java:368)
	at java.lang.Thread.run(Thread.java:748)


FAILED:  org.apache.solr.handler.RequestLoggingTest.testLogBeforeExecuteWithRequestLogger

Error Message:


Stack Trace:
java.lang.AssertionError
	at __randomizedtesting.SeedInfo.seed([3FADBE9FC211ED00:8EC49E906FE7554E]:0)
	at org.junit.Assert.fail(Assert.java:92)
	at org.junit.Assert.assertTrue(Assert.java:43)
	at org.junit.Assert.assertTrue(Assert.java:54)
	at org.apache.solr.handler.RequestLoggingTest.testLogBeforeExecute(RequestLoggingTest.java:88)
	at org.apache.solr.handler.RequestLoggingTest.testLogBeforeExecuteWithRequestLogger(RequestLoggingTest.java:71)
	at sun.reflect.NativeMethodAccessorImpl.invoke0(Native Method)
	at sun.reflect.NativeMethodAccessorImpl.invoke(NativeMethodAccessorImpl.java:62)
	at sun.reflect.DelegatingMethodAccessorImpl.invoke(DelegatingMethodAccessorImpl.java:43)
	at java.lang.reflect.Method.invoke(Method.java:498)
	at com.carrotsearch.randomizedtesting.RandomizedRunner.invoke(RandomizedRunner.java:1737)
	at com.carrotsearch.randomizedtesting.RandomizedRunner$8.evaluate(RandomizedRunner.java:934)
	at com.carrotsearch.randomizedtesting.RandomizedRunner$9.evaluate(RandomizedRunner.java:970)
	at com.carrotsearch.randomizedtesting.RandomizedRunner$10.evaluate(RandomizedRunner.java:984)
	at com.carrotsearch.randomizedtesting.rules.SystemPropertiesRestoreRule$1.evaluate(SystemPropertiesRestoreRule.java:57)
	at org.apache.lucene.util.TestRuleSetupTeardownChained$1.evaluate(TestRuleSetupTeardownChained.java:49)
	at org.apache.lucene.util.AbstractBeforeAfterRule$1.evaluate(AbstractBeforeAfterRule.java:45)
	at org.apache.lucene.util.TestRuleThreadAndTestName$1.evaluate(TestRuleThreadAndTestName.java:48)
	at org.apache.lucene.util.TestRuleIgnoreAfterMaxFailures$1.evaluate(TestRuleIgnoreAfterMaxFailures.java:64)
	at org.apache.lucene.util.TestRuleMarkFailure$1.evaluate(TestRuleMarkFailure.java:47)
	at com.carrotsearch.randomizedtesting.rules.StatementAdapter.evaluate(StatementAdapter.java:36)
	at com.carrotsearch.randomizedtesting.ThreadLeakControl$StatementRunner.run(ThreadLeakControl.java:368)
	at com.carrotsearch.randomizedtesting.ThreadLeakControl.forkTimeoutingTask(ThreadLeakControl.java:817)
	at com.carrotsearch.randomizedtesting.ThreadLeakControl$3.evaluate(ThreadLeakControl.java:468)
	at com.carrotsearch.randomizedtesting.RandomizedRunner.runSingleTest(RandomizedRunner.java:943)
	at com.carrotsearch.randomizedtesting.RandomizedRunner$5.evaluate(RandomizedRunner.java:829)
	at com.carrotsearch.randomizedtesting.RandomizedRunner$6.evaluate(RandomizedRunner.java:879)
	at com.carrotsearch.randomizedtesting.RandomizedRunner$7.evaluate(RandomizedRunner.java:890)
	at com.carrotsearch.randomizedtesting.rules.StatementAdapter.evaluate(StatementAdapter.java:36)
	at com.carrotsearch.randomizedtesting.rules.SystemPropertiesRestoreRule$1.evaluate(SystemPropertiesRestoreRule.java:57)
	at org.apache.lucene.util.AbstractBeforeAfterRule$1.evaluate(AbstractBeforeAfterRule.java:45)
	at com.carrotsearch.randomizedtesting.rules.StatementAdapter.evaluate(StatementAdapter.java:36)
	at org.apache.lucene.util.TestRuleStoreClassName$1.evaluate(TestRuleStoreClassName.java:41)
	at com.carrotsearch.randomizedtesting.rules.NoShadowingOrOverridesOnMethodsRule$1.evaluate(NoShadowingOrOverridesOnMethodsRule.java:40)
	at com.carrotsearch.randomizedtesting.rules.NoShadowingOrOverridesOnMethodsRule$1.evaluate(NoShadowingOrOverridesOnMethodsRule.java:40)
	at com.carrotsearch.randomizedtesting.rules.StatementAdapter.evaluate(StatementAdapter.java:36)
	at com.carrotsearch.randomizedtesting.rules.StatementAdapter.evaluate(StatementAdapter.java:36)
	at com.carrotsearch.randomizedtesting.rules.StatementAdapter.evaluate(StatementAdapter.java:36)
	at org.apache.lucene.util.TestRuleAssertionsRequired$1.evaluate(TestRuleAssertionsRequired.java:53)
	at org.apache.lucene.util.TestRuleMarkFailure$1.evaluate(TestRuleMarkFailure.java:47)
	at org.apache.lucene.util.TestRuleIgnoreAfterMaxFailures$1.evaluate(TestRuleIgnoreAfterMaxFailures.java:64)
	at org.apache.lucene.util.TestRuleIgnoreTestSuites$1.evaluate(TestRuleIgnoreTestSuites.java:54)
	at com.carrotsearch.randomizedtesting.rules.StatementAdapter.evaluate(StatementAdapter.java:36)
	at com.carrotsearch.randomizedtesting.ThreadLeakControl$StatementRunner.run(ThreadLeakControl.java:368)
	at java.lang.Thread.run(Thread.java:748)




Build Log:
[...truncated 14076 lines...]
   [junit4] Suite: org.apache.solr.cloud.TestWithCollection
   [junit4]   2> Creating dataDir: /export/home/jenkins/workspace/Lucene-Solr-master-Solaris/solr/build/solr-core/test/J1/temp/solr.cloud.TestWithCollection_3FADBE9FC211ED00-001/init-core-data-001
   [junit4]   2> 3349294 WARN  (SUITE-TestWithCollection-seed#[3FADBE9FC211ED00]-worker) [    ] o.a.s.SolrTestCaseJ4 startTrackingSearchers: numOpens=7 numCloses=7
   [junit4]   2> 3349294 INFO  (SUITE-TestWithCollection-seed#[3FADBE9FC211ED00]-worker) [    ] o.a.s.SolrTestCaseJ4 Using PointFields (NUMERIC_POINTS_SYSPROP=true) w/NUMERIC_DOCVALUES_SYSPROP=false
   [junit4]   2> 3349296 INFO  (SUITE-TestWithCollection-seed#[3FADBE9FC211ED00]-worker) [    ] o.a.s.SolrTestCaseJ4 Randomized ssl (false) and clientAuth (false) via: @org.apache.solr.util.RandomizeSSL(reason=, value=NaN, ssl=NaN, clientAuth=NaN)
   [junit4]   2> 3349296 INFO  (SUITE-TestWithCollection-seed#[3FADBE9FC211ED00]-worker) [    ] o.a.s.SolrTestCaseJ4 SecureRandom sanity checks: test.solr.allowed.securerandom=null & java.security.egd=file:/dev/./urandom
   [junit4]   2> 3349296 INFO  (SUITE-TestWithCollection-seed#[3FADBE9FC211ED00]-worker) [    ] o.a.s.c.MiniSolrCloudCluster Starting cluster of 2 servers in /export/home/jenkins/workspace/Lucene-Solr-master-Solaris/solr/build/solr-core/test/J1/temp/solr.cloud.TestWithCollection_3FADBE9FC211ED00-001/tempDir-001
   [junit4]   2> 3349296 INFO  (SUITE-TestWithCollection-seed#[3FADBE9FC211ED00]-worker) [    ] o.a.s.c.ZkTestServer STARTING ZK TEST SERVER
   [junit4]   2> 3349296 INFO  (Thread-7021) [    ] o.a.s.c.ZkTestServer client port:0.0.0.0/0.0.0.0:0
   [junit4]   2> 3349297 INFO  (Thread-7021) [    ] o.a.s.c.ZkTestServer Starting server
   [junit4]   2> 3349299 ERROR (Thread-7021) [    ] o.a.z.s.ZooKeeperServer ZKShutdownHandler is not registered, so ZooKeeper server won't take any action on ERROR or SHUTDOWN server state changes
   [junit4]   2> 3349399 INFO  (SUITE-TestWithCollection-seed#[3FADBE9FC211ED00]-worker) [    ] o.a.s.c.ZkTestServer start zk server on port:51763
   [junit4]   2> 3349402 INFO  (zkConnectionManagerCallback-9150-thread-1) [    ] o.a.s.c.c.ConnectionManager zkClient has connected
   [junit4]   2> 3349406 INFO  (jetty-launcher-9147-thread-1) [    ] o.e.j.s.Server jetty-9.4.11.v20180605; built: 2018-06-05T18:24:03.829Z; git: d5fc0523cfa96bfebfbda19606cad384d772f04c; jvm 1.8.0_172-b11
   [junit4]   2> 3349406 INFO  (jetty-launcher-9147-thread-2) [    ] o.e.j.s.Server jetty-9.4.11.v20180605; built: 2018-06-05T18:24:03.829Z; git: d5fc0523cfa96bfebfbda19606cad384d772f04c; jvm 1.8.0_172-b11
   [junit4]   2> 3349408 INFO  (jetty-launcher-9147-thread-1) [    ] o.e.j.s.session DefaultSessionIdManager workerName=node0
   [junit4]   2> 3349408 INFO  (jetty-launcher-9147-thread-1) [    ] o.e.j.s.session No SessionScavenger set, using defaults
   [junit4]   2> 3349408 INFO  (jetty-launcher-9147-thread-1) [    ] o.e.j.s.session node0 Scavenging every 600000ms
   [junit4]   2> 3349408 INFO  (jetty-launcher-9147-thread-1) [    ] o.e.j.s.h.ContextHandler Started o.e.j.s.ServletContextHandler@35e6757c{/solr,null,AVAILABLE}
   [junit4]   2> 3349409 INFO  (jetty-launcher-9147-thread-1) [    ] o.e.j.s.AbstractConnector Started ServerConnector@4a8de99e{HTTP/1.1,[http/1.1]}{127.0.0.1:58489}
   [junit4]   2> 3349409 INFO  (jetty-launcher-9147-thread-1) [    ] o.e.j.s.Server Started @3351067ms
   [junit4]   2> 3349409 INFO  (jetty-launcher-9147-thread-1) [    ] o.a.s.c.s.e.JettySolrRunner Jetty properties: {hostContext=/solr, hostPort=58489}
   [junit4]   2> 3349409 ERROR (jetty-launcher-9147-thread-1) [    ] o.a.s.u.StartupLoggingUtils Missing Java Option solr.log.dir. Logging may be missing or incomplete.
   [junit4]   2> 3349409 INFO  (jetty-launcher-9147-thread-1) [    ] o.a.s.s.SolrDispatchFilter Using logger factory org.apache.logging.slf4j.Log4jLoggerFactory
   [junit4]   2> 3349409 INFO  (jetty-launcher-9147-thread-2) [    ] o.e.j.s.session DefaultSessionIdManager workerName=node0
   [junit4]   2> 3349409 INFO  (jetty-launcher-9147-thread-2) [    ] o.e.j.s.session No SessionScavenger set, using defaults
   [junit4]   2> 3349409 INFO  (jetty-launcher-9147-thread-2) [    ] o.e.j.s.session node0 Scavenging every 660000ms
   [junit4]   2> 3349410 INFO  (jetty-launcher-9147-thread-2) [    ] o.e.j.s.h.ContextHandler Started o.e.j.s.ServletContextHandler@155b4739{/solr,null,AVAILABLE}
   [junit4]   2> 3349410 INFO  (jetty-launcher-9147-thread-2) [    ] o.e.j.s.AbstractConnector Started ServerConnector@6998150e{HTTP/1.1,[http/1.1]}{127.0.0.1:64548}
   [junit4]   2> 3349410 INFO  (jetty-launcher-9147-thread-2) [    ] o.e.j.s.Server Started @3351068ms
   [junit4]   2> 3349410 INFO  (jetty-launcher-9147-thread-2) [    ] o.a.s.c.s.e.JettySolrRunner Jetty properties: {hostContext=/solr, hostPort=64548}
   [junit4]   2> 3349410 ERROR (jetty-launcher-9147-thread-2) [    ] o.a.s.u.StartupLoggingUtils Missing Java Option solr.log.dir. Logging may be missing or incomplete.
   [junit4]   2> 3349410 INFO  (jetty-launcher-9147-thread-2) [    ] o.a.s.s.SolrDispatchFilter Using logger factory org.apache.logging.slf4j.Log4jLoggerFactory
   [junit4]   2> 3349410 INFO  (jetty-launcher-9147-thread-2) [    ] o.a.s.s.SolrDispatchFilter  ___      _       Welcome to Apache Solr? version 8.0.0
   [junit4]   2> 3349410 INFO  (jetty-launcher-9147-thread-2) [    ] o.a.s.s.SolrDispatchFilter / __| ___| |_ _   Starting in cloud mode on port null
   [junit4]   2> 3349410 INFO  (jetty-launcher-9147-thread-2) [    ] o.a.s.s.SolrDispatchFilter \__ \/ _ \ | '_|  Install dir: null
   [junit4]   2> 3349410 INFO  (jetty-launcher-9147-thread-2) [    ] o.a.s.s.SolrDispatchFilter |___/\___/_|_|    Start time: 2018-09-02T05:25:23.355Z
   [junit4]   2> 3349411 INFO  (jetty-launcher-9147-thread-1) [    ] o.a.s.s.SolrDispatchFilter  ___      _       Welcome to Apache Solr? version 8.0.0
   [junit4]   2> 3349412 INFO  (jetty-launcher-9147-thread-1) [    ] o.a.s.s.SolrDispatchFilter / __| ___| |_ _   Starting in cloud mode on port null
   [junit4]   2> 3349412 INFO  (jetty-launcher-9147-thread-1) [    ] o.a.s.s.SolrDispatchFilter \__ \/ _ \ | '_|  Install dir: null
   [junit4]   2> 3349412 INFO  (jetty-launcher-9147-thread-1) [    ] o.a.s.s.SolrDispatchFilter |___/\___/_|_|    Start time: 2018-09-02T05:25:23.357Z
   [junit4]   2> 3349415 INFO  (zkConnectionManagerCallback-9152-thread-1) [    ] o.a.s.c.c.ConnectionManager zkClient has connected
   [junit4]   2> 3349416 INFO  (zkConnectionManagerCallback-9154-thread-1) [    ] o.a.s.c.c.ConnectionManager zkClient has connected
   [junit4]   2> 3349417 INFO  (jetty-launcher-9147-thread-1) [    ] o.a.s.s.SolrDispatchFilter solr.xml found in ZooKeeper. Loading...
   [junit4]   2> 3349417 INFO  (jetty-launcher-9147-thread-2) [    ] o.a.s.s.SolrDispatchFilter solr.xml found in ZooKeeper. Loading...
   [junit4]   2> 3349886 INFO  (jetty-launcher-9147-thread-1) [    ] o.a.s.c.ZkContainer Zookeeper client=127.0.0.1:51763/solr
   [junit4]   2> 3349896 INFO  (zkConnectionManagerCallback-9158-thread-1) [    ] o.a.s.c.c.ConnectionManager zkClient has connected
   [junit4]   2> 3349906 INFO  (zkConnectionManagerCallback-9160-thread-1) [    ] o.a.s.c.c.ConnectionManager zkClient has connected
   [junit4]   2> 3350311 INFO  (jetty-launcher-9147-thread-1) [n:127.0.0.1:58489_solr    ] o.a.s.c.OverseerElectionContext I am going to be the leader 127.0.0.1:58489_solr
   [junit4]   2> 3350313 INFO  (jetty-launcher-9147-thread-1) [n:127.0.0.1:58489_solr    ] o.a.s.c.Overseer Overseer (id=72265234333368324-127.0.0.1:58489_solr-n_0000000000) starting
   [junit4]   2> 3350325 INFO  (zkConnectionManagerCallback-9167-thread-1) [    ] o.a.s.c.c.ConnectionManager zkClient has connected
   [junit4]   2> 3350336 INFO  (jetty-launcher-9147-thread-1) [n:127.0.0.1:58489_solr    ] o.a.s.c.s.i.ZkClientClusterStateProvider Cluster at 127.0.0.1:51763/solr ready
   [junit4]   2> 3350337 INFO  (OverseerStateUpdate-72265234333368324-127.0.0.1:58489_solr-n_0000000000) [n:127.0.0.1:58489_solr    ] o.a.s.c.Overseer Starting to work on the main queue : 127.0.0.1:58489_solr
   [junit4]   2> 3350338 INFO  (jetty-launcher-9147-thread-1) [n:127.0.0.1:58489_solr    ] o.a.s.c.ZkController Register node as live in ZooKeeper:/live_nodes/127.0.0.1:58489_solr
   [junit4]   2> 3350339 DEBUG (OverseerAutoScalingTriggerThread-72265234333368324-127.0.0.1:58489_solr-n_0000000000) [    ] o.a.s.c.a.OverseerTriggerThread Adding .auto_add_replicas and .scheduled_maintenance triggers
   [junit4]   2> 3350340 INFO  (OverseerStateUpdate-72265234333368324-127.0.0.1:58489_solr-n_0000000000) [n:127.0.0.1:58489_solr    ] o.a.s.c.c.ZkStateReader Updated live nodes from ZooKeeper... (0) -> (1)
   [junit4]   2> 3350341 INFO  (zkCallback-9166-thread-1) [    ] o.a.s.c.c.ZkStateReader Updated live nodes from ZooKeeper... (0) -> (1)
   [junit4]   2> 3350341 DEBUG (OverseerAutoScalingTriggerThread-72265234333368324-127.0.0.1:58489_solr-n_0000000000) [    ] o.a.s.c.a.OverseerTriggerThread Refreshing /autoscaling.json with znode version 1
   [junit4]   2> 3350342 DEBUG (OverseerAutoScalingTriggerThread-72265234333368324-127.0.0.1:58489_solr-n_0000000000) [    ] o.a.s.c.a.OverseerTriggerThread Current znodeVersion 1, lastZnodeVersion -1
   [junit4]   2> 3350342 DEBUG (OverseerAutoScalingTriggerThread-72265234333368324-127.0.0.1:58489_solr-n_0000000000) [    ] o.a.s.c.a.OverseerTriggerThread Processed trigger updates upto znodeVersion 1
   [junit4]   2> 3350350 DEBUG (OverseerAutoScalingTriggerThread-72265234333368324-127.0.0.1:58489_solr-n_0000000000) [    ] o.a.s.c.a.NodeLostTrigger NodeLostTrigger .auto_add_replicas - Initial livenodes: [127.0.0.1:58489_solr]
   [junit4]   2> 3350350 DEBUG (OverseerAutoScalingTriggerThread-72265234333368324-127.0.0.1:58489_solr-n_0000000000) [    ] o.a.s.c.a.OverseerTriggerThread -- clean old nodeAdded markers
   [junit4]   2> 3350351 DEBUG (OverseerAutoScalingTriggerThread-72265234333368324-127.0.0.1:58489_solr-n_0000000000) [    ] o.a.s.c.a.OverseerTriggerThread Current znodeVersion 1, lastZnodeVersion 1
   [junit4]   2> 3350351 DEBUG (ScheduledTrigger-12588-thread-1) [    ] o.a.s.c.a.NodeLostTrigger Running NodeLostTrigger: .auto_add_replicas with currently live nodes: 1
   [junit4]   2> 3350368 INFO  (jetty-launcher-9147-thread-1) [n:127.0.0.1:58489_solr    ] o.a.s.h.a.MetricsHistoryHandler No .system collection, keeping metrics history in memory.
   [junit4]   2> 3350422 INFO  (jetty-launcher-9147-thread-1) [n:127.0.0.1:58489_solr    ] o.a.s.m.r.SolrJmxReporter JMX monitoring for 'solr_58489.solr.node' (registry 'solr.node') enabled at server: com.sun.jmx.mbeanserver.JmxMBeanServer@61d9870d
   [junit4]   2> 3350430 INFO  (jetty-launcher-9147-thread-1) [n:127.0.0.1:58489_solr    ] o.a.s.m.r.SolrJmxReporter JMX monitoring for 'solr_58489.solr.jvm' (registry 'solr.jvm') enabled at server: com.sun.jmx.mbeanserver.JmxMBeanServer@61d9870d
   [junit4]   2> 3350430 INFO  (jetty-launcher-9147-thread-1) [n:127.0.0.1:58489_solr    ] o.a.s.m.r.SolrJmxReporter JMX monitoring for 'solr_58489.solr.jetty' (registry 'solr.jetty') enabled at server: com.sun.jmx.mbeanserver.JmxMBeanServer@61d9870d
   [junit4]   2> 3350431 INFO  (jetty-launcher-9147-thread-1) [n:127.0.0.1:58489_solr    ] o.a.s.c.CorePropertiesLocator Found 0 core definitions underneath /export/home/jenkins/workspace/Lucene-Solr-master-Solaris/solr/build/solr-core/test/J1/temp/solr.cloud.TestWithCollection_3FADBE9FC211ED00-001/tempDir-001/node1/.
   [junit4]   2> 3350907 INFO  (jetty-launcher-9147-thread-2) [    ] o.a.s.c.ZkContainer Zookeeper client=127.0.0.1:51763/solr
   [junit4]   2> 3350909 INFO  (zkConnectionManagerCallback-9172-thread-1) [    ] o.a.s.c.c.ConnectionManager zkClient has connected
   [junit4]   2> 3350913 INFO  (zkConnectionManagerCallback-9174-thread-1) [    ] o.a.s.c.c.ConnectionManager zkClient has connected
   [junit4]   2> 3350928 INFO  (jetty-launcher-9147-thread-2) [n:127.0.0.1:64548_solr    ] o.a.s.c.c.ZkStateReader Updated live nodes from ZooKeeper... (0) -> (1)
   [junit4]   2> 3350936 INFO  (jetty-launcher-9147-thread-2) [n:127.0.0.1:64548_solr    ] o.a.s.c.TransientSolrCoreCacheDefault Allocating transient cache for 2147483647 transient cores
   [junit4]   2> 3350937 INFO  (jetty-launcher-9147-thread-2) [n:127.0.0.1:64548_solr    ] o.a.s.c.ZkController Register node as live in ZooKeeper:/live_nodes/127.0.0.1:64548_solr
   [junit4]   2> 3350937 DEBUG (OverseerStateUpdate-72265234333368324-127.0.0.1:58489_solr-n_0000000000) [n:127.0.0.1:58489_solr    ] o.a.s.c.o.NodeMutator DownNode state invoked for node: 127.0.0.1:64548_solr
   [junit4]   2> 3350939 INFO  (zkCallback-9159-thread-1) [    ] o.a.s.c.c.ZkStateReader Updated live nodes from ZooKeeper... (1) -> (2)
   [junit4]   2> 3350939 INFO  (zkCallback-9173-thread-1) [    ] o.a.s.c.c.ZkStateReader Updated live nodes from ZooKeeper... (1) -> (2)
   [junit4]   2> 3350939 INFO  (zkCallback-9166-thread-1) [    ] o.a.s.c.c.ZkStateReader Updated live nodes from ZooKeeper... (1) -> (2)
   [junit4]   2> 3350961 INFO  (zkConnectionManagerCallback-9181-thread-1) [    ] o.a.s.c.c.ConnectionManager zkClient has connected
   [junit4]   2> 3350964 INFO  (jetty-launcher-9147-thread-2) [n:127.0.0.1:64548_solr    ] o.a.s.c.c.ZkStateReader Updated live nodes from ZooKeeper... (0) -> (2)
   [junit4]   2> 3350966 INFO  (jetty-launcher-9147-thread-2) [n:127.0.0.1:64548_solr    ] o.a.s.c.s.i.ZkClientClusterStateProvider Cluster at 127.0.0.1:51763/solr ready
   [junit4]   2> 3350966 INFO  (jetty-launcher-9147-thread-2) [n:127.0.0.1:64548_solr    ] o.a.s.h.a.MetricsHistoryHandler No .system collection, keeping metrics history in memory.
   [junit4]   2> 3350995 INFO  (jetty-launcher-9147-thread-2) [n:127.0.0.1:64548_solr    ] o.a.s.m.r.SolrJmxReporter JMX monitoring for 'solr_64548.solr.node' (registry 'solr.node') enabled at server: com.sun.jmx.mbeanserver.JmxMBeanServer@61d9870d
   [junit4]   2> 3351002 INFO  (jetty-launcher-9147-thread-2) [n:127.0.0.1:64548_solr    ] o.a.s.m.r.SolrJmxReporter JMX monitoring for 'solr_64548.solr.jvm' (registry 'solr.jvm') enabled at server: com.sun.jmx.mbeanserver.JmxMBeanServer@61d9870d
   [junit4]   2> 3351003 INFO  (jetty-launcher-9147-thread-2) [n:127.0.0.1:64548_solr    ] o.a.s.m.r.SolrJmxReporter JMX monitoring for 'solr_64548.solr.jetty' (registry 'solr.jetty') enabled at server: com.sun.jmx.mbeanserver.JmxMBeanServer@61d9870d
   [junit4]   2> 3351020 INFO  (jetty-launcher-9147-thread-2) [n:127.0.0.1:64548_solr    ] o.a.s.c.CorePropertiesLocator Found 0 core definitions underneath /export/home/jenkins/workspace/Lucene-Solr-master-Solaris/solr/build/solr-core/test/J1/temp/solr.cloud.TestWithCollection_3FADBE9FC211ED00-001/tempDir-001/node2/.
   [junit4]   2> 3351063 INFO  (zkConnectionManagerCallback-9184-thread-1) [    ] o.a.s.c.c.ConnectionManager zkClient has connected
   [junit4]   2> 3351074 INFO  (zkConnectionManagerCallback-9189-thread-1) [    ] o.a.s.c.c.ConnectionManager zkClient has connected
   [junit4]   2> 3351077 INFO  (SUITE-TestWithCollection-seed#[3FADBE9FC211ED00]-worker) [    ] o.a.s.c.c.ZkStateReader Updated live nodes from ZooKeeper... (0) -> (2)
   [junit4]   2> 3351078 INFO  (SUITE-TestWithCollection-seed#[3FADBE9FC211ED00]-worker) [    ] o.a.s.c.s.i.ZkClientClusterStateProvider Cluster at 127.0.0.1:51763/solr ready
   [junit4]   2> 3351144 INFO  (TEST-TestWithCollection.testCreateCollectionNoWithCollection-seed#[3FADBE9FC211ED00]) [    ] o.a.s.SolrTestCaseJ4 ###Starting testCreateCollectionNoWithCollection
   [junit4]   2> 3351174 DEBUG (zkCallback-9166-thread-1) [    ] o.a.s.c.a.OverseerTriggerThread Refreshing /autoscaling.json with znode version 2
   [junit4]   2> 3351174 DEBUG (OverseerAutoScalingTriggerThread-72265234333368324-127.0.0.1:58489_solr-n_0000000000) [    ] o.a.s.c.a.OverseerTriggerThread Processed trigger updates upto znodeVersion 2
   [junit4]   2> 3351178 INFO  (TEST-TestWithCollection.testCreateCollectionNoWithCollection-seed#[3FADBE9FC211ED00]) [    ] o.a.s.c.c.ZkStateReader Updated live nodes from ZooKeeper... (0) -> (2)
   [junit4]   2> 3351178 DEBUG (OverseerAutoScalingTriggerThread-72265234333368324-127.0.0.1:58489_solr-n_0000000000) [    ] o.a.s.c.a.OverseerTriggerThread -- clean old nodeLost markers
   [junit4]   2> 3351179 DEBUG (OverseerAutoScalingTriggerThread-72265234333368324-127.0.0.1:58489_solr-n_0000000000) [    ] o.a.s.c.a.OverseerTriggerThread -- clean old nodeAdded markers
   [junit4]   2> 3351180 DEBUG (OverseerAutoScalingTriggerThread-72265234333368324-127.0.0.1:58489_solr-n_0000000000) [    ] o.a.s.c.a.OverseerTriggerThread Current znodeVersion 2, lastZnodeVersion 2
   [junit4]   2> 3351185 INFO  (qtp116246888-32635) [n:127.0.0.1:64548_solr    ] o.a.s.h.a.CollectionsHandler Invoked Collection Action :create with params pullReplicas=0&withCollection=testCreateCollectionNoWithCollection_abc&name=testCreateCollectionNoWithCollection_xyz&nrtReplicas=1&action=CREATE&numShards=1&tlogReplicas=0&wt=javabin&version=2 and sendToOCPQueue=true
   [junit4]   2> 3351200 INFO  (OverseerThreadFactory-12590-thread-1-processing-n:127.0.0.1:58489_solr) [n:127.0.0.1:58489_solr    ] o.a.s.c.a.c.CreateCollectionCmd Create collection testCreateCollectionNoWithCollection_xyz
   [junit4]   2> 3351200 ERROR (OverseerThreadFactory-12590-thread-1-processing-n:127.0.0.1:58489_solr) [n:127.0.0.1:58489_solr    ] o.a.s.c.a.c.OverseerCollectionMessageHandler Collection: testCreateCollectionNoWithCollection_xyz operation: create failed:org.apache.solr.common.SolrException: The 'withCollection' does not exist: testCreateCollectionNoWithCollection_abc
   [junit4]   2> 	at org.apache.solr.cloud.api.collections.CreateCollectionCmd.call(CreateCollectionCmd.java:117)
   [junit4]   2> 	at org.apache.solr.cloud.api.collections.OverseerCollectionMessageHandler.processMessage(OverseerCollectionMessageHandler.java:259)
   [junit4]   2> 	at org.apache.solr.cloud.OverseerTaskProcessor$Runner.run(OverseerTaskProcessor.java:478)
   [junit4]   2> 	at org.apache.solr.common.util.ExecutorUtil$MDCAwareThreadPoolExecutor.lambda$execute$0(ExecutorUtil.java:209)
   [junit4]   2> 	at java.util.concurrent.ThreadPoolExecutor.runWorker(ThreadPoolExecutor.java:1149)
   [junit4]   2> 	at java.util.concurrent.ThreadPoolExecutor$Worker.run(ThreadPoolExecutor.java:624)
   [junit4]   2> 	at java.lang.Thread.run(Thread.java:748)
   [junit4]   2> 
   [junit4]   2> 3351219 INFO  (qtp116246888-32635) [n:127.0.0.1:64548_solr    ] o.a.s.s.HttpSolrCall [admin] webapp=null path=/admin/collections params={pullReplicas=0&withCollection=testCreateCollectionNoWithCollection_abc&name=testCreateCollectionNoWithCollection_xyz&nrtReplicas=1&action=CREATE&numShards=1&tlogReplicas=0&wt=javabin&version=2} status=400 QTime=34
   [junit4]   2> 3351220 INFO  (qtp116246888-32621) [n:127.0.0.1:64548_solr    ] o.a.s.h.a.CollectionsHandler Invoked Collection Action :create with params pullReplicas=0&name=testCreateCollectionNoWithCollection_abc&nrtReplicas=1&action=CREATE&numShards=2&tlogReplicas=0&wt=javabin&version=2 and sendToOCPQueue=true
   [junit4]   2> 3351249 INFO  (OverseerThreadFactory-12590-thread-2-processing-n:127.0.0.1:58489_solr) [n:127.0.0.1:58489_solr    ] o.a.s.c.a.c.CreateCollectionCmd Create collection testCreateCollectionNoWithCollection_abc
   [junit4]   2> 3351251 INFO  (OverseerThreadFactory-12590-thread-2-processing-n:127.0.0.1:58489_solr) [n:127.0.0.1:58489_solr    ] o.a.s.c.c.ZkConfigManager Copying zk node /configs/_default/managed-schema to /configs/testCreateCollectionNoWithCollection_abc.AUTOCREATED/managed-schema
   [junit4]   2> 3351291 INFO  (OverseerThreadFactory-12590-thread-2-processing-n:127.0.0.1:58489_solr) [n:127.0.0.1:58489_solr    ] o.a.s.c.c.ZkConfigManager Copying zk node /configs/_default/protwords.txt to /configs/testCreateCollectionNoWithCollection_abc.AUTOCREATED/protwords.txt
   [junit4]   2> 3351296 INFO  (OverseerThreadFactory-12590-thread-2-processing-n:127.0.0.1:58489_solr) [n:127.0.0.1:58489_solr    ] o.a.s.c.c.ZkConfigManager Copying zk node /configs/_default/solrconfig.xml to /configs/testCreateCollectionNoWithCollection_abc.AUTOCREATED/solrconfig.xml
   [junit4]   2> 3351301 INFO  (OverseerThreadFactory-12590-thread-2-processing-n:127.0.0.1:58489_solr) [n:127.0.0.1:58489_solr    ] o.a.s.c.c.ZkConfigManager Copying zk node /configs/_default/synonyms.txt to /configs/testCreateCollectionNoWithCollection_abc.AUTOCREATED/synonyms.txt
   [junit4]   2> 3351306 INFO  (OverseerThreadFactory-12590-thread-2-processing-n:127.0.0.1:58489_solr) [n:127.0.0.1:58489_solr    ] o.a.s.c.c.ZkConfigManager Copying zk node /configs/_default/stopwords.txt to /configs/testCreateCollectionNoWithCollection_abc.AUTOCREATED/stopwords.txt
   [junit4]   2> 3351314 INFO  (OverseerThreadFactory-12590-thread-2-processing-n:127.0.0.1:58489_solr) [n:127.0.0.1:58489_solr    ] o.a.s.c.c.ZkConfigManager Copying zk node /configs/_default/lang/contractions_it.txt to /configs/testCreateCollectionNoWithCollection_abc.AUTOCREATED/lang/contractions_it.txt
   [junit4]   2> 3351323 INFO  (OverseerThreadFactory-12590-thread-2-processing-n:127.0.0.1:58489_solr) [n:127.0.0.1:58489_solr    ] o.a.s.c.c.ZkConfigManager Copying zk node /configs/_default/lang/stopwords_no.txt to /configs/testCreateCollectionNoWithCollection_abc.AUTOCREATED/lang/stopwords_no.txt
   [junit4]   2> 3351327 INFO  (OverseerThreadFactory-12590-thread-2-processing-n:127.0.0.1:58489_solr) [n:127.0.0.1:58489_solr    ] o.a.s.c.c.ZkConfigManager Copying zk node /configs/_default/lang/stopwords_hy.txt to /configs/testCreateCollectionNoWithCollection_abc.AUTOCREATED/lang/stopwords_hy.txt
   [junit4]   2> 3351332 INFO  (OverseerThreadFactory-12590-thread-2-processing-n:127.0.0.1:58489_solr) [n:127.0.0.1:58489_solr    ] o.a.s.c.c.ZkConfigManager Copying zk node /configs/_default/lang/contractions_ca.txt to /configs/testCreateCollectionNoWithCollection_abc.AUTOCREATED/lang/contractions_ca.txt
   [junit4]   2> 3351336 INFO  (OverseerThreadFactory-12590-thread-2-processing-n:127.0.0.1:58489_solr) [n:127.0.0.1:58489_solr    ] o.a.s.c.c.ZkConfigManager Copying zk node /configs/_default/lang/stemdict_nl.txt to /configs/testCreateCollectionNoWithCollection_abc.AUTOCREATED/lang/stemdict_nl.txt
   [junit4]   2> 3351343 INFO  (OverseerThreadFactory-12590-thread-2-processing-n:127.0.0.1:58489_solr) [n:127.0.0.1:58489_solr    ] o.a.s.c.c.ZkConfigManager Copying zk node /configs/_default/lang/stopwords_id.txt to /configs/testCreateCollectionNoWithCollection_abc.AUTOCREATED/lang/stopwords_id.txt
   [junit4]   2> 3351348 INFO  (OverseerThreadFactory-12590-thread-2-processing-n:127.0.0.1:58489_solr) [n:127.0.0.1:58489_solr    ] o.a.s.c.c.ZkConfigManager Copying zk node /configs/_default/lang/stopwords_ga.txt to /configs/testCreateCollectionNoWithCollection_abc.AUTOCREATED/lang/stopwords_ga.txt
   [junit4]   2> 3351352 INFO  (OverseerThreadFactory-12590-thread-2-processing-n:127.0.0.1:58489_solr) [n:127.0.0.1:58489_solr    ] o.a.s.c.c.ZkConfigManager Copying zk node /configs/_default/lang/stopwords_hi.txt to /configs/testCreateCollectionNoWithCollection_abc.AUTOCREATED/lang/stopwords_hi.txt
   [junit4]   2> 3351356 INFO  (OverseerThreadFactory-12590-thread-2-processing-n:127.0.0.1:58489_solr) [n:127.0.0.1:58489_solr    ] o.a.s.c.c.ZkConfigManager Copying zk node /configs/_default/lang/stopwords_da.txt to /configs/testCreateCollectionNoWithCollection_abc.AUTOCREATED/lang/stopwords_da.txt
   [junit4]   2> 3351361 INFO  (OverseerThreadFactory-12590-thread-2-processing-n:127.0.0.1:58489_solr) [n:127.0.0.1:58489_solr    ] o.a.s.c.c.ZkConfigManager Copying zk node /configs/_default/lang/stopwords_ja.txt to /configs/testCreateCollectionNoWithCollection_abc.AUTOCREATED/lang/stopwords_ja.txt
   [junit4]   2> 3351365 INFO  (OverseerThreadFactory-12590-thread-2-processing-n:127.0.0.1:58489_solr) [n:127.0.0.1:58489_solr    ] o.a.s.c.c.ZkConfigManager Copying zk node /configs/_default/lang/stopwords_pt.txt to /configs/testCreateCollectionNoWithCollection_abc.AUTOCREATED/lang/stopwords_pt.txt
   [junit4]   2> 3351379 INFO  (OverseerThreadFactory-12590-thread-2-processing-n:127.0.0.1:58489_solr) [n:127.0.0.1:58489_solr    ] o.a.s.c.c.ZkConfigManager Copying zk node /configs/_default/lang/stopwords_hu.txt to /configs/testCreateCollectionNoWithCollection_abc.AUTOCREATED/lang/stopwords_hu.txt
   [junit4]   2> 3351387 INFO  (OverseerThreadFactory-12590-thread-2-processing-n:127.0.0.1:58489_solr) [n:127.0.0.1:58489_solr    ] o.a.s.c.c.ZkConfigManager Copying zk node /configs/_default/lang/stopwords_el.txt to /configs/testCreateCollectionNoWithCollection_abc.AUTOCREATED/lang/stopwords_el.txt
   [junit4]   2> 3351396 INFO  (OverseerThreadFactory-12590-thread-2-processing-n:127.0.0.1:58489_solr) [n:127.0.0.1:58489_solr    ] o.a.s.c.c.ZkConfigManager Copying zk node /configs/_default/lang/stopwords_ru.txt to /configs/testCreateCollectionNoWithCollection_abc.AUTOCREATED/lang/stopwords_ru.txt
   [junit4]   2> 3351413 INFO  (OverseerThreadFactory-12590-thread-2-processing-n:127.0.0.1:58489_solr) [n:127.0.0.1:58489_solr    ] o.a.s.c.c.ZkConfigManager Copying zk node /configs/_default/lang/stopwords_tr.txt to /configs/testCreateCollectionNoWithCollection_abc.AUTOCREATED/lang/stopwords_tr.txt
   [junit4]   2> 3351430 INFO  (OverseerThreadFactory-12590-thread-2-processing-n:127.0.0.1:58489_solr) [n:127.0.0.1:58489_solr    ] o.a.s.c.c.ZkConfigManager Copying zk node /configs/_default/lang/stopwords_ar.txt to /configs/testCreateCollectionNoWithCollection_abc.AUTOCREATED/lang/stopwords_ar.txt
   [junit4]   2> 3351448 INFO  (OverseerThreadFactory-12590-thread-2-processing-n:127.0.0.1:58489_solr) [n:127.0.0.1:58489_solr    ] o.a.s.c.c.ZkConfigManager Copying zk node /configs/_default/lang/userdict_ja.txt to /configs/testCreateCollectionNoWithCollection_abc.AUTOCREATED/lang/userdict_ja.txt
   [junit4]   2> 3351463 INFO  (OverseerThreadFactory-12590-thread-2-processing-n:127.0.0.1:58489_solr) [n:127.0.0.1:58489_solr    ] o.a.s.c.c.ZkConfigManager Copying zk node /configs/_default/lang/stopwords_it.txt to /configs/testCreateCollectionNoWithCollection_abc.AUTOCREATED/lang/stopwords_it.txt
   [junit4]   2> 3351467 INFO  (OverseerThreadFactory-12590-thread-2-processing-n:127.0.0.1:58489_solr) [n:127.0.0.1:58489_solr    ] o.a.s.c.c.ZkConfigManager Copying zk node /configs/_default/lang/stopwords_eu.txt to /configs/testCreateCollectionNoWithCollection_abc.AUTOCREATED/lang/stopwords_eu.txt
   [junit4]   2> 3351475 INFO  (OverseerThreadFactory-12590-thread-2-processing-n:127.0.0.1:58489_solr) [n:127.0.0.1:58489_solr    ] o.a.s.c.c.ZkConfigManager Copying zk node /configs/_default/lang/stopwords_cz.txt to /configs/testCreateCollectionNoWithCollection_abc.AUTOCREATED/lang/stopwords_cz.txt
   [junit4]   2> 3351480 INFO  (OverseerThreadFactory-12590-thread-2-processing-n:127.0.0.1:58489_solr) [n:127.0.0.1:58489_solr    ] o.a.s.c.c.ZkConfigManager Copying zk node /configs/_default/lang/stoptags_ja.txt to /configs/testCreateCollectionNoWithCollection_abc.AUTOCREATED/lang/stoptags_ja.txt
   [junit4]   2> 3351486 INFO  (OverseerThreadFactory-12590-thread-2-processing-n:127.0.0.1:58489_solr) [n:127.0.0.1:58489_solr    ] o.a.s.c.c.ZkConfigManager Copying zk node /configs/_default/lang/contractions_fr.txt to /configs/testCreateCollectionNoWithCollection_abc.AUTOCREATED/lang/contractions_fr.txt
   [junit4]   2> 3351495 INFO  (OverseerThreadFactory-12590-thread-2-processing-n:127.0.0.1:58489_solr) [n:127.0.0.1:58489_solr    ] o.a.s.c.c.ZkConfigManager Copying zk node /configs/_default/lang/stopwords_de.txt to /configs/testCreateCollectionNoWithCollection_abc.AUTOCREATED/lang/stopwords_de.txt
   [junit4]   2> 3351501 INFO  (OverseerThreadFactory-12590-thread-2-processing-n:127.0.0.1:58489_solr) [n:127.0.0.1:58489_solr    ] o.a.s.c.c.ZkConfigManager Copying zk node /configs/_default/lang/stopwords_fa.txt to /configs/testCreateCollectionNoWithCollection_abc.AUTOCREATED/lang/stopwords_fa.txt
   [junit4]   2> 3351510 INFO  (OverseerThreadFactory-12590-thread-2-processing-n:127.0.0.1:58489_solr) [n:127.0.0.1:58489_solr    ] o.a.s.c.c.ZkConfigManager Copying zk node /configs/_default/lang/contractions_ga.txt to /configs/testCreateCollectionNoWithCollection_abc.AUTOCREATED/lang/contractions_ga.txt
   [junit4]   2> 3351515 INFO  (OverseerThreadFactory-12590-thread-2-processing-n:127.0.0.1:58489_solr) [n:127.0.0.1:58489_solr    ] o.a.s.c.c.ZkConfigManager Copying zk node /configs/_default/lang/stopwords_ca.txt to /configs/testCreateCollectionNoWithCollection_abc.AUTOCREATED/lang/stopwords_ca.txt
   [junit4]   2> 3351520 INFO  (OverseerThreadFactory-12590-thread-2-processing-n:127.0.0.1:58489_solr) [n:127.0.0.1:58489_solr    ] o.a.s.c.c.ZkConfigManager Copying zk node /configs/_default/lang/stopwords_nl.txt to /configs/testCreateCollectionNoWithCollection_abc.AUTOCREATED/lang/stopwords_nl.txt
   [junit4]   2> 3351524 INFO  (OverseerThreadFactory-12590-thread-2-processing-n:127.0.0.1:58489_solr) [n:127.0.0.1:58489_solr    ] o.a.s.c.c.ZkConfigManager Copying zk node /configs/_default/lang/stopwords_bg.txt to /configs/testCreateCollectionNoWithCollection_abc.AUTOCREATED/lang/stopwords_bg.txt
   [junit4]   2> 3351528 INFO  (OverseerThreadFactory-12590-thread-2-processing-n:127.0.0.1:58489_solr) [n:127.0.0.1:58489_solr    ] o.a.s.c.c.ZkConfigManager Copying zk node /configs/_default/lang/stopwords_lv.txt to /configs/testCreateCollectionNoWithCollection_abc.AUTOCREATED/lang/stopwords_lv.txt
   [junit4]   2> 3351536 INFO  (OverseerThreadFactory-12590-thread-2-processing-n:127.0.0.1:58489_solr) [n:127.0.0.1:58489_solr    ] o.a.s.c.c.ZkConfigManager Copying zk node /configs/_default/lang/stopwords_es.txt to /configs/testCreateCollectionNoWithCollection_abc.AUTOCREATED/lang/stopwords_es.txt
   [junit4]   2> 3351547 INFO  (OverseerThreadFactory-12590-thread-2-processing-n:127.0.0.1:58489_solr) [n:127.0.0.1:58489_solr    ] o.a.s.c.c.ZkConfigManager Copying zk node /configs/_default/lang/stopwords_en.txt to /configs/testCreateCollectionNoWithCollection_abc.AUTOCREATED/lang/stopwords_en.txt
   [junit4]   2> 3351554 INFO  (OverseerThreadFactory-12590-thread-2-processing-n:127.0.0.1:58489_solr) [n:127.0.0.1:58489_solr    ] o.a.s.c.c.ZkConfigManager Copying zk node /configs/_default/lang/stopwords_ro.txt to /configs/testCreateCollectionNoWithCollection_abc.AUTOCREATED/lang/stopwords_ro.txt
   [junit4]   2> 3351559 INFO  (OverseerThreadFactory-12590-thread-2-processing-n:127.0.0.1:58489_solr) [n:127.0.0.1:58489_solr    ] o.a.s.c.c.ZkConfigManager Copying zk node /configs/_default/lang/stopwords_th.txt to /configs/testCreateCollectionNoWithCollection_abc.AUTOCREATED/lang/stopwords_th.txt
   [junit4]   2> 3351572 INFO  (OverseerThreadFactory-12590-thread-2-processing-n:127.0.0.1:58489_solr) [n:127.0.0.1:58489_solr    ] o.a.s.c.c.ZkConfigManager Copying zk node /configs/_default/lang/stopwords_fr.txt to /configs/testCreateCollectionNoWithCollection_abc.AUTOCREATED/lang/stopwords_fr.txt
   [junit4]   2> 3351576 INFO  (OverseerThreadFactory-12590-thread-2-processing-n:127.0.0.1:58489_solr) [n:127.0.0.1:58489_solr    ] o.a.s.c.c.ZkConfigManager Copying zk node /configs/_default/lang/stopwords_sv.txt to /configs/testCreateCollectionNoWithCollection_abc.AUTOCREATED/lang/stopwords_sv.txt
   [junit4]   2> 3351581 INFO  (OverseerThreadFactory-12590-thread-2-processing-n:127.0.0.1:58489_solr) [n:127.0.0.1:58489_solr    ] o.a.s.c.c.ZkConfigManager Copying zk node /configs/_default/lang/stopwords_fi.txt to /configs/testCreateCollectionNoWithCollection_abc.AUTOCREATED/lang/stopwords_fi.txt
   [junit4]   2> 3351589 INFO  (OverseerThreadFactory-12590-thread-2-processing-n:127.0.0.1:58489_solr) [n:127.0.0.1:58489_solr    ] o.a.s.c.c.ZkConfigManager Copying zk node /configs/_default/lang/hyphenations_ga.txt to /configs/testCreateCollectionNoWithCollection_abc.AUTOCREATED/lang/hyphenations_ga.txt
   [junit4]   2> 3351593 INFO  (OverseerThreadFactory-12590-thread-2-processing-n:127.0.0.1:58489_solr) [n:127.0.0.1:58489_solr    ] o.a.s.c.c.ZkConfigManager Copying zk node /configs/_default/lang/stopwords_gl.txt to /configs/testCreateCollectionNoWithCollection_abc.AUTOCREATED/lang/stopwords_gl.txt
   [junit4]   2> 3351597 INFO  (OverseerThreadFactory-12590-thread-2-processing-n:127.0.0.1:58489_solr) [n:127.0.0.1:58489_solr    ] o.a.s.c.c.ZkConfigManager Copying zk node /configs/_default/params.json to /configs/testCreateCollectionNoWithCollection_abc.AUTOCREATED/params.json
   [junit4]   2> 3351614 DEBUG (OverseerStateUpdate-72265234333368324-127.0.0.1:58489_solr-n_0000000000) [n:127.0.0.1:58489_solr    ] o.a.s.c.o.ClusterStateMutator building a new cName: testCreateCollectionNoWithCollection_abc
   [junit4]   2> 3351615 DEBUG (OverseerStateUpdate-72265234333368324-127.0.0.1:58489_solr-n_0000000000) [n:127.0.0.1:58489_solr    ] o.a.s.c.o.ZkStateWriter going to create_collection /collections/testCreateCollectionNoWithCollection_abc/state.json
   [junit4]   2> 3351720 INFO  (OverseerStateUpdate-72265234333368324-127.0.0.1:58489_solr-n_0000000000) [n:127.0.0.1:58489_solr    ] o.a.s.c.o.SliceMutator createReplica() {
   [junit4]   2>   "operation":"ADDREPLICA",
   [junit4]   2>   "collection":"testCreateCollectionNoWithCollection_abc",
   [junit4]   2>   "shard":"shard1",
   [junit4]   2>   "core":"testCreateCollectionNoWithCollection_abc_shard1_replica_n1",
   [junit4]   2>   "state":"down",
   [junit4]   2>   "base_url":"http://127.0.0.1:58489/solr",
   [junit4]   2>   "type":"NRT",
   [junit4]   2>   "waitForFinalState":"false"} 
   [junit4]   2> 3351722 DEBUG (OverseerStateUpdate-72265234333368324-127.0.0.1:58489_solr-n_0000000000) [n:127.0.0.1:58489_solr    ] o.a.s.c.o.SliceMutator Old Slice: shard1:{
   [junit4]   2>   "range":"80000000-ffffffff",
   [junit4]   2>   "state":"active",
   [junit4]   2>   "replicas":{}}
   [junit4]   2> 3351722 DEBUG (OverseerStateUpdate-72265234333368324-127.0.0.1:58489_solr-n_0000000000) [n:127.0.0.1:58489_solr    ] o.a.s.c.o.SliceMutator New Slice: shard1:{
   [junit4]   2>   "range":"80000000-ffffffff",
   [junit4]   2>   "state":"active",
   [junit4]   2>   "replicas":{"core_node2":{
   [junit4]   2>       "core":"testCreateCollectionNoWithCollection_abc_shard1_replica_n1",
   [junit4]   2>       "base_url":"http://127.0.0.1:58489/solr",
   [junit4]   2>       "state":"down",
   [junit4]   2>       "node_name":null,
   [junit4]   2>       "type":"NRT"}}}
   [junit4]   2> 3351727 INFO  (OverseerStateUpdate-72265234333368324-127.0.0.1:58489_solr-n_0000000000) [n:127.0.0.1:58489_solr    ] o.a.s.c.o.SliceMutator createReplica() {
   [junit4]   2>   "operation":"ADDREPLICA",
   [junit4]   2>   "collection":"testCreateCollectionNoWithCollection_abc",
   [junit4]   2>   "shard":"shard2",
   [junit4]   2>   "core":"testCreateCollectionNoWithCollection_abc_shard2_replica_n3",
   [junit4]   2>   "state":"down",
   [junit4]   2>   "base_url":"http://127.0.0.1:64548/solr",
   [junit4]   2>   "type":"NRT",
   [junit4]   2>   "waitForFinalState":"false"} 
   [junit4]   2> 3351729 DEBUG (OverseerStateUpdate-72265234333368324-127.0.0.1:58489_solr-n_0000000000) [n:127.0.0.1:58489_solr    ] o.a.s.c.o.SliceMutator Old Slice: shard2:{
   [junit4]   2>   "range":"0-7fffffff",
   [junit4]   2>   "state":"active",
   [junit4]   2>   "replicas":{}}
   [junit4]   2> 3351729 DEBUG (OverseerStateUpdate-72265234333368324-127.0.0.1:58489_solr-n_0000000000) [n:127.0.0.1:58489_solr    ] o.a.s.c.o.SliceMutator New Slice: shard2:{
   [junit4]   2>   "range":"0-7fffffff",
   [junit4]   2>   "state":"active",
   [junit4]   2>   "replicas":{"core_node4":{
   [junit4]   2>       "core":"testCreateCollectionNoWithCollection_abc_shard2_replica_n3",
   [junit4]   2>       "base_url":"http://127.0.0.1:64548/solr",
   [junit4]   2>       "state":"down",
   [junit4]   2>       "node_name":null,
   [junit4]   2>       "type":"NRT"}}}
   [junit4]   2> 3351831 DEBUG (OverseerStateUpdate-72265234333368324-127.0.0.1:58489_solr-n_0000000000) [n:127.0.0.1:58489_solr    ] o.a.s.c.o.ZkStateWriter going to update_collection /collections/testCreateCollectionNoWithCollection_abc/state.json version: 0
   [junit4]   2> 3351932 INFO  (qtp116246888-32625) [n:127.0.0.1:64548_solr    x:testCreateCollectionNoWithCollection_abc_shard2_replica_n3] o.a.s.h.a.CoreAdminOperation core create command qt=/admin/cores&coreNodeName=core_node4&collection.configName=testCreateCollectionNoWithCollection_abc.AUTOCREATED&newCollection=true&name=testCreateCollectionNoWithCollection_abc_shard2_replica_n3&action=CREATE&numShards=2&collection=testCreateCollectionNoWithCollection_abc&shard=shard2&wt=javabin&version=2&replicaType=NRT
   [junit4]   2> 3351936 INFO  (qtp602095531-32630) [n:127.0.0.1:58489_solr    x:testCreateCollectionNoWithCollection_abc_shard1_replica_n1] o.a.s.h.a.CoreAdminOperation core create command qt=/admin/cores&coreNodeName=core_node2&collection.configName=testCreateCollectionNoWithCollection_abc.AUTOCREATED&newCollection=true&name=testCreateCollectionNoWithCollection_abc_shard1_replica_n1&action=CREATE&numShards=2&collection=testCreateCollectionNoWithCollection_abc&shard=shard1&wt=javabin&version=2&replicaType=NRT
   [junit4]   2> 3351938 INFO  (qtp602095531-32630) [n:127.0.0.1:58489_solr    x:testCreateCollectionNoWithCollection_abc_shard1_replica_n1] o.a.s.c.TransientSolrCoreCacheDefault Allocating transient cache for 2147483647 transient cores
   [junit4]   2> 3351955 DEBUG (OverseerStateUpdate-72265234333368324-127.0.0.1:58489_solr-n_0000000000) [n:127.0.0.1:58489_solr    ] o.a.s.c.o.ReplicaMutator Update state numShards=2 message={
   [junit4]   2>   "core":"testCreateCollectionNoWithCollection_abc_shard2_replica_n3",
   [junit4]   2>   "core_node_name":"core_node4",
   [junit4]   2>   "roles":null,
   [junit4]   2>   "base_url":"http://127.0.0.1:64548/solr",
   [junit4]   2>   "node_name":"127.0.0.1:64548_solr",
   [junit4]   2>   "numShards":"2",
   [junit4]   2>   "state":"down",
   [junit4]   2>   "shard":"shard2",
   [junit4]   2>   "collection":"testCreateCollectionNoWithCollection_abc",
   [junit4]   2>   "type":"NRT",
   [junit4]   2>   "force_set_state":"false",
   [junit4]   2>   "operation":"state"}
   [junit4]   2> 3351955 DEBUG (OverseerStateUpdate-72265234333368324-127.0.0.1:58489_solr-n_0000000000) [n:127.0.0.1:58489_solr    ] o.a.s.c.o.ReplicaMutator Will update state for replica: core_node4:{"core":"testCreateCollectionNoWithCollection_abc_shard2_replica_n3","base_url":"http://127.0.0.1:64548/solr","node_name":"127.0.0.1:64548_solr","state":"down","type":"NRT","force_set_state":"false"}
   [junit4]   2> 3351955 DEBUG (OverseerStateUpdate-72265234333368324-127.0.0.1:58489_solr-n_0000000000) [n:127.0.0.1:58489_solr    ] o.a.s.c.o.ReplicaMutator Collection is now: DocCollection(testCreateCollectionNoWithCollection_abc//collections/testCreateCollectionNoWithCollection_abc/state.json/1)={
   [junit4]   2>   "pullReplicas":"0",
   [junit4]   2>   "replicationFactor":"1",
   [junit4]   2>   "router":{"name":"compositeId"},
   [junit4]   2>   "maxShardsPerNode":"1",
   [junit4]   2>   "autoAddReplicas":"false",
   [junit4]   2>   "nrtReplicas":"1",
   [junit4]   2>   "tlogReplicas":"0",
   [junit4]   2>   "shards":{
   [junit4]   2>     "shard1":{
   [junit4]   2>       "range":"80000000-ffffffff",
   [junit4]   2>       "state":"active",
   [junit4]   2>       "replicas":{"core_node2":{
   [junit4]   2>           "core":"testCreateCollectionNoWithCollection_abc_shard1_replica_n1",
   [junit4]   2>           "base_url":"http://127.0.0.1:58489/solr",
   [junit4]   2>           "state":"down",
   [junit4]   2>           "node_name":null,
   [junit4]   2>           "type":"NRT"}}},
   [junit4]   2>     "shard2":{
   [junit4]   2>       "range":"0-7fffffff",
   [junit4]   2>       "state":"active",
   [junit4]   2>       "replicas":{"core_node4":{
   [junit4]   2>           "core":"testCreateCollectionNoWithCollection_abc_shard2_replica_n3",
   [junit4]   2>           "base_url":"http://127.0.0.1:64548/solr",
   [junit4]   2>           "node_name":"127.0.0.1:64548_solr",
   [junit4]   2>           "state":"down",
   [junit4]   2>           "type":"NRT",
   [junit4]   2>           "force_set_state":"false"}}}}}
   [junit4]   2> 3351963 DEBUG (OverseerStateUpdate-72265234333368324-127.0.0.1:58489_solr-n_0000000000) [n:127.0.0.1:58489_solr    ] o.a.s.c.o.ReplicaMutator Update state numShards=2 message={
   [junit4]   2>   "core":"testCreateCollectionNoWithCollection_abc_shard1_replica_n1",
   [junit4]   2>   "core_node_name":"core_node2",
   [junit4]   2>   "roles":null,
   [junit4]   2>   "base_url":"http://127.0.0.1:58489/solr",
   [junit4]   2>   "node_name":"127.0.0.1:58489_solr",
   [junit4]   2>   "numShards":"2",
   [junit4]   2>   "state":"down",
   [junit4]   2>   "shard":"shard1",
   [junit4]   2>   "collection":"testCreateCollectionNoWithCollection_abc",
   [junit4]   2>   "type":"NRT",
   [junit4]   2>   "force_set_state":"false",
   [junit4]   2>   "operation":"state"}
   [junit4]   2> 3351963 DEBUG (OverseerStateUpdate-72265234333368324-127.0.0.1:58489_solr-n_0000000000) [n:127.0.0.1:58489_solr    ] o.a.s.c.o.ReplicaMutator Will update state for replica: core_node2:{"core":"testCreateCollectionNoWithCollection_abc_shard1_replica_n1","base_url":"http://127.0.0.1:58489/solr","node_name":"127.0.0.1:58489_solr","state":"down","type":"NRT","force_set_state":"false"}
   [junit4]   2> 3351963 DEBUG (OverseerStateUpdate-72265234333368324-127.0.0.1:58489_solr-n_0000000000) [n:127.0.0.1:58489_solr    ] o.a.s.c.o.ReplicaMutator Collection is now: DocCollection(testCreateCollectionNoWithCollection_abc//collections/testCreateCollectionNoWithCollection_abc/state.json/1)={
   [junit4]   2>   "pullReplicas":"0",
   [junit4]   2>   "replicationFactor":"1",
   [junit4]   2>   "router":{"name":"compositeId"},
   [junit4]   2>   "maxShardsPerNode":"1",
   [junit4]   2>   "autoAddReplicas":"false",
   [junit4]   2>   "nrtReplicas":"1",
   [junit4]   2>   "tlogReplicas":"0",
   [junit4]   2>   "shards":{
   [junit4]   2>     "shard1":{
   [junit4]   2>       "range":"80000000-ffffffff",
   [junit4]   2>       "state":"active",
   [junit4]   2>       "replicas":{"core_node2":{
   [junit4]   2>           "core":"testCreateCollectionNoWithCollection_abc_shard1_replica_n1",
   [junit4]   2>           "base_url":"http://127.0.0.1:58489/solr",
   [junit4]   2>           "node_name":"127.0.0.1:58489_solr",
   [junit4]   2>           "state":"down",
   [junit4]   2>           "type":"NRT",
   [junit4]   2>           "force_set_state":"false"}}},
   [junit4]   2>     "shard2":{
   [junit4]   2>       "range":"0-7fffffff",
   [junit4]   2>       "state":"active",
   [junit4]   2>       "replicas":{"core_node4":{
   [junit4]   2>           "core":"testCreateCollectionNoWithCollection_abc_shard2_replica_n3",
   [junit4]   2>           "base_url":"http://127.0.0.1:64548/solr",
   [junit4]   2>           "node_name":"127.0.0.1:64548_solr",
   [junit4]   2>           "state":"down",
   [junit4]   2>           "type":"NRT",
   [junit4]   2>           "force_set_state":"false"}}}}}
   [junit4]   2> 3352064 DEBUG (OverseerStateUpdate-72265234333368324-127.0.0.1:58489_solr-n_0000000000) [n:127.0.0.1:58489_solr    ] o.a.s.c.o.ZkStateWriter going to update_collection /collections/testCreateCollectionNoWithCollection_abc/state.json version: 1
   [junit4]   2> 3352988 INFO  (qtp116246888-32625) [n:127.0.0.1:64548_solr c:testCreateCollectionNoWithCollection_abc s:shard2 r:core_node4 x:testCreateCollectionNoWithCollection_abc_shard2_replica_n3] o.a.s.c.RequestParams conf resource params.json loaded . version : 0 
   [junit4]   2> 3352988 INFO  (qtp116246888-32625) [n:127.0.0.1:64548_solr c:testCreateCollectionNoWithCollection_abc s:shard2 r:core_node4 x:testCreateCollectionNoWithCollection_abc_shard2_replica_n3] o.a.s.c.RequestParams request params refreshed to version 0
   [junit4]   2> 3352989 WARN  (qtp116246888-32625) [n:127.0.0.1:64548_solr c:testCreateCollectionNoWithCollection_abc s:shard2 r:core_node4 x:testCreateCollectionNoWithCollection_abc_shard2_replica_n3] o.a.s.c.SolrConfig Couldn't add files from /export/home/jenkins/workspace/Lucene-Solr-master-Solaris/solr/build/solr-core/test/J1/temp/solr.cloud.TestWithCollection_3FADBE9FC211ED00-001/tempDir-001/node2/testCreateCollectionNoWithCollection_abc_shard2_replica_n3/../../../../contrib/extraction/lib filtered by .*\.jar to classpath: /export/home/jenkins/workspace/Lucene-Solr-master-Solaris/solr/build/solr-core/test/J1/temp/solr.cloud.TestWithCollection_3FADBE9FC211ED00-001/tempDir-001/node2/testCreateCollectionNoWithCollection_abc_shard2_replica_n3/../../../../contrib/extraction/lib
   [junit4]   2> 3352989 WARN  (qtp116246888-32625) [n:127.0.0.1:64548_solr c:testCreateCollectionNoWithCollection_abc s:shard2 r:core_node4 x:testCreateCollectionNoWithCollection_abc_shard2_replica_n3] o.a.s.c.SolrConfig Couldn't add files from /export/home/jenkins/workspace/Lucene-Solr-master-Solaris/solr/build/solr-core/test/J1/temp/solr.cloud.TestWithCollection_3FADBE9FC211ED00-001/tempDir-001/node2/testCreateCollectionNoWithCollection_abc_shard2_replica_n3/../../../../dist filtered by solr-cell-\d.*\.jar to classpath: /export/home/jenkins/workspace/Lucene-Solr-master-Solaris/solr/build/solr-core/test/J1/temp/solr.cloud.TestWithCollection_3FADBE9FC211ED00-001/tempDir-001/node2/testCreateCollectionNoWithCollection_abc_shard2_replica_n3/../../../../dist
   [junit4]   2> 3352989 WARN  (qtp116246888-32625) [n:127.0.0.1:64548_solr c:testCreateCollectionNoWithCollection_abc s:shard2 r:core_node4 x:testCreateCollectionNoWithCollection_abc_shard2_replica_n3] o.a.s.c.SolrConfig Couldn't add files from /export/home/jenkins/workspace/Lucene-Solr-master-Solaris/solr/build/solr-core/test/J1/temp/solr.cloud.TestWithCollection_3FADBE9FC211ED00-001/tempDir-001/node2/testCreateCollectionNoWithCollection_abc_shard2_replica_n3/../../../../contrib/clustering/lib filtered by .*\.jar to classpath: /export/home/jenkins/workspace/Lucene-Solr-master-Solaris/solr/build/solr-core/test/J1/temp/solr.cloud.TestWithCollection_3FADBE9FC211ED00-001/tempDir-001/node2/testCreateCollectionNoWithCollection_abc_shard2_replica_n3/../../../../contrib/clustering/lib
   [junit4]   2> 3352989 WARN  (qtp116246888-32625) [n:127.0.0.1:64548_solr c:testCreateCollectionNoWithCollection_abc s:shard2 r:core_node4 x:testCreateCollectionNoWithCollection_abc_shard2_replica_n3] o.a.s.c.SolrConfig Couldn't add files from /export/home/jenkins/workspace/Lucene-Solr-master-Solaris/solr/build/solr-core/test/J1/temp/solr.cloud.TestWithCollection_3FADBE9FC211ED00-001/tempDir-001/node2/testCreateCollectionNoWithCollection_abc_shard2_replica_n3/../../../../dist filtered by solr-clustering-\d.*\.jar to classpath: /export/home/jenkins/workspace/Lucene-Solr-master-Solaris/solr/build/solr-core/test/J1/temp/solr.cloud.TestWithCollection_3FADBE9FC211ED00-001/tempDir-001/node2/testCreateCollectionNoWithCollection_abc_shard2_replica_n3/../../../../dist
   [junit4]   2> 3352989 WARN  (qtp116246888-32625) [n:127.0.0.1:64548_solr c:testCreateCollectionNoWithCollection_abc s:shard2 r:core_node4 x:testCreateCollectionNoWithCollection_abc_shard2_replica_n3] o.a.s.c.SolrConfig Couldn't add files from /export/home/jenkins/workspace/Lucene-Solr-master-Solaris/solr/build/solr-core/test/J1/temp/solr.cloud.TestWithCollection_3FADBE9FC211ED00-001/tempDir-001/node2/testCreateCollectionNoWithCollection_abc_shard2_replica_n3/../../../../contrib/langid/lib filtered by .*\.jar to classpath: /export/home/jenkins/workspace/Lucene-Solr-master-Solaris/solr/build/solr-core/test/J1/temp/solr.cloud.TestWithCollection_3FADBE9FC211ED00-001/tempDir-001/node2/testCreateCollectionNoWithCollection_abc_shard2_replica_n3/../../../../contrib/langid/lib
   [junit4]   2> 3352990 WARN  (qtp116246888-32625) [n:127.0.0.1:64548_solr c:testCreateCollectionNoWithCollection_abc s:shard2 r:core_node4 x:testCreateCollectionNoWithCollection_abc_shard2_replica_n3] o.a.s.c.SolrConfig Couldn't add files from /export/home/jenkins/workspace/Lucene-Solr-master-Solaris/solr/build/solr-core/test/J1/temp/solr.cloud.TestWithCollection_3FADBE9FC211ED00-001/tempDir-001/node2/testCreateCollectionNoWithCollection_abc_shard2_replica_n3/../../../../dist filtered by solr-langid-\d.*\.jar to classpath: /export/home/jenkins/workspace/Lucene-Solr-master-Solaris/solr/build/solr-core/test/J1/temp/solr.cloud.TestWithCollection_3FADBE9FC211ED00-001/tempDir-001/node2/testCreateCollectionNoWithCollection_abc_shard2_replica_n3/../../../../dist
   [junit4]   2> 3352990 WARN  (qtp116246888-32625) [n:127.0.0.1:64548_solr c:testCreateCollectionNoWithCollection_abc s:shard2 r:core_node4 x:testCreateCollectionNoWithCollection_abc_shard2_replica_n3] o.a.s.c.SolrConfig Couldn't add files from /export/home/jenkins/workspace/Lucene-Solr-master-Solaris/solr/build/solr-core/test/J1/temp/solr.cloud.TestWithCollection_3FADBE9FC211ED00-001/tempDir-001/node2/testCreateCollectionNoWithCollection_abc_shard2_replica_n3/../../../../contrib/velocity/lib filtered by .*\.jar to classpath: /export/home/jenkins/workspace/Lucene-Solr-master-Solaris/solr/build/solr-core/test/J1/temp/solr.cloud.TestWithCollection_3FADBE9FC211ED00-001/tempDir-001/node2/testCreateCollectionNoWithCollection_abc_shard2_replica_n3/../../../../contrib/velocity/lib
   [junit4]   2> 3352990 WARN  (qtp116246888-32625) [n:127.0.0.1:64548_solr c:testCreateCollectionNoWithCollection_abc s:shard2 r:core_node4 x:testCreateCollectionNoWithCollection_abc_shard2_replica_n3] o.a.s.c.SolrConfig Couldn't add files from /export/home/jenkins/workspace/Lucene-Solr-master-Solaris/solr/build/solr-core/test/J1/temp/solr.cloud.TestWithCollection_3FADBE9FC211ED00-001/tempDir-001/node2/testCreateCollectionNoWithCollection_abc_shard2_replica_n3/../../../../dist filtered by solr-velocity-\d.*\.jar to classpath: /export/home/jenkins/workspace/Lucene-Solr-master-Solaris/solr/build/solr-core/test/J1/temp/solr.cloud.TestWithCollection_3FADBE9FC211ED00-001/tempDir-001/node2/testCreateCollectionNoWithCollection_abc_shard2_replica_n3/../../../../dist
   [junit4]   2> 3352991 WARN  (qtp116246888-32625) [n:127.0.0.1:64548_solr c:testCreateCollectionNoWithCollection_abc s:shard2 r:core_node4 x:testCreateCollectionNoWithCollection_abc_shard2_replica_n3] o.a.s.c.SolrConfig Couldn't add files from /export/home/jenkins/workspace/Lucene-Solr-master-Solaris/solr/build/solr-core/test/J1/temp/solr.cloud.TestWithCollection_3FADBE9FC211ED00-001/tempDir-001/node2/testCreateCollectionNoWithCollection_abc_shard2_replica_n3/../../../../dist filtered by solr-ltr-\d.*\.jar to classpath: /export/home/jenkins/workspace/Lucene-Solr-master-Solaris/solr/build/solr-core/test/J1/temp/solr.cloud.TestWithCollection_3FADBE9FC211ED00-001/tempDir-001/node2/testCreateCollectionNoWithCollection_abc_shard2_replica_n3/../../../../dist
   [junit4]   2> 3352992 INFO  (qtp602095531-32630) [n:127.0.0.1:58489_solr c:testCreateCollectionNoWithCollection_abc s:shard1 r:core_node2 x:testCreateCollectionNoWithCollection_abc_shard1_replica_n1] o.a.s.c.RequestParams conf resource params.json loaded . version : 0 
   [junit4]   2> 3352992 INFO  (qtp602095531-32630) [n:127.0.0.1:58489_solr c:testCreateCollectionNoWithCollection_abc s:shard1 r:core_node2 x:testCreateCollectionNoWithCollection_abc_shard1_replica_n1] o.a.s.c.RequestParams request params refreshed to version 0
   [junit4]   2> 3352993 WARN  (qtp602095531-32630) [n:127.0.0.1:58489_solr c:testCreateCollectionNoWithCollection_abc s:shard1 r:core_node2 x:testCreateCollectionNoWithCollection_abc_shard1_replica_n1] o.a.s.c.SolrConfig Couldn't add files from /export/home/jenkins/workspace/Lucene-Solr-master-Solaris/solr/build/solr-core/test/J1/temp/solr.cloud.TestWithCollection_3FADBE9FC211ED00-001/tempDir-001/node1/testCreateCollectionNoWithCollection_abc_shard1_replica_n1/../../../../contrib/extraction/lib filtered by .*\.jar to classpath: /export/home/jenkins/workspace/Lucene-Solr-master-Solaris/solr/build/solr-core/test/J1/temp/solr.cloud.TestWithCollection_3FADBE9FC211ED00-001/tempDir-001/node1/testCreateCollectionNoWithCollection_abc_shard1_replica_n1/../../../../contrib/extraction/lib
   [junit4]   2> 3352993 WARN  (qtp602095531-32630) [n:127.0.0.1:58489_solr c:testCreateCollectionNoWithCollection_abc s:shard1 r:core_node2 x:testCreateCollectionNoWithCollection_abc_shard1_replica_n1] o.a.s.c.SolrConfig Couldn't add files from /export/home/jenkins/workspace/Lucene-Solr-master-Solaris/solr/build/solr-core/test/J1/temp/solr.cloud.TestWithCollection_3FADBE9FC211ED00-001/tempDir-001/node1/testCreateCollectionNoWithCollection_abc_shard1_replica_n1/../../../../dist filtered by solr-cell-\d.*\.jar to classpath: /export/home/jenkins/workspace/Lucene-Solr-master-Solaris/solr/build/solr-core/test/J1/temp/solr.cloud.TestWithCollection_3FADBE9FC211ED00-001/tempDir-001/node1/testCreateCollectionNoWithCollection_abc_shard1_replica_n1/../../../../dist
   [junit4]   2> 3352993 WARN  (qtp602095531-32630) [n:127.0.0.1:58489_solr c:testCreateCollectionNoWithCollection_abc s:shard1 r:core_node2 x:testCreateCollectionNoWithCollection_abc_shard1_replica_n1] o.a.s.c.SolrConfig Couldn't add files from /export/home/jenkins/workspace/Lucene-Solr-master-Solaris/solr/build/solr-core/test/J1/temp/solr.cloud.TestWithCollection_3FADBE9FC211ED00-001/tempDir-001/node1/testCreateCollectionNoWithCollection_abc_shard1_replica_n1/../../../../contrib/clustering/lib filtered by .*\.jar to classpath: /export/home/jenkins/workspace/Lucene-Solr-master-Solaris/solr/build/solr-core/test/J1/temp/solr.cloud.TestWithCollection_3FADBE9FC211ED00-001/tempDir-001/node1/testCreateCollectionNoWithCollection_abc_shard1_replica_n1/../../../../contrib/clustering/lib
   [junit4]   2> 3352993 WARN  (qtp602095531-32630) [n:127.0.0.1:58489_solr c:testCreateCollectionNoWithCollection_abc s:shard1 r:core_node2 x:testCreateCollectionNoWithCollection_abc_shard1_replica_n1] o.a.s.c.SolrConfig Couldn't add files from /export/home/jenkins/workspace/Lucene-Solr-master-Solaris/solr/build/solr-core/test/J1/temp/solr.cloud.TestWithCollection_3FADBE9FC211ED00-001/tempDir-001/node1/testCreateCollectionNoWithCollection_abc_shard1_replica_n1/../../../../dist filtered by solr-clustering-\d.*\.jar to classpath: /export/home/jenkins/workspace/Lucene-Solr-master-Solaris/solr/build/solr-core/test/J1/temp/solr.cloud.TestWithCollection_3FADBE9FC211ED00-001/tempDir-001/node1/testCreateCollectionNoWithCollection_abc_shard1_replica_n1/../../../../dist
   [junit4]   2> 3352993 WARN  (qtp602095531-32630) [n:127.0.0.1:58489_solr c:testCreateCollectionNoWithCollection_abc s:shard1 r:core_node2 x:testCreateCollectionNoWithCollection_abc_shard1_replica_n1] o.a.s.c.SolrConfig Couldn't add files from /export/home/jenkins/workspace/Lucene-Solr-master-Solaris/solr/build/solr-core/test/J1/temp/solr.cloud.TestWithCollection_3FADBE9FC211ED00-001/tempDir-001/node1/testCreateCollectionNoWithCollection_abc_shard1_replica_n1/../../../../contrib/langid/lib filtered by .*\.jar to classpath: /export/home/jenkins/workspace/Lucene-Solr-master-Solaris/solr/build/solr-core/test/J1/temp/solr.cloud.TestWithCollection_3FADBE9FC211ED00-001/tempDir-001/node1/testCreateCollectionNoWithCollection_abc_shard1_replica_n1/../../../../contrib/langid/lib
   [junit4]   2> 3352994 WARN  (qtp602095531-32630) [n:127.0.0.1:58489_solr c:testCreateCollectionNoWithCollection_abc s:shard1 r:core_node2 x:testCreateCollectionNoWithCollection_abc_shard1_replica_n1] o.a.s.c.SolrConfig Couldn't add files from /export/home/jenkins/workspace/Lucene-Solr-master-Solaris/solr/build/solr-core/test/J1/temp/solr.cloud.TestWithCollection_3FADBE9FC211ED00-001/tempDir-001/node1/testCreateCollectionNoWithCollection_abc_shard1_replica_n1/../../../../dist filtered by solr-langid-\d.*\.jar to classpath: /export/home/jenkins/workspace/Lucene-Solr-master-Solaris/solr/build/solr-core/test/J1/temp/solr.cloud.TestWithCollection_3FADBE9FC211ED00-001/tempDir-001/node1/testCreateCollectionNoWithCollection_abc_shard1_replica_n1/../../../../dist
   [junit4]   2> 3352994 WARN  (qtp602095531-32630) [n:127.0.0.1:58489_solr c:testCreateCollectionNoWithCollection_abc s:shard1 r:core_node2 x:testCreateCollectionNoWithCollection_abc_shard1_replica_n1] o.a.s.c.SolrConfig Couldn't add files from /export/home/jenkins/workspace/Lucene-Solr-master-Solaris/solr/build/solr-core/test/J1/temp/solr.cloud.TestWithCollection_3FADBE9FC211ED00-001/tempDir-001/node1/testCreateCollectionNoWithCollection_abc_shard1_replica_n1/../../../../contrib/velocity/lib filtered by .*\.jar to classpath: /export/home/jenkins/workspace/Lucene-Solr-master-Solaris/solr/build/solr-core/test/J1/temp/solr.cloud.TestWithCollection_3FADBE9FC211ED00-001/tempDir-001/node1/testCreateCollectionNoWithCollection_abc_shard1_replica_n1/../../../../contrib/velocity/lib
   [junit4]   2> 3352994 WARN  (qtp602095531-32630) [n:127.0.0.1:58489_solr c:testCreateCollectionNoWithCollection_abc s:shard1 r:core_node2 x:testCreateCollectionNoWithCollection_abc_shard1_replica_n1] o.a.s.c.SolrConfig Couldn't add files from /export/home/jenkins/workspace/Lucene-Solr-master-Solaris/solr/build/solr-core/test/J1/temp/solr.cloud.TestWithCollection_3FADBE9FC211ED00-001/tempDir-001/node1/testCreateCollectionNoWithCollection_abc_shard1_replica_n1/../../../../dist filtered by solr-velocity-\d.*\.jar to classpath: /export/home/jenkins/workspace/Lucene-Solr-master-Solaris/solr/build/solr-core/test/J1/temp/solr.cloud.TestWithCollection_3FADBE9FC211ED00-001/tempDir-001/node1/testCreateCollectionNoWithCollection_abc_shard1_replica_n1/../../../../dist
   [junit4]   2> 3352994 WARN  (qtp602095531-32630) [n:127.0.0.1:58489_solr c:testCreateCollectionNoWithCollection_abc s:shard1 r:core_node2 x:testCreateCollectionNoWithCollection_abc_shard1_replica_n1] o.a.s.c.SolrConfig Couldn't add files from /export/home/jenkins/workspace/Lucene-Solr-master-Solaris/solr/build/solr-core/test/J1/temp/solr.cloud.TestWithCollection_3FADBE9FC211ED00-001/tempDir-001/node1/testCreateCollectionNoWithCollection_abc_shard1_replica_n1/../../../../dist filtered by solr-ltr-\d.*\.jar to classpath: /export/home/jenkins/workspace/Lucene-Solr-master-Solaris/solr/build/solr-core/test/J1/temp/solr.cloud.TestWithCollection_3FADBE9FC211ED00-001/tempDir-001/node1/testCreateCollectionNoWithCollection_abc_shard1_replica_n1/../../../../dist
   [junit4]   2> 3353001 INFO  (qtp116246888-32625) [n:127.0.0.1:64548_solr c:testCreateCollectionNoWithCollection_abc s:shard2 r:core_node4 x:testCreateCollectionNoWithCollection_abc_shard2_replica_n3] o.a.s.c.SolrConfig Using Lucene MatchVersion: 8.0.0
   [junit4]   2> 3353006 INFO  (qtp602095531-32630) [n:127.0.0.1:58489_solr c:testCreateCollectionNoWithCollection_abc s:shard1 r:core_node2 x:testCreateCollectionNoWithCollection_abc_shard1_replica_n1] o.a.s.c.SolrConfig Using Lucene MatchVersion: 8.0.0
   [junit4]   2> 3353055 INFO  (qtp116246888-32625) [n:127.0.0.1:64548_solr c:testCreateCollectionNoWithCollection_abc s:shard2 r:core_node4 x:testCreateCollectionNoWithCollection_abc_shard2_replica_n3] o.a.s.s.IndexSchema [testCreateCollectionNoWithCollection_abc_shard2_replica_n3] Schema name=default-config
   [junit4]   2> 3353065 INFO  (qtp602095531-32630) [n:127.0.0.1:58489_solr c:testCreateCollectionNoWithCollection_abc s:shard1 r:core_node2 x:testCreateCollectionNoWithCollection_abc_shard1_replica_n1] o.a.s.s.IndexSchema [testCreateCollectionNoWithCollection_abc_shard1_replica_n1] Schema name=default-config
   [junit4]   2> 3353324 INFO  (qtp602095531-32630) [n:127.0.0.1:58489_solr c:testCreateCollectionNoWithCollection_abc s:shard1 r:core_node2 x:testCreateCollectionNoWithCollection_abc_shard1_replica_n1] o.a.s.s.IndexSchema Loaded schema default-config/1.6 with uniqueid field id
   [junit4]   2> 3353325 INFO  (qtp116246888-32625) [n:127.0.0.1:64548_solr c:testCreateCollectionNoWithCollection_abc s:shard2 r:core_node4 x:testCreateCollectionNoWithCollection_abc_shard2_replica_n3] o.a.s.s.IndexSchema Loaded schema default-config/1.6 with uniqueid field id
   [junit4]   2> 3353416 INFO  (qtp116246888-32625) [n:127.0.0.1:64548_solr c:testCreateCollectionNoWithCollection_abc s:shard2 r:core_node4 x:testCreateCollectionNoWithCollection_abc_shard2_replica_n3] o.a.s.c.CoreContainer Creating SolrCore 'testCreateCollectionNoWithCollection_abc_shard2_replica_n3' using configuration from collection testCreateCollectionNoWithCollection_abc, trusted=true
   [junit4]   2> 3353416 INFO  (qtp116246888-32625) [n:127.0.0.1:64548_solr c:testCreateCollectionNoWithCollection_abc s:shard2 r:core_node4 x:testCreateCollectionNoWithCollection_abc_shard2_replica_n3] o.a.s.m.r.SolrJmxReporter JMX monitoring for 'solr_64548.solr.core.testCreateCollectionNoWithCollection_abc.shard2.replica_n3' (registry 'solr.core.testCreateCollectionNoWithCollection_abc.shard2.replica_n3') enabled at server: com.sun.jmx.mbeanserver.JmxMBeanServer@61d9870d
   [junit4]   2> 3353417 INFO  (qtp116246888-32625) [n:127.0.0.1:64548_solr c:testCreateCollectionNoWithCollection_abc s:shard2 r:core_node4 x:testCreateCollectionNoWithCollection_abc_shard2_replica_n3] o.a.s.c.SolrCore solr.RecoveryStrategy.Builder
   [junit4]   2> 3353417 INFO  (qtp116246888-32625) [n:127.0.0.1:64548_solr c:testCreateCollectionNoWithCollection_abc s:shard2 r:core_node4 x:testCreateCollectionNoWithCollection_abc_shard2_replica_n3] o.a.s.c.SolrCore [[testCreateCollectionNoWithCollection_abc_shard2_replica_n3] ] Opening new SolrCore at [/export/home/jenkins/workspace/Lucene-Solr-master-Solaris/solr/build/solr-core/test/J1/temp/solr.cloud.TestWithCollection_3FADBE9FC211ED00-001/tempDir-001/node2/testCreateCollectionNoWithCollection_abc_shard2_replica_n3], dataDir=[/export/home/jenkins/workspace/Lucene-Solr-master-Solaris/solr/build/solr-core/test/J1/temp/solr.cloud.TestWithCollection_3FADBE9FC211ED00-001/tempDir-001/node2/./testCreateCollectionNoWithCollection_abc_shard2_replica_n3/data/]
   [junit4]   2> 3353420 INFO  (qtp116246888-32625) [n:127.0.0.1:64548_solr c:testCreateCollectionNoWithCollection_abc s:shard2 r:core_node4 x:testCreateCollectionNoWithCollection_abc_shard2_replica_n3] o.a.s.r.XSLTResponseWriter xsltCacheLifetimeSeconds=5
   [junit4]   2> 3353438 INFO  (qtp602095531-32630) [n:127.0.0.1:58489_solr c:testCreateCollectionNoWithCollection_abc s:shard1 r:core_node2 x:testCreateCollectionNoWithCollection_abc_shard1_replica_n1] o.a.s.c.CoreContainer Creating SolrCore 'testCreateCollectionNoWithCollection_abc_shard1_replica_n1' using configuration from collection testCreateCollectionNoWithCollection_abc, trusted=true
   [junit4]   2> 3353439 INFO  (qtp602095531-32630) [n:127.0.0.1:58489_solr c:testCreateCollectionNoWithCollection_abc s:shard1 r:core_node2 x:testCreateCollectionNoWithCollection_abc_shard1_replica_n1] o.a.s.m.r.SolrJmxReporter JMX monitoring for 'solr_58489.solr.core.testCreateCollectionNoWithCollection_abc.shard1.replica_n1' (registry 'solr.core.testCreateCollectionNoWithCollection_abc.shard1.replica_n1') enabled at server: com.sun.jmx.mbeanserver.JmxMBeanServer@61d9870d
   [junit4]   2> 3353439 INFO  (qtp602095531-32630) [n:127.0.0.1:58489_solr c:testCreateCollectionNoWithCollection_abc s:shard1 r:core_node2 x:testCreateCollectionNoWithCollection_abc_shard1_replica_n1] o.a.s.c.SolrCore solr.RecoveryStrategy.Builder
   [junit4]   2> 3353439 INFO  (qtp602095531-32630) [n:127.0.0.1:58489_solr c:testCreateCollectionNoWithCollection_abc s:shard1 r:core_node2 x:testCreateCollectionNoWithCollection_abc_shard1_replica_n1] o.a.s.c.SolrCore [[testCreateCollectionNoWithCollection_abc_shard1_replica_n1] ] Opening new SolrCore at [/export/home/jenkins/workspace/Lucene-Solr-master-Solaris/solr/build/solr-core/test/J1/temp/solr.cloud.TestWithCollection_3FADBE9FC211ED00-001/tempDir-001/node1/testCreateCollectionNoWithCollection_abc_shard1_replica_n1], dataDir=[/export/home/jenkins/workspace/Lucene-Solr-master-Solaris/solr/build/solr-core/test/J1/temp/solr.cloud.TestWithCollection_3FADBE9FC211ED00-001/tempDir-001/node1/./testCreateCollectionNoWithCollection_abc_shard1_replica_n1/data/]
   [junit4]   2> 3353442 INFO  (qtp602095531-32630) [n:127.0.0.1:58489_solr c:testCreateCollectionNoWithCollection_abc s:shard1 r:core_node2 x:testCreateCollectionNoWithCollection_abc_shard1_replica_n1] o.a.s.r.XSLTResponseWriter xsltCacheLifetimeSeconds=5
   [junit4]   2> 3353506 INFO  (qtp116246888-32625) [n:127.0.0.1:64548_solr c:testCreateCollectionNoWithCollection_abc s:shard2 r:core_node4 x:testCreateCollectionNoWithCollection_abc_shard2_replica_n3] o.a.s.u.UpdateHandler Using UpdateLog implementation: org.apache.solr.update.UpdateLog
   [junit4]   2> 3353506 INFO  (qtp116246888-32625) [n:127.0.0.1:64548_solr c:testCreateCollectionNoWithCollection_abc s:shard2 r:core_node4 x:testCreateCollectionNoWithCollection_abc_shard2_replica_n3] o.a.s.u.UpdateLog Initializing UpdateLog: dataDir= defaultSyncLevel=FLUSH numRecordsToKeep=100 maxNumLogsToKeep=10 numVersionBuckets=65536
   [junit4]   2> 3353507 INFO  (qtp116246888-32625) [n:127.0.0.1:64548_solr c:testCreateCollectionNoWithCollection_abc s:shard2 r:core_node4 x:testCreateCollectionNoWithCollection_abc_shard2_replica_n3] o.a.s.u.CommitTracker Hard AutoCommit: if uncommitted for 15000ms; 
   [junit4]   2> 3353507 INFO  (qtp116246888-32625) [n:127.0.0.1:64548_solr c:testCreateCollectionNoWithCollection_abc s:shard2 r:core_node4 x:testCreateCollectionNoWithCollection_abc_shard2_replica_n3] o.a.s.u.CommitTracker Soft AutoCommit: disabled
   [junit4]   2> 3353508 INFO  (qtp116246888-32625) [n:127.0.0.1:64548_solr c:testCreateCollectionNoWithCollection_abc s:shard2 r:core_node4 x:testCreateCollectionNoWithCollection_abc_shard2_replica_n3] o.a.s.s.SolrIndexSearcher Opening [Searcher@5dce6793[testCreateCollectionNoWithCollection_abc_shard2_replica_n3] main]
   [junit4]   2> 3353516 INFO  (qtp116246888-32625) [n:127.0.0.1:64548_solr c:testCreateCollectionNoWithCollection_abc s:shard2 r:core_node4 x:testCreateCollectionNoWithCollection_abc_shard2_replica_n3] o.a.s.r.ManagedResourceStorage Configured ZooKeeperStorageIO with znodeBase: /configs/testCreateCollectionNoWithCollection_abc.AUTOCREATED
   [junit4]   2> 3353517 INFO  (qtp116246888-32625) [n:127.0.0.1:64548_solr c:testCreateCollectionNoWithCollection_abc s:shard2 r:core_node4 x:testCreateCollectionNoWithCollection_abc_shard2_replica_n3] o.a.s.r.ManagedResourceStorage Loaded null at path _rest_managed.json using ZooKeeperStorageIO:path=/configs/testCreateCollectionNoWithCollection_abc.AUTOCREATED
   [junit4]   2> 3353518 INFO  (qtp116246888-32625) [n:127.0.0.1:64548_solr c:testCreateCollectionNoWithCollection_abc s:shard2 r:core_node4 x:testCreateCollectionNoWithCollection_abc_shard2_replica_n3] o.a.s.s.ZkIndexSchemaReader Creating ZooKeeper watch for the managed schema at /configs/testCreateCollectionNoWithCollection_abc.AUTOCREATED/managed-schema
   [junit4]   2> 3353519 INFO  (qtp116246888-32625) [n:127.0.0.1:64548_solr c:testCreateCollectionNoWithCollection_abc s:shard2 r:core_node4 x:testCreateCollectionNoWithCollection_abc_shard2_replica_n3] o.a.s.s.ZkIndexSchemaReader Current schema version 0 is already the latest
   [junit4]   2> 3353520 INFO  (qtp116246888-32625) [n:127.0.0.1:64548_solr c:testCreateCollectionNoWithCollection_abc s:shard2 r:core_node4 x:testCreateCollectionNoWithCollection_abc_shard2_replica_n3] o.a.s.h.c.SpellCheckComponent Initializing spell checkers
   [junit4]   2> 3353520 INFO  (qtp116246888-32625) [n:127.0.0.1:64548_solr c:testCreateCollectionNoWithCollection_abc s:shard2 r:core_node4 x:testCreateCollectionNoWithCollection_abc_shard2_replica_n3] o.a.s.s.DirectSolrSpellChecker init: {name=default,field=_text_,classname=solr.DirectSolrSpellChecker,distanceMeasure=internal,accuracy=0.5,maxEdits=2,minPrefix=1,maxInspections=5,minQueryLength=4,maxQueryFrequency=0.01}
   [junit4]   2> 3353522 INFO  (qtp116246888-32625) [n:127.0.0.1:64548_solr c:testCreateCollectionNoWithCollection_abc s:shard2 r:core_node4 x:testCreateCollectionNoWithCollection_abc_shard2_replica_n3] o.a.s.h.ReplicationHandler Commits will be reserved for 10000ms.
   [junit4]   2> 3353522 INFO  (qtp116246888-32625) [n:127.0.0.1:64548_solr c:testCreateCollectionNoWithCollection_abc s:shard2 r:core_node4 x:testCreateCollectionNoWithCollection_abc_shard2_replica_n3] o.a.s.u.UpdateLog Could not find max version in index or recent updates, using new clock 1610472150759636992
   [junit4]   2> 3353522 INFO  (searcherExecutor-12602-thread-1-processing-n:127.0.0.1:64548_solr x:testCreateCollectionNoWithCollection_abc_shard2_replica_n3 c:testCreateCollectionNoWithCollection_abc s:shard2 r:core_node4) [n:127.0.0.1:64548_solr c:testCreateCollectionNoWithCollection_abc s:shard2 r:core_node4 x:testCreateCollectionNoWithCollection_abc_shard2_replica_n3] o.a.s.c.QuerySenderListener QuerySenderListener sending requests to Searcher@5dce6793[testCreateCollectionNoWithCollection_abc_shard2_replica_n3] main{ExitableDirectoryReader(UninvertingDirectoryReader())}
   [junit4]   2> 3353522 INFO  (searcherExecutor-12602-thread-1-processing-n:127.0.0.1:64548_solr x:testCreateCollectionNoWithCollection_abc_shard2_replica_n3 c:testCreateCollectionNoWithCollection_abc s:shard2 r:core_node4) [n:127.0.0.1:64548_solr c:testCreateCollectionNoWithCollection_abc s:shard2 r:core_node4 x:testCreateCollectionNoWithCollection_abc_shard2_replica_n3] o.a.s.c.QuerySenderListener QuerySenderListener done.
   [junit4]   2> 3353522 INFO  (searcherExecutor-12602-thread-1-processing-n:127.0.0.1:64548_solr x:testCreateCollectionNoWithCollection_abc_shard2_replica_n3 c:testCreateCollectionNoWithCollection_abc s:shard2 r:core_node4) [n:127.0.0.1:64548_solr c:testCreateCollectionNoWithCollection_abc s:shard2 r:core_node4 x:testCreateCollectionNoWithCollection_abc_shard2_replica_n3] o.a.s.h.c.SpellCheckComponent Loading spell index for spellchecker: default
   [junit4]   2> 3353523 INFO  (searcherExecutor-12602-thread-1-processing-n:127.0.0.1:64548_solr x:testCreateCollectionNoWithCollection_abc_shard2_replica_n3 c:testCreateCollectionNoWithCollection_abc s:shard2 r:core_node4) [n:127.0.0.1:64548_solr c:testCreateCollectionNoWithCollection_abc s:shard2 r:core_node4 x:testCreateCollectionNoWithCollection_abc_shard2_replica_n3] o.a.s.c.SolrCore [testCreateCollectionNoWithCollection_abc_shard2_replica_n3] Registered new searcher Searcher@5dce6793[testCreateCollectionNoWithCollection_abc_shard2_replica_n3] main{ExitableDirectoryReader(UninvertingDirectoryReader())}
   [junit4]   2> 3353528 INFO  (qtp602095531-32630) [n:127.0.0.1:58489_solr c:testCreateCollectionNoWithCollection_abc s:shard1 r:core_node2 x:testCreateCollectionNoWithCollection_abc_shard1_replica_n1] o.a.s.u.UpdateHandler Using UpdateLog implementation: org.apache.solr.update.UpdateLog
   [junit4]   2> 3353528 INFO  (qtp602095531-32630) [n:127.0.0.1:58489_solr c:testCreateCollectionNoWithCollection_abc s:shard1 r:core_node2 x:testCreateCollectionNoWithCollection_abc_shard1_replica_n1] o.a.s.u.UpdateLog Initializing UpdateLog: dataDir= defaultSyncLevel=FLUSH numRecordsToKeep=100 maxNumLogsToKeep=10 numVersionBuckets=65536
   [junit4]   2> 3353530 INFO  (qtp602095531-32630) [n:127.0.0.1:58489_solr c:testCreateCollectionNoWithCollection_abc s:shard1 r:core_node2 x:testCreateCollectionNoWithCollection_abc_shard1_replica_n1] o.a.s.u.CommitTracker Hard AutoCommit: if uncommitted for 15000ms; 
   [junit4]   2> 3353530 INFO  (qtp602095531-32630) [n:127.0.0.1:58489_solr c:testCreateCollectionNoWithCollection_abc s:shard1 r:core_node2 x:testCreateCollectionNoWithCollection_abc_shard1_replica_n1] o.a.s.u.CommitTracker Soft AutoCommit: disabled
   [junit4]   2> 3353531 INFO  (qtp602095531-32630) [n:127.0.0.1:58489_solr c:testCreateCollectionNoWithCollection_abc s:shard1 r:core_node2 x:testCreateCollectionNoWithCollection_abc_shard1_replica_n1] o.a.s.s.SolrIndexSearcher Opening [Searcher@711d005f[testCreateCollectionNoWithCollection_abc_shard1_replica_n1] main]
   [junit4]   2> 3353533 INFO  (qtp602095531-32630) [n:127.0.0.1:58489_solr c:testCreateCollectionNoWithCollection_abc s:shard1 r:core_node2 x:testCreateCollectionNoWithCollection_abc_shard1_replica_n1] o.a.s.r.ManagedResourceStorage Configured ZooKeeperStorageIO with znodeBase: /configs/testCreateCollectionNoWithCollection_abc.AUTOCREATED
   [junit4]   2> 3353534 INFO  (qtp602095531-32630) [n:127.0.0.1:58489_solr c:testCreateCollectionNoWithCollection_abc s:shard1 r:core_node2 x:testCreateCollectionNoWithCollection_abc_shard1_replica_n1] o.a.s.r.ManagedResourceStorage Loaded null at path _rest_managed.json using ZooKeeperStorageIO:path=/configs/testCreateCollectionNoWithCollection_abc.AUTOCREATED
   [junit4]   2> 3353534 INFO  (qtp602095531-32630) [n:127.0.0.1:58489_solr c:testCreateCollectionNoWithCollection_abc s:shard1 r:core_node2 x:testCreateCollectionNoWithCollection_abc_shard1_replica_n1] o.a.s.s.ZkIndexSchemaReader Creating ZooKeeper watch for the managed schema at /configs/testCreateCollectionNoWithCollection_abc.AUTOCREATED/managed-schema
   [junit4]   2> 3353535 INFO  (qtp602095531-32630) [n:127.0.0.1:58489_solr c:testCreateCollectionNoWithCollection_abc s:shard1 r:core_node2 x:testCreateCollectionNoWithCollection_abc_shard1_replica_n1] o.a.s.s.ZkIndexSchemaReader Current schema version 0 is already the latest
   [junit4]   2> 3353536 INFO  (qtp602095531-32630) [n:127.0.0.1:58489_solr c:testCreateCollectionNoWithCollection_abc s:shard1 r:core_node2 x:testCreateCollectionNoWithCollection_abc_shard1_replica_n1] o.a.s.h.c.SpellCheckComponent Initializing spell checkers
   [junit4]   2> 3353537 INFO  (qtp116246888-32625) [n:127.0.0.1:64548_solr c:testCreateCollectionNoWithCollection_abc s:shard2 

[...truncated too long message...]

ainCollection
   [junit4] OK      18.9s J1 | TestWithCollection.testDeleteWithCollection
   [junit4] OK      5.89s J1 | TestWithCollection.testMoveReplicaWithCollection
   [junit4] OK      6.57s J1 | TestWithCollection.testCreateCollection
   [junit4] OK      9.13s J1 | TestWithCollection.testAddReplicaSimple
   [junit4] OK      10.1s J1 | TestWithCollection.testAddReplicaWithPolicy
   [junit4] Completed [5/10] on J1 in 110.72s, 9 tests
   [junit4] 
   [junit4] Duplicate suite name used with XML reports: org.apache.solr.cloud.TestWithCollection. This may confuse tools that process XML reports. Set 'ignoreDuplicateSuites' to true to skip this message.
   [junit4] Suite: org.apache.solr.cloud.TestWithCollection
   [junit4] OK      2.95s J0 | TestWithCollection.testCreateCollectionNoWithCollection
   [junit4] OK      18.4s J0 | TestWithCollection.testMultipleWithCollections
   [junit4] OK      18.1s J0 | TestWithCollection.testNodeAdded
   [junit4] OK      11.8s J0 | TestWithCollection.testMoveReplicaMainCollection
   [junit4] OK      20.5s J0 | TestWithCollection.testDeleteWithCollection
   [junit4] OK      5.90s J0 | TestWithCollection.testMoveReplicaWithCollection
   [junit4] OK      6.58s J0 | TestWithCollection.testCreateCollection
   [junit4] OK      9.68s J0 | TestWithCollection.testAddReplicaSimple
   [junit4] OK      9.40s J0 | TestWithCollection.testAddReplicaWithPolicy
   [junit4] Completed [6/10] on J0 in 111.67s, 9 tests
   [junit4] 
   [junit4] Suite: org.apache.solr.cloud.TestWithCollection
   [junit4] OK      3.11s J1 | TestWithCollection.testCreateCollectionNoWithCollection
   [junit4] OK      18.4s J1 | TestWithCollection.testMultipleWithCollections
   [junit4] OK      18.0s J1 | TestWithCollection.testNodeAdded
   [junit4] OK      11.4s J1 | TestWithCollection.testMoveReplicaMainCollection
   [junit4] OK      20.9s J1 | TestWithCollection.testDeleteWithCollection
   [junit4] OK      5.75s J1 | TestWithCollection.testMoveReplicaWithCollection
   [junit4] OK      6.64s J1 | TestWithCollection.testCreateCollection
   [junit4] OK      9.26s J1 | TestWithCollection.testAddReplicaSimple
   [junit4] OK      9.62s J1 | TestWithCollection.testAddReplicaWithPolicy
   [junit4] Completed [7/10] on J1 in 110.67s, 9 tests
   [junit4] 
   [junit4] Suite: org.apache.solr.handler.RequestLoggingTest
   [junit4] OK      0.01s J1 | RequestLoggingTest.testLogBeforeExecuteWithCoreLogger
   [junit4] OK      0.01s J1 | RequestLoggingTest.testLogBeforeExecuteWithRequestLogger
   [junit4] Completed [8/10] on J1 in 1.14s, 2 tests
   [junit4] 
   [junit4] Suite: org.apache.solr.handler.RequestLoggingTest
   [junit4] OK      0.01s J1 | RequestLoggingTest.testLogBeforeExecuteWithCoreLogger
   [junit4] OK      0.01s J1 | RequestLoggingTest.testLogBeforeExecuteWithRequestLogger
   [junit4] Completed [9/10] on J1 in 1.01s, 2 tests
   [junit4] 
   [junit4] Suite: org.apache.solr.cloud.TestWithCollection
   [junit4] OK      3.00s J0 | TestWithCollection.testCreateCollectionNoWithCollection
   [junit4] OK      18.8s J0 | TestWithCollection.testMultipleWithCollections
   [junit4] OK      20.1s J0 | TestWithCollection.testNodeAdded
   [junit4] OK      11.2s J0 | TestWithCollection.testMoveReplicaMainCollection
   [junit4] OK      18.8s J0 | TestWithCollection.testDeleteWithCollection
   [junit4] OK      6.03s J0 | TestWithCollection.testMoveReplicaWithCollection
   [junit4] OK      6.73s J0 | TestWithCollection.testCreateCollection
   [junit4] OK      9.09s J0 | TestWithCollection.testAddReplicaSimple
   [junit4] OK      9.32s J0 | TestWithCollection.testAddReplicaWithPolicy
   [junit4] Completed [10/10] on J0 in 109.83s, 9 tests
   [junit4] 
   [junit4] JVM J0:     0.69 ..   338.81 =   338.12s
   [junit4] JVM J1:     0.69 ..   237.94 =   237.24s
   [junit4] Execution time total: 5 minutes 38 seconds
   [junit4] Tests summary: 10 suites, 55 tests
   [junit4] Could not remove temporary path: /export/home/jenkins/workspace/Lucene-Solr-master-Solaris/solr/build/solr-core/test/J1 (java.nio.file.DirectoryNotEmptyException: Remaining files: [/export/home/jenkins/workspace/Lucene-Solr-master-Solaris/solr/build/solr-core/test/J1/temp])
   [junit4] Could not remove temporary path: /export/home/jenkins/workspace/Lucene-Solr-master-Solaris/solr/build/solr-core/test/J0 (java.nio.file.DirectoryNotEmptyException: Remaining files: [/export/home/jenkins/workspace/Lucene-Solr-master-Solaris/solr/build/solr-core/test/J0/temp])
     [echo] 5 slowest tests:
[junit4:tophints] 609.51s | org.apache.solr.cloud.BasicDistributedZkTest
[junit4:tophints] 491.66s | org.apache.solr.cloud.api.collections.ShardSplitTest
[junit4:tophints] 456.66s | org.apache.solr.cloud.cdcr.CdcrWithNodesRestartsTest
[junit4:tophints] 282.18s | org.apache.solr.cloud.cdcr.CdcrOpsAndBoundariesTest
[junit4:tophints] 179.39s | org.apache.solr.cloud.api.collections.CollectionsAPIDistributedZkTest

-check-totals:

test-nocompile:

BUILD SUCCESSFUL
Total time: 5 minutes 41 seconds
[repro] Failures:
[repro]   0/5 failed: org.apache.solr.cloud.TestWithCollection
[repro]   0/5 failed: org.apache.solr.handler.RequestLoggingTest
[repro] Exiting with code 0
+ mv lucene/build lucene/build.repro
+ mv solr/build solr/build.repro
+ mv lucene/build.orig lucene/build
+ mv solr/build.orig solr/build
Archiving artifacts
Setting ANT_1_8_2_HOME=/export/home/jenkins/tools/hudson.tasks.Ant_AntInstallation/ANT_1.8.2
java.lang.InterruptedException: no matches found within 10000
	at hudson.FilePath$ValidateAntFileMask.hasMatch(FilePath.java:2846)
	at hudson.FilePath$ValidateAntFileMask.invoke(FilePath.java:2725)
	at hudson.FilePath$ValidateAntFileMask.invoke(FilePath.java:2706)
	at hudson.FilePath$FileCallableWrapper.call(FilePath.java:3085)
Also:   hudson.remoting.Channel$CallSiteStackTrace: Remote call to Solaris VBOX
		at hudson.remoting.Channel.attachCallSiteStackTrace(Channel.java:1741)
		at hudson.remoting.UserRequest$ExceptionResponse.retrieve(UserRequest.java:357)
		at hudson.remoting.Channel.call(Channel.java:955)
		at hudson.FilePath.act(FilePath.java:1071)
		at hudson.FilePath.act(FilePath.java:1060)
		at hudson.FilePath.validateAntFileMask(FilePath.java:2704)
		at hudson.tasks.ArtifactArchiver.perform(ArtifactArchiver.java:243)
		at hudson.tasks.BuildStepCompatibilityLayer.perform(BuildStepCompatibilityLayer.java:81)
		at hudson.tasks.BuildStepMonitor$1.perform(BuildStepMonitor.java:20)
		at hudson.model.AbstractBuild$AbstractBuildExecution.perform(AbstractBuild.java:744)
		at hudson.model.AbstractBuild$AbstractBuildExecution.performAllBuildSteps(AbstractBuild.java:690)
		at hudson.model.Build$BuildExecution.post2(Build.java:186)
		at hudson.model.AbstractBuild$AbstractBuildExecution.post(AbstractBuild.java:635)
		at hudson.model.Run.execute(Run.java:1840)
		at hudson.model.FreeStyleBuild.run(FreeStyleBuild.java:43)
		at hudson.model.ResourceController.execute(ResourceController.java:97)
		at hudson.model.Executor.run(Executor.java:429)
Caused: hudson.FilePath$TunneledInterruptedException
	at hudson.FilePath$FileCallableWrapper.call(FilePath.java:3087)
	at hudson.remoting.UserRequest.perform(UserRequest.java:212)
	at hudson.remoting.UserRequest.perform(UserRequest.java:54)
	at hudson.remoting.Request$2.run(Request.java:369)
	at hudson.remoting.InterceptingExecutorService$1.call(InterceptingExecutorService.java:72)
	at java.util.concurrent.FutureTask.run(FutureTask.java:266)
	at java.util.concurrent.ThreadPoolExecutor.runWorker(ThreadPoolExecutor.java:1149)
	at java.util.concurrent.ThreadPoolExecutor$Worker.run(ThreadPoolExecutor.java:624)
	at java.lang.Thread.run(Thread.java:748)
Caused: java.lang.InterruptedException: java.lang.InterruptedException: no matches found within 10000
	at hudson.FilePath.act(FilePath.java:1073)
	at hudson.FilePath.act(FilePath.java:1060)
	at hudson.FilePath.validateAntFileMask(FilePath.java:2704)
	at hudson.tasks.ArtifactArchiver.perform(ArtifactArchiver.java:243)
	at hudson.tasks.BuildStepCompatibilityLayer.perform(BuildStepCompatibilityLayer.java:81)
	at hudson.tasks.BuildStepMonitor$1.perform(BuildStepMonitor.java:20)
	at hudson.model.AbstractBuild$AbstractBuildExecution.perform(AbstractBuild.java:744)
	at hudson.model.AbstractBuild$AbstractBuildExecution.performAllBuildSteps(AbstractBuild.java:690)
	at hudson.model.Build$BuildExecution.post2(Build.java:186)
	at hudson.model.AbstractBuild$AbstractBuildExecution.post(AbstractBuild.java:635)
	at hudson.model.Run.execute(Run.java:1840)
	at hudson.model.FreeStyleBuild.run(FreeStyleBuild.java:43)
	at hudson.model.ResourceController.execute(ResourceController.java:97)
	at hudson.model.Executor.run(Executor.java:429)
No artifacts found that match the file pattern "**/*.events,heapdumps/**,**/*_pid*.log". Configuration error?
[WARNINGS] Parsing warnings in console log with parser Java Compiler (javac)
Setting ANT_1_8_2_HOME=/export/home/jenkins/tools/hudson.tasks.Ant_AntInstallation/ANT_1.8.2
Setting ANT_1_8_2_HOME=/export/home/jenkins/tools/hudson.tasks.Ant_AntInstallation/ANT_1.8.2
<Git Blamer> Using GitBlamer to create author and commit information for all warnings.
<Git Blamer> GIT_COMMIT=d93c46ea94dec612aa53e37d119fe34b5e8a828e, workspace=/export/home/jenkins/workspace/Lucene-Solr-master-Solaris
[WARNINGS] Computing warning deltas based on reference build #2039
Recording test results
Setting ANT_1_8_2_HOME=/export/home/jenkins/tools/hudson.tasks.Ant_AntInstallation/ANT_1.8.2
Build step 'Publish JUnit test result report' changed build result to UNSTABLE
Email was triggered for: Unstable (Test Failures)
Sending email for trigger: Unstable (Test Failures)
Setting ANT_1_8_2_HOME=/export/home/jenkins/tools/hudson.tasks.Ant_AntInstallation/ANT_1.8.2
Setting ANT_1_8_2_HOME=/export/home/jenkins/tools/hudson.tasks.Ant_AntInstallation/ANT_1.8.2
Setting ANT_1_8_2_HOME=/export/home/jenkins/tools/hudson.tasks.Ant_AntInstallation/ANT_1.8.2
Setting ANT_1_8_2_HOME=/export/home/jenkins/tools/hudson.tasks.Ant_AntInstallation/ANT_1.8.2

Mime
View raw message