lucene-dev mailing list archives

Site index · List index
Message view « Date » · « Thread »
Top « Date » · « Thread »
From Apache Jenkins Server <jenk...@builds.apache.org>
Subject [JENKINS] Lucene-Solr-BadApples-Tests-7.x - Build # 148 - Unstable
Date Mon, 03 Sep 2018 12:24:20 GMT
Build: https://builds.apache.org/job/Lucene-Solr-BadApples-Tests-7.x/148/

5 tests failed.
FAILED:  junit.framework.TestSuite.org.apache.solr.update.processor.IgnoreLargeDocumentProcessorFactoryTest

Error Message:
1 thread leaked from SUITE scope at org.apache.solr.update.processor.IgnoreLargeDocumentProcessorFactoryTest:     1) Thread[id=13, name=Log4j2-TF-1-AsyncLoggerConfig--1, state=TIMED_WAITING, group=TGRP-IgnoreLargeDocumentProcessorFactoryTest]         at sun.misc.Unsafe.park(Native Method)         at java.util.concurrent.locks.LockSupport.parkNanos(LockSupport.java:215)         at java.util.concurrent.locks.AbstractQueuedSynchronizer$ConditionObject.awaitNanos(AbstractQueuedSynchronizer.java:2078)         at com.lmax.disruptor.TimeoutBlockingWaitStrategy.waitFor(TimeoutBlockingWaitStrategy.java:38)         at com.lmax.disruptor.ProcessingSequenceBarrier.waitFor(ProcessingSequenceBarrier.java:56)         at com.lmax.disruptor.BatchEventProcessor.run(BatchEventProcessor.java:128)         at java.lang.Thread.run(Thread.java:748)

Stack Trace:
com.carrotsearch.randomizedtesting.ThreadLeakError: 1 thread leaked from SUITE scope at org.apache.solr.update.processor.IgnoreLargeDocumentProcessorFactoryTest: 
   1) Thread[id=13, name=Log4j2-TF-1-AsyncLoggerConfig--1, state=TIMED_WAITING, group=TGRP-IgnoreLargeDocumentProcessorFactoryTest]
        at sun.misc.Unsafe.park(Native Method)
        at java.util.concurrent.locks.LockSupport.parkNanos(LockSupport.java:215)
        at java.util.concurrent.locks.AbstractQueuedSynchronizer$ConditionObject.awaitNanos(AbstractQueuedSynchronizer.java:2078)
        at com.lmax.disruptor.TimeoutBlockingWaitStrategy.waitFor(TimeoutBlockingWaitStrategy.java:38)
        at com.lmax.disruptor.ProcessingSequenceBarrier.waitFor(ProcessingSequenceBarrier.java:56)
        at com.lmax.disruptor.BatchEventProcessor.run(BatchEventProcessor.java:128)
        at java.lang.Thread.run(Thread.java:748)
	at __randomizedtesting.SeedInfo.seed([DB01A99458F44E82]:0)


FAILED:  junit.framework.TestSuite.org.apache.solr.update.processor.IgnoreLargeDocumentProcessorFactoryTest

Error Message:
There are still zombie threads that couldn't be terminated:    1) Thread[id=13, name=Log4j2-TF-1-AsyncLoggerConfig--1, state=TIMED_WAITING, group=TGRP-IgnoreLargeDocumentProcessorFactoryTest]         at sun.misc.Unsafe.park(Native Method)         at java.util.concurrent.locks.LockSupport.parkNanos(LockSupport.java:215)         at java.util.concurrent.locks.AbstractQueuedSynchronizer$ConditionObject.awaitNanos(AbstractQueuedSynchronizer.java:2078)         at com.lmax.disruptor.TimeoutBlockingWaitStrategy.waitFor(TimeoutBlockingWaitStrategy.java:38)         at com.lmax.disruptor.ProcessingSequenceBarrier.waitFor(ProcessingSequenceBarrier.java:56)         at com.lmax.disruptor.BatchEventProcessor.run(BatchEventProcessor.java:128)         at java.lang.Thread.run(Thread.java:748)

Stack Trace:
com.carrotsearch.randomizedtesting.ThreadLeakError: There are still zombie threads that couldn't be terminated:
   1) Thread[id=13, name=Log4j2-TF-1-AsyncLoggerConfig--1, state=TIMED_WAITING, group=TGRP-IgnoreLargeDocumentProcessorFactoryTest]
        at sun.misc.Unsafe.park(Native Method)
        at java.util.concurrent.locks.LockSupport.parkNanos(LockSupport.java:215)
        at java.util.concurrent.locks.AbstractQueuedSynchronizer$ConditionObject.awaitNanos(AbstractQueuedSynchronizer.java:2078)
        at com.lmax.disruptor.TimeoutBlockingWaitStrategy.waitFor(TimeoutBlockingWaitStrategy.java:38)
        at com.lmax.disruptor.ProcessingSequenceBarrier.waitFor(ProcessingSequenceBarrier.java:56)
        at com.lmax.disruptor.BatchEventProcessor.run(BatchEventProcessor.java:128)
        at java.lang.Thread.run(Thread.java:748)
	at __randomizedtesting.SeedInfo.seed([DB01A99458F44E82]:0)


FAILED:  org.apache.solr.util.OrderedExecutorTest.testLockWhenQueueIsFull

Error Message:


Stack Trace:
java.lang.AssertionError
	at __randomizedtesting.SeedInfo.seed([DB01A99458F44E82:F2FA78B2DF9FBBA4]:0)
	at org.junit.Assert.fail(Assert.java:92)
	at org.junit.Assert.assertTrue(Assert.java:43)
	at org.junit.Assert.assertTrue(Assert.java:54)
	at org.apache.solr.util.OrderedExecutorTest.testLockWhenQueueIsFull(OrderedExecutorTest.java:54)
	at sun.reflect.NativeMethodAccessorImpl.invoke0(Native Method)
	at sun.reflect.NativeMethodAccessorImpl.invoke(NativeMethodAccessorImpl.java:62)
	at sun.reflect.DelegatingMethodAccessorImpl.invoke(DelegatingMethodAccessorImpl.java:43)
	at java.lang.reflect.Method.invoke(Method.java:498)
	at com.carrotsearch.randomizedtesting.RandomizedRunner.invoke(RandomizedRunner.java:1737)
	at com.carrotsearch.randomizedtesting.RandomizedRunner$8.evaluate(RandomizedRunner.java:934)
	at com.carrotsearch.randomizedtesting.RandomizedRunner$9.evaluate(RandomizedRunner.java:970)
	at com.carrotsearch.randomizedtesting.RandomizedRunner$10.evaluate(RandomizedRunner.java:984)
	at org.apache.lucene.util.TestRuleSetupTeardownChained$1.evaluate(TestRuleSetupTeardownChained.java:49)
	at org.apache.lucene.util.AbstractBeforeAfterRule$1.evaluate(AbstractBeforeAfterRule.java:45)
	at org.apache.lucene.util.TestRuleThreadAndTestName$1.evaluate(TestRuleThreadAndTestName.java:48)
	at org.apache.lucene.util.TestRuleIgnoreAfterMaxFailures$1.evaluate(TestRuleIgnoreAfterMaxFailures.java:64)
	at org.apache.lucene.util.TestRuleMarkFailure$1.evaluate(TestRuleMarkFailure.java:47)
	at com.carrotsearch.randomizedtesting.rules.StatementAdapter.evaluate(StatementAdapter.java:36)
	at com.carrotsearch.randomizedtesting.ThreadLeakControl$StatementRunner.run(ThreadLeakControl.java:368)
	at com.carrotsearch.randomizedtesting.ThreadLeakControl.forkTimeoutingTask(ThreadLeakControl.java:817)
	at com.carrotsearch.randomizedtesting.ThreadLeakControl$3.evaluate(ThreadLeakControl.java:468)
	at com.carrotsearch.randomizedtesting.RandomizedRunner.runSingleTest(RandomizedRunner.java:943)
	at com.carrotsearch.randomizedtesting.RandomizedRunner$5.evaluate(RandomizedRunner.java:829)
	at com.carrotsearch.randomizedtesting.RandomizedRunner$6.evaluate(RandomizedRunner.java:879)
	at com.carrotsearch.randomizedtesting.RandomizedRunner$7.evaluate(RandomizedRunner.java:890)
	at org.apache.lucene.util.AbstractBeforeAfterRule$1.evaluate(AbstractBeforeAfterRule.java:45)
	at com.carrotsearch.randomizedtesting.rules.StatementAdapter.evaluate(StatementAdapter.java:36)
	at org.apache.lucene.util.TestRuleStoreClassName$1.evaluate(TestRuleStoreClassName.java:41)
	at com.carrotsearch.randomizedtesting.rules.NoShadowingOrOverridesOnMethodsRule$1.evaluate(NoShadowingOrOverridesOnMethodsRule.java:40)
	at com.carrotsearch.randomizedtesting.rules.NoShadowingOrOverridesOnMethodsRule$1.evaluate(NoShadowingOrOverridesOnMethodsRule.java:40)
	at com.carrotsearch.randomizedtesting.rules.StatementAdapter.evaluate(StatementAdapter.java:36)
	at com.carrotsearch.randomizedtesting.rules.StatementAdapter.evaluate(StatementAdapter.java:36)
	at com.carrotsearch.randomizedtesting.rules.StatementAdapter.evaluate(StatementAdapter.java:36)
	at org.apache.lucene.util.TestRuleAssertionsRequired$1.evaluate(TestRuleAssertionsRequired.java:53)
	at org.apache.lucene.util.TestRuleMarkFailure$1.evaluate(TestRuleMarkFailure.java:47)
	at org.apache.lucene.util.TestRuleIgnoreAfterMaxFailures$1.evaluate(TestRuleIgnoreAfterMaxFailures.java:64)
	at org.apache.lucene.util.TestRuleIgnoreTestSuites$1.evaluate(TestRuleIgnoreTestSuites.java:54)
	at com.carrotsearch.randomizedtesting.rules.StatementAdapter.evaluate(StatementAdapter.java:36)
	at com.carrotsearch.randomizedtesting.ThreadLeakControl$StatementRunner.run(ThreadLeakControl.java:368)
	at java.lang.Thread.run(Thread.java:748)


FAILED:  junit.framework.TestSuite.org.apache.solr.util.OrderedExecutorTest

Error Message:
1 thread leaked from SUITE scope at org.apache.solr.util.OrderedExecutorTest:     1) Thread[id=706, name=testLockWhenQueueIsFull-203-thread-1, state=TIMED_WAITING, group=TGRP-OrderedExecutorTest]         at sun.misc.Unsafe.park(Native Method)         at java.util.concurrent.locks.LockSupport.parkNanos(LockSupport.java:215)         at java.util.concurrent.SynchronousQueue$TransferStack.awaitFulfill(SynchronousQueue.java:460)         at java.util.concurrent.SynchronousQueue$TransferStack.transfer(SynchronousQueue.java:362)         at java.util.concurrent.SynchronousQueue.poll(SynchronousQueue.java:941)         at java.util.concurrent.ThreadPoolExecutor.getTask(ThreadPoolExecutor.java:1073)         at java.util.concurrent.ThreadPoolExecutor.runWorker(ThreadPoolExecutor.java:1134)         at java.util.concurrent.ThreadPoolExecutor$Worker.run(ThreadPoolExecutor.java:624)         at java.lang.Thread.run(Thread.java:748)

Stack Trace:
com.carrotsearch.randomizedtesting.ThreadLeakError: 1 thread leaked from SUITE scope at org.apache.solr.util.OrderedExecutorTest: 
   1) Thread[id=706, name=testLockWhenQueueIsFull-203-thread-1, state=TIMED_WAITING, group=TGRP-OrderedExecutorTest]
        at sun.misc.Unsafe.park(Native Method)
        at java.util.concurrent.locks.LockSupport.parkNanos(LockSupport.java:215)
        at java.util.concurrent.SynchronousQueue$TransferStack.awaitFulfill(SynchronousQueue.java:460)
        at java.util.concurrent.SynchronousQueue$TransferStack.transfer(SynchronousQueue.java:362)
        at java.util.concurrent.SynchronousQueue.poll(SynchronousQueue.java:941)
        at java.util.concurrent.ThreadPoolExecutor.getTask(ThreadPoolExecutor.java:1073)
        at java.util.concurrent.ThreadPoolExecutor.runWorker(ThreadPoolExecutor.java:1134)
        at java.util.concurrent.ThreadPoolExecutor$Worker.run(ThreadPoolExecutor.java:624)
        at java.lang.Thread.run(Thread.java:748)
	at __randomizedtesting.SeedInfo.seed([DB01A99458F44E82]:0)


FAILED:  junit.framework.TestSuite.org.apache.solr.util.OrderedExecutorTest

Error Message:
There are still zombie threads that couldn't be terminated:    1) Thread[id=706, name=testLockWhenQueueIsFull-203-thread-1, state=TIMED_WAITING, group=TGRP-OrderedExecutorTest]         at sun.misc.Unsafe.park(Native Method)         at java.util.concurrent.locks.LockSupport.parkNanos(LockSupport.java:215)         at java.util.concurrent.SynchronousQueue$TransferStack.awaitFulfill(SynchronousQueue.java:460)         at java.util.concurrent.SynchronousQueue$TransferStack.transfer(SynchronousQueue.java:362)         at java.util.concurrent.SynchronousQueue.poll(SynchronousQueue.java:941)         at java.util.concurrent.ThreadPoolExecutor.getTask(ThreadPoolExecutor.java:1073)         at java.util.concurrent.ThreadPoolExecutor.runWorker(ThreadPoolExecutor.java:1134)         at java.util.concurrent.ThreadPoolExecutor$Worker.run(ThreadPoolExecutor.java:624)         at java.lang.Thread.run(Thread.java:748)

Stack Trace:
com.carrotsearch.randomizedtesting.ThreadLeakError: There are still zombie threads that couldn't be terminated:
   1) Thread[id=706, name=testLockWhenQueueIsFull-203-thread-1, state=TIMED_WAITING, group=TGRP-OrderedExecutorTest]
        at sun.misc.Unsafe.park(Native Method)
        at java.util.concurrent.locks.LockSupport.parkNanos(LockSupport.java:215)
        at java.util.concurrent.SynchronousQueue$TransferStack.awaitFulfill(SynchronousQueue.java:460)
        at java.util.concurrent.SynchronousQueue$TransferStack.transfer(SynchronousQueue.java:362)
        at java.util.concurrent.SynchronousQueue.poll(SynchronousQueue.java:941)
        at java.util.concurrent.ThreadPoolExecutor.getTask(ThreadPoolExecutor.java:1073)
        at java.util.concurrent.ThreadPoolExecutor.runWorker(ThreadPoolExecutor.java:1134)
        at java.util.concurrent.ThreadPoolExecutor$Worker.run(ThreadPoolExecutor.java:624)
        at java.lang.Thread.run(Thread.java:748)
	at __randomizedtesting.SeedInfo.seed([DB01A99458F44E82]:0)




Build Log:
[...truncated 12381 lines...]
   [junit4] Suite: org.apache.solr.update.processor.IgnoreLargeDocumentProcessorFactoryTest
   [junit4]   2> Sep 03, 2018 11:39:48 AM com.carrotsearch.randomizedtesting.ThreadLeakControl checkThreadLeaks
   [junit4]   2> WARNING: Will linger awaiting termination of 1 leaked thread(s).
   [junit4]   2> Sep 03, 2018 11:40:09 AM com.carrotsearch.randomizedtesting.ThreadLeakControl checkThreadLeaks
   [junit4]   2> SEVERE: 1 thread leaked from SUITE scope at org.apache.solr.update.processor.IgnoreLargeDocumentProcessorFactoryTest: 
   [junit4]   2>    1) Thread[id=13, name=Log4j2-TF-1-AsyncLoggerConfig--1, state=TIMED_WAITING, group=TGRP-IgnoreLargeDocumentProcessorFactoryTest]
   [junit4]   2>         at sun.misc.Unsafe.park(Native Method)
   [junit4]   2>         at java.util.concurrent.locks.LockSupport.parkNanos(LockSupport.java:215)
   [junit4]   2>         at java.util.concurrent.locks.AbstractQueuedSynchronizer$ConditionObject.awaitNanos(AbstractQueuedSynchronizer.java:2078)
   [junit4]   2>         at com.lmax.disruptor.TimeoutBlockingWaitStrategy.waitFor(TimeoutBlockingWaitStrategy.java:38)
   [junit4]   2>         at com.lmax.disruptor.ProcessingSequenceBarrier.waitFor(ProcessingSequenceBarrier.java:56)
   [junit4]   2>         at com.lmax.disruptor.BatchEventProcessor.run(BatchEventProcessor.java:128)
   [junit4]   2>         at java.lang.Thread.run(Thread.java:748)
   [junit4]   2> Sep 03, 2018 11:40:09 AM com.carrotsearch.randomizedtesting.ThreadLeakControl tryToInterruptAll
   [junit4]   2> INFO: Starting to interrupt leaked threads:
   [junit4]   2>    1) Thread[id=13, name=Log4j2-TF-1-AsyncLoggerConfig--1, state=TIMED_WAITING, group=TGRP-IgnoreLargeDocumentProcessorFactoryTest]
   [junit4]   2> AsyncLogger error handling event seq=0, value='null':
   [junit4]   2> java.lang.InterruptedException
   [junit4]   2> 	at java.util.concurrent.locks.AbstractQueuedSynchronizer$ConditionObject.reportInterruptAfterWait(AbstractQueuedSynchronizer.java:2014)
   [junit4]   2> 	at java.util.concurrent.locks.AbstractQueuedSynchronizer$ConditionObject.awaitNanos(AbstractQueuedSynchronizer.java:2088)
   [junit4]   2> 	at com.lmax.disruptor.TimeoutBlockingWaitStrategy.waitFor(TimeoutBlockingWaitStrategy.java:38)
   [junit4]   2> 	at com.lmax.disruptor.ProcessingSequenceBarrier.waitFor(ProcessingSequenceBarrier.java:56)
   [junit4]   2> 	at com.lmax.disruptor.BatchEventProcessor.run(BatchEventProcessor.java:128)
   [junit4]   2> 	at java.lang.Thread.run(Thread.java:748)
   [junit4]   2> AsyncLogger error handling event seq=1, value='null':
   [junit4]   2> java.lang.InterruptedException
   [junit4]   2> 	at java.util.concurrent.locks.AbstractQueuedSynchronizer$ConditionObject.reportInterruptAfterWait(AbstractQueuedSynchronizer.java:2014)
   [junit4]   2> 	at java.util.concurrent.locks.AbstractQueuedSynchronizer$ConditionObject.awaitNanos(AbstractQueuedSynchronizer.java:2088)
   [junit4]   2> 	at com.lmax.disruptor.TimeoutBlockingWaitStrategy.waitFor(TimeoutBlockingWaitStrategy.java:38)
   [junit4]   2> 	at com.lmax.disruptor.ProcessingSequenceBarrier.waitFor(ProcessingSequenceBarrier.java:56)
   [junit4]   2> 	at com.lmax.disruptor.BatchEventProcessor.run(BatchEventProcessor.java:128)
   [junit4]   2> 	at java.lang.Thread.run(Thread.java:748)
   [junit4]   2> AsyncLogger error handling event seq=2, value='null':
   [junit4]   2> java.lang.InterruptedException
   [junit4]   2> 	at java.util.concurrent.locks.AbstractQueuedSynchronizer$ConditionObject.reportInterruptAfterWait(AbstractQueuedSynchronizer.java:2014)
   [junit4]   2> 	at java.util.concurrent.locks.AbstractQueuedSynchronizer$ConditionObject.awaitNanos(AbstractQueuedSynchronizer.java:2088)
   [junit4]   2> 	at com.lmax.disruptor.TimeoutBlockingWaitStrategy.waitFor(TimeoutBlockingWaitStrategy.java:38)
   [junit4]   2> 	at com.lmax.disruptor.ProcessingSequenceBarrier.waitFor(ProcessingSequenceBarrier.java:56)
   [junit4]   2> 	at com.lmax.disruptor.BatchEventProcessor.run(BatchEventProcessor.java:128)
   [junit4]   2> 	at java.lang.Thread.run(Thread.java:748)
   [junit4]   2> AsyncLogger error handling event seq=3, value='null':
   [junit4]   2> java.lang.InterruptedException
   [junit4]   2> 	at java.util.concurrent.locks.AbstractQueuedSynchronizer$ConditionObject.reportInterruptAfterWait(AbstractQueuedSynchronizer.java:2014)
   [junit4]   2> 	at java.util.concurrent.locks.AbstractQueuedSynchronizer$ConditionObject.awaitNanos(AbstractQueuedSynchronizer.java:2088)
   [junit4]   2> 	at com.lmax.disruptor.TimeoutBlockingWaitStrategy.waitFor(TimeoutBlockingWaitStrategy.java:38)
   [junit4]   2> 	at com.lmax.disruptor.ProcessingSequenceBarrier.waitFor(ProcessingSequenceBarrier.java:56)
   [junit4]   2> 	at com.lmax.disruptor.BatchEventProcessor.run(BatchEventProcessor.java:128)
   [junit4]   2> 	at java.lang.Thread.run(Thread.java:748)
   [junit4]   2> AsyncLogger error handling event seq=4, value='null':
   [junit4]   2> java.lang.InterruptedException
   [junit4]   2> 	at java.util.concurrent.locks.AbstractQueuedSynchronizer$ConditionObject.reportInterruptAfterWait(AbstractQueuedSynchronizer.java:2014)
   [junit4]   2> 	at java.util.concurrent.locks.AbstractQueuedSynchronizer$ConditionObject.awaitNanos(AbstractQueuedSynchronizer.java:2088)
   [junit4]   2> 	at com.lmax.disruptor.TimeoutBlockingWaitStrategy.waitFor(TimeoutBlockingWaitStrategy.java:38)
   [junit4]   2> 	at com.lmax.disruptor.ProcessingSequenceBarrier.waitFor(ProcessingSequenceBarrier.java:56)
   [junit4]   2> 	at com.lmax.disruptor.BatchEventProcessor.run(BatchEventProcessor.java:128)
   [junit4]   2> 	at java.lang.Thread.run(Thread.java:748)
   [junit4]   2> AsyncLogger error handling event seq=5, value='null':
   [junit4]   2> java.lang.InterruptedException
   [junit4]   2> 	at java.util.concurrent.locks.AbstractQueuedSynchronizer$ConditionObject.reportInterruptAfterWait(AbstractQueuedSynchronizer.java:2014)
   [junit4]   2> 	at java.util.concurrent.locks.AbstractQueuedSynchronizer$ConditionObject.awaitNanos(AbstractQueuedSynchronizer.java:2088)
   [junit4]   2> 	at com.lmax.disruptor.TimeoutBlockingWaitStrategy.waitFor(TimeoutBlockingWaitStrategy.java:38)
   [junit4]   2> 	at com.lmax.disruptor.ProcessingSequenceBarrier.waitFor(ProcessingSequenceBarrier.java:56)
   [junit4]   2> 	at com.lmax.disruptor.BatchEventProcessor.run(BatchEventProcessor.java:128)
   [junit4]   2> 	at java.lang.Thread.run(Thread.java:748)
   [junit4]   2> Sep 03, 2018 11:40:12 AM com.carrotsearch.randomizedtesting.ThreadLeakControl tryToInterruptAll
   [junit4]   2> SEVERE: There are still zombie threads that couldn't be terminated:
   [junit4]   2>    1) Thread[id=13, name=Log4j2-TF-1-AsyncLoggerConfig--1, state=TIMED_WAITING, group=TGRP-IgnoreLargeDocumentProcessorFactoryTest]
   [junit4]   2>         at sun.misc.Unsafe.park(Native Method)
   [junit4]   2>         at java.util.concurrent.locks.LockSupport.parkNanos(LockSupport.java:215)
   [junit4]   2>         at java.util.concurrent.locks.AbstractQueuedSynchronizer$ConditionObject.awaitNanos(AbstractQueuedSynchronizer.java:2078)
   [junit4]   2>         at com.lmax.disruptor.TimeoutBlockingWaitStrategy.waitFor(TimeoutBlockingWaitStrategy.java:38)
   [junit4]   2>         at com.lmax.disruptor.ProcessingSequenceBarrier.waitFor(ProcessingSequenceBarrier.java:56)
   [junit4]   2>         at com.lmax.disruptor.BatchEventProcessor.run(BatchEventProcessor.java:128)
   [junit4]   2>         at java.lang.Thread.run(Thread.java:748)
   [junit4]   2> NOTE: test params are: codec=Asserting(Lucene70): {}, docValues:{}, maxPointsInLeafNode=1079, maxMBSortInHeap=7.640048296024601, sim=RandomSimilarity(queryNorm=false): {}, locale=zh-SG, timezone=America/Dawson_Creek
   [junit4]   2> NOTE: Linux 4.4.0-130-generic amd64/Oracle Corporation 1.8.0_172 (64-bit)/cpus=4,threads=2,free=234659568,total=319291392
   [junit4]   2> NOTE: All tests run in this JVM: [IgnoreLargeDocumentProcessorFactoryTest]
   [junit4]   2> NOTE: reproduce with: ant test  -Dtestcase=IgnoreLargeDocumentProcessorFactoryTest -Dtests.seed=DB01A99458F44E82 -Dtests.multiplier=2 -Dtests.slow=true -Dtests.badapples=true -Dtests.locale=zh-SG -Dtests.timezone=America/Dawson_Creek -Dtests.asserts=true -Dtests.file.encoding=UTF-8
   [junit4] ERROR   0.00s J2 | IgnoreLargeDocumentProcessorFactoryTest (suite) <<<
   [junit4]    > Throwable #1: com.carrotsearch.randomizedtesting.ThreadLeakError: 1 thread leaked from SUITE scope at org.apache.solr.update.processor.IgnoreLargeDocumentProcessorFactoryTest: 
   [junit4]    >    1) Thread[id=13, name=Log4j2-TF-1-AsyncLoggerConfig--1, state=TIMED_WAITING, group=TGRP-IgnoreLargeDocumentProcessorFactoryTest]
   [junit4]    >         at sun.misc.Unsafe.park(Native Method)
   [junit4]    >         at java.util.concurrent.locks.LockSupport.parkNanos(LockSupport.java:215)
   [junit4]    >         at java.util.concurrent.locks.AbstractQueuedSynchronizer$ConditionObject.awaitNanos(AbstractQueuedSynchronizer.java:2078)
   [junit4]    >         at com.lmax.disruptor.TimeoutBlockingWaitStrategy.waitFor(TimeoutBlockingWaitStrategy.java:38)
   [junit4]    >         at com.lmax.disruptor.ProcessingSequenceBarrier.waitFor(ProcessingSequenceBarrier.java:56)
   [junit4]    >         at com.lmax.disruptor.BatchEventProcessor.run(BatchEventProcessor.java:128)
   [junit4]    >         at java.lang.Thread.run(Thread.java:748)
   [junit4]    > 	at __randomizedtesting.SeedInfo.seed([DB01A99458F44E82]:0)Throwable #2: com.carrotsearch.randomizedtesting.ThreadLeakError: There are still zombie threads that couldn't be terminated:
   [junit4]    >    1) Thread[id=13, name=Log4j2-TF-1-AsyncLoggerConfig--1, state=TIMED_WAITING, group=TGRP-IgnoreLargeDocumentProcessorFactoryTest]
   [junit4]    >         at sun.misc.Unsafe.park(Native Method)
   [junit4]    >         at java.util.concurrent.locks.LockSupport.parkNanos(LockSupport.java:215)
   [junit4]    >         at java.util.concurrent.locks.AbstractQueuedSynchronizer$ConditionObject.awaitNanos(AbstractQueuedSynchronizer.java:2078)
   [junit4]    >         at com.lmax.disruptor.TimeoutBlockingWaitStrategy.waitFor(TimeoutBlockingWaitStrategy.java:38)
   [junit4]    >         at com.lmax.disruptor.ProcessingSequenceBarrier.waitFor(ProcessingSequenceBarrier.java:56)
   [junit4]    >         at com.lmax.disruptor.BatchEventProcessor.run(BatchEventProcessor.java:128)
   [junit4]    >         at java.lang.Thread.run(Thread.java:748)
   [junit4]    > 	at __randomizedtesting.SeedInfo.seed([DB01A99458F44E82]:0)
   [junit4] Completed [11/831 (1!)] on J2 in 25.33s, 4 tests, 2 errors <<< FAILURES!

[...truncated 1117 lines...]
   [junit4] Suite: org.apache.solr.util.OrderedExecutorTest
   [junit4]   2> NOTE: reproduce with: ant test  -Dtestcase=OrderedExecutorTest -Dtests.method=testLockWhenQueueIsFull -Dtests.seed=DB01A99458F44E82 -Dtests.multiplier=2 -Dtests.slow=true -Dtests.badapples=true -Dtests.locale=es-CR -Dtests.timezone=Pacific/Majuro -Dtests.asserts=true -Dtests.file.encoding=UTF-8
   [junit4] FAILURE 0.47s J1 | OrderedExecutorTest.testLockWhenQueueIsFull <<<
   [junit4]    > Throwable #1: java.lang.AssertionError
   [junit4]    > 	at __randomizedtesting.SeedInfo.seed([DB01A99458F44E82:F2FA78B2DF9FBBA4]:0)
   [junit4]    > 	at org.apache.solr.util.OrderedExecutorTest.testLockWhenQueueIsFull(OrderedExecutorTest.java:54)
   [junit4]    > 	at java.lang.Thread.run(Thread.java:748)
   [junit4]   2> Sep 03, 2018 11:40:48 AM com.carrotsearch.randomizedtesting.ThreadLeakControl checkThreadLeaks
   [junit4]   2> WARNING: Will linger awaiting termination of 1 leaked thread(s).
   [junit4]   2> Sep 03, 2018 11:41:08 AM com.carrotsearch.randomizedtesting.ThreadLeakControl checkThreadLeaks
   [junit4]   2> SEVERE: 1 thread leaked from SUITE scope at org.apache.solr.util.OrderedExecutorTest: 
   [junit4]   2>    1) Thread[id=706, name=testLockWhenQueueIsFull-203-thread-1, state=TIMED_WAITING, group=TGRP-OrderedExecutorTest]
   [junit4]   2>         at sun.misc.Unsafe.park(Native Method)
   [junit4]   2>         at java.util.concurrent.locks.LockSupport.parkNanos(LockSupport.java:215)
   [junit4]   2>         at java.util.concurrent.SynchronousQueue$TransferStack.awaitFulfill(SynchronousQueue.java:460)
   [junit4]   2>         at java.util.concurrent.SynchronousQueue$TransferStack.transfer(SynchronousQueue.java:362)
   [junit4]   2>         at java.util.concurrent.SynchronousQueue.poll(SynchronousQueue.java:941)
   [junit4]   2>         at java.util.concurrent.ThreadPoolExecutor.getTask(ThreadPoolExecutor.java:1073)
   [junit4]   2>         at java.util.concurrent.ThreadPoolExecutor.runWorker(ThreadPoolExecutor.java:1134)
   [junit4]   2>         at java.util.concurrent.ThreadPoolExecutor$Worker.run(ThreadPoolExecutor.java:624)
   [junit4]   2>         at java.lang.Thread.run(Thread.java:748)
   [junit4]   2> Sep 03, 2018 11:41:08 AM com.carrotsearch.randomizedtesting.ThreadLeakControl tryToInterruptAll
   [junit4]   2> INFO: Starting to interrupt leaked threads:
   [junit4]   2>    1) Thread[id=706, name=testLockWhenQueueIsFull-203-thread-1, state=TIMED_WAITING, group=TGRP-OrderedExecutorTest]
   [junit4]   2> Sep 03, 2018 11:41:11 AM com.carrotsearch.randomizedtesting.ThreadLeakControl tryToInterruptAll
   [junit4]   2> SEVERE: There are still zombie threads that couldn't be terminated:
   [junit4]   2>    1) Thread[id=706, name=testLockWhenQueueIsFull-203-thread-1, state=TIMED_WAITING, group=TGRP-OrderedExecutorTest]
   [junit4]   2>         at sun.misc.Unsafe.park(Native Method)
   [junit4]   2>         at java.util.concurrent.locks.LockSupport.parkNanos(LockSupport.java:215)
   [junit4]   2>         at java.util.concurrent.SynchronousQueue$TransferStack.awaitFulfill(SynchronousQueue.java:460)
   [junit4]   2>         at java.util.concurrent.SynchronousQueue$TransferStack.transfer(SynchronousQueue.java:362)
   [junit4]   2>         at java.util.concurrent.SynchronousQueue.poll(SynchronousQueue.java:941)
   [junit4]   2>         at java.util.concurrent.ThreadPoolExecutor.getTask(ThreadPoolExecutor.java:1073)
   [junit4]   2>         at java.util.concurrent.ThreadPoolExecutor.runWorker(ThreadPoolExecutor.java:1134)
   [junit4]   2>         at java.util.concurrent.ThreadPoolExecutor$Worker.run(ThreadPoolExecutor.java:624)
   [junit4]   2>         at java.lang.Thread.run(Thread.java:748)
   [junit4]   2> NOTE: test params are: codec=Asserting(Lucene70): {}, docValues:{}, maxPointsInLeafNode=717, maxMBSortInHeap=5.3520097066939964, sim=RandomSimilarity(queryNorm=false): {}, locale=es-CR, timezone=Pacific/Majuro
   [junit4]   2> NOTE: Linux 4.4.0-130-generic amd64/Oracle Corporation 1.8.0_172 (64-bit)/cpus=4,threads=2,free=357793176,total=456654848
   [junit4]   2> NOTE: All tests run in this JVM: [IgnoreCommitOptimizeUpdateProcessorFactoryTest, TestFieldCache, TestImplicitCoreProperties, TaggerTest, TestDeleteCollectionOnDownNodes, EmbeddedSolrNoSerializeTest, TestGeoJSONResponseWriter, TestReplicaProperties, SolrSlf4jReporterTest, V2StandaloneTest, BadComponentTest, OrderedExecutorTest]
   [junit4]   2> NOTE: reproduce with: ant test  -Dtestcase=OrderedExecutorTest -Dtests.seed=DB01A99458F44E82 -Dtests.multiplier=2 -Dtests.slow=true -Dtests.badapples=true -Dtests.locale=es-CR -Dtests.timezone=Pacific/Majuro -Dtests.asserts=true -Dtests.file.encoding=UTF-8
   [junit4] ERROR   0.00s J1 | OrderedExecutorTest (suite) <<<
   [junit4]    > Throwable #1: com.carrotsearch.randomizedtesting.ThreadLeakError: 1 thread leaked from SUITE scope at org.apache.solr.util.OrderedExecutorTest: 
   [junit4]    >    1) Thread[id=706, name=testLockWhenQueueIsFull-203-thread-1, state=TIMED_WAITING, group=TGRP-OrderedExecutorTest]
   [junit4]    >         at sun.misc.Unsafe.park(Native Method)
   [junit4]    >         at java.util.concurrent.locks.LockSupport.parkNanos(LockSupport.java:215)
   [junit4]    >         at java.util.concurrent.SynchronousQueue$TransferStack.awaitFulfill(SynchronousQueue.java:460)
   [junit4]    >         at java.util.concurrent.SynchronousQueue$TransferStack.transfer(SynchronousQueue.java:362)
   [junit4]    >         at java.util.concurrent.SynchronousQueue.poll(SynchronousQueue.java:941)
   [junit4]    >         at java.util.concurrent.ThreadPoolExecutor.getTask(ThreadPoolExecutor.java:1073)
   [junit4]    >         at java.util.concurrent.ThreadPoolExecutor.runWorker(ThreadPoolExecutor.java:1134)
   [junit4]    >         at java.util.concurrent.ThreadPoolExecutor$Worker.run(ThreadPoolExecutor.java:624)
   [junit4]    >         at java.lang.Thread.run(Thread.java:748)
   [junit4]    > 	at __randomizedtesting.SeedInfo.seed([DB01A99458F44E82]:0)Throwable #2: com.carrotsearch.randomizedtesting.ThreadLeakError: There are still zombie threads that couldn't be terminated:
   [junit4]    >    1) Thread[id=706, name=testLockWhenQueueIsFull-203-thread-1, state=TIMED_WAITING, group=TGRP-OrderedExecutorTest]
   [junit4]    >         at sun.misc.Unsafe.park(Native Method)
   [junit4]    >         at java.util.concurrent.locks.LockSupport.parkNanos(LockSupport.java:215)
   [junit4]    >         at java.util.concurrent.SynchronousQueue$TransferStack.awaitFulfill(SynchronousQueue.java:460)
   [junit4]    >         at java.util.concurrent.SynchronousQueue$TransferStack.transfer(SynchronousQueue.java:362)
   [junit4]    >         at java.util.concurrent.SynchronousQueue.poll(SynchronousQueue.java:941)
   [junit4]    >         at java.util.concurrent.ThreadPoolExecutor.getTask(ThreadPoolExecutor.java:1073)
   [junit4]    >         at java.util.concurrent.ThreadPoolExecutor.runWorker(ThreadPoolExecutor.java:1134)
   [junit4]    >         at java.util.concurrent.ThreadPoolExecutor$Worker.run(ThreadPoolExecutor.java:624)
   [junit4]    >         at java.lang.Thread.run(Thread.java:748)
   [junit4]    > 	at __randomizedtesting.SeedInfo.seed([DB01A99458F44E82]:0)
   [junit4] Completed [377/831 (2!)] on J1 in 24.10s, 4 tests, 1 failure, 2 errors <<< FAILURES!

[...truncated 50054 lines...]
[asciidoctor:convert] asciidoctor: ERROR: about-this-guide.adoc: line 1: invalid part, must have at least one section (e.g., chapter, appendix, etc.)
[asciidoctor:convert] asciidoctor: WARNING: simulations.adoc: line 25: section title out of sequence: expected level 3, got level 4
[asciidoctor:convert] asciidoctor: WARNING: simulations.adoc: line 92: section title out of sequence: expected level 3, got level 4
[asciidoctor:convert] asciidoctor: ERROR: solr-glossary.adoc: line 1: invalid part, must have at least one section (e.g., chapter, appendix, etc.)
[asciidoctor:convert] asciidoctor: WARNING: simulations.adoc: line 25: section title out of sequence: expected levels 0 or 1, got level 2
[asciidoctor:convert] asciidoctor: WARNING: simulations.adoc: line 92: section title out of sequence: expected levels 0 or 1, got level 2
     [java] Processed 2310 links (1863 relative) to 3131 anchors in 245 files
     [echo] Validated Links & Anchors via: /x1/jenkins/jenkins-slave/workspace/Lucene-Solr-BadApples-Tests-7.x/solr/build/solr-ref-guide/bare-bones-html/

-documentation-lint:
    [jtidy] Checking for broken html (such as invalid tags)...
   [delete] Deleting directory /x1/jenkins/jenkins-slave/workspace/Lucene-Solr-BadApples-Tests-7.x/lucene/build/jtidy_tmp
     [echo] Checking for broken links...
     [exec] 
     [exec] Crawl/parse...
     [exec] 
     [exec] Verify...
     [echo] Checking for malformed docs...

jar-checksums:

resolve:

ivy-availability-check:
[loadresource] Do not set property disallowed.ivy.jars.list as its length is 0.

-ivy-fail-disallowed-ivy-version:

ivy-fail:

ivy-configure:
[ivy:configure] :: loading settings :: file = /x1/jenkins/jenkins-slave/workspace/Lucene-Solr-BadApples-Tests-7.x/lucene/top-level-ivy-settings.xml

resolve:

ivy-availability-check:
[loadresource] Do not set property disallowed.ivy.jars.list as its length is 0.

-ivy-fail-disallowed-ivy-version:

ivy-fail:

ivy-configure:
[ivy:configure] :: loading settings :: file = /x1/jenkins/jenkins-slave/workspace/Lucene-Solr-BadApples-Tests-7.x/lucene/top-level-ivy-settings.xml

resolve:

resolve:

ivy-availability-check:
[loadresource] Do not set property disallowed.ivy.jars.list as its length is 0.

-ivy-fail-disallowed-ivy-version:

ivy-fail:

ivy-configure:
[ivy:configure] :: loading settings :: file = /x1/jenkins/jenkins-slave/workspace/Lucene-Solr-BadApples-Tests-7.x/lucene/top-level-ivy-settings.xml

resolve:

ivy-availability-check:
[loadresource] Do not set property disallowed.ivy.jars.list as its length is 0.

-ivy-fail-disallowed-ivy-version:

ivy-fail:

ivy-configure:
[ivy:configure] :: loading settings :: file = /x1/jenkins/jenkins-slave/workspace/Lucene-Solr-BadApples-Tests-7.x/lucene/top-level-ivy-settings.xml

resolve:

ivy-availability-check:
[loadresource] Do not set property disallowed.ivy.jars.list as its length is 0.

-ivy-fail-disallowed-ivy-version:

ivy-fail:

ivy-configure:
[ivy:configure] :: loading settings :: file = /x1/jenkins/jenkins-slave/workspace/Lucene-Solr-BadApples-Tests-7.x/lucene/top-level-ivy-settings.xml

resolve:

ivy-availability-check:
[loadresource] Do not set property disallowed.ivy.jars.list as its length is 0.

-ivy-fail-disallowed-ivy-version:

ivy-fail:

ivy-configure:
[ivy:configure] :: loading settings :: file = /x1/jenkins/jenkins-slave/workspace/Lucene-Solr-BadApples-Tests-7.x/lucene/top-level-ivy-settings.xml

resolve:

ivy-availability-check:
[loadresource] Do not set property disallowed.ivy.jars.list as its length is 0.

-ivy-fail-disallowed-ivy-version:

ivy-fail:

ivy-configure:
[ivy:configure] :: loading settings :: file = /x1/jenkins/jenkins-slave/workspace/Lucene-Solr-BadApples-Tests-7.x/lucene/top-level-ivy-settings.xml

resolve:

ivy-availability-check:
[loadresource] Do not set property disallowed.ivy.jars.list as its length is 0.

-ivy-fail-disallowed-ivy-version:

ivy-fail:

ivy-configure:
[ivy:configure] :: loading settings :: file = /x1/jenkins/jenkins-slave/workspace/Lucene-Solr-BadApples-Tests-7.x/lucene/top-level-ivy-settings.xml

resolve:

ivy-availability-check:
[loadresource] Do not set property disallowed.ivy.jars.list as its length is 0.

-ivy-fail-disallowed-ivy-version:

ivy-fail:

ivy-configure:
[ivy:configure] :: loading settings :: file = /x1/jenkins/jenkins-slave/workspace/Lucene-Solr-BadApples-Tests-7.x/lucene/top-level-ivy-settings.xml

resolve:

ivy-availability-check:
[loadresource] Do not set property disallowed.ivy.jars.list as its length is 0.

-ivy-fail-disallowed-ivy-version:

ivy-fail:

ivy-configure:
[ivy:configure] :: loading settings :: file = /x1/jenkins/jenkins-slave/workspace/Lucene-Solr-BadApples-Tests-7.x/lucene/top-level-ivy-settings.xml

resolve:

ivy-availability-check:
[loadresource] Do not set property disallowed.ivy.jars.list as its length is 0.

-ivy-fail-disallowed-ivy-version:

ivy-fail:

ivy-configure:
[ivy:configure] :: loading settings :: file = /x1/jenkins/jenkins-slave/workspace/Lucene-Solr-BadApples-Tests-7.x/lucene/top-level-ivy-settings.xml

resolve:

ivy-availability-check:
[loadresource] Do not set property disallowed.ivy.jars.list as its length is 0.

-ivy-fail-disallowed-ivy-version:

ivy-fail:

ivy-configure:
[ivy:configure] :: loading settings :: file = /x1/jenkins/jenkins-slave/workspace/Lucene-Solr-BadApples-Tests-7.x/lucene/top-level-ivy-settings.xml

resolve:

ivy-availability-check:
[loadresource] Do not set property disallowed.ivy.jars.list as its length is 0.

-ivy-fail-disallowed-ivy-version:

ivy-fail:

ivy-configure:
[ivy:configure] :: loading settings :: file = /x1/jenkins/jenkins-slave/workspace/Lucene-Solr-BadApples-Tests-7.x/lucene/top-level-ivy-settings.xml

resolve:

ivy-availability-check:
[loadresource] Do not set property disallowed.ivy.jars.list as its length is 0.

-ivy-fail-disallowed-ivy-version:

ivy-fail:

ivy-configure:
[ivy:configure] :: loading settings :: file = /x1/jenkins/jenkins-slave/workspace/Lucene-Solr-BadApples-Tests-7.x/lucene/top-level-ivy-settings.xml

resolve:

ivy-availability-check:
[loadresource] Do not set property disallowed.ivy.jars.list as its length is 0.

-ivy-fail-disallowed-ivy-version:

ivy-fail:

ivy-configure:
[ivy:configure] :: loading settings :: file = /x1/jenkins/jenkins-slave/workspace/Lucene-Solr-BadApples-Tests-7.x/lucene/top-level-ivy-settings.xml

resolve:

ivy-availability-check:
[loadresource] Do not set property disallowed.ivy.jars.list as its length is 0.

-ivy-fail-disallowed-ivy-version:

ivy-fail:

ivy-configure:
[ivy:configure] :: loading settings :: file = /x1/jenkins/jenkins-slave/workspace/Lucene-Solr-BadApples-Tests-7.x/lucene/top-level-ivy-settings.xml

resolve:

ivy-availability-check:
[loadresource] Do not set property disallowed.ivy.jars.list as its length is 0.

-ivy-fail-disallowed-ivy-version:

ivy-fail:

ivy-configure:
[ivy:configure] :: loading settings :: file = /x1/jenkins/jenkins-slave/workspace/Lucene-Solr-BadApples-Tests-7.x/lucene/top-level-ivy-settings.xml

resolve:

ivy-availability-check:
[loadresource] Do not set property disallowed.ivy.jars.list as its length is 0.

-ivy-fail-disallowed-ivy-version:

ivy-fail:

ivy-configure:
[ivy:configure] :: loading settings :: file = /x1/jenkins/jenkins-slave/workspace/Lucene-Solr-BadApples-Tests-7.x/lucene/top-level-ivy-settings.xml

resolve:

ivy-availability-check:
[loadresource] Do not set property disallowed.ivy.jars.list as its length is 0.

-ivy-fail-disallowed-ivy-version:

ivy-fail:

ivy-configure:
[ivy:configure] :: loading settings :: file = /x1/jenkins/jenkins-slave/workspace/Lucene-Solr-BadApples-Tests-7.x/lucene/top-level-ivy-settings.xml

resolve:

ivy-availability-check:
[loadresource] Do not set property disallowed.ivy.jars.list as its length is 0.

-ivy-fail-disallowed-ivy-version:

ivy-fail:

ivy-configure:
[ivy:configure] :: loading settings :: file = /x1/jenkins/jenkins-slave/workspace/Lucene-Solr-BadApples-Tests-7.x/lucene/top-level-ivy-settings.xml

resolve:

ivy-availability-check:
[loadresource] Do not set property disallowed.ivy.jars.list as its length is 0.

-ivy-fail-disallowed-ivy-version:

ivy-fail:

ivy-configure:
[ivy:configure] :: loading settings :: file = /x1/jenkins/jenkins-slave/workspace/Lucene-Solr-BadApples-Tests-7.x/lucene/top-level-ivy-settings.xml

resolve:

ivy-availability-check:
[loadresource] Do not set property disallowed.ivy.jars.list as its length is 0.

-ivy-fail-disallowed-ivy-version:

ivy-fail:

ivy-configure:
[ivy:configure] :: loading settings :: file = /x1/jenkins/jenkins-slave/workspace/Lucene-Solr-BadApples-Tests-7.x/lucene/top-level-ivy-settings.xml

resolve:

ivy-availability-check:
[loadresource] Do not set property disallowed.ivy.jars.list as its length is 0.

-ivy-fail-disallowed-ivy-version:

ivy-fail:

ivy-configure:
[ivy:configure] :: loading settings :: file = /x1/jenkins/jenkins-slave/workspace/Lucene-Solr-BadApples-Tests-7.x/lucene/top-level-ivy-settings.xml

resolve:

ivy-availability-check:
[loadresource] Do not set property disallowed.ivy.jars.list as its length is 0.

-ivy-fail-disallowed-ivy-version:

ivy-fail:

ivy-configure:
[ivy:configure] :: loading settings :: file = /x1/jenkins/jenkins-slave/workspace/Lucene-Solr-BadApples-Tests-7.x/lucene/top-level-ivy-settings.xml

resolve:

ivy-availability-check:
[loadresource] Do not set property disallowed.ivy.jars.list as its length is 0.

-ivy-fail-disallowed-ivy-version:

ivy-fail:

ivy-configure:
[ivy:configure] :: loading settings :: file = /x1/jenkins/jenkins-slave/workspace/Lucene-Solr-BadApples-Tests-7.x/lucene/top-level-ivy-settings.xml

resolve:

ivy-availability-check:
[loadresource] Do not set property disallowed.ivy.jars.list as its length is 0.

-ivy-fail-disallowed-ivy-version:

ivy-fail:

ivy-configure:
[ivy:configure] :: loading settings :: file = /x1/jenkins/jenkins-slave/workspace/Lucene-Solr-BadApples-Tests-7.x/lucene/top-level-ivy-settings.xml

common.resolve:

resolve:

ivy-availability-check:
[loadresource] Do not set property disallowed.ivy.jars.list as its length is 0.

-ivy-fail-disallowed-ivy-version:

ivy-fail:

ivy-configure:
[ivy:configure] :: loading settings :: file = /x1/jenkins/jenkins-slave/workspace/Lucene-Solr-BadApples-Tests-7.x/lucene/top-level-ivy-settings.xml

resolve:

ivy-availability-check:
[loadresource] Do not set property disallowed.ivy.jars.list as its length is 0.

-ivy-fail-disallowed-ivy-version:

ivy-fail:

ivy-configure:
[ivy:configure] :: loading settings :: file = /x1/jenkins/jenkins-slave/workspace/Lucene-Solr-BadApples-Tests-7.x/lucene/top-level-ivy-settings.xml

resolve:

ivy-availability-check:
[loadresource] Do not set property disallowed.ivy.jars.list as its length is 0.

-ivy-fail-disallowed-ivy-version:

ivy-fail:

ivy-configure:
[ivy:configure] :: loading settings :: file = /x1/jenkins/jenkins-slave/workspace/Lucene-Solr-BadApples-Tests-7.x/lucene/top-level-ivy-settings.xml

resolve:

ivy-availability-check:
[loadresource] Do not set property disallowed.ivy.jars.list as its length is 0.

-ivy-fail-disallowed-ivy-version:

ivy-fail:

ivy-configure:
[ivy:configure] :: loading settings :: file = /x1/jenkins/jenkins-slave/workspace/Lucene-Solr-BadApples-Tests-7.x/lucene/top-level-ivy-settings.xml

resolve:

ivy-availability-check:
[loadresource] Do not set property disallowed.ivy.jars.list as its length is 0.

-ivy-fail-disallowed-ivy-version:

ivy-fail:

ivy-configure:
[ivy:configure] :: loading settings :: file = /x1/jenkins/jenkins-slave/workspace/Lucene-Solr-BadApples-Tests-7.x/lucene/top-level-ivy-settings.xml

resolve:

jar-checksums:
    [mkdir] Created dir: /x1/jenkins/jenkins-slave/workspace/Lucene-Solr-BadApples-Tests-7.x/lucene/null1729054122
     [copy] Copying 35 files to /x1/jenkins/jenkins-slave/workspace/Lucene-Solr-BadApples-Tests-7.x/lucene/null1729054122
   [delete] Deleting directory /x1/jenkins/jenkins-slave/workspace/Lucene-Solr-BadApples-Tests-7.x/lucene/null1729054122

resolve-example:

ivy-availability-check:
[loadresource] Do not set property disallowed.ivy.jars.list as its length is 0.

-ivy-fail-disallowed-ivy-version:

ivy-fail:

ivy-configure:
[ivy:configure] :: loading settings :: file = /x1/jenkins/jenkins-slave/workspace/Lucene-Solr-BadApples-Tests-7.x/lucene/top-level-ivy-settings.xml

resolve:

resolve-server:

ivy-availability-check:
[loadresource] Do not set property disallowed.ivy.jars.list as its length is 0.

-ivy-fail-disallowed-ivy-version:

ivy-fail:

ivy-fail:

ivy-configure:
[ivy:configure] :: loading settings :: file = /x1/jenkins/jenkins-slave/workspace/Lucene-Solr-BadApples-Tests-7.x/lucene/top-level-ivy-settings.xml

resolve:

resolve:

ivy-availability-check:
[loadresource] Do not set property disallowed.ivy.jars.list as its length is 0.

-ivy-fail-disallowed-ivy-version:

ivy-fail:

ivy-fail:

ivy-configure:
[ivy:configure] :: loading settings :: file = /x1/jenkins/jenkins-slave/workspace/Lucene-Solr-BadApples-Tests-7.x/lucene/top-level-ivy-settings.xml

resolve:

ivy-availability-check:
[loadresource] Do not set property disallowed.ivy.jars.list as its length is 0.

-ivy-fail-disallowed-ivy-version:

ivy-fail:

ivy-fail:

ivy-configure:
[ivy:configure] :: loading settings :: file = /x1/jenkins/jenkins-slave/workspace/Lucene-Solr-BadApples-Tests-7.x/lucene/top-level-ivy-settings.xml

resolve:

ivy-availability-check:
[loadresource] Do not set property disallowed.ivy.jars.list as its length is 0.

-ivy-fail-disallowed-ivy-version:

ivy-fail:

ivy-configure:
[ivy:configure] :: loading settings :: file = /x1/jenkins/jenkins-slave/workspace/Lucene-Solr-BadApples-Tests-7.x/lucene/top-level-ivy-settings.xml

resolve:

ivy-availability-check:
[loadresource] Do not set property disallowed.ivy.jars.list as its length is 0.

-ivy-fail-disallowed-ivy-version:

ivy-fail:

ivy-fail:

ivy-configure:
[ivy:configure] :: loading settings :: file = /x1/jenkins/jenkins-slave/workspace/Lucene-Solr-BadApples-Tests-7.x/lucene/top-level-ivy-settings.xml

resolve:

ivy-availability-check:
[loadresource] Do not set property disallowed.ivy.jars.list as its length is 0.

-ivy-fail-disallowed-ivy-version:

ivy-fail:

ivy-configure:
[ivy:configure] :: loading settings :: file = /x1/jenkins/jenkins-slave/workspace/Lucene-Solr-BadApples-Tests-7.x/lucene/top-level-ivy-settings.xml

resolve:

ivy-availability-check:
[loadresource] Do not set property disallowed.ivy.jars.list as its length is 0.

-ivy-fail-disallowed-ivy-version:

ivy-fail:

ivy-fail:

ivy-configure:
[ivy:configure] :: loading settings :: file = /x1/jenkins/jenkins-slave/workspace/Lucene-Solr-BadApples-Tests-7.x/lucene/top-level-ivy-settings.xml

resolve:

ivy-availability-check:
[loadresource] Do not set property disallowed.ivy.jars.list as its length is 0.

-ivy-fail-disallowed-ivy-version:

ivy-fail:

ivy-fail:

ivy-configure:
[ivy:configure] :: loading settings :: file = /x1/jenkins/jenkins-slave/workspace/Lucene-Solr-BadApples-Tests-7.x/lucene/top-level-ivy-settings.xml

resolve:

ivy-availability-check:
[loadresource] Do not set property disallowed.ivy.jars.list as its length is 0.

-ivy-fail-disallowed-ivy-version:

ivy-fail:

ivy-fail:

ivy-configure:
[ivy:configure] :: loading settings :: file = /x1/jenkins/jenkins-slave/workspace/Lucene-Solr-BadApples-Tests-7.x/lucene/top-level-ivy-settings.xml

resolve:

ivy-availability-check:
[loadresource] Do not set property disallowed.ivy.jars.list as its length is 0.

-ivy-fail-disallowed-ivy-version:

ivy-fail:

ivy-fail:

ivy-configure:
[ivy:configure] :: loading settings :: file = /x1/jenkins/jenkins-slave/workspace/Lucene-Solr-BadApples-Tests-7.x/lucene/top-level-ivy-settings.xml

resolve:

ivy-availability-check:
[loadresource] Do not set property disallowed.ivy.jars.list as its length is 0.

-ivy-fail-disallowed-ivy-version:

ivy-fail:

ivy-fail:

ivy-configure:
[ivy:configure] :: loading settings :: file = /x1/jenkins/jenkins-slave/workspace/Lucene-Solr-BadApples-Tests-7.x/lucene/top-level-ivy-settings.xml

resolve:

ivy-availability-check:
[loadresource] Do not set property disallowed.ivy.jars.list as its length is 0.

-ivy-fail-disallowed-ivy-version:

ivy-fail:

ivy-fail:

ivy-configure:
[ivy:configure] :: loading settings :: file = /x1/jenkins/jenkins-slave/workspace/Lucene-Solr-BadApples-Tests-7.x/lucene/top-level-ivy-settings.xml

resolve:

ivy-availability-check:
[loadresource] Do not set property disallowed.ivy.jars.list as its length is 0.

-ivy-fail-disallowed-ivy-version:

ivy-fail:

ivy-fail:

ivy-configure:
[ivy:configure] :: loading settings :: file = /x1/jenkins/jenkins-slave/workspace/Lucene-Solr-BadApples-Tests-7.x/lucene/top-level-ivy-settings.xml

resolve:

ivy-availability-check:
[loadresource] Do not set property disallowed.ivy.jars.list as its length is 0.

-ivy-fail-disallowed-ivy-version:

ivy-fail:

ivy-fail:

ivy-configure:
[ivy:configure] :: loading settings :: file = /x1/jenkins/jenkins-slave/workspace/Lucene-Solr-BadApples-Tests-7.x/lucene/top-level-ivy-settings.xml

resolve:

ivy-availability-check:
[loadresource] Do not set property disallowed.ivy.jars.list as its length is 0.

-ivy-fail-disallowed-ivy-version:

ivy-fail:

ivy-fail:

ivy-configure:
[ivy:configure] :: loading settings :: file = /x1/jenkins/jenkins-slave/workspace/Lucene-Solr-BadApples-Tests-7.x/lucene/top-level-ivy-settings.xml

resolve:

ivy-availability-check:
[loadresource] Do not set property disallowed.ivy.jars.list as its length is 0.

-ivy-fail-disallowed-ivy-version:

ivy-fail:

ivy-fail:

ivy-configure:
[ivy:configure] :: loading settings :: file = /x1/jenkins/jenkins-slave/workspace/Lucene-Solr-BadApples-Tests-7.x/lucene/top-level-ivy-settings.xml

resolve:

jar-checksums:
    [mkdir] Created dir: /x1/jenkins/jenkins-slave/workspace/Lucene-Solr-BadApples-Tests-7.x/solr/null174112278
     [copy] Copying 239 files to /x1/jenkins/jenkins-slave/workspace/Lucene-Solr-BadApples-Tests-7.x/solr/null174112278
   [delete] Deleting directory /x1/jenkins/jenkins-slave/workspace/Lucene-Solr-BadApples-Tests-7.x/solr/null174112278

check-working-copy:
[ivy:cachepath] :: resolving dependencies :: org.eclipse.jgit#org.eclipse.jgit-caller;working
[ivy:cachepath] 	confs: [default]
[ivy:cachepath] 	found org.eclipse.jgit#org.eclipse.jgit;4.6.0.201612231935-r in public
[ivy:cachepath] 	found com.jcraft#jsch;0.1.53 in public
[ivy:cachepath] 	found com.googlecode.javaewah#JavaEWAH;1.1.6 in public
[ivy:cachepath] 	found org.apache.httpcomponents#httpclient;4.3.6 in public
[ivy:cachepath] 	found org.apache.httpcomponents#httpcore;4.3.3 in public
[ivy:cachepath] 	found commons-logging#commons-logging;1.1.3 in public
[ivy:cachepath] 	found commons-codec#commons-codec;1.6 in public
[ivy:cachepath] 	found org.slf4j#slf4j-api;1.7.2 in public
[ivy:cachepath] :: resolution report :: resolve 20ms :: artifacts dl 1ms
	---------------------------------------------------------------------
	|                  |            modules            ||   artifacts   |
	|       conf       | number| search|dwnlded|evicted|| number|dwnlded|
	---------------------------------------------------------------------
	|      default     |   8   |   0   |   0   |   0   ||   8   |   0   |
	---------------------------------------------------------------------
[wc-checker] Initializing working copy...
[wc-checker] SLF4J: Failed to load class "org.slf4j.impl.StaticLoggerBinder".
[wc-checker] SLF4J: Defaulting to no-operation (NOP) logger implementation
[wc-checker] SLF4J: See http://www.slf4j.org/codes.html#StaticLoggerBinder for further details.
[wc-checker] Checking working copy status...

-jenkins-base:

BUILD SUCCESSFUL
Total time: 70 minutes 5 seconds
Archiving artifacts
java.lang.InterruptedException: no matches found within 10000
	at hudson.FilePath$34.hasMatch(FilePath.java:2678)
	at hudson.FilePath$34.invoke(FilePath.java:2557)
	at hudson.FilePath$34.invoke(FilePath.java:2547)
	at hudson.FilePath$FileCallableWrapper.call(FilePath.java:2918)
Also:   hudson.remoting.Channel$CallSiteStackTrace: Remote call to lucene
		at hudson.remoting.Channel.attachCallSiteStackTrace(Channel.java:1741)
		at hudson.remoting.UserRequest$ExceptionResponse.retrieve(UserRequest.java:357)
		at hudson.remoting.Channel.call(Channel.java:955)
		at hudson.FilePath.act(FilePath.java:1036)
		at hudson.FilePath.act(FilePath.java:1025)
		at hudson.FilePath.validateAntFileMask(FilePath.java:2547)
		at hudson.tasks.ArtifactArchiver.perform(ArtifactArchiver.java:243)
		at hudson.tasks.BuildStepCompatibilityLayer.perform(BuildStepCompatibilityLayer.java:81)
		at hudson.tasks.BuildStepMonitor$1.perform(BuildStepMonitor.java:20)
		at hudson.model.AbstractBuild$AbstractBuildExecution.perform(AbstractBuild.java:744)
		at hudson.model.AbstractBuild$AbstractBuildExecution.performAllBuildSteps(AbstractBuild.java:690)
		at hudson.model.Build$BuildExecution.post2(Build.java:186)
		at hudson.model.AbstractBuild$AbstractBuildExecution.post(AbstractBuild.java:635)
		at hudson.model.Run.execute(Run.java:1819)
		at hudson.model.FreeStyleBuild.run(FreeStyleBuild.java:43)
		at hudson.model.ResourceController.execute(ResourceController.java:97)
		at hudson.model.Executor.run(Executor.java:429)
Caused: hudson.FilePath$TunneledInterruptedException
	at hudson.FilePath$FileCallableWrapper.call(FilePath.java:2920)
	at hudson.remoting.UserRequest.perform(UserRequest.java:212)
	at hudson.remoting.UserRequest.perform(UserRequest.java:54)
	at hudson.remoting.Request$2.run(Request.java:369)
	at hudson.remoting.InterceptingExecutorService$1.call(InterceptingExecutorService.java:72)
	at java.util.concurrent.FutureTask.run(FutureTask.java:266)
	at java.util.concurrent.ThreadPoolExecutor.runWorker(ThreadPoolExecutor.java:1142)
	at java.util.concurrent.ThreadPoolExecutor$Worker.run(ThreadPoolExecutor.java:617)
	at java.lang.Thread.run(Thread.java:748)
Caused: java.lang.InterruptedException: java.lang.InterruptedException: no matches found within 10000
	at hudson.FilePath.act(FilePath.java:1038)
	at hudson.FilePath.act(FilePath.java:1025)
	at hudson.FilePath.validateAntFileMask(FilePath.java:2547)
	at hudson.tasks.ArtifactArchiver.perform(ArtifactArchiver.java:243)
	at hudson.tasks.BuildStepCompatibilityLayer.perform(BuildStepCompatibilityLayer.java:81)
	at hudson.tasks.BuildStepMonitor$1.perform(BuildStepMonitor.java:20)
	at hudson.model.AbstractBuild$AbstractBuildExecution.perform(AbstractBuild.java:744)
	at hudson.model.AbstractBuild$AbstractBuildExecution.performAllBuildSteps(AbstractBuild.java:690)
	at hudson.model.Build$BuildExecution.post2(Build.java:186)
	at hudson.model.AbstractBuild$AbstractBuildExecution.post(AbstractBuild.java:635)
	at hudson.model.Run.execute(Run.java:1819)
	at hudson.model.FreeStyleBuild.run(FreeStyleBuild.java:43)
	at hudson.model.ResourceController.execute(ResourceController.java:97)
	at hudson.model.Executor.run(Executor.java:429)
No artifacts found that match the file pattern "**/*.events,heapdumps/**,**/hs_err_pid*". Configuration error?
Recording test results
Build step 'Publish JUnit test result report' changed build result to UNSTABLE
Email was triggered for: Unstable (Test Failures)
Sending email for trigger: Unstable (Test Failures)

Mime
View raw message