lucene-dev mailing list archives

Site index · List index
Message view « Date » · « Thread »
Top « Date » · « Thread »
From Apache Jenkins Server <jenk...@builds.apache.org>
Subject [JENKINS] Lucene-Solr-Tests-master - Build # 2824 - Still Unstable
Date Thu, 27 Sep 2018 02:13:46 GMT
Build: https://builds.apache.org/job/Lucene-Solr-Tests-master/2824/

1 tests failed.
FAILED:  org.apache.solr.cloud.ChaosMonkeySafeLeaderTest.test

Error Message:
shard2 is not consistent.  Got 11 from http://127.0.0.1:45389/collection1_shard2_replica_n61 (previous client) and got 10 from http://127.0.0.1:44256/collection1_shard2_replica_n67

Stack Trace:
java.lang.AssertionError: shard2 is not consistent.  Got 11 from http://127.0.0.1:45389/collection1_shard2_replica_n61 (previous client) and got 10 from http://127.0.0.1:44256/collection1_shard2_replica_n67
	at __randomizedtesting.SeedInfo.seed([4C259C22B4978AC1:C471A3F81A6BE739]:0)
	at org.junit.Assert.fail(Assert.java:93)
	at org.apache.solr.cloud.AbstractFullDistribZkTestBase.checkShardConsistency(AbstractFullDistribZkTestBase.java:1330)
	at org.apache.solr.cloud.AbstractFullDistribZkTestBase.checkShardConsistency(AbstractFullDistribZkTestBase.java:1309)
	at org.apache.solr.cloud.ChaosMonkeySafeLeaderTest.test(ChaosMonkeySafeLeaderTest.java:163)
	at sun.reflect.NativeMethodAccessorImpl.invoke0(Native Method)
	at sun.reflect.NativeMethodAccessorImpl.invoke(NativeMethodAccessorImpl.java:62)
	at sun.reflect.DelegatingMethodAccessorImpl.invoke(DelegatingMethodAccessorImpl.java:43)
	at java.lang.reflect.Method.invoke(Method.java:498)
	at com.carrotsearch.randomizedtesting.RandomizedRunner.invoke(RandomizedRunner.java:1742)
	at com.carrotsearch.randomizedtesting.RandomizedRunner$8.evaluate(RandomizedRunner.java:935)
	at com.carrotsearch.randomizedtesting.RandomizedRunner$9.evaluate(RandomizedRunner.java:971)
	at com.carrotsearch.randomizedtesting.RandomizedRunner$10.evaluate(RandomizedRunner.java:985)
	at org.apache.solr.BaseDistributedSearchTestCase$ShardsRepeatRule$ShardsFixedStatement.callStatement(BaseDistributedSearchTestCase.java:1008)
	at org.apache.solr.BaseDistributedSearchTestCase$ShardsRepeatRule$ShardsStatement.evaluate(BaseDistributedSearchTestCase.java:983)
	at com.carrotsearch.randomizedtesting.rules.SystemPropertiesRestoreRule$1.evaluate(SystemPropertiesRestoreRule.java:57)
	at org.apache.lucene.util.TestRuleSetupTeardownChained$1.evaluate(TestRuleSetupTeardownChained.java:49)
	at org.apache.lucene.util.AbstractBeforeAfterRule$1.evaluate(AbstractBeforeAfterRule.java:45)
	at org.apache.lucene.util.TestRuleThreadAndTestName$1.evaluate(TestRuleThreadAndTestName.java:48)
	at org.apache.lucene.util.TestRuleIgnoreAfterMaxFailures$1.evaluate(TestRuleIgnoreAfterMaxFailures.java:64)
	at org.apache.lucene.util.TestRuleMarkFailure$1.evaluate(TestRuleMarkFailure.java:47)
	at com.carrotsearch.randomizedtesting.rules.StatementAdapter.evaluate(StatementAdapter.java:36)
	at com.carrotsearch.randomizedtesting.ThreadLeakControl$StatementRunner.run(ThreadLeakControl.java:368)
	at com.carrotsearch.randomizedtesting.ThreadLeakControl.forkTimeoutingTask(ThreadLeakControl.java:817)
	at com.carrotsearch.randomizedtesting.ThreadLeakControl$3.evaluate(ThreadLeakControl.java:468)
	at com.carrotsearch.randomizedtesting.RandomizedRunner.runSingleTest(RandomizedRunner.java:944)
	at com.carrotsearch.randomizedtesting.RandomizedRunner$5.evaluate(RandomizedRunner.java:830)
	at com.carrotsearch.randomizedtesting.RandomizedRunner$6.evaluate(RandomizedRunner.java:880)
	at com.carrotsearch.randomizedtesting.RandomizedRunner$7.evaluate(RandomizedRunner.java:891)
	at com.carrotsearch.randomizedtesting.rules.StatementAdapter.evaluate(StatementAdapter.java:36)
	at com.carrotsearch.randomizedtesting.rules.SystemPropertiesRestoreRule$1.evaluate(SystemPropertiesRestoreRule.java:57)
	at org.apache.lucene.util.AbstractBeforeAfterRule$1.evaluate(AbstractBeforeAfterRule.java:45)
	at com.carrotsearch.randomizedtesting.rules.StatementAdapter.evaluate(StatementAdapter.java:36)
	at org.apache.lucene.util.TestRuleStoreClassName$1.evaluate(TestRuleStoreClassName.java:41)
	at com.carrotsearch.randomizedtesting.rules.NoShadowingOrOverridesOnMethodsRule$1.evaluate(NoShadowingOrOverridesOnMethodsRule.java:40)
	at com.carrotsearch.randomizedtesting.rules.NoShadowingOrOverridesOnMethodsRule$1.evaluate(NoShadowingOrOverridesOnMethodsRule.java:40)
	at com.carrotsearch.randomizedtesting.rules.StatementAdapter.evaluate(StatementAdapter.java:36)
	at com.carrotsearch.randomizedtesting.rules.StatementAdapter.evaluate(StatementAdapter.java:36)
	at com.carrotsearch.randomizedtesting.rules.StatementAdapter.evaluate(StatementAdapter.java:36)
	at org.apache.lucene.util.TestRuleAssertionsRequired$1.evaluate(TestRuleAssertionsRequired.java:53)
	at org.apache.lucene.util.TestRuleMarkFailure$1.evaluate(TestRuleMarkFailure.java:47)
	at org.apache.lucene.util.TestRuleIgnoreAfterMaxFailures$1.evaluate(TestRuleIgnoreAfterMaxFailures.java:64)
	at org.apache.lucene.util.TestRuleIgnoreTestSuites$1.evaluate(TestRuleIgnoreTestSuites.java:54)
	at com.carrotsearch.randomizedtesting.rules.StatementAdapter.evaluate(StatementAdapter.java:36)
	at com.carrotsearch.randomizedtesting.ThreadLeakControl$StatementRunner.run(ThreadLeakControl.java:368)
	at java.lang.Thread.run(Thread.java:748)




Build Log:
[...truncated 13829 lines...]
   [junit4] Suite: org.apache.solr.cloud.ChaosMonkeySafeLeaderTest
   [junit4]   2> Creating dataDir: /x1/jenkins/jenkins-slave/workspace/Lucene-Solr-Tests-master/solr/build/solr-core/test/J0/temp/solr.cloud.ChaosMonkeySafeLeaderTest_4C259C22B4978AC1-001/init-core-data-001
   [junit4]   2> 1682319 WARN  (SUITE-ChaosMonkeySafeLeaderTest-seed#[4C259C22B4978AC1]-worker) [    ] o.a.s.SolrTestCaseJ4 startTrackingSearchers: numOpens=33 numCloses=33
   [junit4]   2> 1682320 INFO  (SUITE-ChaosMonkeySafeLeaderTest-seed#[4C259C22B4978AC1]-worker) [    ] o.a.s.SolrTestCaseJ4 Using PointFields (NUMERIC_POINTS_SYSPROP=true) w/NUMERIC_DOCVALUES_SYSPROP=false
   [junit4]   2> 1682321 INFO  (SUITE-ChaosMonkeySafeLeaderTest-seed#[4C259C22B4978AC1]-worker) [    ] o.a.s.SolrTestCaseJ4 Randomized ssl (false) and clientAuth (false) via: @org.apache.solr.util.RandomizeSSL(reason=, ssl=NaN, value=NaN, clientAuth=NaN)
   [junit4]   2> 1682321 INFO  (SUITE-ChaosMonkeySafeLeaderTest-seed#[4C259C22B4978AC1]-worker) [    ] o.a.s.SolrTestCaseJ4 SecureRandom sanity checks: test.solr.allowed.securerandom=null & java.security.egd=file:/dev/./urandom
   [junit4]   2> 1682322 INFO  (SUITE-ChaosMonkeySafeLeaderTest-seed#[4C259C22B4978AC1]-worker) [    ] o.a.s.BaseDistributedSearchTestCase Setting hostContext system property: /
   [junit4]   2> 1682323 INFO  (TEST-ChaosMonkeySafeLeaderTest.test-seed#[4C259C22B4978AC1]) [    ] o.a.s.c.ZkTestServer STARTING ZK TEST SERVER
   [junit4]   2> 1682324 INFO  (Thread-4191) [    ] o.a.s.c.ZkTestServer client port:0.0.0.0/0.0.0.0:0
   [junit4]   2> 1682324 INFO  (Thread-4191) [    ] o.a.s.c.ZkTestServer Starting server
   [junit4]   2> 1682325 ERROR (Thread-4191) [    ] o.a.z.s.ZooKeeperServer ZKShutdownHandler is not registered, so ZooKeeper server won't take any action on ERROR or SHUTDOWN server state changes
   [junit4]   2> 1682424 INFO  (TEST-ChaosMonkeySafeLeaderTest.test-seed#[4C259C22B4978AC1]) [    ] o.a.s.c.ZkTestServer start zk server on port:39409
   [junit4]   2> 1682426 INFO  (zkConnectionManagerCallback-4277-thread-1) [    ] o.a.s.c.c.ConnectionManager zkClient has connected
   [junit4]   2> 1682430 INFO  (zkConnectionManagerCallback-4279-thread-1) [    ] o.a.s.c.c.ConnectionManager zkClient has connected
   [junit4]   2> 1682433 INFO  (TEST-ChaosMonkeySafeLeaderTest.test-seed#[4C259C22B4978AC1]) [    ] o.a.s.c.AbstractZkTestCase put /x1/jenkins/jenkins-slave/workspace/Lucene-Solr-Tests-master/solr/core/src/test-files/solr/collection1/conf/solrconfig-tlog.xml to /configs/conf1/solrconfig.xml
   [junit4]   2> 1682435 INFO  (TEST-ChaosMonkeySafeLeaderTest.test-seed#[4C259C22B4978AC1]) [    ] o.a.s.c.AbstractZkTestCase put /x1/jenkins/jenkins-slave/workspace/Lucene-Solr-Tests-master/solr/core/src/test-files/solr/collection1/conf/schema15.xml to /configs/conf1/schema.xml
   [junit4]   2> 1682436 INFO  (TEST-ChaosMonkeySafeLeaderTest.test-seed#[4C259C22B4978AC1]) [    ] o.a.s.c.AbstractZkTestCase put /x1/jenkins/jenkins-slave/workspace/Lucene-Solr-Tests-master/solr/core/src/test-files/solr/collection1/conf/solrconfig.snippet.randomindexconfig.xml to /configs/conf1/solrconfig.snippet.randomindexconfig.xml
   [junit4]   2> 1682437 INFO  (TEST-ChaosMonkeySafeLeaderTest.test-seed#[4C259C22B4978AC1]) [    ] o.a.s.c.AbstractZkTestCase put /x1/jenkins/jenkins-slave/workspace/Lucene-Solr-Tests-master/solr/core/src/test-files/solr/collection1/conf/stopwords.txt to /configs/conf1/stopwords.txt
   [junit4]   2> 1682438 INFO  (TEST-ChaosMonkeySafeLeaderTest.test-seed#[4C259C22B4978AC1]) [    ] o.a.s.c.AbstractZkTestCase put /x1/jenkins/jenkins-slave/workspace/Lucene-Solr-Tests-master/solr/core/src/test-files/solr/collection1/conf/protwords.txt to /configs/conf1/protwords.txt
   [junit4]   2> 1682439 INFO  (TEST-ChaosMonkeySafeLeaderTest.test-seed#[4C259C22B4978AC1]) [    ] o.a.s.c.AbstractZkTestCase put /x1/jenkins/jenkins-slave/workspace/Lucene-Solr-Tests-master/solr/core/src/test-files/solr/collection1/conf/currency.xml to /configs/conf1/currency.xml
   [junit4]   2> 1682440 INFO  (TEST-ChaosMonkeySafeLeaderTest.test-seed#[4C259C22B4978AC1]) [    ] o.a.s.c.AbstractZkTestCase put /x1/jenkins/jenkins-slave/workspace/Lucene-Solr-Tests-master/solr/core/src/test-files/solr/collection1/conf/enumsConfig.xml to /configs/conf1/enumsConfig.xml
   [junit4]   2> 1682441 INFO  (TEST-ChaosMonkeySafeLeaderTest.test-seed#[4C259C22B4978AC1]) [    ] o.a.s.c.AbstractZkTestCase put /x1/jenkins/jenkins-slave/workspace/Lucene-Solr-Tests-master/solr/core/src/test-files/solr/collection1/conf/open-exchange-rates.json to /configs/conf1/open-exchange-rates.json
   [junit4]   2> 1682441 INFO  (TEST-ChaosMonkeySafeLeaderTest.test-seed#[4C259C22B4978AC1]) [    ] o.a.s.c.AbstractZkTestCase put /x1/jenkins/jenkins-slave/workspace/Lucene-Solr-Tests-master/solr/core/src/test-files/solr/collection1/conf/mapping-ISOLatin1Accent.txt to /configs/conf1/mapping-ISOLatin1Accent.txt
   [junit4]   2> 1682442 INFO  (TEST-ChaosMonkeySafeLeaderTest.test-seed#[4C259C22B4978AC1]) [    ] o.a.s.c.AbstractZkTestCase put /x1/jenkins/jenkins-slave/workspace/Lucene-Solr-Tests-master/solr/core/src/test-files/solr/collection1/conf/old_synonyms.txt to /configs/conf1/old_synonyms.txt
   [junit4]   2> 1682443 INFO  (TEST-ChaosMonkeySafeLeaderTest.test-seed#[4C259C22B4978AC1]) [    ] o.a.s.c.AbstractZkTestCase put /x1/jenkins/jenkins-slave/workspace/Lucene-Solr-Tests-master/solr/core/src/test-files/solr/collection1/conf/synonyms.txt to /configs/conf1/synonyms.txt
   [junit4]   2> 1682445 INFO  (TEST-ChaosMonkeySafeLeaderTest.test-seed#[4C259C22B4978AC1]) [    ] o.a.s.c.AbstractFullDistribZkTestBase Will use NRT replicas unless explicitly asked otherwise
   [junit4]   2> 1682576 INFO  (TEST-ChaosMonkeySafeLeaderTest.test-seed#[4C259C22B4978AC1]) [    ] o.e.j.s.Server jetty-9.4.11.v20180605; built: 2018-06-05T18:24:03.829Z; git: d5fc0523cfa96bfebfbda19606cad384d772f04c; jvm 1.8.0_172-b11
   [junit4]   2> 1682577 INFO  (TEST-ChaosMonkeySafeLeaderTest.test-seed#[4C259C22B4978AC1]) [    ] o.e.j.s.session DefaultSessionIdManager workerName=node0
   [junit4]   2> 1682577 INFO  (TEST-ChaosMonkeySafeLeaderTest.test-seed#[4C259C22B4978AC1]) [    ] o.e.j.s.session No SessionScavenger set, using defaults
   [junit4]   2> 1682577 INFO  (TEST-ChaosMonkeySafeLeaderTest.test-seed#[4C259C22B4978AC1]) [    ] o.e.j.s.session node0 Scavenging every 660000ms
   [junit4]   2> 1682577 INFO  (TEST-ChaosMonkeySafeLeaderTest.test-seed#[4C259C22B4978AC1]) [    ] o.e.j.s.h.ContextHandler Started o.e.j.s.ServletContextHandler@6a236a4b{/,null,AVAILABLE}
   [junit4]   2> 1682578 INFO  (TEST-ChaosMonkeySafeLeaderTest.test-seed#[4C259C22B4978AC1]) [    ] o.e.j.s.AbstractConnector Started ServerConnector@7b1f894c{HTTP/1.1,[http/1.1]}{127.0.0.1:?????}
   [junit4]   2> 1682578 INFO  (TEST-ChaosMonkeySafeLeaderTest.test-seed#[4C259C22B4978AC1]) [    ] o.e.j.s.Server Started @???????ms
   [junit4]   2> 1682578 INFO  (TEST-ChaosMonkeySafeLeaderTest.test-seed#[4C259C22B4978AC1]) [    ] o.a.s.c.s.e.JettySolrRunner Jetty properties: {solr.data.dir=/x1/jenkins/jenkins-slave/workspace/Lucene-Solr-Tests-master/solr/build/solr-core/test/J0/temp/solr.cloud.ChaosMonkeySafeLeaderTest_4C259C22B4978AC1-001/tempDir-001/control/data, replicaType=NRT, hostContext=/, hostPort=44948, coreRootDirectory=/x1/jenkins/jenkins-slave/workspace/Lucene-Solr-Tests-master/solr/build/solr-core/test/J0/temp/solr.cloud.ChaosMonkeySafeLeaderTest_4C259C22B4978AC1-001/control-001/cores}
   [junit4]   2> 1682578 ERROR (TEST-ChaosMonkeySafeLeaderTest.test-seed#[4C259C22B4978AC1]) [    ] o.a.s.u.StartupLoggingUtils Missing Java Option solr.log.dir. Logging may be missing or incomplete.
   [junit4]   2> 1682578 INFO  (TEST-ChaosMonkeySafeLeaderTest.test-seed#[4C259C22B4978AC1]) [    ] o.a.s.s.SolrDispatchFilter Using logger factory org.apache.logging.slf4j.Log4jLoggerFactory
   [junit4]   2> 1682578 INFO  (TEST-ChaosMonkeySafeLeaderTest.test-seed#[4C259C22B4978AC1]) [    ] o.a.s.s.SolrDispatchFilter  ___      _       Welcome to Apache Solr? version 8.0.0
   [junit4]   2> 1682578 INFO  (TEST-ChaosMonkeySafeLeaderTest.test-seed#[4C259C22B4978AC1]) [    ] o.a.s.s.SolrDispatchFilter / __| ___| |_ _   Starting in cloud mode on port null
   [junit4]   2> 1682579 INFO  (TEST-ChaosMonkeySafeLeaderTest.test-seed#[4C259C22B4978AC1]) [    ] o.a.s.s.SolrDispatchFilter \__ \/ _ \ | '_|  Install dir: null
   [junit4]   2> 1682579 INFO  (TEST-ChaosMonkeySafeLeaderTest.test-seed#[4C259C22B4978AC1]) [    ] o.a.s.s.SolrDispatchFilter |___/\___/_|_|    Start time: 2018-09-27T01:29:35.102Z
   [junit4]   2> 1682580 INFO  (zkConnectionManagerCallback-4281-thread-1) [    ] o.a.s.c.c.ConnectionManager zkClient has connected
   [junit4]   2> 1682581 INFO  (TEST-ChaosMonkeySafeLeaderTest.test-seed#[4C259C22B4978AC1]) [    ] o.a.s.s.SolrDispatchFilter Loading solr.xml from SolrHome (not found in ZooKeeper)
   [junit4]   2> 1682581 INFO  (TEST-ChaosMonkeySafeLeaderTest.test-seed#[4C259C22B4978AC1]) [    ] o.a.s.c.SolrXmlConfig Loading container configuration from /x1/jenkins/jenkins-slave/workspace/Lucene-Solr-Tests-master/solr/build/solr-core/test/J0/temp/solr.cloud.ChaosMonkeySafeLeaderTest_4C259C22B4978AC1-001/control-001/solr.xml
   [junit4]   2> 1682599 INFO  (TEST-ChaosMonkeySafeLeaderTest.test-seed#[4C259C22B4978AC1]) [    ] o.a.s.c.SolrXmlConfig Configuration parameter autoReplicaFailoverWorkLoopDelay is ignored
   [junit4]   2> 1682599 INFO  (TEST-ChaosMonkeySafeLeaderTest.test-seed#[4C259C22B4978AC1]) [    ] o.a.s.c.SolrXmlConfig Configuration parameter autoReplicaFailoverBadNodeExpiration is ignored
   [junit4]   2> 1682600 INFO  (TEST-ChaosMonkeySafeLeaderTest.test-seed#[4C259C22B4978AC1]) [    ] o.a.s.c.SolrXmlConfig MBean server found: com.sun.jmx.mbeanserver.JmxMBeanServer@1886f4e, but no JMX reporters were configured - adding default JMX reporter.
   [junit4]   2> 1682665 INFO  (TEST-ChaosMonkeySafeLeaderTest.test-seed#[4C259C22B4978AC1]) [    ] o.a.s.c.ZkContainer Zookeeper client=127.0.0.1:39409/solr
   [junit4]   2> 1682669 INFO  (zkConnectionManagerCallback-4285-thread-1) [    ] o.a.s.c.c.ConnectionManager zkClient has connected
   [junit4]   2> 1682674 INFO  (zkConnectionManagerCallback-4287-thread-1) [    ] o.a.s.c.c.ConnectionManager zkClient has connected
   [junit4]   2> 1682736 INFO  (TEST-ChaosMonkeySafeLeaderTest.test-seed#[4C259C22B4978AC1]) [n:127.0.0.1:44948_    ] o.a.s.c.OverseerElectionContext I am going to be the leader 127.0.0.1:44948_
   [junit4]   2> 1682736 INFO  (TEST-ChaosMonkeySafeLeaderTest.test-seed#[4C259C22B4978AC1]) [n:127.0.0.1:44948_    ] o.a.s.c.Overseer Overseer (id=72404967250657284-127.0.0.1:44948_-n_0000000000) starting
   [junit4]   2> 1682745 INFO  (zkConnectionManagerCallback-4294-thread-1) [    ] o.a.s.c.c.ConnectionManager zkClient has connected
   [junit4]   2> 1682747 INFO  (TEST-ChaosMonkeySafeLeaderTest.test-seed#[4C259C22B4978AC1]) [n:127.0.0.1:44948_    ] o.a.s.c.s.i.ZkClientClusterStateProvider Cluster at 127.0.0.1:39409/solr ready
   [junit4]   2> 1682748 INFO  (OverseerStateUpdate-72404967250657284-127.0.0.1:44948_-n_0000000000) [n:127.0.0.1:44948_    ] o.a.s.c.Overseer Starting to work on the main queue : 127.0.0.1:44948_
   [junit4]   2> 1682752 INFO  (TEST-ChaosMonkeySafeLeaderTest.test-seed#[4C259C22B4978AC1]) [n:127.0.0.1:44948_    ] o.a.s.c.ZkController Register node as live in ZooKeeper:/live_nodes/127.0.0.1:44948_
   [junit4]   2> 1682758 INFO  (zkCallback-4293-thread-1) [    ] o.a.s.c.c.ZkStateReader Updated live nodes from ZooKeeper... (0) -> (1)
   [junit4]   2> 1682769 INFO  (zkCallback-4286-thread-1) [    ] o.a.s.c.c.ZkStateReader Updated live nodes from ZooKeeper... (0) -> (1)
   [junit4]   2> 1682779 INFO  (TEST-ChaosMonkeySafeLeaderTest.test-seed#[4C259C22B4978AC1]) [n:127.0.0.1:44948_    ] o.a.s.h.a.MetricsHistoryHandler No .system collection, keeping metrics history in memory.
   [junit4]   2> 1682800 INFO  (TEST-ChaosMonkeySafeLeaderTest.test-seed#[4C259C22B4978AC1]) [n:127.0.0.1:44948_    ] o.a.s.m.r.SolrJmxReporter JMX monitoring for 'solr.node' (registry 'solr.node') enabled at server: com.sun.jmx.mbeanserver.JmxMBeanServer@1886f4e
   [junit4]   2> 1682809 INFO  (TEST-ChaosMonkeySafeLeaderTest.test-seed#[4C259C22B4978AC1]) [n:127.0.0.1:44948_    ] o.a.s.m.r.SolrJmxReporter JMX monitoring for 'solr.jvm' (registry 'solr.jvm') enabled at server: com.sun.jmx.mbeanserver.JmxMBeanServer@1886f4e
   [junit4]   2> 1682810 INFO  (TEST-ChaosMonkeySafeLeaderTest.test-seed#[4C259C22B4978AC1]) [n:127.0.0.1:44948_    ] o.a.s.m.r.SolrJmxReporter JMX monitoring for 'solr.jetty' (registry 'solr.jetty') enabled at server: com.sun.jmx.mbeanserver.JmxMBeanServer@1886f4e
   [junit4]   2> 1682811 INFO  (TEST-ChaosMonkeySafeLeaderTest.test-seed#[4C259C22B4978AC1]) [n:127.0.0.1:44948_    ] o.a.s.c.CorePropertiesLocator Found 0 core definitions underneath /x1/jenkins/jenkins-slave/workspace/Lucene-Solr-Tests-master/solr/build/solr-core/test/J0/temp/solr.cloud.ChaosMonkeySafeLeaderTest_4C259C22B4978AC1-001/control-001/cores
   [junit4]   2> 1682833 INFO  (zkConnectionManagerCallback-4300-thread-1) [    ] o.a.s.c.c.ConnectionManager zkClient has connected
   [junit4]   2> 1682833 INFO  (TEST-ChaosMonkeySafeLeaderTest.test-seed#[4C259C22B4978AC1]) [    ] o.a.s.c.c.ZkStateReader Updated live nodes from ZooKeeper... (0) -> (1)
   [junit4]   2> 1682834 INFO  (TEST-ChaosMonkeySafeLeaderTest.test-seed#[4C259C22B4978AC1]) [    ] o.a.s.c.s.i.ZkClientClusterStateProvider Cluster at 127.0.0.1:39409/solr ready
   [junit4]   2> 1682836 INFO  (qtp787646612-16709) [n:127.0.0.1:44948_    ] o.a.s.h.a.CollectionsHandler Invoked Collection Action :create with params collection.configName=conf1&name=control_collection&nrtReplicas=1&action=CREATE&numShards=1&createNodeSet=127.0.0.1:44948_&wt=javabin&version=2 and sendToOCPQueue=true
   [junit4]   2> 1682838 INFO  (OverseerThreadFactory-6539-thread-1-processing-n:127.0.0.1:44948_) [n:127.0.0.1:44948_    ] o.a.s.c.a.c.CreateCollectionCmd Create collection control_collection
   [junit4]   2> 1682959 INFO  (qtp787646612-16704) [n:127.0.0.1:44948_    x:control_collection_shard1_replica_n1] o.a.s.h.a.CoreAdminOperation core create command qt=/admin/cores&collection.configName=conf1&newCollection=true&name=control_collection_shard1_replica_n1&action=CREATE&numShards=1&collection=control_collection&shard=shard1&wt=javabin&version=2&replicaType=NRT
   [junit4]   2> 1682960 INFO  (qtp787646612-16704) [n:127.0.0.1:44948_    x:control_collection_shard1_replica_n1] o.a.s.c.TransientSolrCoreCacheDefault Allocating transient cache for 4 transient cores
   [junit4]   2> 1683982 INFO  (qtp787646612-16704) [n:127.0.0.1:44948_ c:control_collection s:shard1  x:control_collection_shard1_replica_n1] o.a.s.c.SolrConfig Using Lucene MatchVersion: 8.0.0
   [junit4]   2> 1683996 INFO  (qtp787646612-16704) [n:127.0.0.1:44948_ c:control_collection s:shard1  x:control_collection_shard1_replica_n1] o.a.s.s.IndexSchema [control_collection_shard1_replica_n1] Schema name=test
   [junit4]   2> 1684088 INFO  (qtp787646612-16704) [n:127.0.0.1:44948_ c:control_collection s:shard1  x:control_collection_shard1_replica_n1] o.a.s.s.IndexSchema Loaded schema test/1.6 with uniqueid field id
   [junit4]   2> 1684109 INFO  (qtp787646612-16704) [n:127.0.0.1:44948_ c:control_collection s:shard1  x:control_collection_shard1_replica_n1] o.a.s.c.CoreContainer Creating SolrCore 'control_collection_shard1_replica_n1' using configuration from collection control_collection, trusted=true
   [junit4]   2> 1684110 INFO  (qtp787646612-16704) [n:127.0.0.1:44948_ c:control_collection s:shard1  x:control_collection_shard1_replica_n1] o.a.s.m.r.SolrJmxReporter JMX monitoring for 'solr.core.control_collection.shard1.replica_n1' (registry 'solr.core.control_collection.shard1.replica_n1') enabled at server: com.sun.jmx.mbeanserver.JmxMBeanServer@1886f4e
   [junit4]   2> 1684110 INFO  (qtp787646612-16704) [n:127.0.0.1:44948_ c:control_collection s:shard1  x:control_collection_shard1_replica_n1] o.a.s.c.SolrCore [[control_collection_shard1_replica_n1] ] Opening new SolrCore at [/x1/jenkins/jenkins-slave/workspace/Lucene-Solr-Tests-master/solr/build/solr-core/test/J0/temp/solr.cloud.ChaosMonkeySafeLeaderTest_4C259C22B4978AC1-001/control-001/cores/control_collection_shard1_replica_n1], dataDir=[/x1/jenkins/jenkins-slave/workspace/Lucene-Solr-Tests-master/solr/build/solr-core/test/J0/temp/solr.cloud.ChaosMonkeySafeLeaderTest_4C259C22B4978AC1-001/control-001/cores/control_collection_shard1_replica_n1/data/]
   [junit4]   2> 1684114 INFO  (qtp787646612-16704) [n:127.0.0.1:44948_ c:control_collection s:shard1  x:control_collection_shard1_replica_n1] o.a.s.u.RandomMergePolicy RandomMergePolicy wrapping class org.apache.lucene.index.TieredMergePolicy: [TieredMergePolicy: maxMergeAtOnce=23, maxMergeAtOnceExplicit=38, maxMergedSegmentMB=10.4482421875, floorSegmentMB=1.7587890625, forceMergeDeletesPctAllowed=14.618191803893929, segmentsPerTier=30.0, maxCFSSegmentSizeMB=8.796093022207999E12, noCFSRatio=0.8587348782650409, deletesPctAllowed=37.36935891244357
   [junit4]   2> 1684123 WARN  (qtp787646612-16704) [n:127.0.0.1:44948_ c:control_collection s:shard1  x:control_collection_shard1_replica_n1] o.a.s.c.RequestHandlers INVALID paramSet a in requestHandler {type = requestHandler,name = /dump,class = DumpRequestHandler,attributes = {initParams=a, name=/dump, class=DumpRequestHandler},args = {defaults={a=A,b=B}}}
   [junit4]   2> 1684175 INFO  (qtp787646612-16704) [n:127.0.0.1:44948_ c:control_collection s:shard1  x:control_collection_shard1_replica_n1] o.a.s.u.UpdateHandler Using UpdateLog implementation: org.apache.solr.update.UpdateLog
   [junit4]   2> 1684175 INFO  (qtp787646612-16704) [n:127.0.0.1:44948_ c:control_collection s:shard1  x:control_collection_shard1_replica_n1] o.a.s.u.UpdateLog Initializing UpdateLog: dataDir= defaultSyncLevel=FLUSH numRecordsToKeep=100 maxNumLogsToKeep=10 numVersionBuckets=65536
   [junit4]   2> 1684176 INFO  (qtp787646612-16704) [n:127.0.0.1:44948_ c:control_collection s:shard1  x:control_collection_shard1_replica_n1] o.a.s.u.CommitTracker Hard AutoCommit: if uncommitted for 15000ms; 
   [junit4]   2> 1684176 INFO  (qtp787646612-16704) [n:127.0.0.1:44948_ c:control_collection s:shard1  x:control_collection_shard1_replica_n1] o.a.s.u.CommitTracker Soft AutoCommit: disabled
   [junit4]   2> 1684177 INFO  (qtp787646612-16704) [n:127.0.0.1:44948_ c:control_collection s:shard1  x:control_collection_shard1_replica_n1] o.a.s.u.RandomMergePolicy RandomMergePolicy wrapping class org.apache.lucene.index.TieredMergePolicy: [TieredMergePolicy: maxMergeAtOnce=46, maxMergeAtOnceExplicit=15, maxMergedSegmentMB=89.8759765625, floorSegmentMB=2.1787109375, forceMergeDeletesPctAllowed=18.250217419840464, segmentsPerTier=42.0, maxCFSSegmentSizeMB=8.796093022207999E12, noCFSRatio=1.0, deletesPctAllowed=47.270165543028625
   [junit4]   2> 1684178 INFO  (qtp787646612-16704) [n:127.0.0.1:44948_ c:control_collection s:shard1  x:control_collection_shard1_replica_n1] o.a.s.s.SolrIndexSearcher Opening [Searcher@7150b990[control_collection_shard1_replica_n1] main]
   [junit4]   2> 1684179 INFO  (qtp787646612-16704) [n:127.0.0.1:44948_ c:control_collection s:shard1  x:control_collection_shard1_replica_n1] o.a.s.r.ManagedResourceStorage Configured ZooKeeperStorageIO with znodeBase: /configs/conf1
   [junit4]   2> 1684180 INFO  (qtp787646612-16704) [n:127.0.0.1:44948_ c:control_collection s:shard1  x:control_collection_shard1_replica_n1] o.a.s.r.ManagedResourceStorage Loaded null at path _rest_managed.json using ZooKeeperStorageIO:path=/configs/conf1
   [junit4]   2> 1684180 INFO  (qtp787646612-16704) [n:127.0.0.1:44948_ c:control_collection s:shard1  x:control_collection_shard1_replica_n1] o.a.s.h.ReplicationHandler Commits will be reserved for 10000ms.
   [junit4]   2> 1684182 INFO  (searcherExecutor-6544-thread-1-processing-n:127.0.0.1:44948_ x:control_collection_shard1_replica_n1 c:control_collection s:shard1) [n:127.0.0.1:44948_ c:control_collection s:shard1  x:control_collection_shard1_replica_n1] o.a.s.c.SolrCore [control_collection_shard1_replica_n1] Registered new searcher Searcher@7150b990[control_collection_shard1_replica_n1] main{ExitableDirectoryReader(UninvertingDirectoryReader())}
   [junit4]   2> 1684182 INFO  (qtp787646612-16704) [n:127.0.0.1:44948_ c:control_collection s:shard1  x:control_collection_shard1_replica_n1] o.a.s.u.UpdateLog Could not find max version in index or recent updates, using new clock 1612722236770222080
   [junit4]   2> 1684188 INFO  (qtp787646612-16704) [n:127.0.0.1:44948_ c:control_collection s:shard1  x:control_collection_shard1_replica_n1] o.a.s.c.ZkShardTerms Successful update of terms at /collections/control_collection/terms/shard1 to Terms{values={core_node2=0}, version=0}
   [junit4]   2> 1684191 INFO  (qtp787646612-16704) [n:127.0.0.1:44948_ c:control_collection s:shard1  x:control_collection_shard1_replica_n1] o.a.s.c.ShardLeaderElectionContext Enough replicas found to continue.
   [junit4]   2> 1684191 INFO  (qtp787646612-16704) [n:127.0.0.1:44948_ c:control_collection s:shard1  x:control_collection_shard1_replica_n1] o.a.s.c.ShardLeaderElectionContext I may be the new leader - try and sync
   [junit4]   2> 1684191 INFO  (qtp787646612-16704) [n:127.0.0.1:44948_ c:control_collection s:shard1  x:control_collection_shard1_replica_n1] o.a.s.c.SyncStrategy Sync replicas to http://127.0.0.1:44948/control_collection_shard1_replica_n1/
   [junit4]   2> 1684192 INFO  (qtp787646612-16704) [n:127.0.0.1:44948_ c:control_collection s:shard1  x:control_collection_shard1_replica_n1] o.a.s.c.SyncStrategy Sync Success - now sync replicas to me
   [junit4]   2> 1684192 INFO  (qtp787646612-16704) [n:127.0.0.1:44948_ c:control_collection s:shard1  x:control_collection_shard1_replica_n1] o.a.s.c.SyncStrategy http://127.0.0.1:44948/control_collection_shard1_replica_n1/ has no replicas
   [junit4]   2> 1684192 INFO  (qtp787646612-16704) [n:127.0.0.1:44948_ c:control_collection s:shard1  x:control_collection_shard1_replica_n1] o.a.s.c.ShardLeaderElectionContext Found all replicas participating in election, clear LIR
   [junit4]   2> 1684195 INFO  (qtp787646612-16704) [n:127.0.0.1:44948_ c:control_collection s:shard1  x:control_collection_shard1_replica_n1] o.a.s.c.ShardLeaderElectionContext I am the new leader: http://127.0.0.1:44948/control_collection_shard1_replica_n1/ shard1
   [junit4]   2> 1684298 INFO  (qtp787646612-16704) [n:127.0.0.1:44948_ c:control_collection s:shard1  x:control_collection_shard1_replica_n1] o.a.s.c.ZkController I am the leader, no recovery necessary
   [junit4]   2> 1684302 INFO  (qtp787646612-16704) [n:127.0.0.1:44948_ c:control_collection s:shard1  x:control_collection_shard1_replica_n1] o.a.s.s.HttpSolrCall [admin] webapp=null path=/admin/cores params={qt=/admin/cores&collection.configName=conf1&newCollection=true&name=control_collection_shard1_replica_n1&action=CREATE&numShards=1&collection=control_collection&shard=shard1&wt=javabin&version=2&replicaType=NRT} status=0 QTime=1342
   [junit4]   2> 1684306 INFO  (qtp787646612-16709) [n:127.0.0.1:44948_    ] o.a.s.h.a.CollectionsHandler Wait for new collection to be active for at most 30 seconds. Check all shard replicas
   [junit4]   2> 1684401 INFO  (zkCallback-4286-thread-1) [    ] o.a.s.c.c.ZkStateReader A cluster state change: [WatchedEvent state:SyncConnected type:NodeDataChanged path:/collections/control_collection/state.json] for collection [control_collection] has occurred - updating... (live nodes size: [1])
   [junit4]   2> 1684840 INFO  (OverseerCollectionConfigSetProcessor-72404967250657284-127.0.0.1:44948_-n_0000000000) [n:127.0.0.1:44948_    ] o.a.s.c.OverseerTaskQueue Response ZK path: /overseer/collection-queue-work/qnr-0000000000 doesn't exist.  Requestor may have disconnected from ZooKeeper
   [junit4]   2> 1685306 INFO  (qtp787646612-16709) [n:127.0.0.1:44948_    ] o.a.s.s.HttpSolrCall [admin] webapp=null path=/admin/collections params={collection.configName=conf1&name=control_collection&nrtReplicas=1&action=CREATE&numShards=1&createNodeSet=127.0.0.1:44948_&wt=javabin&version=2} status=0 QTime=2470
   [junit4]   2> 1685313 INFO  (zkConnectionManagerCallback-4305-thread-1) [    ] o.a.s.c.c.ConnectionManager zkClient has connected
   [junit4]   2> 1685314 INFO  (TEST-ChaosMonkeySafeLeaderTest.test-seed#[4C259C22B4978AC1]) [    ] o.a.s.c.c.ZkStateReader Updated live nodes from ZooKeeper... (0) -> (1)
   [junit4]   2> 1685315 INFO  (TEST-ChaosMonkeySafeLeaderTest.test-seed#[4C259C22B4978AC1]) [    ] o.a.s.c.s.i.ZkClientClusterStateProvider Cluster at 127.0.0.1:39409/solr ready
   [junit4]   2> 1685315 INFO  (TEST-ChaosMonkeySafeLeaderTest.test-seed#[4C259C22B4978AC1]) [    ] o.a.s.c.ChaosMonkey monkey: init - expire sessions:false cause connection loss:false
   [junit4]   2> 1685316 INFO  (qtp787646612-16705) [n:127.0.0.1:44948_    ] o.a.s.h.a.CollectionsHandler Invoked Collection Action :create with params collection.configName=conf1&name=collection1&nrtReplicas=1&action=CREATE&numShards=3&createNodeSet=&stateFormat=2&wt=javabin&version=2 and sendToOCPQueue=true
   [junit4]   2> 1685318 INFO  (OverseerThreadFactory-6539-thread-2-processing-n:127.0.0.1:44948_) [n:127.0.0.1:44948_    ] o.a.s.c.a.c.CreateCollectionCmd Create collection collection1
   [junit4]   2> 1685522 WARN  (OverseerThreadFactory-6539-thread-2-processing-n:127.0.0.1:44948_) [n:127.0.0.1:44948_    ] o.a.s.c.a.c.CreateCollectionCmd It is unusual to create a collection (collection1) without cores.
   [junit4]   2> 1685524 INFO  (qtp787646612-16705) [n:127.0.0.1:44948_    ] o.a.s.h.a.CollectionsHandler Wait for new collection to be active for at most 30 seconds. Check all shard replicas
   [junit4]   2> 1685525 INFO  (qtp787646612-16705) [n:127.0.0.1:44948_    ] o.a.s.s.HttpSolrCall [admin] webapp=null path=/admin/collections params={collection.configName=conf1&name=collection1&nrtReplicas=1&action=CREATE&numShards=3&createNodeSet=&stateFormat=2&wt=javabin&version=2} status=0 QTime=209
   [junit4]   2> 1685644 INFO  (TEST-ChaosMonkeySafeLeaderTest.test-seed#[4C259C22B4978AC1]) [    ] o.a.s.c.AbstractFullDistribZkTestBase create jetty 1 in directory /x1/jenkins/jenkins-slave/workspace/Lucene-Solr-Tests-master/solr/build/solr-core/test/J0/temp/solr.cloud.ChaosMonkeySafeLeaderTest_4C259C22B4978AC1-001/shard-1-001 of type NRT
   [junit4]   2> 1685645 INFO  (TEST-ChaosMonkeySafeLeaderTest.test-seed#[4C259C22B4978AC1]) [    ] o.e.j.s.Server jetty-9.4.11.v20180605; built: 2018-06-05T18:24:03.829Z; git: d5fc0523cfa96bfebfbda19606cad384d772f04c; jvm 1.8.0_172-b11
   [junit4]   2> 1685646 INFO  (TEST-ChaosMonkeySafeLeaderTest.test-seed#[4C259C22B4978AC1]) [    ] o.e.j.s.session DefaultSessionIdManager workerName=node0
   [junit4]   2> 1685646 INFO  (TEST-ChaosMonkeySafeLeaderTest.test-seed#[4C259C22B4978AC1]) [    ] o.e.j.s.session No SessionScavenger set, using defaults
   [junit4]   2> 1685646 INFO  (TEST-ChaosMonkeySafeLeaderTest.test-seed#[4C259C22B4978AC1]) [    ] o.e.j.s.session node0 Scavenging every 600000ms
   [junit4]   2> 1685646 INFO  (TEST-ChaosMonkeySafeLeaderTest.test-seed#[4C259C22B4978AC1]) [    ] o.e.j.s.h.ContextHandler Started o.e.j.s.ServletContextHandler@11227915{/,null,AVAILABLE}
   [junit4]   2> 1685647 INFO  (TEST-ChaosMonkeySafeLeaderTest.test-seed#[4C259C22B4978AC1]) [    ] o.e.j.s.AbstractConnector Started ServerConnector@14f5d895{HTTP/1.1,[http/1.1]}{127.0.0.1:?????}
   [junit4]   2> 1685647 INFO  (TEST-ChaosMonkeySafeLeaderTest.test-seed#[4C259C22B4978AC1]) [    ] o.e.j.s.Server Started @???????ms
   [junit4]   2> 1685647 INFO  (TEST-ChaosMonkeySafeLeaderTest.test-seed#[4C259C22B4978AC1]) [    ] o.a.s.c.s.e.JettySolrRunner Jetty properties: {solr.data.dir=/x1/jenkins/jenkins-slave/workspace/Lucene-Solr-Tests-master/solr/build/solr-core/test/J0/temp/solr.cloud.ChaosMonkeySafeLeaderTest_4C259C22B4978AC1-001/tempDir-001/jetty1, replicaType=NRT, solrconfig=solrconfig.xml, hostContext=/, hostPort=45389, coreRootDirectory=/x1/jenkins/jenkins-slave/workspace/Lucene-Solr-Tests-master/solr/build/solr-core/test/J0/../../../../../../../../../../x1/jenkins/jenkins-slave/workspace/Lucene-Solr-Tests-master/solr/build/solr-core/test/J0/temp/solr.cloud.ChaosMonkeySafeLeaderTest_4C259C22B4978AC1-001/shard-1-001/cores}
   [junit4]   2> 1685647 ERROR (TEST-ChaosMonkeySafeLeaderTest.test-seed#[4C259C22B4978AC1]) [    ] o.a.s.u.StartupLoggingUtils Missing Java Option solr.log.dir. Logging may be missing or incomplete.
   [junit4]   2> 1685647 INFO  (TEST-ChaosMonkeySafeLeaderTest.test-seed#[4C259C22B4978AC1]) [    ] o.a.s.s.SolrDispatchFilter Using logger factory org.apache.logging.slf4j.Log4jLoggerFactory
   [junit4]   2> 1685647 INFO  (TEST-ChaosMonkeySafeLeaderTest.test-seed#[4C259C22B4978AC1]) [    ] o.a.s.s.SolrDispatchFilter  ___      _       Welcome to Apache Solr? version 8.0.0
   [junit4]   2> 1685647 INFO  (TEST-ChaosMonkeySafeLeaderTest.test-seed#[4C259C22B4978AC1]) [    ] o.a.s.s.SolrDispatchFilter / __| ___| |_ _   Starting in cloud mode on port null
   [junit4]   2> 1685647 INFO  (TEST-ChaosMonkeySafeLeaderTest.test-seed#[4C259C22B4978AC1]) [    ] o.a.s.s.SolrDispatchFilter \__ \/ _ \ | '_|  Install dir: null
   [junit4]   2> 1685647 INFO  (TEST-ChaosMonkeySafeLeaderTest.test-seed#[4C259C22B4978AC1]) [    ] o.a.s.s.SolrDispatchFilter |___/\___/_|_|    Start time: 2018-09-27T01:29:38.170Z
   [junit4]   2> 1685649 INFO  (zkConnectionManagerCallback-4307-thread-1) [    ] o.a.s.c.c.ConnectionManager zkClient has connected
   [junit4]   2> 1685651 INFO  (TEST-ChaosMonkeySafeLeaderTest.test-seed#[4C259C22B4978AC1]) [    ] o.a.s.s.SolrDispatchFilter Loading solr.xml from SolrHome (not found in ZooKeeper)
   [junit4]   2> 1685651 INFO  (TEST-ChaosMonkeySafeLeaderTest.test-seed#[4C259C22B4978AC1]) [    ] o.a.s.c.SolrXmlConfig Loading container configuration from /x1/jenkins/jenkins-slave/workspace/Lucene-Solr-Tests-master/solr/build/solr-core/test/J0/temp/solr.cloud.ChaosMonkeySafeLeaderTest_4C259C22B4978AC1-001/shard-1-001/solr.xml
   [junit4]   2> 1685656 INFO  (TEST-ChaosMonkeySafeLeaderTest.test-seed#[4C259C22B4978AC1]) [    ] o.a.s.c.SolrXmlConfig Configuration parameter autoReplicaFailoverWorkLoopDelay is ignored
   [junit4]   2> 1685656 INFO  (TEST-ChaosMonkeySafeLeaderTest.test-seed#[4C259C22B4978AC1]) [    ] o.a.s.c.SolrXmlConfig Configuration parameter autoReplicaFailoverBadNodeExpiration is ignored
   [junit4]   2> 1685658 INFO  (TEST-ChaosMonkeySafeLeaderTest.test-seed#[4C259C22B4978AC1]) [    ] o.a.s.c.SolrXmlConfig MBean server found: com.sun.jmx.mbeanserver.JmxMBeanServer@1886f4e, but no JMX reporters were configured - adding default JMX reporter.
   [junit4]   2> 1685729 INFO  (TEST-ChaosMonkeySafeLeaderTest.test-seed#[4C259C22B4978AC1]) [    ] o.a.s.c.ZkContainer Zookeeper client=127.0.0.1:39409/solr
   [junit4]   2> 1685731 INFO  (zkConnectionManagerCallback-4311-thread-1) [    ] o.a.s.c.c.ConnectionManager zkClient has connected
   [junit4]   2> 1685733 INFO  (zkConnectionManagerCallback-4313-thread-1) [    ] o.a.s.c.c.ConnectionManager zkClient has connected
   [junit4]   2> 1685738 INFO  (TEST-ChaosMonkeySafeLeaderTest.test-seed#[4C259C22B4978AC1]) [    ] o.a.s.c.c.ZkStateReader Updated live nodes from ZooKeeper... (0) -> (1)
   [junit4]   2> 1685742 INFO  (TEST-ChaosMonkeySafeLeaderTest.test-seed#[4C259C22B4978AC1]) [    ] o.a.s.c.TransientSolrCoreCacheDefault Allocating transient cache for 4 transient cores
   [junit4]   2> 1685743 INFO  (TEST-ChaosMonkeySafeLeaderTest.test-seed#[4C259C22B4978AC1]) [    ] o.a.s.c.ZkController Register node as live in ZooKeeper:/live_nodes/127.0.0.1:45389_
   [junit4]   2> 1685744 INFO  (zkCallback-4293-thread-1) [    ] o.a.s.c.c.ZkStateReader Updated live nodes from ZooKeeper... (1) -> (2)
   [junit4]   2> 1685744 INFO  (zkCallback-4286-thread-1) [    ] o.a.s.c.c.ZkStateReader Updated live nodes from ZooKeeper... (1) -> (2)
   [junit4]   2> 1685744 INFO  (zkCallback-4304-thread-1) [    ] o.a.s.c.c.ZkStateReader Updated live nodes from ZooKeeper... (1) -> (2)
   [junit4]   2> 1685750 INFO  (zkCallback-4312-thread-1) [    ] o.a.s.c.c.ZkStateReader Updated live nodes from ZooKeeper... (1) -> (2)
   [junit4]   2> 1685765 INFO  (zkConnectionManagerCallback-4320-thread-1) [    ] o.a.s.c.c.ConnectionManager zkClient has connected
   [junit4]   2> 1685766 INFO  (TEST-ChaosMonkeySafeLeaderTest.test-seed#[4C259C22B4978AC1]) [    ] o.a.s.c.c.ZkStateReader Updated live nodes from ZooKeeper... (0) -> (2)
   [junit4]   2> 1685767 INFO  (TEST-ChaosMonkeySafeLeaderTest.test-seed#[4C259C22B4978AC1]) [    ] o.a.s.c.s.i.ZkClientClusterStateProvider Cluster at 127.0.0.1:39409/solr ready
   [junit4]   2> 1685768 INFO  (TEST-ChaosMonkeySafeLeaderTest.test-seed#[4C259C22B4978AC1]) [    ] o.a.s.h.a.MetricsHistoryHandler No .system collection, keeping metrics history in memory.
   [junit4]   2> 1685788 INFO  (TEST-ChaosMonkeySafeLeaderTest.test-seed#[4C259C22B4978AC1]) [    ] o.a.s.m.r.SolrJmxReporter JMX monitoring for 'solr.node' (registry 'solr.node') enabled at server: com.sun.jmx.mbeanserver.JmxMBeanServer@1886f4e
   [junit4]   2> 1685799 INFO  (TEST-ChaosMonkeySafeLeaderTest.test-seed#[4C259C22B4978AC1]) [    ] o.a.s.m.r.SolrJmxReporter JMX monitoring for 'solr.jvm' (registry 'solr.jvm') enabled at server: com.sun.jmx.mbeanserver.JmxMBeanServer@1886f4e
   [junit4]   2> 1685799 INFO  (TEST-ChaosMonkeySafeLeaderTest.test-seed#[4C259C22B4978AC1]) [    ] o.a.s.m.r.SolrJmxReporter JMX monitoring for 'solr.jetty' (registry 'solr.jetty') enabled at server: com.sun.jmx.mbeanserver.JmxMBeanServer@1886f4e
   [junit4]   2> 1685801 INFO  (TEST-ChaosMonkeySafeLeaderTest.test-seed#[4C259C22B4978AC1]) [    ] o.a.s.c.CorePropertiesLocator Found 0 core definitions underneath /x1/jenkins/jenkins-slave/workspace/Lucene-Solr-Tests-master/solr/build/solr-core/test/J0/../../../../../../../../../../x1/jenkins/jenkins-slave/workspace/Lucene-Solr-Tests-master/solr/build/solr-core/test/J0/temp/solr.cloud.ChaosMonkeySafeLeaderTest_4C259C22B4978AC1-001/shard-1-001/cores
   [junit4]   2> 1685829 INFO  (qtp787646612-16711) [n:127.0.0.1:44948_    ] o.a.s.h.a.CollectionsHandler Invoked Collection Action :addreplica with params node=127.0.0.1:45389_&action=ADDREPLICA&collection=collection1&shard=shard2&type=NRT&wt=javabin&version=2 and sendToOCPQueue=true
   [junit4]   2> 1685832 INFO  (OverseerCollectionConfigSetProcessor-72404967250657284-127.0.0.1:44948_-n_0000000000) [n:127.0.0.1:44948_    ] o.a.s.c.OverseerTaskQueue Response ZK path: /overseer/collection-queue-work/qnr-0000000002 doesn't exist.  Requestor may have disconnected from ZooKeeper
   [junit4]   2> 1685833 INFO  (OverseerThreadFactory-6539-thread-3-processing-n:127.0.0.1:44948_) [n:127.0.0.1:44948_ c:collection1 s:shard2  ] o.a.s.c.a.c.AddReplicaCmd Node Identified 127.0.0.1:45389_ for creating new replica of shard shard2
   [junit4]   2> 1685837 INFO  (qtp1524054163-16763) [n:127.0.0.1:45389_    x:collection1_shard2_replica_n61] o.a.s.h.a.CoreAdminOperation core create command qt=/admin/cores&collection.configName=conf1&name=collection1_shard2_replica_n61&action=CREATE&collection=collection1&shard=shard2&wt=javabin&version=2&replicaType=NRT
   [junit4]   2> 1686854 INFO  (qtp1524054163-16763) [n:127.0.0.1:45389_ c:collection1 s:shard2  x:collection1_shard2_replica_n61] o.a.s.c.SolrConfig Using Lucene MatchVersion: 8.0.0
   [junit4]   2> 1686869 INFO  (qtp1524054163-16763) [n:127.0.0.1:45389_ c:collection1 s:shard2  x:collection1_shard2_replica_n61] o.a.s.s.IndexSchema [collection1_shard2_replica_n61] Schema name=test
   [junit4]   2> 1686960 INFO  (qtp1524054163-16763) [n:127.0.0.1:45389_ c:collection1 s:shard2  x:collection1_shard2_replica_n61] o.a.s.s.IndexSchema Loaded schema test/1.6 with uniqueid field id
   [junit4]   2> 1686977 INFO  (qtp1524054163-16763) [n:127.0.0.1:45389_ c:collection1 s:shard2  x:collection1_shard2_replica_n61] o.a.s.c.CoreContainer Creating SolrCore 'collection1_shard2_replica_n61' using configuration from collection collection1, trusted=true
   [junit4]   2> 1686978 INFO  (qtp1524054163-16763) [n:127.0.0.1:45389_ c:collection1 s:shard2  x:collection1_shard2_replica_n61] o.a.s.m.r.SolrJmxReporter JMX monitoring for 'solr.core.collection1.shard2.replica_n61' (registry 'solr.core.collection1.shard2.replica_n61') enabled at server: com.sun.jmx.mbeanserver.JmxMBeanServer@1886f4e
   [junit4]   2> 1686978 INFO  (qtp1524054163-16763) [n:127.0.0.1:45389_ c:collection1 s:shard2  x:collection1_shard2_replica_n61] o.a.s.c.SolrCore [[collection1_shard2_replica_n61] ] Opening new SolrCore at [/x1/jenkins/jenkins-slave/workspace/Lucene-Solr-Tests-master/solr/build/solr-core/test/J0/temp/solr.cloud.ChaosMonkeySafeLeaderTest_4C259C22B4978AC1-001/shard-1-001/cores/collection1_shard2_replica_n61], dataDir=[/x1/jenkins/jenkins-slave/workspace/Lucene-Solr-Tests-master/solr/build/solr-core/test/J0/../../../../../../../../../../x1/jenkins/jenkins-slave/workspace/Lucene-Solr-Tests-master/solr/build/solr-core/test/J0/temp/solr.cloud.ChaosMonkeySafeLeaderTest_4C259C22B4978AC1-001/shard-1-001/cores/collection1_shard2_replica_n61/data/]
   [junit4]   2> 1686982 INFO  (qtp1524054163-16763) [n:127.0.0.1:45389_ c:collection1 s:shard2  x:collection1_shard2_replica_n61] o.a.s.u.RandomMergePolicy RandomMergePolicy wrapping class org.apache.lucene.index.TieredMergePolicy: [TieredMergePolicy: maxMergeAtOnce=23, maxMergeAtOnceExplicit=38, maxMergedSegmentMB=10.4482421875, floorSegmentMB=1.7587890625, forceMergeDeletesPctAllowed=14.618191803893929, segmentsPerTier=30.0, maxCFSSegmentSizeMB=8.796093022207999E12, noCFSRatio=0.8587348782650409, deletesPctAllowed=37.36935891244357
   [junit4]   2> 1686989 WARN  (qtp1524054163-16763) [n:127.0.0.1:45389_ c:collection1 s:shard2  x:collection1_shard2_replica_n61] o.a.s.c.RequestHandlers INVALID paramSet a in requestHandler {type = requestHandler,name = /dump,class = DumpRequestHandler,attributes = {initParams=a, name=/dump, class=DumpRequestHandler},args = {defaults={a=A,b=B}}}
   [junit4]   2> 1687039 INFO  (qtp1524054163-16763) [n:127.0.0.1:45389_ c:collection1 s:shard2  x:collection1_shard2_replica_n61] o.a.s.u.UpdateHandler Using UpdateLog implementation: org.apache.solr.update.UpdateLog
   [junit4]   2> 1687039 INFO  (qtp1524054163-16763) [n:127.0.0.1:45389_ c:collection1 s:shard2  x:collection1_shard2_replica_n61] o.a.s.u.UpdateLog Initializing UpdateLog: dataDir= defaultSyncLevel=FLUSH numRecordsToKeep=100 maxNumLogsToKeep=10 numVersionBuckets=65536
   [junit4]   2> 1687041 INFO  (qtp1524054163-16763) [n:127.0.0.1:45389_ c:collection1 s:shard2  x:collection1_shard2_replica_n61] o.a.s.u.CommitTracker Hard AutoCommit: if uncommitted for 15000ms; 
   [junit4]   2> 1687041 INFO  (qtp1524054163-16763) [n:127.0.0.1:45389_ c:collection1 s:shard2  x:collection1_shard2_replica_n61] o.a.s.u.CommitTracker Soft AutoCommit: disabled
   [junit4]   2> 1687043 INFO  (qtp1524054163-16763) [n:127.0.0.1:45389_ c:collection1 s:shard2  x:collection1_shard2_replica_n61] o.a.s.u.RandomMergePolicy RandomMergePolicy wrapping class org.apache.lucene.index.TieredMergePolicy: [TieredMergePolicy: maxMergeAtOnce=46, maxMergeAtOnceExplicit=15, maxMergedSegmentMB=89.8759765625, floorSegmentMB=2.1787109375, forceMergeDeletesPctAllowed=18.250217419840464, segmentsPerTier=42.0, maxCFSSegmentSizeMB=8.796093022207999E12, noCFSRatio=1.0, deletesPctAllowed=47.270165543028625
   [junit4]   2> 1687043 INFO  (qtp1524054163-16763) [n:127.0.0.1:45389_ c:collection1 s:shard2  x:collection1_shard2_replica_n61] o.a.s.s.SolrIndexSearcher Opening [Searcher@36d570a0[collection1_shard2_replica_n61] main]
   [junit4]   2> 1687045 INFO  (qtp1524054163-16763) [n:127.0.0.1:45389_ c:collection1 s:shard2  x:collection1_shard2_replica_n61] o.a.s.r.ManagedResourceStorage Configured ZooKeeperStorageIO with znodeBase: /configs/conf1
   [junit4]   2> 1687045 INFO  (qtp1524054163-16763) [n:127.0.0.1:45389_ c:collection1 s:shard2  x:collection1_shard2_replica_n61] o.a.s.r.ManagedResourceStorage Loaded null at path _rest_managed.json using ZooKeeperStorageIO:path=/configs/conf1
   [junit4]   2> 1687047 INFO  (qtp1524054163-16763) [n:127.0.0.1:45389_ c:collection1 s:shard2  x:collection1_shard2_replica_n61] o.a.s.h.ReplicationHandler Commits will be reserved for 10000ms.
   [junit4]   2> 1687048 INFO  (searcherExecutor-6558-thread-1-processing-n:127.0.0.1:45389_ x:collection1_shard2_replica_n61 c:collection1 s:shard2) [n:127.0.0.1:45389_ c:collection1 s:shard2  x:collection1_shard2_replica_n61] o.a.s.c.SolrCore [collection1_shard2_replica_n61] Registered new searcher Searcher@36d570a0[collection1_shard2_replica_n61] main{ExitableDirectoryReader(UninvertingDirectoryReader())}
   [junit4]   2> 1687048 INFO  (qtp1524054163-16763) [n:127.0.0.1:45389_ c:collection1 s:shard2  x:collection1_shard2_replica_n61] o.a.s.u.UpdateLog Could not find max version in index or recent updates, using new clock 1612722239775440896
   [junit4]   2> 1687055 INFO  (qtp1524054163-16763) [n:127.0.0.1:45389_ c:collection1 s:shard2  x:collection1_shard2_replica_n61] o.a.s.c.ZkShardTerms Successful update of terms at /collections/collection1/terms/shard2 to Terms{values={core_node62=0}, version=0}
   [junit4]   2> 1687059 INFO  (qtp1524054163-16763) [n:127.0.0.1:45389_ c:collection1 s:shard2  x:collection1_shard2_replica_n61] o.a.s.c.ShardLeaderElectionContext Enough replicas found to continue.
   [junit4]   2> 1687059 INFO  (qtp1524054163-16763) [n:127.0.0.1:45389_ c:collection1 s:shard2  x:collection1_shard2_replica_n61] o.a.s.c.ShardLeaderElectionContext I may be the new leader - try and sync
   [junit4]   2> 1687059 INFO  (qtp1524054163-16763) [n:127.0.0.1:45389_ c:collection1 s:shard2  x:collection1_shard2_replica_n61] o.a.s.c.SyncStrategy Sync replicas to http://127.0.0.1:45389/collection1_shard2_replica_n61/
   [junit4]   2> 1687060 INFO  (qtp1524054163-16763) [n:127.0.0.1:45389_ c:collection1 s:shard2  x:collection1_shard2_replica_n61] o.a.s.c.SyncStrategy Sync Success - now sync replicas to me
   [junit4]   2> 1687060 INFO  (qtp1524054163-16763) [n:127.0.0.1:45389_ c:collection1 s:shard2  x:collection1_shard2_replica_n61] o.a.s.c.SyncStrategy http://127.0.0.1:45389/collection1_shard2_replica_n61/ has no replicas
   [junit4]   2> 1687060 INFO  (qtp1524054163-16763) [n:127.0.0.1:45389_ c:collection1 s:shard2  x:collection1_shard2_replica_n61] o.a.s.c.ShardLeaderElectionContext Found all replicas participating in election, clear LIR
   [junit4]   2> 1687064 INFO  (qtp1524054163-16763) [n:127.0.0.1:45389_ c:collection1 s:shard2  x:collection1_shard2_replica_n61] o.a.s.c.ShardLeaderElectionContext I am the new leader: http://127.0.0.1:45389/collection1_shard2_replica_n61/ shard2
   [junit4]   2> 1687167 INFO  (qtp1524054163-16763) [n:127.0.0.1:45389_ c:collection1 s:shard2  x:collection1_shard2_replica_n61] o.a.s.c.ZkController I am the leader, no recovery necessary
   [junit4]   2> 1687171 INFO  (qtp1524054163-16763) [n:127.0.0.1:45389_ c:collection1 s:shard2  x:collection1_shard2_replica_n61] o.a.s.s.HttpSolrCall [admin] webapp=null path=/admin/cores params={qt=/admin/cores&collection.configName=conf1&name=collection1_shard2_replica_n61&action=CREATE&collection=collection1&shard=shard2&wt=javabin&version=2&replicaType=NRT} status=0 QTime=1334
   [junit4]   2> 1687174 INFO  (qtp787646612-16711) [n:127.0.0.1:44948_ c:collection1   ] o.a.s.s.HttpSolrCall [admin] webapp=null path=/admin/collections params={node=127.0.0.1:45389_&action=ADDREPLICA&collection=collection1&shard=shard2&type=NRT&wt=javabin&version=2} status=0 QTime=1344
   [junit4]   2> 1687270 INFO  (zkCallback-4312-thread-1) [    ] o.a.s.c.c.ZkStateReader A cluster state change: [WatchedEvent state:SyncConnected type:NodeDataChanged path:/collections/collection1/state.json] for collection [collection1] has occurred - updating... (live nodes size: [2])
   [junit4]   2> 1687299 INFO  (TEST-ChaosMonkeySafeLeaderTest.test-seed#[4C259C22B4978AC1]) [    ] o.a.s.c.AbstractFullDistribZkTestBase create jetty 2 in directory /x1/jenkins/jenkins-slave/workspace/Lucene-Solr-Tests-master/solr/build/solr-core/test/J0/temp/solr.cloud.ChaosMonkeySafeLeaderTest_4C259C22B4978AC1-001/shard-2-001 of type NRT
   [junit4]   2> 1687300 INFO  (TEST-ChaosMonkeySafeLeaderTest.test-seed#[4C259C22B4978AC1]) [    ] o.e.j.s.Server jetty-9.4.11.v20180605; built: 2018-06-05T18:24:03.829Z; git: d5fc0523cfa96bfebfbda19606cad384d772f04c; jvm 1.8.0_172-b11
   [junit4]   2> 1687301 INFO  (TEST-ChaosMonkeySafeLeaderTest.test-seed#[4C259C22B4978AC1]) [    ] o.e.j.s.session DefaultSessionIdManager workerName=node0
   [junit4]   2> 1687301 INFO  (TEST-ChaosMonkeySafeLeaderTest.test-seed#[4C259C22B4978AC1]) [    ] o.e.j.s.session No SessionScavenger set, using defaults
   [junit4]   2> 1687301 INFO  (TEST-ChaosMonkeySafeLeaderTest.test-seed#[4C259C22B4978AC1]) [    ] o.e.j.s.session node0 Scavenging every 660000ms
   [junit4]   2> 1687301 INFO  (TEST-ChaosMonkeySafeLeaderTest.test-seed#[4C259C22B4978AC1]) [    ] o.e.j.s.h.ContextHandler Started o.e.j.s.ServletContextHandler@4890b9db{/,null,AVAILABLE}
   [junit4]   2> 1687302 INFO  (TEST-ChaosMonkeySafeLeaderTest.test-seed#[4C259C22B4978AC1]) [    ] o.e.j.s.AbstractConnector Started ServerConnector@6e4741ca{HTTP/1.1,[http/1.1]}{127.0.0.1:?????}
   [junit4]   2> 1687302 INFO  (TEST-ChaosMonkeySafeLeaderTest.test-seed#[4C259C22B4978AC1]) [    ] o.e.j.s.Server Started @???????ms
   [junit4]   2> 1687302 INFO  (TEST-ChaosMonkeySafeLeaderTest.test-seed#[4C259C22B4978AC1]) [    ] o.a.s.c.s.e.JettySolrRunner Jetty properties: {solr.data.dir=/x1/jenkins/jenkins-slave/workspace/Lucene-Solr-Tests-master/solr/build/solr-core/test/J0/temp/solr.cloud.ChaosMonkeySafeLeaderTest_4C259C22B4978AC1-001/tempDir-001/jetty2, solrconfig=solrconfig.xml, hostContext=/, hostPort=33466, coreRootDirectory=/x1/jenkins/jenkins-slave/workspace/Lucene-Solr-Tests-master/solr/build/solr-core/test/J0/temp/solr.cloud.ChaosMonkeySafeLeaderTest_4C259C22B4978AC1-001/shard-2-001/cores}
   [junit4]   2> 1687302 ERROR (TEST-ChaosMonkeySafeLeaderTest.test-seed#[4C259C22B4978AC1]) [    ] o.a.s.u.StartupLoggingUtils Missing Java Option solr.log.dir. Logging may be missing or incomplete.
   [junit4]   2> 1687303 INFO  (TEST-ChaosMonkeySafeLeaderTest.test-seed#[4C259C22B4978AC1]) [    ] o.a.s.s.SolrDispatchFilter Using logger factory org.apache.logging.slf4j.Log4jLoggerFactory
   [junit4]   2> 1687303 INFO  (TEST-ChaosMonkeySafeLeaderTest.test-seed#[4C259C22B4978AC1]) [    ] o.a.s.s.SolrDispatchFilter  ___      _       Welcome to Apache Solr? version 8.0.0
   [junit4]   2> 1687303 INFO  (TEST-ChaosMonkeySafeLeaderTest.test-seed#[4C259C22B4978AC1]) [    ] o.a.s.s.SolrDispatchFilter / __| ___| |_ _   Starting in cloud mode on port null
   [junit4]   2> 1687303 INFO  (TEST-ChaosMonkeySafeLeaderTest.test-seed#[4C259C22B4978AC1]) [    ] o.a.s.s.SolrDispatchFilter \__ \/ _ \ | '_|  Install dir: null
   [junit4]   2> 1687303 INFO  (TEST-ChaosMonkeySafeLeaderTest.test-seed#[4C259C22B4978AC1]) [    ] o.a.s.s.SolrDispatchFilter |___/\___/_|_|    Start time: 2018-09-27T01:29:39.826Z
   [junit4]   2> 1687305 INFO  (zkConnectionManagerCallback-4323-thread-1) [    ] o.a.s.c.c.ConnectionManager zkClient has connected
   [junit4]   2> 1687306 INFO  (TEST-ChaosMonkeySafeLeaderTest.test-seed#[4C259C22B4978AC1]) [    ] o.a.s.s.SolrDispatchFilter Loading solr.xml from SolrHome (not found in ZooKeeper)
   [junit4]   2> 1687306 INFO  (TEST-ChaosMonkeySafeLeaderTest.test-seed#[4C259C22B4978AC1]) [    ] o.a.s.c.SolrXmlConfig Loading container configuration from /x1/jenkins/jenkins-slave/workspace/Lucene-Solr-Tests-master/solr/build/solr-core/test/J0/temp/solr.cloud.ChaosMonkeySafeLeaderTest_4C259C22B4978AC1-001/shard-2-001/solr.xml
   [junit4]   2> 1687310 INFO  (TEST-ChaosMonkeySafeLeaderTest.test-seed#[4C259C22B4978AC1]) [    ] o.a.s.c.SolrXmlConfig Configuration parameter autoReplicaFailoverWorkLoopDelay is ignored
   [junit4]   2> 1687310 INFO  (TEST-ChaosMonkeySafeLeaderTest.test-seed#[4C259C22B4978AC1]) [    ] o.a.s.c.SolrXmlConfig Configuration parameter autoReplicaFailoverBadNodeExpiration is ignored
   [junit4]   2> 1687312 INFO  (TEST-ChaosMonkeySafeLeaderTest.test-seed#[4C259C22B4978AC1]) [    ] o.a.s.c.SolrXmlConfig MBean server found: com.sun.jmx.mbeanserver.JmxMBeanServer@1886f4e, but no JMX reporters were configured - adding default JMX reporter.
   [junit4]   2> 1687389 INFO  (TEST-ChaosMonkeySafeLeaderTest.test-seed#[4C259C22B4978AC1]) [    ] o.a.s.c.ZkContainer Zookeeper client=127.0.0.1:39409/solr
   [junit4]   2> 1687390 INFO  (zkConnectionManagerCallback-4327-thread-1) [    ] o.a.s.c.c.ConnectionManager zkClient has connected
   [junit4]   2> 1687392 INFO  (zkConnectionManagerCallback-4329-thread-1) [    ] o.a.s.c.c.ConnectionManager zkClient has connected
   [junit4]   2> 1687406 INFO  (TEST-ChaosMonkeySafeLeaderTest.test-seed#[4C259C22B4978AC1]) [    ] o.a.s.c.c.ZkStateReader Updated live nodes from ZooKeeper... (0) -> (2)
   [junit4]   2> 1687411 INFO  (TEST-ChaosMonkeySafeLeaderTest.test-seed#[4C259C22B4978AC1]) [    ] o.a.s.c.TransientSolrCoreCacheDefault Allocating transient cache for 4 transient cores
   [junit4]   2> 1687411 INFO  (TEST-ChaosMonkeySafeLeaderTest.test-seed#[4C259C22B4978AC1]) [    ] o.a.s.c.ZkController Register node as live in ZooKeeper:/live_nodes/127.0.0.1:33466_
   [junit4]   2> 1687418 INFO  (zkCallback-4304-thread-1) [    ] o.a.s.c.c.ZkStateReader Updated live nodes from ZooKeeper... (2) -> (3)
   [junit4]   2> 1687418 INFO  (zkCallback-4293-thread-1) [    ] o.a.s.c.c.ZkStateReader Updated live nodes from ZooKeeper... (2) -> (3)
   [junit4]   2> 1687418 INFO  (zkCallback-4312-thread-1) [    ] o.a.s.c.c.ZkStateReader Updated live nodes from ZooKeeper... (2) -> (3)
   [junit4]   2> 1687418 INFO  (zkCallback-4328-thread-1) [    ] o.a.s.c.c.ZkStateReader Updated live nodes from ZooKeeper... (2) -> (3)
   [junit4]   2> 1687419 INFO  (zkCallback-4319-thread-1) [    ] o.a.s.c.c.ZkStateReader Updated live nodes from ZooKeeper... (2) -> (3)
   [junit4]   2> 1687419 INFO  (zkCallback-4286-thread-2) [    ] o.a.s.c.c.ZkStateReader Updated live nodes from ZooKeeper... (2) -> (3)
   [junit4]   2> 1687442 INFO  (zkConnectionManagerCallback-4336-thread-1) [    ] o.a.s.c.c.ConnectionManager zkClient has connected
   [junit4]   2> 1687443 INFO  (TEST-ChaosMonkeySafeLeaderTest.test-seed#[4C259C22B4978AC1]) [    ] o.a.s.c.c.ZkStateReader Updated live nodes from ZooKeeper... (0) -> (3)
   [junit4]   2> 1687444 INFO  (TEST-ChaosMonkeySafeLeaderTest.test-seed#[4C259C22B4978AC1]) [    ] o.a.s.c.s.i.ZkClientClusterStateProvider Cluster at 127.0.0.1:39409/solr ready
   [junit4]   2> 1687445 INFO  (TEST-ChaosMonkeySafeLeaderTest.test-seed#[4C259C22B4978AC1]) [    ] o.a.s.h.a.MetricsHistoryHandler No .system collection, keeping metrics history in memory.
   [junit4]   2> 1687466 INFO  (TEST-ChaosMonkeySafeLeaderTest.test-seed#[4C259C22B4978AC1]) [    ] o.a.s.m.r.SolrJmxReporter JMX monitoring for 'solr.node' (registry 'solr.node') enabled at server: com.sun.jmx.mbeanserver.JmxMBeanServer@1886f4e
   [junit4]   2> 1687477 INFO  (TEST-ChaosMonkeySafeLeaderTest.test-seed#[4C259C22B4978AC1]) [    ] o.a.s.m.r.SolrJmxReporter JMX monitoring for 'solr.jvm' (registry 'solr.jvm') enabled at server: com.sun.jmx.mbeanserver.JmxMBeanServer@1886f4e
   [junit4]   2> 1687477 INFO  (TEST-ChaosMonkeySafeLeaderTest.test-seed#[4C259C22B4978AC1]) [    ] o.a.s.m.r.SolrJmxReporter JMX monitoring for 'solr.jetty' (registry 'solr.jetty') enabled at server: com.sun.jmx.mbeanserver.JmxMBeanServer@1886f4e
   [junit4]   2> 1687479 INFO  (TEST-ChaosMonkeySafeLeaderTest.test-seed#[4C259C22B4978AC1]) [    ] o.a.s.c.CorePropertiesLocator Found 0 core definitions underneath /x1/jenkins/jenkins-slave/workspace/Lucene-Solr-Tests-master/solr/build/solr-core/test/J0/temp/solr.cloud.ChaosMonkeySafeLeaderTest_4C259C22B4978AC1-001/shard-2-001/cores
   [junit4]   2> 1687520 INFO  (qtp1706250941-16801) [n:127.0.0.1:33466_    ] o.a.s.h.a.CollectionsHandler Invoked Collection Action :addreplica with params node=127.0.0.1:33466_&action=ADDREPLICA&collection=collection1&shard=shard3&type=NRT&wt=javabin&version=2 and sendToOCPQueue=true
   [junit4]   2> 1687526 INFO  (OverseerCollectionConfigSetProcessor-72404967250657284-127.0.0.1:44948_-n_0000000000) [n:127.0.0.1:44948_    ] o.a.s.c.OverseerTaskQueue Response ZK path: /overseer/collection-queue-work/qnr-0000000004 doesn't exist.  Requestor may have disconnected from ZooKeeper
   [junit4]   2> 1687528 INFO  (OverseerThreadFactory-6539-thread-4-processing-n:127.0.0.1:44948_) [n:127.0.0.1:44948_ c:collection1 s:shard3  ] o.a.s.c.a.c.AddReplicaCmd Node Identified 127.0.0.1:33466_ for creating new replica of shard shard3
   [junit4]   2> 1687531 INFO  (qtp1706250941-16796) [n:127.0.0.1:33466_    x:collection1_shard3_replica_n63] o.a.s.h.a.CoreAdminOperation core create command qt=/admin/cores&collection.configName=conf1&name=collection1_shard3_replica_n63&action=CREATE&collection=collection1&shard=shard3&wt=javabin&version=2&replicaType=NRT
   [junit4]   2> 1687636 INFO  (zkCallback-4312-thread-1) [    ] o.a.s.c.c.ZkStateReader A cluster state change: [WatchedEvent state:SyncConnected type:NodeDataChanged path:/collections/collection1/state.json] for collection [collection1] has occurred - updating... (live nodes size: [3])
   [junit4]   2> 1688579 INFO  (qtp1706250941-16796) [n:127.0.0.1:33466_ c:collection1 s:shard3  x:collection1_shard3_replica_n63] o.a.s.c.SolrConfig Using Lucene MatchVersion: 8.0.0
   [junit4]   2> 1688591 INFO  (qtp1706250941-16796) [n:127.0.0.1:33466_ c:collection1 s:shard3  x:collection1_shard3_replica_n63] o.a.s.s.IndexSchema [collection1_shard3_replica_n63] Schema name=test
   [junit4]   2> 1688676 INFO  (qtp1706250941-16796) [n:127.0.0.1:33466_ c:collection1 s:shard3  x:collection1_shard3_replica_n63] o.a.s.s.IndexSchema Loaded schema test/1.6 with uniqueid field id
   [junit4]   2> 1688689 INFO  (qtp1706250941-16796) [n:127.0.0.1:33466_ c:collection1 s:shard3  x:collection1_shard3_replica_n63] o.a.s.c.CoreContainer Creating SolrCore 'collection1_shard3_replica_n63' using configuration from collection collection1, trusted=true
   [junit4]   2> 1688690 INFO  (qtp1706250941-16796) [n:127.0.0.1:33466_ c:collection1 s:shard3  x:collection1_shard3_replica_n63] o.a.s.m.r.SolrJmxReporter JMX monitoring for 'solr.core.collection1.shard3.replica_n63' (registry 'solr.core.collection1.shard3.replica_n63') enabled at server: com.sun.jmx.mbeanserver.JmxMBeanServer@1886f4e
   [junit4]   2> 1688690 INFO  (qtp1706250941-16796) [n:127.0.0.1:33466_ c:collection1 s:shard3  x:collection1_shard3_replica_n63] o.a.s.c.SolrCore [[collection1_shard3_replica_n63] ] Opening new SolrCore at [/x1/jenkins/jenkins-slave/workspace/Lucene-Solr-Tests-master/solr/build/solr-core/test/J0/temp/solr.cloud.ChaosMonkeySafeLeaderTest_4C259C22B4978AC1-001/shard-2-001/cores/collection1_shard3_replica_n63], dataDir=[/x1/jenkins/jenkins-slave/workspace/Lucene-Solr-Tests-master/solr/build/solr-core/test/J0/temp/solr.cloud.ChaosMonkeySafeLeaderTest_4C259C22B4978AC1-001/shard-2-001/cores/collection1_shard3_replica_n63/data/]
   [junit4]   2> 1688694 INFO  (qtp1706250941-16796) [n:127.0.0.1:33466_ c:collection1 s:shard3  x:collection1_shard3_replica_n63] o.a.s.u.RandomMergePolicy RandomMergePolicy wrapping class org.apache.lucene.index.TieredMergePolicy: [TieredMergePolicy: maxMergeAtOnce=23, maxMergeAtOnceExplicit=38, maxMergedSegmentMB=10.4482421875, floorSegmentMB=1.7587890625, forceMergeDeletesPctAllowed=14.618191803893929, segmentsPerTier=30.0, maxCFSSegmentSizeMB=8.796093022207999E12, noCFSRatio=0.8587348782650409, deletesPctAllowed=37.36935891244357
   [junit4]   2> 1688702 WARN  (qtp1706250941-16796) [n:127.0.0.1:33466_ c:collection1 s:shard3  x:collection1_shard3_replica_n63] o.a.s.c.RequestHandlers INVALID paramSet a in requestHandler {type = requestHandler,name = /dump,class = DumpRequestHandler,attributes = {initParams=a, name=/dump, class=DumpRequestHandler},args = {defaults={a=A,b=B}}}
   [junit4]   2> 1688747 INFO  (qtp1706250941-16796) [n:127.0.0.1:33466_ c:collection1 s:shard3  x:collection1_shard3_replica_n63] o.a.s.u.UpdateHandler Using UpdateLog implementation: org.apache.solr.update.UpdateLog
   [junit4]   2> 1688747 INFO  (qtp1706250941-16796) [n:127.0.0.1:33466_ c:collection1 s:shard3  x:collection1_shard3_replica_n63] o.a.s.u.UpdateLog Initializing UpdateLog: dataDir= defaultSyncLevel=FLUSH numRecordsToKeep=100 maxNumLogsToKeep=10 numVersionBuckets=65536
   [junit4]   2> 1688748 INFO  (qtp1706250941-16796) [n:127.0.0.1:33466_ c:collection1 s:shard3  x:collection1_shard3_replica_n63] o.a.s.u.CommitTracker Hard AutoCommit: if uncommitted for 15000ms; 
   [junit4]   2> 1688748 INFO  (qtp1706250941-16796) [n:127.0.0.1:33466_ c:collection1 s:shard3  x:collection1_shard3_replica_n63] o.a.s.u.CommitTracker Soft AutoCommit: disabled
   [junit4]   2> 1688749 INFO  (qtp1706250941-16796) [n:127.0.0.1:33466_ c:collection1 s:shard3  x:collection1_shard3_replica_n63] o.a.s.u.RandomMergePolicy RandomMergePolicy wrapping class org.apache.lucene.index.TieredMergePolicy: [TieredMergePolicy: maxMergeAtOnce=46, maxMergeAtOnceExplicit=15, maxMergedSegmentMB=89.8759765625, floorSegmentMB=2.1787109375, forceMergeDeletesPctAllowed=18.250217419840464, segmentsPerTier=42.0, maxCFSSegmentSizeMB=8.796093022207999E12, noCFSRatio=1.0, deletesPctAllowed=47.270165543028625
   [junit4]   2> 1688750 INFO  (qtp1706250941-16796) [n:127.0.0.1:33466_ c:collection1 s:shard3  x:collection1_shard3_replica_n63] o.a.s.s.SolrIndexSearcher Opening [Searcher@4e3b810c[collection1_shard3_replica_n63] main]
   [junit4]   2> 1688751 INFO  (qtp1706250941-16796) [n:127.0.0.1:33466_ c:collection1 s:shard3  x:collection1_shard3_replica_n63] o.a.s.r.ManagedResourceStorage Configured ZooKeeperStorageIO with znodeBase: /configs/conf1
   [junit4]   2> 1688751 INFO  (qtp1706250941-16796) [n:127.0.0.1:33466_ c:collection1 s:shard3  x:collection1_shard3_replica_n63] o.a.s.r.ManagedResourceStorage Loaded null at path _rest_managed.json using ZooKeeperStorageIO:path=/configs/conf1
   [junit4]   2> 1688752 INFO  (qtp1706250941-16796) [n:127.0.0.1:33466_ c:collection1 s:shard3  x:collection1_shard3_replica_n63] o.a.s.h.ReplicationHandler Commits will be reserved for 10000ms.
   [junit4]   2> 1688752 INFO  (qtp1706250941-16796) [n:127.0.0.1:33466_ c:collection1 s:shard3  x:collection1_shard3_replica_n63] o.a.s.u.UpdateLog Could not find max version in index or recent updates, using new clock 1612722241562214400
   [junit4]   2> 1688753 INFO  (searcherExecutor-6572-thread-1-processing-n:127.0.0.1:33466_ x:collection1_shard3_replica_n63 c:collection1 s:shard3) [n:127.0.0.1:33466_ c:collection1 s:shard3  x:collection1_shard3_replica_n63] o.a.s.c.SolrCore [collection1_shard3_replica_n63] Registered new searcher Searcher@4e3b810c[collection1_shard3_replica_n63] main{ExitableDirectoryReader(UninvertingDirectoryReader())}
   [junit4]   2> 1688757 INFO  (qtp1706250941-16796) [n:127.0.0.1:33466_ c:collection1 s:shard3  x:collection1_shard3_replica_n63] o.a.s.c.ZkShardTerms Successful update of terms at /collections/collection1/terms/shard3 to Terms{values={core_node64=0}, version=0}
   [junit4]   2> 1688760 INFO  (qtp1706250941-16796) [n:127.0.0.1:33466_ c:collection1 s:shard3  x:collection1_shard3_replica_n63] o.a.s.c.ShardLeaderElectionContext Enough replicas found to continue.
   [junit4]   2> 1688760 INFO  (qtp1706250941-16796) [n:127.0.0.1:33466_ c:collection1 s:shard3  x:collection1_shard3_replica_n63] o.a.s.c.ShardLeaderElectionContext I may be the new leader - try and sync
   [junit4]   2> 1688760 INFO  (qtp1706250941-16796) [n:127.0.0.1:33466_ c:collection1 s:shard3  x:collection1_shard3_replica_n63] o.a.s.c.SyncStrategy Sync replicas to http://127.0.0.1:33466/collection1_shard3_replica_n63/
   [junit4]   2> 1688760 INFO  (qtp1706250941-16796) [n:127.0.0.1:33466_ c:collection1 s:shard3  x:collection1_shard3_replica_n63] o.a.s.c.SyncStrategy Sync Success - now sync replicas to me
   [junit4]   2> 1688760 INFO  (qtp1706250941-16796) [n:127.0.0.1:33466_ c:collection1 s:shard3  x:collection1_shard3_replica_n63] o.a.s.c.SyncStrategy http://127.0.0.1:33466/collection1_shard3_replica_n63/ has no replicas
   [junit4]   2> 1688760 INFO  (qtp1706250941-16796) [n:127.0.0.1:33466_ c:collection1 s:shard3  x:collection1_shard3_replica_n63] o.a.s.c.ShardLeaderElectionContext Found all replicas participating in election, clear LIR
   [junit4]   2> 1688764 INFO  (qtp1706250941-16796) [n:127.0.0.1:33466_ c:collection1 s:shard3  x:collection1_shard3_replica_n63] o.a.s.c.ShardLeaderElectionContext I am the new leader: http://127.0.0.1:33466/collection1_shard3_replica_n63/ shard3
   [junit4]   2> 1688866 INFO  (zkCallback-4312-thread-1) [    ] o.a.s.c.c.ZkStateReader A cluster state change: [WatchedEvent state:SyncConnected type:NodeDataChanged path:/collections/collection1/state.json] for collection [collection1] has occurred - updating... (live nodes size: [3])
   [junit4]   2> 1688867 INFO  (qtp1706250941-16796) [n:127.0.0.1:33466_ c:collection1 s:shard3  x:collection1_shard3_replica_n63] o.a.s.c.ZkController I am the leader, no recovery necessary
   [junit4]   2> 1688870 INFO  (qtp1706250941-16796) [n:127.0.0.1:33466_ c:collection1 s:shard3  x:collection1_shard3_replica_n63] o.a.s.s.HttpSolrCall [admin] webapp=null path=/admin/cores params={qt=/admin/cores&collection.configName=conf1&name=collection1_shard3_replica_n63&action=CREATE&collection=collection1&shard=shard3&wt=javabin&version=2&replicaType=NRT} status=0 QTime=1340
   [junit4]   2> 1688873 INFO  (qtp1706250941-16801) [n:127.0.0.1:33466_ c:collection1   ] o.a.s.s.HttpSolrCall [admin] webapp=null path=/admin/collections params={node=127.0.0.1:33466_&action=ADDREPLICA&collection=collection1&shard=shard3&type=NRT&wt=javabin&version=2} status=0 QTime=1353
   [junit4]   2> 1688970 INFO  (zkCallback-4312-thread-1) [    ] o.a.s.c.c.ZkStateReader A cluster state change: [WatchedEvent state:SyncConnected type:NodeDataChanged path:/collections/collection1/state.json] for collection [collection1] has occurred - updating... (live nodes size: [3])
   [junit4]   2> 1688970 INFO  (zkCallback-4328-thread-1) [    ] o.a.s.c.c.ZkStateReader A cluster state change: [WatchedEvent state:SyncConnected type:NodeDataChanged path:/collections/collection1/state.json] for collection [collection1] has occurred - updating... (live nodes size: [3])
   [junit4]   2> 1688992 INFO  (TEST-ChaosMonkeySafeLeaderTest.test-seed#[4C259C22B4978AC1]) [    ] o.a.s.c.AbstractFullDistribZkTestBase create jetty 3 in directory /x1/jenkins/jenkins-slave/workspace/Lucene-Solr-Tests-master/solr/build/solr-core/test/J0/temp/solr.cloud.ChaosMonkeySafeLeaderTest_4C259C22B4978AC1-001/shard-3-001 of type NRT
   [junit4]   2> 1688993 INFO  (TEST-ChaosMonkeySafeLeaderTest.test-seed#[4C259C22B4978AC1]) [    ] o.e.j.s.Server jetty-9.4.11.v20180605; built: 2018-06-05T18:24:03.829Z; git: d5fc0523cfa96bfebfbda19606cad384d772f04c; jvm 1.8.0_172-b11
   [junit4]   2> 1688994 INFO  (TEST-ChaosMonkeySafeLeaderTest.test-seed#[4C259C22B4978AC1]) [    ] o.e.j.s.session DefaultSessionIdManager workerName=node0
   [junit4]   2> 1688994 INFO  (TEST-ChaosMonkeySafeLeaderTest.test-seed#[4C259C22B4978AC1]) [    ] o.e.j.s.session No SessionScavenger set, using defaults
   [junit4]   2> 1688994 INFO  (TEST-ChaosMonkeySafeLeaderTest.test-seed#[4C259C22B4978AC1]) [    ] o.e.j.s.session node0 Scavenging every 600000ms
   [junit4]   2> 1688994 INFO  (TEST-ChaosMonkeySafeLeaderTest.test-seed#[4C259C22B4978AC1]) [    ] o.e.j.s.h.ContextHandler Started o.e.j.s.ServletContextHandler@33cf5c30{/,null,AVAILABLE}
   [junit4]   2> 1688995 INFO  (TEST-ChaosMonkeySafeLeaderTest.test-seed#[4C259C22B4978AC1]) [    ] o.e.j.s.AbstractConnector Started ServerConnector@232b9c6a{HTTP/1.1,[http/1.1]}{127.0.0.1:?????}
   [junit4]   2> 1688995 INFO  (TEST-ChaosMonkeySafeLeaderTest.test-seed#[4C259C22B4978AC1]) [    ] o.e.j.s.Server Started @???????ms
   [junit4]   2> 1688995 INFO  (TEST-ChaosMonkeySafeLeaderTest.test-seed#[4C259C22B4978AC1]) [    ] o.a.s.c.s.e.JettySolrRunner Jetty properties: {solr.data.dir=/x1/jenkins/jenkins-slave/workspace/Lucene-Solr-Tests-master/solr/build/solr-core/test/J0/temp/solr.cloud.ChaosMonkeySafeLeaderTest_4C259C22B4978AC1-001/tempDir-001/jetty3, solrconfig=solrconfig.xml, hostContext=/, hostPort=46784, coreRootDirectory=/x1/jenkins/jenkins-slave/workspace/Lucene-Solr-Tests-master/solr/build/solr-core/test/J0/../../../../../../../../../../x1/jenkins/jenkins-slave/workspace/Lucene-Solr-Tests-master/solr/build/solr-core/test/J0/temp/solr.cloud.ChaosMonkeySafeLeaderTest_4C259C22B4978AC1-001/shard-3-001/cores}
   [junit4]   2> 1688995 ERROR (TEST-ChaosMonkeySafeLeaderTest.test-seed#[4C259C22B4978AC1]) [    ] o.a.s.u.StartupLoggingUtils Missing Java Option solr.log.dir. Logging may be missing or incomplete.
   [junit4]   2> 1688996 INFO  (TEST-ChaosMonkeySafeLeaderTest.test-seed#[4C259C22B4978AC1]) [    ] o.a.s.s.SolrDispatchFilter Using logger factory org.apache.logging.slf4j.Log4jLoggerFactory
   [junit4]   2> 1688996 INFO  (TEST-ChaosMonkeySafeLeaderTest.test-seed#[4C259C22B4978AC1]) [    ] o.a.s.s.SolrDispatchFilter  ___      _       Welcome to Apache Solr? version 8.0.0
   [junit4]   2> 1688996 INFO  (TEST-ChaosMonkeySafeLeaderTest.test-seed#[4C259C22B4978AC1]) [    ] o.a.s.s.SolrDispatchFilter / __| ___| |_ _   Starting in cloud mode on port null
   [junit4]   2> 1688996 INFO  (TEST-ChaosMonkeySafeLeaderTest.test-seed#[4C259C22B4978AC1]) [    ] o.a.s.s.SolrDispatchFilter \__ \/ _ \ | '_|  Install dir: null
   [junit4]   2> 1688996 INFO  (TEST-ChaosMonkeySafeLeaderTest.test-seed#[4C259C22B4978AC1]) [    ] o.a.s.s.SolrDispatchFilter |___/\___/_|_|    Start time: 2018-09-27T01:29:41.519Z
   [junit4]   2> 1688998 INFO  (zkConnectionManagerCallback-4339-thread-1) [    ] o.a.s.c.c.ConnectionManager zkClient has connected
   [junit4]   2> 1688999 INFO  (TEST-ChaosMonkeySafeLeaderTest.test-seed#[4C259C22B4978AC1]) [    ] o.a.s.s.SolrDispatchFilter Loading solr.xml from SolrHome (not found in ZooKeeper)
   [junit4]   2> 1688999 INFO  (TEST-ChaosMonkeySafeLeaderTest.test-seed#[4C259C22B4978AC1]) [    ] o.a.s.c.SolrXmlConfig Loading container configuration from /x1/jenkins/jenkins-slave/workspace/Lucene-Solr-Tests-master/solr/build/solr-core/test/J0/temp/solr.cloud.ChaosMonkeySafeLeaderTest_4C259C22B4978AC1-001/shard-3-001/solr.xml
   [junit4]   2> 1689002 INFO  (TEST-ChaosMonkeySafeLeaderTest.test-seed#[4C259C22B4978AC1]) [    ] o.a.s.c.SolrXmlConfig Configuration parameter autoReplicaFailoverWorkLoopDelay is ignored
   [junit4]   2> 1689002 INFO  (TEST-ChaosMonkeySafeLeaderTest.test-seed#[4C259C22B4978AC1]) [    ] o.a.s.c.SolrXmlConfig Configuration parameter autoReplicaFailoverBadNodeExpiration is ignored
   [junit4]   2> 1689004 INFO  (TEST-ChaosMonkeySafeLeaderTest.test-seed#[4C259C22B4978AC1]) [    ] o.a.s.c.SolrXmlConfig MBean server found: com.sun.jmx.mbeanserver.JmxMBeanServer@1886f4e, but no JMX reporters were configured - adding default JMX reporter.
   [junit4]   2> 1689256 INFO  (TEST-ChaosMonkeySafeLeaderTest.test-seed#[4C259C22B4978AC1]) [    ] o.a.s.c.ZkContainer Zookeeper client=127.0.0.1:39409/solr
   [junit4]   2> 1689258 INFO  (zkConnectionManagerCallback-4343-thread-1) [    ] o.a.s.c.c.ConnectionManager zkClient has connected
   [junit4]   2> 1689260 INFO  (zkConnectionManagerCallback-4345-thread-1) [    ] o.a.s.c.c.ConnectionManager zkClient has connected
   [junit4]   2> 1689265 INFO  (TEST-ChaosMonkeySafeLeaderTest.test-seed#[4C259C22B4978AC1]) [    ] o.a.s.c.c.ZkStateReader Updated live nodes from ZooKeeper... (0) -> (3)
   [junit4]   2> 1689269 INFO  (TEST-ChaosMonkeySafeLeaderTest.test-seed#[4C259C22B4978AC1]) [    ] o.a.s.c.TransientSolrCoreCacheDefault Allocating transient cache for 4 transient cores
   [junit4]   2> 1689269 INFO  (TEST-ChaosMonkeySafeLeaderTest.test-seed#[4C259C22B4978AC1]) [    ] o.a.s.c.ZkController Register node as live in ZooKeeper:/live_nodes/127.0.0.1:46784_
   [junit4]   2> 1689270 INFO  (zkCallback-4328-thread-1) [    ] o.a.s.c.c.ZkStateReader Updated live nodes from ZooKeeper... (3) -> (4)
   [junit4]   2> 1689270 INFO  (zkCallback-4312-thread-1) [    ] o.a.s.c.c.ZkStateReader Updated live nodes from ZooKeeper... (3) -> (4)
   [junit4]   2> 1689271 INFO  (zkCallback-4319-thread-1) [    ] o.a.s.c.c.ZkStateReader Updated live nodes from ZooKeeper... (3) -> (4)
   [junit4]   2> 1689271 INFO  (zkCallback-4293-thread-1) [    ] o.a.s.c.c.ZkStateReader Updated live nodes from ZooKeeper... (3) -> (4)
   [junit4]   2> 1689271 INFO  (zkCallback-4304-thread-1) [    ] o.a.s.c.c.ZkStateReader Updated live nodes from ZooKeeper... (3) -> (4)
   [junit4]   2> 1689271 INFO  (zkCallback-4286-thread-2) [    ] o.a.s.c.c.ZkStateReader Updated live nodes from ZooKeeper... (3) -> (4)
   [junit4]   2> 1689271 INFO  (zkCallback-4335-thread-1) [    ] o.a.s.c.c.ZkStateReader Updated live nodes from ZooKeeper... (3) -> (4)
   [junit4]   2> 1689274 INFO  (zkCallback-4344-thread-1) [    ] o.a.s.c.c.ZkStateReader Updated live nodes from ZooKeeper... (3) -> (4)
   [junit4]   2> 1689291 INFO  (zkConnectionManagerCallback-4352-thread-1) [    ] o.a.s.c.c.ConnectionManager zkClient has connected
   [junit4]   2> 1689292 INFO  (TEST-ChaosMonkeySafeLeaderTest.test-seed#[4C259C22B4978AC1]) [    ] o.a.s.c.c.ZkStateReader Updated live nodes from ZooKeeper... (0) -> (4)
   [junit4]   2> 1689293 INFO  (TEST-ChaosMonkeySafeLeaderTest.test-seed#[4C259C22B4978AC1]) [    ] o.a.s.c.s.i.ZkClientClusterStateProvider Cluster at 127.0.0.1:39409/solr ready
   [junit4]   2> 1689293 INFO  (TEST-ChaosMonkeySafeLeaderTest.test-seed#[4C259C22B4978AC1]) [    ] o.a.s.h.a.MetricsHistoryHandler No .system collection, keeping metrics history in memory.
   [junit4]   2> 1689312 INFO  (TEST-ChaosMonkeySafeLeaderTest.test-seed#[4C259C22B4978AC1]) [    ] o.a.s.m.r.SolrJmxReporter JMX monitoring for 'solr.node' (registry 'solr.node') enabled at server: com.sun.jmx.mbeanserver.JmxMBeanServer@1886f4e
   [junit4]   2> 1689323 INFO  (TEST-ChaosMonkeySafeLeaderTest.test-seed#[4C259C22B4978AC1]) [    ] o.a.s.m.r.SolrJmxReporter JMX monitoring for 'solr.jvm' (registry 'solr.jvm') enabled at server: com.sun.jmx.mbeanserver.JmxMBeanServer@1886f4e
   [junit4]   2> 1689323 INFO  (TEST-ChaosMonkeySafeLeaderTest.test-seed#[4C259C22B4978AC1]) [    ] o.a.s.m.r.SolrJmxReporter JMX monitoring for 'solr.jetty' (registry 'solr.jetty') enabled at server: com.sun.jmx.mbeanserver.JmxMBeanServer@1886f4e
   [junit4]   2> 1689325 INFO  (TEST-ChaosMonkeySafeLeaderTest.test-seed#[4C259C22B4978AC1]) [    ] o.a.s.c.CorePropertiesLocator Found 0 core definitions underneath /x1/jenkins/jenkins-slave/workspace/Lucene-Solr-Tests-master/solr/build/solr-core/test/J0/../../../../../../../../../../x1/jenkins/jenkins-slave/workspace/Lucene-Solr-Tests-master/solr/build/solr-core/test/J0/temp/solr.cloud.ChaosMonkeySafeLeaderTest_4C259C22B4978AC1-001/shard-3-001/cores
   [junit4]   2> 1689369 INFO  (qtp1706250941-16797) [n:127.0.0.1:33466_    ] o.a.s.h.a.CollectionsHandler Invoked Collection Action :addreplica with params node=127.0.0.1:46784_&action=ADDREPLICA&collection=collection1&shard=shard1&type=NRT&wt=javabin&version=2 and sendToOCPQueue=true
   [junit4]   2> 1689372 INFO  (OverseerCollectionConfigSetProcessor-72404967250657284-127.0.0.1:44948_-n_0000000000) [n:127.0.0.1:44948_    ] o.a.s.c.OverseerTaskQueue Response ZK path: /overseer/collection-queue-work/qnr-0000000006 doesn't exist.  Requestor may have disconnected from ZooKeeper
   [junit4]   2> 1689373 INFO  (OverseerThreadFactory-6539-thread-5-processing-n:127.0.0.1:44948_) [n:127.0.0.1:44948_ c:collection1 s:shard1  ] o.a.s.c.a.c.AddReplicaCmd Node Identified 127.0.0.1:46784_ for creating new replica of shard shard1
   [junit4]   2> 1689376 INFO  (qtp1772200927-16840) [n:127.0.0.1:46784_    x:collection1_shard1_replica_n65] o.a.s.h.a.CoreAdminOperation core create command qt=/admin/cores&collection.configName=conf1&name=collection1_shard1_replica_n65&action=CREATE&collection=collection1&shard=shard1&wt=javabin&version=2&replicaType=NRT
   [junit4]   2> 1689482 INFO  (zkCallback-4312-thread-1) [    ] o.a.s.c.c.ZkStateReader A cluster state change: [WatchedEvent state:SyncConnected type:NodeDataChanged path:/collections/collection1/state.json] for collection [collection1] has occurred - updating... (live nodes size: [4])
   [junit4]   2> 1689482 INFO  (zkCallback-4328-thread-1) [    ] o.a.s.c.c.ZkStateReader A cluster state change: [WatchedEvent state:SyncConnected type:NodeDataChanged path:/collections/collection1/state.json] for collection [collection1] has occurred - updating... (live nodes size: [4])
   [junit4]   2> 1690394 INFO  (qtp1772200927-16840) [n:127.0.0.1:46784_ c:collection1 s:shard1  x:collection1_shard1_replica_n65] o.a.s.c.SolrConfig Using Lucene MatchVersion: 8.0.0
   [junit4]   2> 1690426 INFO  (qtp1772200927-16840) [n:127.0.0.1:46784_ c:collection1 s:shard1  x:collection1_shard1_replica_n65] o.a.s.s.IndexSchema [collection1_shard1_replica_n65] Schema name=test
   [junit4]   2> 1690492 INFO  (qtp1772200927-16840) [n:127.0.0.1:46784_ c:collection1 s:shard1  x:collection1_shard1_replica_n65] o.a.s.s.IndexSchema Loaded schema test/1.6 with uniqueid field id
   [junit4]   2> 1690506 INFO  (qtp1772200927-16840) [n:127.0.0.1:46784_ c:collection1 s:shard1  x:collection1_shard1_replica_n65] o.a.s.c.CoreContainer Creating SolrCore 'collection1_shard1_replica_n65' using configuration from collection collection1, trusted=true
   [junit4]   2> 1690506 INFO  (qtp1772200927-16840) [n:127.0.0.1:46784_ c:collection1 s:shard1  x:collection1_shard1_replica_n65] o.a.s.m.r.SolrJmxReporter JMX monitoring for 'solr.core.collection1.shard1.replica_n65' (registry 'solr.core.collection1.shard1.replica_n65') enabled at server: com.sun.jmx.mbeanserver.JmxMBeanServer@1886f4e
   [junit4]   2> 1690506 INFO  (qtp1772200927-16840) [n:127.0.0.1:46784_ c:collection1 s:shard1  x:collection1_shard1_replica_n65] o.a.s.c.SolrCore [[collection1_shard1_replica_n65] ] Opening new SolrCore at [/x1/jenkins/jenkins-slave/workspace/Lucene-Solr-Tests-master/solr/build/solr-core/test/J0/temp/solr.cloud.ChaosMonkeySafeLeaderTest_4C259C22B4978AC1-001/shard-3-001/cores/collection1_shard1_replica_n65], dataDir=[/x1/jenkins/jenkins-slave/workspace/Lucene-Solr-Tests-master/solr/build/solr-core/test/J0/../../../../../../../../../../x1/jenkins/jenkins-slave/workspace/Lucene-Solr-Tests-master/solr/build/solr-core/test/J0/temp/solr.cloud.ChaosMonkeySafeLeaderTest_4C259C22B4978AC1-001/shard-3-001/cores/collection1_shard1_replica_n65/data/]
   [junit4]   2> 1690510 INFO  (qtp1772200927-16840) [n:127.0.0.1:46784_ c:collection1 s:shard1  x:collection1_shard1_replica_n65] o.a.s.u.RandomMergePolicy RandomMergePolicy wrapping class org.apache.lucene.index.TieredMergePolicy: [TieredMergePolicy: maxMergeAtOnce=23, maxMergeAtOnceExplicit=38, maxMergedSegmentMB=10.4482421875, floorSegmentMB=1.7587890625, forceMergeDeletesPctAllowed=14.618191803893929, segmentsPerTier=30.0, maxCFSSegmentSizeMB=8.796093022207999E12, noCFSRatio=0.8587348782650409, deletesPctAllowed=37.36935891244357
   [junit4]   2> 1690516 WARN  (qtp1772200927-16840) [n:127.0.0.1:46784_ c:collection1 s:shard1  x:collection1_shard1_replica_n65] o.a.s.c.RequestHandlers INVALID paramSet a in requestHandler {type = requestHandler,name = /dump,class = DumpRequestHandler,attributes = {initParams=a, name=/dump, class=DumpRequestHandler},args = {defaults={a=A,b=B}}}
   [junit4]   2> 1690578 INFO  (qtp1772200927-16840) [n:127.0.0.1:46784_ c:collection1 s:shard1  x:collection1_shard1_replica_n65] o.a.s.u.UpdateHandler Using UpdateLog implementation: org.apache.solr.update.UpdateLog
   [junit4]   2> 1690578 INFO  (qtp1772200927-16840) [n:127.0.0.1:46784_ c:collection1 s:shard1  x:collection1_shard1_replica_n65] o.a.s.u.UpdateLog Initializing UpdateLog: dataDir= defaultSyncLevel=FLUSH numRecordsToKeep=100 maxNumLogsToKeep=10 numVersionBuckets=65536
   [junit4]   2> 1690580 INFO  (qtp1772200927-16840) [n:127.0.0.1:46784_ c:collection1 s:shard1  x:collection1_shard1_replica_n65] o.a.s.u.CommitTracker Hard AutoCommit: if uncommitted for 15000ms; 
   [junit4]   2> 1690580 INFO  (qtp1772200927-16840) [n:127.0.0.1:46784_ c:collection1 s:shard1  x:collection1_shard1_replica_n65] o.a.s.u.CommitTracker Soft AutoCommit: disabled
   [junit4]   2> 1690581 INFO  (qtp1772200927-16840) [n:127.0.0.1:46784_ c:collection1 s:shard1  x:collection1_shard1_replica_n65] o.a.s.u.RandomMergePolicy RandomMergePolicy wrapping class org.apache.lucene.index.TieredMergePolicy: [TieredMergePolicy: maxMergeAtOnce=46, maxMergeAtOnceExplicit=15, maxMergedSegmentMB=89.8759765625, floorSegmentMB=2.1787109375, forceMergeDeletesPctAllowed=18.250217419840464, segmentsPerTier=42.0, maxCFSSegmentSizeMB=8.796093022207999E12, noCFSRatio=1.0, deletesPctAllowed=47.270165543028625
   [junit4]   2> 1690581 INFO  (qtp1772200927-16840) [n:127.0.0.1:46784_ c:collection1 s:shard1  x:collection1_shard1_replica_n65] o.a.s.s.SolrIndexSearcher Opening [Searcher@1681f320[collection1_shard1_replica_n65] main]
   [junit4]   2> 1690582 INFO  (qtp1772200927-16840) [n:127.0.0.1:46784_ c:collection1 s:shard1  x:collection1_shard1_replica_n65] o.a.s.r.ManagedResourceStorage Configured ZooKeeperStorageIO with znodeBase: /configs/conf1
   [junit4]   2> 1690583 INFO  (qtp1772200927-16840) [n:127.0.0.1:46784_ c:collection1 s:shard1  x:collection1_shard1_replica_n65] o.a.s.r.ManagedResourceStorage Loaded null at path _rest_managed.json using ZooKeeperStorageIO:path=/configs/conf1
   [junit4]   2> 1690583 INFO  (qtp1772200927-16840) [n:127.0.0.1:46784_ c:collection1 s:shard1  x:collection1_shard1_replica_n65] o.a.s.h.ReplicationHandler Commits will be reserved for 10000ms.
   [junit4]   2> 1690584 INFO  (searcherExecutor-6586-thread-1-processing-n:127.0.0.1:46784_ x:collection1_shard1_replica_n65 c:collection1 s:shard1) [n:127.0.0.1:46784_ c:collection1 s:shard1  x:collection1_shard1_replica_n65] o.a.s.c.SolrCore [collection1_shard1_replica_n65] Registered new searcher Searcher@1681f320[collection1_shard1_replica_n65] main{ExitableDirectoryReader(UninvertingDirectoryReader())}
   [junit4]   2> 1690584 INFO  (qtp1772200927-16840) [n:127.0.0.1:46784_ c:collection1 s:shard1  x:collection1_shard1_replica_n65] o.a.s.u.UpdateLog Could not find max version in index or recent updates, using new clock 1612722243483205632
   [junit4]   2> 1690589 INFO  (qtp1772200927-16840) [n:127.0.0.1:46784_ c:collection1 s:shard1  x:collection1_shard1_replica_n65] o.a.s.c.ZkShardTerms Successful update of terms at /collections/collection1/terms/shard1 to Terms{values={core_node66=0}, version=0}
   [junit4]   2> 1690593 INFO  (qtp1772200927-16840) [n:127.0.0.1:46784_ c:collection1 s:shard1  x:collection1_shard1_replica_n65] o.a.s.c.ShardLeaderElectionContext Enough replicas found to continue.
   [junit4]   2> 1690593 INFO  (qtp1772200927-16840) [n:127.0.0.1:46784_ c:collection1 s:shard1  x:collection1_shard1_replica_n65] o.a.s.c.ShardLeaderElectionContext I may be the new leader - try and sync
   [junit4]   2> 1690593 INFO  (qtp1772200927-16840) [n:127.0.0.1:46784_ c:collection1 s:shard1  x:collection1_shard1_replica_n65] o.a.s.c.SyncStrategy Sync replicas to http://127.0.0.1:46784/collection1_shard1_replica_n65/
   [junit4]   2> 1690593 INFO  (qtp1772200927-16840) [n:127.0.0.1:46784_ c:collection1 s:shard1  x:collection1_shard1_replica_n65] o.a.s.c.SyncStrategy Sync Success - now sync replicas to me
   [junit4]   2> 1690593 INFO  (qtp1772200927-16840) [n:127.0.0.1:46784_ c:collection1 s:shard1  x:collection1_shard1_replica_n65] o.a.s.c.SyncStrategy http://127.0.0.1:46784/collection1_shard1_replica_n65/ has no replicas
   [junit4]   2> 1690593 INFO  (qtp1772200927-16840) [n:127.0.0.1:46784_ c:collection1 s:shard1  x:collection1_shard1_replica_n65] o.a.s.c.ShardLeaderElectionContext Found all replicas participating in election, clear LIR
   [junit4]   2> 1690596 INFO  (qtp1772200927-16840) [n:127.0.0.1:46784_ c:collection1 s:shard1  x:collection1_shard1_replica_n65] o.a.s.c.ShardLeaderElectionContext I am the new leader: http://127.0.0.1:46784/collection1_shard1_replica_n65/ shard1
   [junit4]   2> 1690698 INFO  (zkCallback-4328-thread-1) [    ] o.a.s.c.c.ZkStateReader A cluster state change: [WatchedEvent state:SyncConnected type:NodeDataChanged path:/collections/collection1/state.json] for collection [collection1] has occurred - updating... (live nodes size: [4])
   [junit4]   2> 1690698 INFO  (zkCallback-4312-thread-1) [    ] o.a.s.c.c.ZkStateReader A cluster state change: [WatchedEvent state:SyncConnected type:NodeDataChanged path:/collections/collection1/state.json] for collection [collection1] has occurred - updating... (live nodes size: [4])
   [junit4]   2> 1690700 INFO  (qtp1772200927-16840) [n:127.0.0.1:46784_ c:collection1 s:shard1  x:collection1_shard1_replica_n65] o.a.s.c.ZkController I am the leader, no recovery necessary
   [junit4]   2> 1690702 INFO  (qtp1772200927-16840) [n:127.0.0.1:46784_ c:collection1 s:shard1  x:collection1_shard1_replica_n65] o.a.s.s.HttpSolrCall [admin] webapp=null path=/admin/cores params={qt=/admin/cores&collection.configName=conf1&name=collection1_shard1_replica_n65&action=CREATE&collection=collection1&shard=shard1&wt=javabin&version=2&replicaType=NRT} status=0 QTime=1326
   [junit4]   2> 1690705 INFO  (qtp1706250941-16797) [n:127.0.0.1:33466_ c:collection1   ] o.a.s.s.HttpSolrCall [admin] webapp=null path=/admin/collections params={node=127.0.0.1:46784_&action=ADDREPLICA&collection=collection1&shard=shard1&type=NRT&wt=javabin&version=2} status=0 QTime=1336
   [junit4]   2> 1690802 INFO  (zkCallback-4328-thread-1) [    ] o.a.s.c.c.ZkStateReader A cluster state change: [WatchedEvent state:SyncConnected type:NodeDataChanged path:/collections/collection1/state.json] for collection [collection1] has occurred - updating... (live nodes size: [4])
   [junit4]   2> 1690802 INFO  (zkCallback-4344-thread-1) [    ] o.a.s.c.c.ZkStateReader A cluster state change: [WatchedEvent state:SyncConnected type:NodeDataChanged path:/collections/collection1/state.json] for collection [collection1] has occurred - updating... (live nodes size: [4])
   [junit4]   2> 1690802 INFO  (zkCallback-4312-thread-1) [    ] o.a.s.c.c.ZkStateReader A cluster state change: [WatchedEvent state:SyncConnected type:NodeDataChanged path:/collections/collection1/state.json] for collection [collection1] has occurred - updating... (live nodes size: [4])
   [junit4]   2> 1690826 INFO  (TEST-ChaosMonkeySafeLeaderTest.test-seed#[4C259C22B4978AC1]) [    ] o.a.s.c.AbstractFullDistribZkTestBase create jetty 4 in directory /x1/jenkins/jenkins-slave/workspace/Lucene-Solr-Tests-master/solr/build/solr-core/test/J0/temp/solr.cloud.ChaosMonkeySafeLeaderTest_4C259C22B4978AC1-001/shard-4-001 of type NRT
   [junit4]   2> 1690827 INFO  (TEST-ChaosMonkeySafeLeaderTest.test-seed#[4C259C22B4978AC1]) [    ] o.e.j.s.Server jetty-9.4.11.v20180605; built: 2018-06-05T18:24:03.829Z; git: d5fc0523cfa96bfebfbda19606cad384d772f04c; jvm 1.8.0_172-b11
   [junit4]   2> 1690828 INFO  (TEST-ChaosMonkeySafeLeaderTest.test-seed#[4C259C22B4978AC1]) [    ] o.e.j.s.session DefaultSessionIdManager workerName=node0
   [junit4]   2> 1690828 INFO  (TEST-ChaosMonkeySafeLeaderTest.test-seed#[4C259C22B4978AC1]) [    ] o.e.j.s.session No SessionScavenger set, using defaults
   [junit4]   2> 1690828 INFO  (TEST-ChaosMonkeySafeLeaderTest.test-seed#[4C259C22B4978AC1]) [    ] o.e.j.s.session node0 Scavenging every 600000ms
   [junit4]   2> 1690828 INFO  (TEST-ChaosMonkeySafeLeaderTest.test-seed#[4C259C22B4978AC1]) [    ] o.e.j.s.h.ContextHandler Started o.e.j.s.ServletContextHandler@4f51df22{/,null,AVAILABLE}
   [junit4]   2> 1690829 INFO  (TEST-ChaosMonkeySafeLeaderTest.test-seed#[4C259C22B4978AC1]) [    ] o.e.j.s.AbstractConnector Started ServerConnector@66e79cc3{HTTP/1.1,[http/1.1]}{127.0.0.1:?????}
   [junit4]   2> 1690829 INFO  (TEST-ChaosMonkeySafeLeaderTest.test-seed#[4C259C22B4978AC1]) [    ] o.e.j.s.Server Started @???????ms
   [junit4]   2> 1690829 INFO  (TEST-ChaosMonkeySafeLeaderTest.test-seed#[4C259C22B4978AC1]) [    ] o.a.s.c.s.e.JettySolrRunner Jetty properties: {solr.data.dir=/x1/jenkins/jenkins-slave/workspace/Lucene-Solr-Tests-master/solr/build/solr-core/test/J0/temp/solr.cloud.ChaosMonkeySafeLeaderTest_4C259C22B4978AC1-001/tempDir-001/jetty4, replicaType=NRT, solrconfig=solrconfig.xml, hostContext=/, hostPort=44256, coreRootDirectory=/x1/jenkins/jenkins-sla

[...truncated too long message...]

d.ivy.jars.list as its length is 0.

-ivy-fail-disallowed-ivy-version:

ivy-fail:

ivy-fail:

ivy-configure:
[ivy:configure] :: loading settings :: file = /x1/jenkins/jenkins-slave/workspace/Lucene-Solr-Tests-master/lucene/top-level-ivy-settings.xml

resolve:

ivy-availability-check:
[loadresource] Do not set property disallowed.ivy.jars.list as its length is 0.

-ivy-fail-disallowed-ivy-version:

ivy-fail:

ivy-configure:
[ivy:configure] :: loading settings :: file = /x1/jenkins/jenkins-slave/workspace/Lucene-Solr-Tests-master/lucene/top-level-ivy-settings.xml

resolve:

ivy-availability-check:
[loadresource] Do not set property disallowed.ivy.jars.list as its length is 0.

-ivy-fail-disallowed-ivy-version:

ivy-fail:

ivy-fail:

ivy-configure:
[ivy:configure] :: loading settings :: file = /x1/jenkins/jenkins-slave/workspace/Lucene-Solr-Tests-master/lucene/top-level-ivy-settings.xml

resolve:

ivy-availability-check:
[loadresource] Do not set property disallowed.ivy.jars.list as its length is 0.

-ivy-fail-disallowed-ivy-version:

ivy-fail:

ivy-configure:
[ivy:configure] :: loading settings :: file = /x1/jenkins/jenkins-slave/workspace/Lucene-Solr-Tests-master/lucene/top-level-ivy-settings.xml

resolve:

ivy-availability-check:
[loadresource] Do not set property disallowed.ivy.jars.list as its length is 0.

-ivy-fail-disallowed-ivy-version:

ivy-fail:

ivy-fail:

ivy-configure:
[ivy:configure] :: loading settings :: file = /x1/jenkins/jenkins-slave/workspace/Lucene-Solr-Tests-master/lucene/top-level-ivy-settings.xml

resolve:

ivy-availability-check:
[loadresource] Do not set property disallowed.ivy.jars.list as its length is 0.

-ivy-fail-disallowed-ivy-version:

ivy-fail:

ivy-fail:

ivy-configure:
[ivy:configure] :: loading settings :: file = /x1/jenkins/jenkins-slave/workspace/Lucene-Solr-Tests-master/lucene/top-level-ivy-settings.xml

resolve:

ivy-availability-check:
[loadresource] Do not set property disallowed.ivy.jars.list as its length is 0.

-ivy-fail-disallowed-ivy-version:

ivy-fail:

ivy-fail:

ivy-configure:
[ivy:configure] :: loading settings :: file = /x1/jenkins/jenkins-slave/workspace/Lucene-Solr-Tests-master/lucene/top-level-ivy-settings.xml

resolve:

ivy-availability-check:
[loadresource] Do not set property disallowed.ivy.jars.list as its length is 0.

-ivy-fail-disallowed-ivy-version:

ivy-fail:

ivy-fail:

ivy-configure:
[ivy:configure] :: loading settings :: file = /x1/jenkins/jenkins-slave/workspace/Lucene-Solr-Tests-master/lucene/top-level-ivy-settings.xml

resolve:

ivy-availability-check:
[loadresource] Do not set property disallowed.ivy.jars.list as its length is 0.

-ivy-fail-disallowed-ivy-version:

ivy-fail:

ivy-fail:

ivy-configure:
[ivy:configure] :: loading settings :: file = /x1/jenkins/jenkins-slave/workspace/Lucene-Solr-Tests-master/lucene/top-level-ivy-settings.xml

resolve:

ivy-availability-check:
[loadresource] Do not set property disallowed.ivy.jars.list as its length is 0.

-ivy-fail-disallowed-ivy-version:

ivy-fail:

ivy-fail:

ivy-configure:
[ivy:configure] :: loading settings :: file = /x1/jenkins/jenkins-slave/workspace/Lucene-Solr-Tests-master/lucene/top-level-ivy-settings.xml

resolve:

ivy-availability-check:
[loadresource] Do not set property disallowed.ivy.jars.list as its length is 0.

-ivy-fail-disallowed-ivy-version:

ivy-fail:

ivy-fail:

ivy-configure:
[ivy:configure] :: loading settings :: file = /x1/jenkins/jenkins-slave/workspace/Lucene-Solr-Tests-master/lucene/top-level-ivy-settings.xml

resolve:

ivy-availability-check:
[loadresource] Do not set property disallowed.ivy.jars.list as its length is 0.

-ivy-fail-disallowed-ivy-version:

ivy-fail:

ivy-fail:

ivy-configure:
[ivy:configure] :: loading settings :: file = /x1/jenkins/jenkins-slave/workspace/Lucene-Solr-Tests-master/lucene/top-level-ivy-settings.xml

resolve:

ivy-availability-check:
[loadresource] Do not set property disallowed.ivy.jars.list as its length is 0.

-ivy-fail-disallowed-ivy-version:

ivy-fail:

ivy-fail:

ivy-configure:
[ivy:configure] :: loading settings :: file = /x1/jenkins/jenkins-slave/workspace/Lucene-Solr-Tests-master/lucene/top-level-ivy-settings.xml

resolve:

ivy-availability-check:
[loadresource] Do not set property disallowed.ivy.jars.list as its length is 0.

-ivy-fail-disallowed-ivy-version:

ivy-fail:

ivy-fail:

ivy-configure:
[ivy:configure] :: loading settings :: file = /x1/jenkins/jenkins-slave/workspace/Lucene-Solr-Tests-master/lucene/top-level-ivy-settings.xml

resolve:

jar-checksums:
    [mkdir] Created dir: /x1/jenkins/jenkins-slave/workspace/Lucene-Solr-Tests-master/solr/null904191790
     [copy] Copying 238 files to /x1/jenkins/jenkins-slave/workspace/Lucene-Solr-Tests-master/solr/null904191790
   [delete] Deleting directory /x1/jenkins/jenkins-slave/workspace/Lucene-Solr-Tests-master/solr/null904191790

check-working-copy:
[ivy:cachepath] :: resolving dependencies :: org.eclipse.jgit#org.eclipse.jgit-caller;working
[ivy:cachepath] 	confs: [default]
[ivy:cachepath] 	found org.eclipse.jgit#org.eclipse.jgit;4.6.0.201612231935-r in public
[ivy:cachepath] 	found com.jcraft#jsch;0.1.53 in public
[ivy:cachepath] 	found com.googlecode.javaewah#JavaEWAH;1.1.6 in public
[ivy:cachepath] 	found org.apache.httpcomponents#httpclient;4.3.6 in public
[ivy:cachepath] 	found org.apache.httpcomponents#httpcore;4.3.3 in public
[ivy:cachepath] 	found commons-logging#commons-logging;1.1.3 in public
[ivy:cachepath] 	found commons-codec#commons-codec;1.6 in public
[ivy:cachepath] 	found org.slf4j#slf4j-api;1.7.2 in public
[ivy:cachepath] :: resolution report :: resolve 63ms :: artifacts dl 6ms
	---------------------------------------------------------------------
	|                  |            modules            ||   artifacts   |
	|       conf       | number| search|dwnlded|evicted|| number|dwnlded|
	---------------------------------------------------------------------
	|      default     |   8   |   0   |   0   |   0   ||   8   |   0   |
	---------------------------------------------------------------------
[wc-checker] Initializing working copy...
[wc-checker] SLF4J: Failed to load class "org.slf4j.impl.StaticLoggerBinder".
[wc-checker] SLF4J: Defaulting to no-operation (NOP) logger implementation
[wc-checker] SLF4J: See http://www.slf4j.org/codes.html#StaticLoggerBinder for further details.
[wc-checker] Checking working copy status...

-jenkins-base:

BUILD SUCCESSFUL
Total time: 107 minutes 37 seconds
Archiving artifacts
java.lang.InterruptedException: no matches found within 10000
	at hudson.FilePath$34.hasMatch(FilePath.java:2678)
	at hudson.FilePath$34.invoke(FilePath.java:2557)
	at hudson.FilePath$34.invoke(FilePath.java:2547)
	at hudson.FilePath$FileCallableWrapper.call(FilePath.java:2918)
Also:   hudson.remoting.Channel$CallSiteStackTrace: Remote call to lucene
		at hudson.remoting.Channel.attachCallSiteStackTrace(Channel.java:1741)
		at hudson.remoting.UserRequest$ExceptionResponse.retrieve(UserRequest.java:357)
		at hudson.remoting.Channel.call(Channel.java:955)
		at hudson.FilePath.act(FilePath.java:1036)
		at hudson.FilePath.act(FilePath.java:1025)
		at hudson.FilePath.validateAntFileMask(FilePath.java:2547)
		at hudson.tasks.ArtifactArchiver.perform(ArtifactArchiver.java:243)
		at hudson.tasks.BuildStepCompatibilityLayer.perform(BuildStepCompatibilityLayer.java:81)
		at hudson.tasks.BuildStepMonitor$1.perform(BuildStepMonitor.java:20)
		at hudson.model.AbstractBuild$AbstractBuildExecution.perform(AbstractBuild.java:744)
		at hudson.model.AbstractBuild$AbstractBuildExecution.performAllBuildSteps(AbstractBuild.java:690)
		at hudson.model.Build$BuildExecution.post2(Build.java:186)
		at hudson.model.AbstractBuild$AbstractBuildExecution.post(AbstractBuild.java:635)
		at hudson.model.Run.execute(Run.java:1819)
		at hudson.model.FreeStyleBuild.run(FreeStyleBuild.java:43)
		at hudson.model.ResourceController.execute(ResourceController.java:97)
		at hudson.model.Executor.run(Executor.java:429)
Caused: hudson.FilePath$TunneledInterruptedException
	at hudson.FilePath$FileCallableWrapper.call(FilePath.java:2920)
	at hudson.remoting.UserRequest.perform(UserRequest.java:212)
	at hudson.remoting.UserRequest.perform(UserRequest.java:54)
	at hudson.remoting.Request$2.run(Request.java:369)
	at hudson.remoting.InterceptingExecutorService$1.call(InterceptingExecutorService.java:72)
	at java.util.concurrent.FutureTask.run(FutureTask.java:266)
	at java.util.concurrent.ThreadPoolExecutor.runWorker(ThreadPoolExecutor.java:1142)
	at java.util.concurrent.ThreadPoolExecutor$Worker.run(ThreadPoolExecutor.java:617)
	at java.lang.Thread.run(Thread.java:748)
Caused: java.lang.InterruptedException: java.lang.InterruptedException: no matches found within 10000
	at hudson.FilePath.act(FilePath.java:1038)
	at hudson.FilePath.act(FilePath.java:1025)
	at hudson.FilePath.validateAntFileMask(FilePath.java:2547)
	at hudson.tasks.ArtifactArchiver.perform(ArtifactArchiver.java:243)
	at hudson.tasks.BuildStepCompatibilityLayer.perform(BuildStepCompatibilityLayer.java:81)
	at hudson.tasks.BuildStepMonitor$1.perform(BuildStepMonitor.java:20)
	at hudson.model.AbstractBuild$AbstractBuildExecution.perform(AbstractBuild.java:744)
	at hudson.model.AbstractBuild$AbstractBuildExecution.performAllBuildSteps(AbstractBuild.java:690)
	at hudson.model.Build$BuildExecution.post2(Build.java:186)
	at hudson.model.AbstractBuild$AbstractBuildExecution.post(AbstractBuild.java:635)
	at hudson.model.Run.execute(Run.java:1819)
	at hudson.model.FreeStyleBuild.run(FreeStyleBuild.java:43)
	at hudson.model.ResourceController.execute(ResourceController.java:97)
	at hudson.model.Executor.run(Executor.java:429)
No artifacts found that match the file pattern "**/*.events,heapdumps/**,**/hs_err_pid*". Configuration error?
Recording test results
Build step 'Publish JUnit test result report' changed build result to UNSTABLE
Email was triggered for: Unstable (Test Failures)
Sending email for trigger: Unstable (Test Failures)

Mime
View raw message