lucene-dev mailing list archives

Site index · List index
Message view « Date » · « Thread »
Top « Date » · « Thread »
From Policeman Jenkins Server <jenk...@thetaphi.de>
Subject [JENKINS] Lucene-Solr-7.x-Solaris (64bit/jdk1.8.0) - Build # 796 - Unstable!
Date Mon, 03 Sep 2018 06:24:50 GMT
Build: https://jenkins.thetaphi.de/job/Lucene-Solr-7.x-Solaris/796/
Java: 64bit/jdk1.8.0 -XX:+UseCompressedOops -XX:+UseConcMarkSweepGC

4 tests failed.
FAILED:  junit.framework.TestSuite.org.apache.solr.search.SignificantTermsQParserPluginTest

Error Message:
1 thread leaked from SUITE scope at org.apache.solr.search.SignificantTermsQParserPluginTest:     1) Thread[id=13, name=Log4j2-TF-1-AsyncLoggerConfig--1, state=TIMED_WAITING, group=TGRP-SignificantTermsQParserPluginTest]         at sun.misc.Unsafe.park(Native Method)         at java.util.concurrent.locks.LockSupport.parkNanos(LockSupport.java:215)         at java.util.concurrent.locks.AbstractQueuedSynchronizer$ConditionObject.awaitNanos(AbstractQueuedSynchronizer.java:2078)         at com.lmax.disruptor.TimeoutBlockingWaitStrategy.waitFor(TimeoutBlockingWaitStrategy.java:38)         at com.lmax.disruptor.ProcessingSequenceBarrier.waitFor(ProcessingSequenceBarrier.java:56)         at com.lmax.disruptor.BatchEventProcessor.run(BatchEventProcessor.java:128)         at java.lang.Thread.run(Thread.java:748)

Stack Trace:
com.carrotsearch.randomizedtesting.ThreadLeakError: 1 thread leaked from SUITE scope at org.apache.solr.search.SignificantTermsQParserPluginTest: 
   1) Thread[id=13, name=Log4j2-TF-1-AsyncLoggerConfig--1, state=TIMED_WAITING, group=TGRP-SignificantTermsQParserPluginTest]
        at sun.misc.Unsafe.park(Native Method)
        at java.util.concurrent.locks.LockSupport.parkNanos(LockSupport.java:215)
        at java.util.concurrent.locks.AbstractQueuedSynchronizer$ConditionObject.awaitNanos(AbstractQueuedSynchronizer.java:2078)
        at com.lmax.disruptor.TimeoutBlockingWaitStrategy.waitFor(TimeoutBlockingWaitStrategy.java:38)
        at com.lmax.disruptor.ProcessingSequenceBarrier.waitFor(ProcessingSequenceBarrier.java:56)
        at com.lmax.disruptor.BatchEventProcessor.run(BatchEventProcessor.java:128)
        at java.lang.Thread.run(Thread.java:748)
	at __randomizedtesting.SeedInfo.seed([9D483F8C0B2F559C]:0)


FAILED:  junit.framework.TestSuite.org.apache.solr.search.SignificantTermsQParserPluginTest

Error Message:
There are still zombie threads that couldn't be terminated:    1) Thread[id=13, name=Log4j2-TF-1-AsyncLoggerConfig--1, state=TIMED_WAITING, group=TGRP-SignificantTermsQParserPluginTest]         at sun.misc.Unsafe.park(Native Method)         at java.util.concurrent.locks.LockSupport.parkNanos(LockSupport.java:215)         at java.util.concurrent.locks.AbstractQueuedSynchronizer$ConditionObject.awaitNanos(AbstractQueuedSynchronizer.java:2078)         at com.lmax.disruptor.TimeoutBlockingWaitStrategy.waitFor(TimeoutBlockingWaitStrategy.java:38)         at com.lmax.disruptor.ProcessingSequenceBarrier.waitFor(ProcessingSequenceBarrier.java:56)         at com.lmax.disruptor.BatchEventProcessor.run(BatchEventProcessor.java:128)         at java.lang.Thread.run(Thread.java:748)

Stack Trace:
com.carrotsearch.randomizedtesting.ThreadLeakError: There are still zombie threads that couldn't be terminated:
   1) Thread[id=13, name=Log4j2-TF-1-AsyncLoggerConfig--1, state=TIMED_WAITING, group=TGRP-SignificantTermsQParserPluginTest]
        at sun.misc.Unsafe.park(Native Method)
        at java.util.concurrent.locks.LockSupport.parkNanos(LockSupport.java:215)
        at java.util.concurrent.locks.AbstractQueuedSynchronizer$ConditionObject.awaitNanos(AbstractQueuedSynchronizer.java:2078)
        at com.lmax.disruptor.TimeoutBlockingWaitStrategy.waitFor(TimeoutBlockingWaitStrategy.java:38)
        at com.lmax.disruptor.ProcessingSequenceBarrier.waitFor(ProcessingSequenceBarrier.java:56)
        at com.lmax.disruptor.BatchEventProcessor.run(BatchEventProcessor.java:128)
        at java.lang.Thread.run(Thread.java:748)
	at __randomizedtesting.SeedInfo.seed([9D483F8C0B2F559C]:0)


FAILED:  junit.framework.TestSuite.org.apache.solr.search.SignificantTermsQParserPluginTest

Error Message:
1 thread leaked from SUITE scope at org.apache.solr.search.SignificantTermsQParserPluginTest:     1) Thread[id=13, name=Log4j2-TF-1-AsyncLoggerConfig--1, state=TIMED_WAITING, group=TGRP-SignificantTermsQParserPluginTest]         at sun.misc.Unsafe.park(Native Method)         at java.util.concurrent.locks.LockSupport.parkNanos(LockSupport.java:215)         at java.util.concurrent.locks.AbstractQueuedSynchronizer$ConditionObject.awaitNanos(AbstractQueuedSynchronizer.java:2078)         at com.lmax.disruptor.TimeoutBlockingWaitStrategy.waitFor(TimeoutBlockingWaitStrategy.java:38)         at com.lmax.disruptor.ProcessingSequenceBarrier.waitFor(ProcessingSequenceBarrier.java:56)         at com.lmax.disruptor.BatchEventProcessor.run(BatchEventProcessor.java:128)         at java.lang.Thread.run(Thread.java:748)

Stack Trace:
com.carrotsearch.randomizedtesting.ThreadLeakError: 1 thread leaked from SUITE scope at org.apache.solr.search.SignificantTermsQParserPluginTest: 
   1) Thread[id=13, name=Log4j2-TF-1-AsyncLoggerConfig--1, state=TIMED_WAITING, group=TGRP-SignificantTermsQParserPluginTest]
        at sun.misc.Unsafe.park(Native Method)
        at java.util.concurrent.locks.LockSupport.parkNanos(LockSupport.java:215)
        at java.util.concurrent.locks.AbstractQueuedSynchronizer$ConditionObject.awaitNanos(AbstractQueuedSynchronizer.java:2078)
        at com.lmax.disruptor.TimeoutBlockingWaitStrategy.waitFor(TimeoutBlockingWaitStrategy.java:38)
        at com.lmax.disruptor.ProcessingSequenceBarrier.waitFor(ProcessingSequenceBarrier.java:56)
        at com.lmax.disruptor.BatchEventProcessor.run(BatchEventProcessor.java:128)
        at java.lang.Thread.run(Thread.java:748)
	at __randomizedtesting.SeedInfo.seed([9D483F8C0B2F559C]:0)


FAILED:  junit.framework.TestSuite.org.apache.solr.search.SignificantTermsQParserPluginTest

Error Message:
There are still zombie threads that couldn't be terminated:    1) Thread[id=13, name=Log4j2-TF-1-AsyncLoggerConfig--1, state=TIMED_WAITING, group=TGRP-SignificantTermsQParserPluginTest]         at sun.misc.Unsafe.park(Native Method)         at java.util.concurrent.locks.LockSupport.parkNanos(LockSupport.java:215)         at java.util.concurrent.locks.AbstractQueuedSynchronizer$ConditionObject.awaitNanos(AbstractQueuedSynchronizer.java:2078)         at com.lmax.disruptor.TimeoutBlockingWaitStrategy.waitFor(TimeoutBlockingWaitStrategy.java:38)         at com.lmax.disruptor.ProcessingSequenceBarrier.waitFor(ProcessingSequenceBarrier.java:56)         at com.lmax.disruptor.BatchEventProcessor.run(BatchEventProcessor.java:128)         at java.lang.Thread.run(Thread.java:748)

Stack Trace:
com.carrotsearch.randomizedtesting.ThreadLeakError: There are still zombie threads that couldn't be terminated:
   1) Thread[id=13, name=Log4j2-TF-1-AsyncLoggerConfig--1, state=TIMED_WAITING, group=TGRP-SignificantTermsQParserPluginTest]
        at sun.misc.Unsafe.park(Native Method)
        at java.util.concurrent.locks.LockSupport.parkNanos(LockSupport.java:215)
        at java.util.concurrent.locks.AbstractQueuedSynchronizer$ConditionObject.awaitNanos(AbstractQueuedSynchronizer.java:2078)
        at com.lmax.disruptor.TimeoutBlockingWaitStrategy.waitFor(TimeoutBlockingWaitStrategy.java:38)
        at com.lmax.disruptor.ProcessingSequenceBarrier.waitFor(ProcessingSequenceBarrier.java:56)
        at com.lmax.disruptor.BatchEventProcessor.run(BatchEventProcessor.java:128)
        at java.lang.Thread.run(Thread.java:748)
	at __randomizedtesting.SeedInfo.seed([9D483F8C0B2F559C]:0)




Build Log:
[...truncated 12309 lines...]
   [junit4] Suite: org.apache.solr.search.SignificantTermsQParserPluginTest
   [junit4]   2> Sep 03, 2018 5:26:46 AM com.carrotsearch.randomizedtesting.ThreadLeakControl checkThreadLeaks
   [junit4]   2> WARNING: Will linger awaiting termination of 1 leaked thread(s).
   [junit4]   2> Sep 03, 2018 5:27:06 AM com.carrotsearch.randomizedtesting.ThreadLeakControl checkThreadLeaks
   [junit4]   2> SEVERE: 1 thread leaked from SUITE scope at org.apache.solr.search.SignificantTermsQParserPluginTest: 
   [junit4]   2>    1) Thread[id=13, name=Log4j2-TF-1-AsyncLoggerConfig--1, state=TIMED_WAITING, group=TGRP-SignificantTermsQParserPluginTest]
   [junit4]   2>         at sun.misc.Unsafe.park(Native Method)
   [junit4]   2>         at java.util.concurrent.locks.LockSupport.parkNanos(LockSupport.java:215)
   [junit4]   2>         at java.util.concurrent.locks.AbstractQueuedSynchronizer$ConditionObject.awaitNanos(AbstractQueuedSynchronizer.java:2078)
   [junit4]   2>         at com.lmax.disruptor.TimeoutBlockingWaitStrategy.waitFor(TimeoutBlockingWaitStrategy.java:38)
   [junit4]   2>         at com.lmax.disruptor.ProcessingSequenceBarrier.waitFor(ProcessingSequenceBarrier.java:56)
   [junit4]   2>         at com.lmax.disruptor.BatchEventProcessor.run(BatchEventProcessor.java:128)
   [junit4]   2>         at java.lang.Thread.run(Thread.java:748)
   [junit4]   2> Sep 03, 2018 5:27:06 AM com.carrotsearch.randomizedtesting.ThreadLeakControl tryToInterruptAll
   [junit4]   2> INFO: Starting to interrupt leaked threads:
   [junit4]   2>    1) Thread[id=13, name=Log4j2-TF-1-AsyncLoggerConfig--1, state=TIMED_WAITING, group=TGRP-SignificantTermsQParserPluginTest]
   [junit4]   2> AsyncLogger error handling event seq=0, value='null':
   [junit4]   2> java.lang.InterruptedException
   [junit4]   2> 	at java.util.concurrent.locks.AbstractQueuedSynchronizer$ConditionObject.reportInterruptAfterWait(AbstractQueuedSynchronizer.java:2014)
   [junit4]   2> 	at java.util.concurrent.locks.AbstractQueuedSynchronizer$ConditionObject.awaitNanos(AbstractQueuedSynchronizer.java:2088)
   [junit4]   2> 	at com.lmax.disruptor.TimeoutBlockingWaitStrategy.waitFor(TimeoutBlockingWaitStrategy.java:38)
   [junit4]   2> 	at com.lmax.disruptor.ProcessingSequenceBarrier.waitFor(ProcessingSequenceBarrier.java:56)
   [junit4]   2> 	at com.lmax.disruptor.BatchEventProcessor.run(BatchEventProcessor.java:128)
   [junit4]   2> 	at java.lang.Thread.run(Thread.java:748)
   [junit4]   2> AsyncLogger error handling event seq=1, value='null':
   [junit4]   2> java.lang.InterruptedException
   [junit4]   2> 	at java.util.concurrent.locks.AbstractQueuedSynchronizer$ConditionObject.reportInterruptAfterWait(AbstractQueuedSynchronizer.java:2014)
   [junit4]   2> 	at java.util.concurrent.locks.AbstractQueuedSynchronizer$ConditionObject.awaitNanos(AbstractQueuedSynchronizer.java:2088)
   [junit4]   2> 	at com.lmax.disruptor.TimeoutBlockingWaitStrategy.waitFor(TimeoutBlockingWaitStrategy.java:38)
   [junit4]   2> 	at com.lmax.disruptor.ProcessingSequenceBarrier.waitFor(ProcessingSequenceBarrier.java:56)
   [junit4]   2> 	at com.lmax.disruptor.BatchEventProcessor.run(BatchEventProcessor.java:128)
   [junit4]   2> 	at java.lang.Thread.run(Thread.java:748)
   [junit4]   2> AsyncLogger error handling event seq=2, value='null':
   [junit4]   2> java.lang.InterruptedException
   [junit4]   2> 	at java.util.concurrent.locks.AbstractQueuedSynchronizer$ConditionObject.reportInterruptAfterWait(AbstractQueuedSynchronizer.java:2014)
   [junit4]   2> 	at java.util.concurrent.locks.AbstractQueuedSynchronizer$ConditionObject.awaitNanos(AbstractQueuedSynchronizer.java:2088)
   [junit4]   2> 	at com.lmax.disruptor.TimeoutBlockingWaitStrategy.waitFor(TimeoutBlockingWaitStrategy.java:38)
   [junit4]   2> 	at com.lmax.disruptor.ProcessingSequenceBarrier.waitFor(ProcessingSequenceBarrier.java:56)
   [junit4]   2> 	at com.lmax.disruptor.BatchEventProcessor.run(BatchEventProcessor.java:128)
   [junit4]   2> 	at java.lang.Thread.run(Thread.java:748)
   [junit4]   2> AsyncLogger error handling event seq=3, value='null':
   [junit4]   2> java.lang.InterruptedException
   [junit4]   2> 	at java.util.concurrent.locks.AbstractQueuedSynchronizer$ConditionObject.reportInterruptAfterWait(AbstractQueuedSynchronizer.java:2014)
   [junit4]   2> 	at java.util.concurrent.locks.AbstractQueuedSynchronizer$ConditionObject.awaitNanos(AbstractQueuedSynchronizer.java:2088)
   [junit4]   2> 	at com.lmax.disruptor.TimeoutBlockingWaitStrategy.waitFor(TimeoutBlockingWaitStrategy.java:38)
   [junit4]   2> 	at com.lmax.disruptor.ProcessingSequenceBarrier.waitFor(ProcessingSequenceBarrier.java:56)
   [junit4]   2> 	at com.lmax.disruptor.BatchEventProcessor.run(BatchEventProcessor.java:128)
   [junit4]   2> 	at java.lang.Thread.run(Thread.java:748)
   [junit4]   2> AsyncLogger error handling event seq=4, value='null':
   [junit4]   2> java.lang.InterruptedException
   [junit4]   2> 	at java.util.concurrent.locks.AbstractQueuedSynchronizer$ConditionObject.reportInterruptAfterWait(AbstractQueuedSynchronizer.java:2014)
   [junit4]   2> 	at java.util.concurrent.locks.AbstractQueuedSynchronizer$ConditionObject.awaitNanos(AbstractQueuedSynchronizer.java:2088)
   [junit4]   2> 	at com.lmax.disruptor.TimeoutBlockingWaitStrategy.waitFor(TimeoutBlockingWaitStrategy.java:38)
   [junit4]   2> 	at com.lmax.disruptor.ProcessingSequenceBarrier.waitFor(ProcessingSequenceBarrier.java:56)
   [junit4]   2> 	at com.lmax.disruptor.BatchEventProcessor.run(BatchEventProcessor.java:128)
   [junit4]   2> 	at java.lang.Thread.run(Thread.java:748)
   [junit4]   2> AsyncLogger error handling event seq=5, value='null':
   [junit4]   2> java.lang.InterruptedException
   [junit4]   2> 	at java.util.concurrent.locks.AbstractQueuedSynchronizer$ConditionObject.reportInterruptAfterWait(AbstractQueuedSynchronizer.java:2014)
   [junit4]   2> 	at java.util.concurrent.locks.AbstractQueuedSynchronizer$ConditionObject.awaitNanos(AbstractQueuedSynchronizer.java:2088)
   [junit4]   2> 	at com.lmax.disruptor.TimeoutBlockingWaitStrategy.waitFor(TimeoutBlockingWaitStrategy.java:38)
   [junit4]   2> 	at com.lmax.disruptor.ProcessingSequenceBarrier.waitFor(ProcessingSequenceBarrier.java:56)
   [junit4]   2> 	at com.lmax.disruptor.BatchEventProcessor.run(BatchEventProcessor.java:128)
   [junit4]   2> 	at java.lang.Thread.run(Thread.java:748)
   [junit4]   2> Sep 03, 2018 5:27:09 AM com.carrotsearch.randomizedtesting.ThreadLeakControl tryToInterruptAll
   [junit4]   2> SEVERE: There are still zombie threads that couldn't be terminated:
   [junit4]   2>    1) Thread[id=13, name=Log4j2-TF-1-AsyncLoggerConfig--1, state=TIMED_WAITING, group=TGRP-SignificantTermsQParserPluginTest]
   [junit4]   2>         at sun.misc.Unsafe.park(Native Method)
   [junit4]   2>         at java.util.concurrent.locks.LockSupport.parkNanos(LockSupport.java:215)
   [junit4]   2>         at java.util.concurrent.locks.AbstractQueuedSynchronizer$ConditionObject.awaitNanos(AbstractQueuedSynchronizer.java:2078)
   [junit4]   2>         at com.lmax.disruptor.TimeoutBlockingWaitStrategy.waitFor(TimeoutBlockingWaitStrategy.java:38)
   [junit4]   2>         at com.lmax.disruptor.ProcessingSequenceBarrier.waitFor(ProcessingSequenceBarrier.java:56)
   [junit4]   2>         at com.lmax.disruptor.BatchEventProcessor.run(BatchEventProcessor.java:128)
   [junit4]   2>         at java.lang.Thread.run(Thread.java:748)
   [junit4]   2> NOTE: test params are: codec=Asserting(Lucene70): {}, docValues:{}, maxPointsInLeafNode=1348, maxMBSortInHeap=6.4924904157215995, sim=RandomSimilarity(queryNorm=false): {}, locale=ar-AE, timezone=Asia/Damascus
   [junit4]   2> NOTE: SunOS 5.11 amd64/Oracle Corporation 1.8.0_172 (64-bit)/cpus=3,threads=2,free=67061024,total=97320960
   [junit4]   2> NOTE: All tests run in this JVM: [SignificantTermsQParserPluginTest]
   [junit4]   2> NOTE: reproduce with: ant test  -Dtestcase=SignificantTermsQParserPluginTest -Dtests.seed=9D483F8C0B2F559C -Dtests.slow=true -Dtests.locale=ar-AE -Dtests.timezone=Asia/Damascus -Dtests.asserts=true -Dtests.file.encoding=UTF-8
   [junit4] ERROR   0.00s J1 | SignificantTermsQParserPluginTest (suite) <<<
   [junit4]    > Throwable #1: com.carrotsearch.randomizedtesting.ThreadLeakError: 1 thread leaked from SUITE scope at org.apache.solr.search.SignificantTermsQParserPluginTest: 
   [junit4]    >    1) Thread[id=13, name=Log4j2-TF-1-AsyncLoggerConfig--1, state=TIMED_WAITING, group=TGRP-SignificantTermsQParserPluginTest]
   [junit4]    >         at sun.misc.Unsafe.park(Native Method)
   [junit4]    >         at java.util.concurrent.locks.LockSupport.parkNanos(LockSupport.java:215)
   [junit4]    >         at java.util.concurrent.locks.AbstractQueuedSynchronizer$ConditionObject.awaitNanos(AbstractQueuedSynchronizer.java:2078)
   [junit4]    >         at com.lmax.disruptor.TimeoutBlockingWaitStrategy.waitFor(TimeoutBlockingWaitStrategy.java:38)
   [junit4]    >         at com.lmax.disruptor.ProcessingSequenceBarrier.waitFor(ProcessingSequenceBarrier.java:56)
   [junit4]    >         at com.lmax.disruptor.BatchEventProcessor.run(BatchEventProcessor.java:128)
   [junit4]    >         at java.lang.Thread.run(Thread.java:748)
   [junit4]    > 	at __randomizedtesting.SeedInfo.seed([9D483F8C0B2F559C]:0)Throwable #2: com.carrotsearch.randomizedtesting.ThreadLeakError: There are still zombie threads that couldn't be terminated:
   [junit4]    >    1) Thread[id=13, name=Log4j2-TF-1-AsyncLoggerConfig--1, state=TIMED_WAITING, group=TGRP-SignificantTermsQParserPluginTest]
   [junit4]    >         at sun.misc.Unsafe.park(Native Method)
   [junit4]    >         at java.util.concurrent.locks.LockSupport.parkNanos(LockSupport.java:215)
   [junit4]    >         at java.util.concurrent.locks.AbstractQueuedSynchronizer$ConditionObject.awaitNanos(AbstractQueuedSynchronizer.java:2078)
   [junit4]    >         at com.lmax.disruptor.TimeoutBlockingWaitStrategy.waitFor(TimeoutBlockingWaitStrategy.java:38)
   [junit4]    >         at com.lmax.disruptor.ProcessingSequenceBarrier.waitFor(ProcessingSequenceBarrier.java:56)
   [junit4]    >         at com.lmax.disruptor.BatchEventProcessor.run(BatchEventProcessor.java:128)
   [junit4]    >         at java.lang.Thread.run(Thread.java:748)
   [junit4]    > 	at __randomizedtesting.SeedInfo.seed([9D483F8C0B2F559C]:0)
   [junit4] Completed [1/831 (1!)] on J1 in 25.95s, 1 test, 2 errors <<< FAILURES!

[...truncated 51548 lines...]
[asciidoctor:convert] asciidoctor: ERROR: about-this-guide.adoc: line 1: invalid part, must have at least one section (e.g., chapter, appendix, etc.)
[asciidoctor:convert] asciidoctor: WARNING: simulations.adoc: line 25: section title out of sequence: expected level 3, got level 4
[asciidoctor:convert] asciidoctor: WARNING: simulations.adoc: line 92: section title out of sequence: expected level 3, got level 4
[asciidoctor:convert] asciidoctor: ERROR: solr-glossary.adoc: line 1: invalid part, must have at least one section (e.g., chapter, appendix, etc.)
[asciidoctor:convert] asciidoctor: WARNING: simulations.adoc: line 25: section title out of sequence: expected levels 0 or 1, got level 2
[asciidoctor:convert] asciidoctor: WARNING: simulations.adoc: line 92: section title out of sequence: expected levels 0 or 1, got level 2
     [java] Processed 2310 links (1863 relative) to 3131 anchors in 245 files
     [echo] Validated Links & Anchors via: /export/home/jenkins/workspace/Lucene-Solr-7.x-Solaris/solr/build/solr-ref-guide/bare-bones-html/

-documentation-lint:
    [jtidy] Checking for broken html (such as invalid tags)...
   [delete] Deleting directory /export/home/jenkins/workspace/Lucene-Solr-7.x-Solaris/lucene/build/jtidy_tmp
     [echo] Checking for broken links...
     [exec] 
     [exec] Crawl/parse...
     [exec] 
     [exec] Verify...
     [echo] Checking for malformed docs...

jar-checksums:

resolve:

ivy-availability-check:
[loadresource] Do not set property disallowed.ivy.jars.list as its length is 0.

-ivy-fail-disallowed-ivy-version:

ivy-fail:

ivy-configure:
[ivy:configure] :: loading settings :: file = /export/home/jenkins/workspace/Lucene-Solr-7.x-Solaris/lucene/top-level-ivy-settings.xml

resolve:

ivy-availability-check:
[loadresource] Do not set property disallowed.ivy.jars.list as its length is 0.

-ivy-fail-disallowed-ivy-version:

ivy-fail:

ivy-configure:
[ivy:configure] :: loading settings :: file = /export/home/jenkins/workspace/Lucene-Solr-7.x-Solaris/lucene/top-level-ivy-settings.xml

resolve:

resolve:

ivy-availability-check:
[loadresource] Do not set property disallowed.ivy.jars.list as its length is 0.

-ivy-fail-disallowed-ivy-version:

ivy-fail:

ivy-configure:
[ivy:configure] :: loading settings :: file = /export/home/jenkins/workspace/Lucene-Solr-7.x-Solaris/lucene/top-level-ivy-settings.xml

resolve:

ivy-availability-check:
[loadresource] Do not set property disallowed.ivy.jars.list as its length is 0.

-ivy-fail-disallowed-ivy-version:

ivy-fail:

ivy-configure:
[ivy:configure] :: loading settings :: file = /export/home/jenkins/workspace/Lucene-Solr-7.x-Solaris/lucene/top-level-ivy-settings.xml

resolve:

ivy-availability-check:
[loadresource] Do not set property disallowed.ivy.jars.list as its length is 0.

-ivy-fail-disallowed-ivy-version:

ivy-fail:

ivy-configure:
[ivy:configure] :: loading settings :: file = /export/home/jenkins/workspace/Lucene-Solr-7.x-Solaris/lucene/top-level-ivy-settings.xml

resolve:

ivy-availability-check:
[loadresource] Do not set property disallowed.ivy.jars.list as its length is 0.

-ivy-fail-disallowed-ivy-version:

ivy-fail:

ivy-configure:
[ivy:configure] :: loading settings :: file = /export/home/jenkins/workspace/Lucene-Solr-7.x-Solaris/lucene/top-level-ivy-settings.xml

resolve:

ivy-availability-check:
[loadresource] Do not set property disallowed.ivy.jars.list as its length is 0.

-ivy-fail-disallowed-ivy-version:

ivy-fail:

ivy-configure:
[ivy:configure] :: loading settings :: file = /export/home/jenkins/workspace/Lucene-Solr-7.x-Solaris/lucene/top-level-ivy-settings.xml

resolve:

ivy-availability-check:
[loadresource] Do not set property disallowed.ivy.jars.list as its length is 0.

-ivy-fail-disallowed-ivy-version:

ivy-fail:

ivy-configure:
[ivy:configure] :: loading settings :: file = /export/home/jenkins/workspace/Lucene-Solr-7.x-Solaris/lucene/top-level-ivy-settings.xml

resolve:

ivy-availability-check:
[loadresource] Do not set property disallowed.ivy.jars.list as its length is 0.

-ivy-fail-disallowed-ivy-version:

ivy-fail:

ivy-configure:
[ivy:configure] :: loading settings :: file = /export/home/jenkins/workspace/Lucene-Solr-7.x-Solaris/lucene/top-level-ivy-settings.xml

resolve:

ivy-availability-check:
[loadresource] Do not set property disallowed.ivy.jars.list as its length is 0.

-ivy-fail-disallowed-ivy-version:

ivy-fail:

ivy-configure:
[ivy:configure] :: loading settings :: file = /export/home/jenkins/workspace/Lucene-Solr-7.x-Solaris/lucene/top-level-ivy-settings.xml

resolve:

ivy-availability-check:
[loadresource] Do not set property disallowed.ivy.jars.list as its length is 0.

-ivy-fail-disallowed-ivy-version:

ivy-fail:

ivy-configure:
[ivy:configure] :: loading settings :: file = /export/home/jenkins/workspace/Lucene-Solr-7.x-Solaris/lucene/top-level-ivy-settings.xml

resolve:

ivy-availability-check:
[loadresource] Do not set property disallowed.ivy.jars.list as its length is 0.

-ivy-fail-disallowed-ivy-version:

ivy-fail:

ivy-configure:
[ivy:configure] :: loading settings :: file = /export/home/jenkins/workspace/Lucene-Solr-7.x-Solaris/lucene/top-level-ivy-settings.xml

resolve:

ivy-availability-check:
[loadresource] Do not set property disallowed.ivy.jars.list as its length is 0.

-ivy-fail-disallowed-ivy-version:

ivy-fail:

ivy-configure:
[ivy:configure] :: loading settings :: file = /export/home/jenkins/workspace/Lucene-Solr-7.x-Solaris/lucene/top-level-ivy-settings.xml

resolve:

ivy-availability-check:
[loadresource] Do not set property disallowed.ivy.jars.list as its length is 0.

-ivy-fail-disallowed-ivy-version:

ivy-fail:

ivy-configure:
[ivy:configure] :: loading settings :: file = /export/home/jenkins/workspace/Lucene-Solr-7.x-Solaris/lucene/top-level-ivy-settings.xml

resolve:

ivy-availability-check:
[loadresource] Do not set property disallowed.ivy.jars.list as its length is 0.

-ivy-fail-disallowed-ivy-version:

ivy-fail:

ivy-configure:
[ivy:configure] :: loading settings :: file = /export/home/jenkins/workspace/Lucene-Solr-7.x-Solaris/lucene/top-level-ivy-settings.xml

resolve:

ivy-availability-check:
[loadresource] Do not set property disallowed.ivy.jars.list as its length is 0.

-ivy-fail-disallowed-ivy-version:

ivy-fail:

ivy-configure:
[ivy:configure] :: loading settings :: file = /export/home/jenkins/workspace/Lucene-Solr-7.x-Solaris/lucene/top-level-ivy-settings.xml

resolve:

ivy-availability-check:
[loadresource] Do not set property disallowed.ivy.jars.list as its length is 0.

-ivy-fail-disallowed-ivy-version:

ivy-fail:

ivy-configure:
[ivy:configure] :: loading settings :: file = /export/home/jenkins/workspace/Lucene-Solr-7.x-Solaris/lucene/top-level-ivy-settings.xml

resolve:

ivy-availability-check:
[loadresource] Do not set property disallowed.ivy.jars.list as its length is 0.

-ivy-fail-disallowed-ivy-version:

ivy-fail:

ivy-configure:
[ivy:configure] :: loading settings :: file = /export/home/jenkins/workspace/Lucene-Solr-7.x-Solaris/lucene/top-level-ivy-settings.xml

resolve:

ivy-availability-check:
[loadresource] Do not set property disallowed.ivy.jars.list as its length is 0.

-ivy-fail-disallowed-ivy-version:

ivy-fail:

ivy-configure:
[ivy:configure] :: loading settings :: file = /export/home/jenkins/workspace/Lucene-Solr-7.x-Solaris/lucene/top-level-ivy-settings.xml

resolve:

ivy-availability-check:
[loadresource] Do not set property disallowed.ivy.jars.list as its length is 0.

-ivy-fail-disallowed-ivy-version:

ivy-fail:

ivy-configure:
[ivy:configure] :: loading settings :: file = /export/home/jenkins/workspace/Lucene-Solr-7.x-Solaris/lucene/top-level-ivy-settings.xml

resolve:

ivy-availability-check:
[loadresource] Do not set property disallowed.ivy.jars.list as its length is 0.

-ivy-fail-disallowed-ivy-version:

ivy-fail:

ivy-configure:
[ivy:configure] :: loading settings :: file = /export/home/jenkins/workspace/Lucene-Solr-7.x-Solaris/lucene/top-level-ivy-settings.xml

resolve:

ivy-availability-check:
[loadresource] Do not set property disallowed.ivy.jars.list as its length is 0.

-ivy-fail-disallowed-ivy-version:

ivy-fail:

ivy-configure:
[ivy:configure] :: loading settings :: file = /export/home/jenkins/workspace/Lucene-Solr-7.x-Solaris/lucene/top-level-ivy-settings.xml

resolve:

ivy-availability-check:
[loadresource] Do not set property disallowed.ivy.jars.list as its length is 0.

-ivy-fail-disallowed-ivy-version:

ivy-fail:

ivy-configure:
[ivy:configure] :: loading settings :: file = /export/home/jenkins/workspace/Lucene-Solr-7.x-Solaris/lucene/top-level-ivy-settings.xml

resolve:

ivy-availability-check:
[loadresource] Do not set property disallowed.ivy.jars.list as its length is 0.

-ivy-fail-disallowed-ivy-version:

ivy-fail:

ivy-configure:
[ivy:configure] :: loading settings :: file = /export/home/jenkins/workspace/Lucene-Solr-7.x-Solaris/lucene/top-level-ivy-settings.xml

resolve:

ivy-availability-check:
[loadresource] Do not set property disallowed.ivy.jars.list as its length is 0.

-ivy-fail-disallowed-ivy-version:

ivy-fail:

ivy-configure:
[ivy:configure] :: loading settings :: file = /export/home/jenkins/workspace/Lucene-Solr-7.x-Solaris/lucene/top-level-ivy-settings.xml

resolve:

ivy-availability-check:
[loadresource] Do not set property disallowed.ivy.jars.list as its length is 0.

-ivy-fail-disallowed-ivy-version:

ivy-fail:

ivy-configure:
[ivy:configure] :: loading settings :: file = /export/home/jenkins/workspace/Lucene-Solr-7.x-Solaris/lucene/top-level-ivy-settings.xml

common.resolve:

resolve:

ivy-availability-check:
[loadresource] Do not set property disallowed.ivy.jars.list as its length is 0.

-ivy-fail-disallowed-ivy-version:

ivy-fail:

ivy-configure:
[ivy:configure] :: loading settings :: file = /export/home/jenkins/workspace/Lucene-Solr-7.x-Solaris/lucene/top-level-ivy-settings.xml

resolve:

ivy-availability-check:
[loadresource] Do not set property disallowed.ivy.jars.list as its length is 0.

-ivy-fail-disallowed-ivy-version:

ivy-fail:

ivy-configure:
[ivy:configure] :: loading settings :: file = /export/home/jenkins/workspace/Lucene-Solr-7.x-Solaris/lucene/top-level-ivy-settings.xml

resolve:

ivy-availability-check:
[loadresource] Do not set property disallowed.ivy.jars.list as its length is 0.

-ivy-fail-disallowed-ivy-version:

ivy-fail:

ivy-configure:
[ivy:configure] :: loading settings :: file = /export/home/jenkins/workspace/Lucene-Solr-7.x-Solaris/lucene/top-level-ivy-settings.xml

resolve:

ivy-availability-check:
[loadresource] Do not set property disallowed.ivy.jars.list as its length is 0.

-ivy-fail-disallowed-ivy-version:

ivy-fail:

ivy-configure:
[ivy:configure] :: loading settings :: file = /export/home/jenkins/workspace/Lucene-Solr-7.x-Solaris/lucene/top-level-ivy-settings.xml

resolve:

ivy-availability-check:
[loadresource] Do not set property disallowed.ivy.jars.list as its length is 0.

-ivy-fail-disallowed-ivy-version:

ivy-fail:

ivy-configure:
[ivy:configure] :: loading settings :: file = /export/home/jenkins/workspace/Lucene-Solr-7.x-Solaris/lucene/top-level-ivy-settings.xml

resolve:

jar-checksums:
    [mkdir] Created dir: /export/home/jenkins/workspace/Lucene-Solr-7.x-Solaris/lucene/null1157353980
     [copy] Copying 35 files to /export/home/jenkins/workspace/Lucene-Solr-7.x-Solaris/lucene/null1157353980
   [delete] Deleting directory /export/home/jenkins/workspace/Lucene-Solr-7.x-Solaris/lucene/null1157353980

resolve-example:

ivy-availability-check:
[loadresource] Do not set property disallowed.ivy.jars.list as its length is 0.

-ivy-fail-disallowed-ivy-version:

ivy-fail:

ivy-configure:
[ivy:configure] :: loading settings :: file = /export/home/jenkins/workspace/Lucene-Solr-7.x-Solaris/lucene/top-level-ivy-settings.xml

resolve:

resolve-server:

ivy-availability-check:
[loadresource] Do not set property disallowed.ivy.jars.list as its length is 0.

-ivy-fail-disallowed-ivy-version:

ivy-fail:

ivy-fail:

ivy-configure:
[ivy:configure] :: loading settings :: file = /export/home/jenkins/workspace/Lucene-Solr-7.x-Solaris/lucene/top-level-ivy-settings.xml

resolve:

resolve:

ivy-availability-check:
[loadresource] Do not set property disallowed.ivy.jars.list as its length is 0.

-ivy-fail-disallowed-ivy-version:

ivy-fail:

ivy-fail:

ivy-configure:
[ivy:configure] :: loading settings :: file = /export/home/jenkins/workspace/Lucene-Solr-7.x-Solaris/lucene/top-level-ivy-settings.xml

resolve:

ivy-availability-check:
[loadresource] Do not set property disallowed.ivy.jars.list as its length is 0.

-ivy-fail-disallowed-ivy-version:

ivy-fail:

ivy-fail:

ivy-configure:
[ivy:configure] :: loading settings :: file = /export/home/jenkins/workspace/Lucene-Solr-7.x-Solaris/lucene/top-level-ivy-settings.xml

resolve:

ivy-availability-check:
[loadresource] Do not set property disallowed.ivy.jars.list as its length is 0.

-ivy-fail-disallowed-ivy-version:

ivy-fail:

ivy-configure:
[ivy:configure] :: loading settings :: file = /export/home/jenkins/workspace/Lucene-Solr-7.x-Solaris/lucene/top-level-ivy-settings.xml

resolve:

ivy-availability-check:
[loadresource] Do not set property disallowed.ivy.jars.list as its length is 0.

-ivy-fail-disallowed-ivy-version:

ivy-fail:

ivy-fail:

ivy-configure:
[ivy:configure] :: loading settings :: file = /export/home/jenkins/workspace/Lucene-Solr-7.x-Solaris/lucene/top-level-ivy-settings.xml

resolve:

ivy-availability-check:
[loadresource] Do not set property disallowed.ivy.jars.list as its length is 0.

-ivy-fail-disallowed-ivy-version:

ivy-fail:

ivy-configure:
[ivy:configure] :: loading settings :: file = /export/home/jenkins/workspace/Lucene-Solr-7.x-Solaris/lucene/top-level-ivy-settings.xml

resolve:

ivy-availability-check:
[loadresource] Do not set property disallowed.ivy.jars.list as its length is 0.

-ivy-fail-disallowed-ivy-version:

ivy-fail:

ivy-fail:

ivy-configure:
[ivy:configure] :: loading settings :: file = /export/home/jenkins/workspace/Lucene-Solr-7.x-Solaris/lucene/top-level-ivy-settings.xml

resolve:

ivy-availability-check:
[loadresource] Do not set property disallowed.ivy.jars.list as its length is 0.

-ivy-fail-disallowed-ivy-version:

ivy-fail:

ivy-fail:

ivy-configure:
[ivy:configure] :: loading settings :: file = /export/home/jenkins/workspace/Lucene-Solr-7.x-Solaris/lucene/top-level-ivy-settings.xml

resolve:

ivy-availability-check:
[loadresource] Do not set property disallowed.ivy.jars.list as its length is 0.

-ivy-fail-disallowed-ivy-version:

ivy-fail:

ivy-fail:

ivy-configure:
[ivy:configure] :: loading settings :: file = /export/home/jenkins/workspace/Lucene-Solr-7.x-Solaris/lucene/top-level-ivy-settings.xml

resolve:

ivy-availability-check:
[loadresource] Do not set property disallowed.ivy.jars.list as its length is 0.

-ivy-fail-disallowed-ivy-version:

ivy-fail:

ivy-fail:

ivy-configure:
[ivy:configure] :: loading settings :: file = /export/home/jenkins/workspace/Lucene-Solr-7.x-Solaris/lucene/top-level-ivy-settings.xml

resolve:

ivy-availability-check:
[loadresource] Do not set property disallowed.ivy.jars.list as its length is 0.

-ivy-fail-disallowed-ivy-version:

ivy-fail:

ivy-fail:

ivy-configure:
[ivy:configure] :: loading settings :: file = /export/home/jenkins/workspace/Lucene-Solr-7.x-Solaris/lucene/top-level-ivy-settings.xml

resolve:

ivy-availability-check:
[loadresource] Do not set property disallowed.ivy.jars.list as its length is 0.

-ivy-fail-disallowed-ivy-version:

ivy-fail:

ivy-fail:

ivy-configure:
[ivy:configure] :: loading settings :: file = /export/home/jenkins/workspace/Lucene-Solr-7.x-Solaris/lucene/top-level-ivy-settings.xml

resolve:

ivy-availability-check:
[loadresource] Do not set property disallowed.ivy.jars.list as its length is 0.

-ivy-fail-disallowed-ivy-version:

ivy-fail:

ivy-fail:

ivy-configure:
[ivy:configure] :: loading settings :: file = /export/home/jenkins/workspace/Lucene-Solr-7.x-Solaris/lucene/top-level-ivy-settings.xml

resolve:

ivy-availability-check:
[loadresource] Do not set property disallowed.ivy.jars.list as its length is 0.

-ivy-fail-disallowed-ivy-version:

ivy-fail:

ivy-fail:

ivy-configure:
[ivy:configure] :: loading settings :: file = /export/home/jenkins/workspace/Lucene-Solr-7.x-Solaris/lucene/top-level-ivy-settings.xml

resolve:

ivy-availability-check:
[loadresource] Do not set property disallowed.ivy.jars.list as its length is 0.

-ivy-fail-disallowed-ivy-version:

ivy-fail:

ivy-fail:

ivy-configure:
[ivy:configure] :: loading settings :: file = /export/home/jenkins/workspace/Lucene-Solr-7.x-Solaris/lucene/top-level-ivy-settings.xml

resolve:

ivy-availability-check:
[loadresource] Do not set property disallowed.ivy.jars.list as its length is 0.

-ivy-fail-disallowed-ivy-version:

ivy-fail:

ivy-fail:

ivy-configure:
[ivy:configure] :: loading settings :: file = /export/home/jenkins/workspace/Lucene-Solr-7.x-Solaris/lucene/top-level-ivy-settings.xml

resolve:

jar-checksums:
    [mkdir] Created dir: /export/home/jenkins/workspace/Lucene-Solr-7.x-Solaris/solr/null438550267
     [copy] Copying 239 files to /export/home/jenkins/workspace/Lucene-Solr-7.x-Solaris/solr/null438550267
   [delete] Deleting directory /export/home/jenkins/workspace/Lucene-Solr-7.x-Solaris/solr/null438550267

check-working-copy:
[ivy:cachepath] :: resolving dependencies :: org.eclipse.jgit#org.eclipse.jgit-caller;working
[ivy:cachepath] 	confs: [default]
[ivy:cachepath] 	found org.eclipse.jgit#org.eclipse.jgit;4.6.0.201612231935-r in public
[ivy:cachepath] 	found com.jcraft#jsch;0.1.53 in public
[ivy:cachepath] 	found com.googlecode.javaewah#JavaEWAH;1.1.6 in public
[ivy:cachepath] 	found org.apache.httpcomponents#httpclient;4.3.6 in public
[ivy:cachepath] 	found org.apache.httpcomponents#httpcore;4.3.3 in public
[ivy:cachepath] 	found commons-logging#commons-logging;1.1.3 in public
[ivy:cachepath] 	found commons-codec#commons-codec;1.6 in public
[ivy:cachepath] 	found org.slf4j#slf4j-api;1.7.2 in public
[ivy:cachepath] :: resolution report :: resolve 36ms :: artifacts dl 1ms
	---------------------------------------------------------------------
	|                  |            modules            ||   artifacts   |
	|       conf       | number| search|dwnlded|evicted|| number|dwnlded|
	---------------------------------------------------------------------
	|      default     |   8   |   0   |   0   |   0   ||   8   |   0   |
	---------------------------------------------------------------------
[wc-checker] Initializing working copy...
[wc-checker] SLF4J: Failed to load class "org.slf4j.impl.StaticLoggerBinder".
[wc-checker] SLF4J: Defaulting to no-operation (NOP) logger implementation
[wc-checker] SLF4J: See http://www.slf4j.org/codes.html#StaticLoggerBinder for further details.
[wc-checker] Checking working copy status...

-jenkins-base:

BUILD SUCCESSFUL
Total time: 71 minutes 1 second
Setting ANT_1_8_2_HOME=/export/home/jenkins/tools/hudson.tasks.Ant_AntInstallation/ANT_1.8.2
[Lucene-Solr-7.x-Solaris] $ /bin/sh -xe /var/tmp/jenkins2877539993073210024.sh
+ mv lucene/build lucene/build.orig
+ mv solr/build solr/build.orig
+ ANT_HOME=/export/home/jenkins/tools/hudson.tasks.Ant_AntInstallation/ANT_1.8.2
+ export ANT_HOME
+ PATH=/export/home/jenkins/tools/hudson.tasks.Ant_AntInstallation/ANT_1.8.2/bin:/export/home/jenkins/tools/java/64bit/jdk1.8.0/bin:/usr/bin:/usr/sbin
+ export PATH
+ python3.4 -u dev-tools/scripts/reproduceJenkinsFailures.py --no-git https://jenkins.thetaphi.de/job/Lucene-Solr-7.x-Solaris/796/consoleText
[repro] Jenkins log URL: https://jenkins.thetaphi.de/job/Lucene-Solr-7.x-Solaris/796/consoleText

[repro] Revision: d35b615c66e8974363b7a938abc0d74a85a798dd

[repro] Ant options: "-Dargs=-XX:+UseCompressedOops -XX:+UseConcMarkSweepGC"
[repro] Repro line:  ant test  -Dtestcase=SignificantTermsQParserPluginTest -Dtests.seed=9D483F8C0B2F559C -Dtests.slow=true -Dtests.locale=ar-AE -Dtests.timezone=Asia/Damascus -Dtests.asserts=true -Dtests.file.encoding=UTF-8

[repro] ant clean
Buildfile: /export/home/jenkins/workspace/Lucene-Solr-7.x-Solaris/build.xml

clean:

clean:

clean:

BUILD SUCCESSFUL
Total time: 0 seconds
[repro] Test suites by module:
[repro]    solr/core
[repro]       SignificantTermsQParserPluginTest
[repro] ant compile-test
Buildfile: /export/home/jenkins/workspace/Lucene-Solr-7.x-Solaris/solr/core/build.xml

check-analyzers-icu-uptodate:

jar-analyzers-icu:

-mrjar-classes-uptodate:

ivy-availability-check:
[loadresource] Do not set property disallowed.ivy.jars.list as its length is 0.

-ivy-fail-disallowed-ivy-version:

ivy-fail:

ivy-configure:
[ivy:configure] :: Apache Ivy 2.4.0 - 20141213170938 :: http://ant.apache.org/ivy/ ::
[ivy:configure] :: loading settings :: file = /export/home/jenkins/workspace/Lucene-Solr-7.x-Solaris/lucene/top-level-ivy-settings.xml

resolve-groovy:
[ivy:cachepath] :: resolving dependencies :: org.codehaus.groovy#groovy-all-caller;working
[ivy:cachepath] 	confs: [default]
[ivy:cachepath] 	found org.codehaus.groovy#groovy-all;2.4.15 in public
[ivy:cachepath] :: resolution report :: resolve 132ms :: artifacts dl 2ms
	---------------------------------------------------------------------
	|                  |            modules            ||   artifacts   |
	|       conf       | number| search|dwnlded|evicted|| number|dwnlded|
	---------------------------------------------------------------------
	|      default     |   1   |   0   |   0   |   0   ||   1   |   0   |
	---------------------------------------------------------------------

check-analyzers-common-uptodate:

jar-analyzers-common:

-mrjar-classes-uptodate:

ivy-availability-check:
[loadresource] Do not set property disallowed.ivy.jars.list as its length is 0.

-ivy-fail-disallowed-ivy-version:

ivy-fail:

ivy-configure:
[ivy:configure] :: loading settings :: file = /export/home/jenkins/workspace/Lucene-Solr-7.x-Solaris/lucene/top-level-ivy-settings.xml

resolve-groovy:

-check-git-state:

-git-cleanroot:

-copy-git-state:
     [copy] Copying 1 file to /export/home/jenkins/workspace/Lucene-Solr-7.x-Solaris/lucene/build

git-autoclean:

resolve:

common.init:

compile-lucene-core:

-check-git-state:

-git-cleanroot:

-copy-git-state:

git-autoclean:

ivy-availability-check:
[loadresource] Do not set property disallowed.ivy.jars.list as its length is 0.

-ivy-fail-disallowed-ivy-version:

ivy-fail:

ivy-configure:
[ivy:configure] :: loading settings :: file = /export/home/jenkins/workspace/Lucene-Solr-7.x-Solaris/lucene/top-level-ivy-settings.xml

resolve:

init:

-clover.disable:

-clover.load:

-clover.classpath:

-clover.setup:

clover:

compile-core:
    [mkdir] Created dir: /export/home/jenkins/workspace/Lucene-Solr-7.x-Solaris/lucene/build/core/classes/java
    [javac] Compiling 855 source files to /export/home/jenkins/workspace/Lucene-Solr-7.x-Solaris/lucene/build/core/classes/java
    [javac] Note: Some input files use or override a deprecated API.
    [javac] Note: Recompile with -Xlint:deprecation for details.
    [javac] Creating empty /export/home/jenkins/workspace/Lucene-Solr-7.x-Solaris/lucene/build/core/classes/java/org/apache/lucene/util/graph/package-info.class
    [javac] Creating empty /export/home/jenkins/workspace/Lucene-Solr-7.x-Solaris/lucene/build/core/classes/java/org/apache/lucene/document/package-info.class
    [javac] Creating empty /export/home/jenkins/workspace/Lucene-Solr-7.x-Solaris/lucene/build/core/classes/java/org/apache/lucene/package-info.class
    [javac] Creating empty /export/home/jenkins/workspace/Lucene-Solr-7.x-Solaris/lucene/build/core/classes/java/org/apache/lucene/util/bkd/package-info.class
    [javac] Creating empty /export/home/jenkins/workspace/Lucene-Solr-7.x-Solaris/lucene/build/core/classes/java/org/apache/lucene/codecs/compressing/package-info.class
    [javac] Creating empty /export/home/jenkins/workspace/Lucene-Solr-7.x-Solaris/lucene/build/core/classes/java/org/apache/lucene/codecs/lucene60/package-info.class
    [javac] Creating empty /export/home/jenkins/workspace/Lucene-Solr-7.x-Solaris/lucene/build/core/classes/java/org/apache/lucene/codecs/package-info.class
    [javac] Creating empty /export/home/jenkins/workspace/Lucene-Solr-7.x-Solaris/lucene/build/core/classes/java/org/apache/lucene/util/package-info.class
    [javac] Creating empty /export/home/jenkins/workspace/Lucene-Solr-7.x-Solaris/lucene/build/core/classes/java/org/apache/lucene/index/package-info.class
    [javac] Creating empty /export/home/jenkins/workspace/Lucene-Solr-7.x-Solaris/lucene/build/core/classes/java/org/apache/lucene/util/fst/package-info.class
    [javac] Creating empty /export/home/jenkins/workspace/Lucene-Solr-7.x-Solaris/lucene/build/core/classes/java/org/apache/lucene/analysis/tokenattributes/package-info.class
    [javac] Creating empty /export/home/jenkins/workspace/Lucene-Solr-7.x-Solaris/lucene/build/core/classes/java/org/apache/lucene/search/package-info.class
    [javac] Creating empty /export/home/jenkins/workspace/Lucene-Solr-7.x-Solaris/lucene/build/core/classes/java/org/apache/lucene/codecs/lucene62/package-info.class
    [javac] Creating empty /export/home/jenkins/workspace/Lucene-Solr-7.x-Solaris/lucene/build/core/classes/java/org/apache/lucene/util/packed/package-info.class
    [javac] Creating empty /export/home/jenkins/workspace/Lucene-Solr-7.x-Solaris/lucene/build/core/classes/java/org/apache/lucene/util/mutable/package-info.class
    [javac] Creating empty /export/home/jenkins/workspace/Lucene-Solr-7.x-Solaris/lucene/build/core/classes/java/org/apache/lucene/codecs/lucene70/package-info.class
    [javac] Creating empty /export/home/jenkins/workspace/Lucene-Solr-7.x-Solaris/lucene/build/core/classes/java/org/apache/lucene/codecs/perfield/package-info.class
    [javac] Creating empty /export/home/jenkins/workspace/Lucene-Solr-7.x-Solaris/lucene/build/core/classes/java/org/apache/lucene/analysis/package-info.class
    [javac] Creating empty /export/home/jenkins/workspace/Lucene-Solr-7.x-Solaris/lucene/build/core/classes/java/org/apache/lucene/analysis/standard/package-info.class
    [javac] Creating empty /export/home/jenkins/workspace/Lucene-Solr-7.x-Solaris/lucene/build/core/classes/java/org/apache/lucene/store/package-info.class
    [javac] Creating empty /export/home/jenkins/workspace/Lucene-Solr-7.x-Solaris/lucene/build/core/classes/java/org/apache/lucene/codecs/blocktree/package-info.class
    [javac] Creating empty /export/home/jenkins/workspace/Lucene-Solr-7.x-Solaris/lucene/build/core/classes/java/org/apache/lucene/search/spans/package-info.class
    [javac] Creating empty /export/home/jenkins/workspace/Lucene-Solr-7.x-Solaris/lucene/build/core/classes/java/org/apache/lucene/search/similarities/package-info.class
    [javac] Creating empty /export/home/jenkins/workspace/Lucene-Solr-7.x-Solaris/lucene/build/core/classes/java/org/apache/lucene/util/automaton/package-info.class
    [javac] Creating empty /export/home/jenkins/workspace/Lucene-Solr-7.x-Solaris/lucene/build/core/classes/java/org/apache/lucene/codecs/lucene50/package-info.class
    [javac] Creating empty /export/home/jenkins/workspace/Lucene-Solr-7.x-Solaris/lucene/build/core/classes/java/org/apache/lucene/geo/package-info.class
     [copy] Copying 3 files to /export/home/jenkins/workspace/Lucene-Solr-7.x-Solaris/lucene/build/core/classes/java

init:

-clover.disable:

-clover.load:

-clover.classpath:

-clover.setup:

clover:

compile-core:
    [mkdir] Created dir: /export/home/jenkins/workspace/Lucene-Solr-7.x-Solaris/lucene/build/analysis/common/classes/java
    [javac] Compiling 475 source files to /export/home/jenkins/workspace/Lucene-Solr-7.x-Solaris/lucene/build/analysis/common/classes/java
    [javac] Note: Some input files use or override a deprecated API.
    [javac] Note: Recompile with -Xlint:deprecation for details.
    [javac] Creating empty /export/home/jenkins/workspace/Lucene-Solr-7.x-Solaris/lucene/build/analysis/common/classes/java/org/apache/lucene/analysis/hunspell/package-info.class
    [javac] Creating empty /export/home/jenkins/workspace/Lucene-Solr-7.x-Solaris/lucene/build/analysis/common/classes/java/org/apache/lucene/analysis/minhash/package-info.class
    [javac] Creating empty /export/home/jenkins/workspace/Lucene-Solr-7.x-Solaris/lucene/build/analysis/common/classes/java/org/apache/lucene/analysis/ga/package-info.class
    [javac] Creating empty /export/home/jenkins/workspace/Lucene-Solr-7.x-Solaris/lucene/build/analysis/common/classes/java/org/apache/lucene/analysis/ca/package-info.class
    [javac] Creating empty /export/home/jenkins/workspace/Lucene-Solr-7.x-Solaris/lucene/build/analysis/common/classes/java/org/apache/lucene/analysis/custom/package-info.class
    [javac] Creating empty /export/home/jenkins/workspace/Lucene-Solr-7.x-Solaris/lucene/build/analysis/common/classes/java/org/apache/lucene/analysis/sr/package-info.class
    [javac] Creating empty /export/home/jenkins/workspace/Lucene-Solr-7.x-Solaris/lucene/build/analysis/common/classes/java/org/apache/lucene/collation/package-info.class
    [javac] Creating empty /export/home/jenkins/workspace/Lucene-Solr-7.x-Solaris/lucene/build/analysis/common/classes/java/org/apache/lucene/analysis/sv/package-info.class
    [javac] Creating empty /export/home/jenkins/workspace/Lucene-Solr-7.x-Solaris/lucene/build/analysis/common/classes/java/org/apache/lucene/analysis/bg/package-info.class
    [javac] Creating empty /export/home/jenkins/workspace/Lucene-Solr-7.x-Solaris/lucene/build/analysis/common/classes/java/org/apache/lucene/analysis/payloads/package-info.class
    [javac] Creating empty /export/home/jenkins/workspace/Lucene-Solr-7.x-Solaris/lucene/build/analysis/common/classes/java/org/apache/lucene/analysis/ngram/package-info.class
    [javac] Creating empty /export/home/jenkins/workspace/Lucene-Solr-7.x-Solaris/lucene/build/analysis/common/classes/java/org/apache/lucene/analysis/core/package-info.class
    [javac] Creating empty /export/home/jenkins/workspace/Lucene-Solr-7.x-Solaris/lucene/build/analysis/common/classes/java/org/apache/lucene/analysis/bn/package-info.class
    [javac] Creating empty /export/home/jenkins/workspace/Lucene-Solr-7.x-Solaris/lucene/build/analysis/common/classes/java/org/apache/lucene/analysis/fr/package-info.class
    [javac] Creating empty /export/home/jenkins/workspace/Lucene-Solr-7.x-Solaris/lucene/build/analysis/common/classes/java/org/tartarus/snowball/ext/package-info.class
    [javac] Creating empty /export/home/jenkins/workspace/Lucene-Solr-7.x-Solaris/lucene/build/analysis/common/classes/java/org/apache/lucene/analysis/br/package-info.class
    [javac] Creating empty /export/home/jenkins/workspace/Lucene-Solr-7.x-Solaris/lucene/build/analysis/common/classes/java/org/apache/lucene/analysis/miscellaneous/package-info.class
    [javac] Creating empty /export/home/jenkins/workspace/Lucene-Solr-7.x-Solaris/lucene/build/analysis/common/classes/java/org/apache/lucene/analysis/sinks/package-info.class
    [javac] Creating empty /export/home/jenkins/workspace/Lucene-Solr-7.x-Solaris/lucene/build/analysis/common/classes/java/org/apache/lucene/analysis/cjk/package-info.class
    [javac] Creating empty /export/home/jenkins/workspace/Lucene-Solr-7.x-Solaris/lucene/build/analysis/common/classes/java/org/apache/lucene/analysis/synonym/package-info.class
    [javac] Creating empty /export/home/jenkins/workspace/Lucene-Solr-7.x-Solaris/lucene/build/analysis/common/classes/java/org/apache/lucene/analysis/wikipedia/package-info.class
    [javac] Creating empty /export/home/jenkins/workspace/Lucene-Solr-7.x-Solaris/lucene/build/analysis/common/classes/java/org/apache/lucene/analysis/fa/package-info.class
    [javac] Creating empty /export/home/jenkins/workspace/Lucene-Solr-7.x-Solaris/lucene/build/analysis/common/classes/java/org/apache/lucene/analysis/reverse/package-info.class
    [javac] Creating empty /export/home/jenkins/workspace/Lucene-Solr-7.x-Solaris/lucene/build/analysis/common/classes/java/org/apache/lucene/analysis/nl/package-info.class
    [javac] Creating empty /export/home/jenkins/workspace/Lucene-Solr-7.x-Solaris/lucene/build/analysis/common/classes/java/org/apache/lucene/analysis/ro/package-info.class
    [javac] Creating empty /export/home/jenkins/workspace/Lucene-Solr-7.x-Solaris/lucene/build/analysis/common/classes/java/org/apache/lucene/analysis/fi/package-info.class
    [javac] Creating empty /export/home/jenkins/workspace/Lucene-Solr-7.x-Solaris/lucene/build/analysis/common/classes/java/org/apache/lucene/analysis/ru/package-info.class
    [javac] Creating empty /export/home/jenkins/workspace/Lucene-Solr-7.x-Solaris/lucene/build/analysis/common/classes/java/org/apache/lucene/analysis/no/package-info.class
    [javac] Creating empty /export/home/jenkins/workspace/Lucene-Solr-7.x-Solaris/lucene/build/analysis/common/classes/java/org/apache/lucene/analysis/el/package-info.class
    [javac] Creating empty /export/home/jenkins/workspace/Lucene-Solr-7.x-Solaris/lucene/build/analysis/common/classes/java/org/apache/lucene/analysis/ckb/package-info.class
    [javac] Creating empty /export/home/jenkins/workspace/Lucene-Solr-7.x-Solaris/lucene/build/analysis/common/classes/java/org/tartarus/snowball/package-info.class
    [javac] Creating empty /export/home/jenkins/workspace/Lucene-Solr-7.x-Solaris/lucene/build/analysis/common/classes/java/org/apache/lucene/analysis/in/package-info.class
    [javac] Creating empty /export/home/jenkins/workspace/Lucene-Solr-7.x-Solaris/lucene/build/analysis/common/classes/java/org/apache/lucene/analysis/util/package-info.class
    [javac] Creating empty /export/home/jenkins/workspace/Lucene-Solr-7.x-Solaris/lucene/build/analysis/common/classes/java/org/apache/lucene/analysis/it/package-info.class
    [javac] Creating empty /export/home/jenkins/workspace/Lucene-Solr-7.x-Solaris/lucene/build/analysis/common/classes/java/org/apache/lucene/analysis/snowball/package-info.class
    [javac] Creating empty /export/home/jenkins/workspace/Lucene-Solr-7.x-Solaris/lucene/build/analysis/common/classes/java/org/apache/lucene/analysis/en/package-info.class
    [javac] Creating empty /export/home/jenkins/workspace/Lucene-Solr-7.x-Solaris/lucene/build/analysis/common/classes/java/org/apache/lucene/analysis/es/package-info.class
    [javac] Creating empty /export/home/jenkins/workspace/Lucene-Solr-7.x-Solaris/lucene/build/analysis/common/classes/java/org/apache/lucene/analysis/shingle/package-info.class
    [javac] Creating empty /export/home/jenkins/workspace/Lucene-Solr-7.x-Solaris/lucene/build/analysis/common/classes/java/org/apache/lucene/analysis/eu/package-info.class
    [javac] Creating empty /export/home/jenkins/workspace/Lucene-Solr-7.x-Solaris/lucene/build/analysis/common/classes/java/org/apache/lucene/analysis/ar/package-info.class
    [javac] Creating empty /export/home/jenkins/workspace/Lucene-Solr-7.x-Solaris/lucene/build/analysis/common/classes/java/org/apache/lucene/analysis/query/package-info.class
    [javac] Creating empty /export/home/jenkins/workspace/Lucene-Solr-7.x-Solaris/lucene/build/analysis/common/classes/java/org/apache/lucene/analysis/id/package-info.class
    [javac] Creating empty /export/home/jenkins/workspace/Lucene-Solr-7.x-Solaris/lucene/build/analysis/common/classes/java/org/apache/lucene/analysis/compound/hyphenation/package-info.class
    [javac] Creating empty /export/home/jenkins/workspace/Lucene-Solr-7.x-Solaris/lucene/build/analysis/common/classes/java/org/apache/lucene/analysis/charfilter/package-info.class
    [javac] Creating empty /export/home/jenkins/workspace/Lucene-Solr-7.x-Solaris/lucene/build/analysis/common/classes/java/org/apache/lucene/analysis/pt/package-info.class
    [javac] Creating empty /export/home/jenkins/workspace/Lucene-Solr-7.x-Solaris/lucene/build/analysis/common/classes/java/org/apache/lucene/analysis/lv/package-info.class
    [javac] Creating empty /export/home/jenkins/workspace/Lucene-Solr-7.x-Solaris/lucene/build/analysis/common/classes/java/org/apache/lucene/analysis/lt/package-info.class
    [javac] Creating empty /export/home/jenkins/workspace/Lucene-Solr-7.x-Solaris/lucene/build/analysis/common/classes/java/org/apache/lucene/analysis/hu/package-info.class
    [javac] Creating empty /export/home/jenkins/workspace/Lucene-Solr-7.x-Solaris/lucene/build/analysis/common/classes/java/org/apache/lucene/analysis/hy/package-info.class
    [javac] Creating empty /export/home/jenkins/workspace/Lucene-Solr-7.x-Solaris/lucene/build/analysis/common/classes/java/org/apache/lucene/analysis/pattern/package-info.class
    [javac] Creating empty /export/home/jenkins/workspace/Lucene-Solr-7.x-Solaris/lucene/build/analysis/common/classes/java/org/apache/lucene/analysis/cz/package-info.class
    [javac] Creating empty /export/home/jenkins/workspace/Lucene-Solr-7.x-Solaris/lucene/build/analysis/common/classes/java/org/apache/lucene/analysis/th/package-info.class
    [javac] Creating empty /export/home/jenkins/workspace/Lucene-Solr-7.x-Solaris/lucene/build/analysis/common/classes/java/org/apache/lucene/analysis/path/package-info.class
    [javac] Creating empty /export/home/jenkins/workspace/Lucene-Solr-7.x-Solaris/lucene/build/analysis/common/classes/java/org/apache/lucene/analysis/tr/package-info.class
    [javac] Creating empty /export/home/jenkins/workspace/Lucene-Solr-7.x-Solaris/lucene/build/analysis/common/classes/java/org/apache/lucene/analysis/da/package-info.class
    [javac] Creating empty /export/home/jenkins/workspace/Lucene-Solr-7.x-Solaris/lucene/build/analysis/common/classes/java/org/apache/lucene/analysis/de/package-info.class
    [javac] Creating empty /export/home/jenkins/workspace/Lucene-Solr-7.x-Solaris/lucene/build/analysis/common/classes/java/org/apache/lucene/analysis/hi/package-info.class
    [javac] Creating empty /export/home/jenkins/workspace/Lucene-Solr-7.x-Solaris/lucene/build/analysis/common/classes/java/org/apache/lucene/collation/tokenattributes/package-info.class
    [javac] Creating empty /export/home/jenkins/workspace/Lucene-Solr-7.x-Solaris/lucene/build/analysis/common/classes/java/org/apache/lucene/analysis/gl/package-info.class
    [javac] Creating empty /export/home/jenkins/workspace/Lucene-Solr-7.x-Solaris/lucene/build/analysis/common/classes/java/org/apache/lucene/analysis/commongrams/package-info.class
    [javac] Creating empty /export/home/jenkins/workspace/Lucene-Solr-7.x-Solaris/lucene/build/analysis/common/classes/java/org/apache/lucene/analysis/compound/package-info.class
     [copy] Copying 40 files to /export/home/jenkins/workspace/Lucene-Solr-7.x-Solaris/lucene/build/analysis/common/classes/java

patch-mrjar-classes:
[patch-cls] Remapped 0 class files for Java 9 to: /export/home/jenkins/workspace/Lucene-Solr-7.x-Solaris/lucene/build/analysis/common/classes/java9
    [touch] Creating /export/home/jenkins/workspace/Lucene-Solr-7.x-Solaris/lucene/build/analysis/common/patch-mrjar.stamp

-mrjar-check:

-mrjar-core:

-jar-core:
     [exec] Execute failed: java.io.IOException: Cannot run program "git" (in directory "/export/home/jenkins/workspace/Lucene-Solr-7.x-Solaris/lucene/analysis/common"): error=2, No such file or directory
      [jar] Building jar: /export/home/jenkins/workspace/Lucene-Solr-7.x-Solaris/lucene/build/analysis/common/lucene-analyzers-common-7.5.0-SNAPSHOT.jar

jar-core:

-check-git-state:

-git-cleanroot:

-copy-git-state:

git-autoclean:

resolve:

common.init:

compile-lucene-core:

-check-git-state:

-git-cleanroot:

-copy-git-state:

git-autoclean:

ivy-availability-check:
[loadresource] Do not set property disallowed.ivy.jars.list as its length is 0.

-ivy-fail-disallowed-ivy-version:

ivy-fail:

ivy-configure:
[ivy:configure] :: loading settings :: file = /export/home/jenkins/workspace/Lucene-Solr-7.x-Solaris/lucene/top-level-ivy-settings.xml

resolve:

init:

-clover.disable:

-clover.load:

-clover.classpath:

-clover.setup:

clover:

compile-core:

init:

-clover.disable:

-clover.load:

-clover.classpath:

-clover.setup:

clover:

common.compile-core:
    [mkdir] Created dir: /export/home/jenkins/workspace/Lucene-Solr-7.x-Solaris/lucene/build/analysis/icu/classes/java
    [javac] Compiling 25 source files to /export/home/jenkins/workspace/Lucene-Solr-7.x-Solaris/lucene/build/analysis/icu/classes/java
    [javac] Note: /export/home/jenkins/workspace/Lucene-Solr-7.x-Solaris/lucene/analysis/icu/src/java/org/apache/lucene/analysis/icu/ICUTransformFilter.java uses or overrides a deprecated API.
    [javac] Note: Recompile with -Xlint:deprecation for details.
    [javac] Creating empty /export/home/jenkins/workspace/Lucene-Solr-7.x-Solaris/lucene/build/analysis/icu/classes/java/org/apache/lucene/analysis/icu/package-info.class
    [javac] Creating empty /export/home/jenkins/workspace/Lucene-Solr-7.x-Solaris/lucene/build/analysis/icu/classes/java/org/apache/lucene/analysis/icu/tokenattributes/package-info.class
    [javac] Creating empty /export/home/jenkins/workspace/Lucene-Solr-7.x-Solaris/lucene/build/analysis/icu/classes/java/org/apache/lucene/analysis/icu/segmentation/package-info.class
     [copy] Copying 6 files to /export/home/jenkins/workspace/Lucene-Solr-7.x-Solaris/lucene/build/analysis/icu/classes/java

compile-core:

patch-mrjar-classes:
[patch-cls] Remapped 0 class files for Java 9 to: /export/home/jenkins/workspace/Lucene-Solr-7.x-Solaris/lucene/build/analysis/icu/classes/java9
    [touch] Creating /export/home/jenkins/workspace/Lucene-Solr-7.x-Solaris/lucene/build/analysis/icu/patch-mrjar.stamp

-mrjar-check:

-mrjar-core:

-jar-core:
     [exec] Execute failed: java.io.IOException: Cannot run program "git" (in directory "/export/home/jenkins/workspace/Lucene-Solr-7.x-Solaris/lucene/analysis/icu"): error=2, No such file or directory
      [jar] Building jar: /export/home/jenkins/workspace/Lucene-Solr-7.x-Solaris/lucene/build/analysis/icu/lucene-analyzers-icu-7.5.0-SNAPSHOT.jar

jar-core:

-compile-test-lucene-queryparser:

-check-git-state:

-git-cleanroot:

-copy-git-state:

git-autoclean:

ivy-availability-check:
[loadresource] Do not set property disallowed.ivy.jars.list as its length is 0.

-ivy-fail-disallowed-ivy-version:

ivy-fail:

ivy-configure:
[ivy:configure] :: loading settings :: file = /export/home/jenkins/workspace/Lucene-Solr-7.x-Solaris/lucene/top-level-ivy-settings.xml

resolve:

common.init:

compile-lucene-core:

-check-git-state:

-git-cleanroot:

-copy-git-state:

git-autoclean:

ivy-availability-check:
[loadresource] Do not set property disallowed.ivy.jars.list as its length is 0.

-ivy-fail-disallowed-ivy-version:

ivy-fail:

ivy-configure:
[ivy:configure] :: loading settings :: file = /export/home/jenkins/workspace/Lucene-Solr-7.x-Solaris/lucene/top-level-ivy-settings.xml

resolve:

init:

-clover.disable:

-clover.load:

-clover.classpath:

-clover.setup:

clover:

compile-core:

init:

compile-test:

check-queries-uptodate:

jar-queries:

-mrjar-classes-uptodate:

ivy-availability-check:
[loadresource] Do not set property disallowed.ivy.jars.list as its length is 0.

-ivy-fail-disallowed-ivy-version:

ivy-fail:

ivy-configure:
[ivy:configure] :: loading settings :: file = /export/home/jenkins/workspace/Lucene-Solr-7.x-Solaris/lucene/top-level-ivy-settings.xml

resolve-groovy:
[ivy:cachepath] :: resolving dependencies :: org.codehaus.groovy#groovy-all-caller;working
[ivy:cachepath] 	confs: [default]
[ivy:cachepath] 	found org.codehaus.groovy#groovy-all;2.4.15 in public
[ivy:cachepath] :: resolution report :: resolve 19ms :: artifacts dl 1ms
	---------------------------------------------------------------------
	|                  |            modules            ||   artifacts   |
	|       conf       | number| search|dwnlded|evicted|| number|dwnlded|
	---------------------------------------------------------------------
	|      default     |   1   |   0   |   0   |   0   ||   1   |   0   |
	---------------------------------------------------------------------

check-expressions-uptodate:

jar-expressions:

-mrjar-classes-uptodate:

ivy-availability-check:
[loadresource] Do not set property disallowed.ivy.jars.list as its length is 0.

-ivy-fail-disallowed-ivy-version:

ivy-fail:

ivy-configure:
[ivy:configure] :: loading settings :: file = /export/home/jenkins/workspace/Lucene-Solr-7.x-Solaris/lucene/top-level-ivy-settings.xml

resolve-groovy:

-check-git-state:

-git-cleanroot:

-copy-git-state:

git-autoclean:

resolve:

common.init:

compile-lucene-core:

init:

-clover.disable:

-clover.load:

-clover.classpath:

-clover.setup:

clover:

compile-core:
    [mkdir] Created dir: /export/home/jenkins/workspace/Lucene-Solr-7.x-Solaris/lucene/build/expressions/classes/java
    [javac] Compiling 17 source files to /export/home/jenkins/workspace/Lucene-Solr-7.x-Solaris/lucene/build/expressions/classes/java
    [javac] Creating empty /export/home/jenkins/workspace/Lucene-Solr-7.x-Solaris/lucene/build/expressions/classes/java/org/apache/lucene/expressions/js/package-info.class
    [javac] Creating empty /export/home/jenkins/workspace/Lucene-Solr-7.x-Solaris/lucene/build/expressions/classes/java/org/apache/lucene/expressions/package-info.class
     [copy] Copying 1 file to /export/home/jenkins/workspace/Lucene-Solr-7.x-Solaris/lucene/build/expressions/classes/java

patch-mrjar-classes:
[patch-cls] Remapped 0 class files for Java 9 to: /export/home/jenkins/workspace/Lucene-Solr-7.x-Solaris/lucene/build/expressions/classes/java9
    [touch] Creating /export/home/jenkins/workspace/Lucene-Solr-7.x-Solaris/lucene/build/expressions/patch-mrjar.stamp

-mrjar-check:

-mrjar-core:

-jar-core:
     [exec] Execute failed: java.io.IOException: Cannot run program "git" (in directory "/export/home/jenkins/workspace/Lucene-Solr-7.x-Solaris/lucene/expressions"): error=2, No such file or directory
      [jar] Building jar: /export/home/jenkins/workspace/Lucene-Solr-7.x-Solaris/lucene/build/expressions/lucene-expressions-7.5.0-SNAPSHOT.jar

jar-core:

-check-git-state:

-git-cleanroot:

-copy-git-state:

git-autoclean:

resolve:

common.init:

compile-lucene-core:

init:

-clover.disable:

-clover.load:

-clover.classpath:

-clover.setup:

clover:

common.compile-core:
    [mkdir] Created dir: /export/home/jenkins/workspace/Lucene-Solr-7.x-Solaris/lucene/build/queries/classes/java
    [javac] Compiling 86 source files to /export/home/jenkins/workspace/Lucene-Solr-7.x-Solaris/lucene/build/queries/classes/java
    [javac] /export/home/jenkins/workspace/Lucene-Solr-7.x-Solaris/lucene/queries/src/java/org/apache/lucene/queries/function/FunctionQuery.java:59: warning: [rawtypes] found raw type: Map
    [javac]     protected final Map context;
    [javac]                     ^
    [javac]   missing type arguments for generic class Map<K,V>
    [javac]   where K,V are type-variables:
    [javac]     K extends Object declared in interface Map
    [javac]     V extends Object declared in interface Map
    [javac] /export/home/jenkins/workspace/Lucene-Solr-7.x-Solaris/lucene/queries/src/java/org/apache/lucene/queries/function/ValueSource.java:54: warning: [rawtypes] found raw type: Map
    [javac]   public abstract FunctionValues getValues(Map context, LeafReaderContext readerContext) throws IOException;
    [javac]                                            ^
    [javac]   missing type arguments for generic class Map<K,V>
    [javac]   where K,V are type-variables:
    [javac]     K extends Object declared in interface Map
    [javac]     V extends Object declared in interface Map
    [javac] /export/home/jenkins/workspace/Lucene-Solr-7.x-Solaris/lucene/queries/src/java/org/apache/lucene/queries/function/ValueSource.java:78: warning: [rawtypes] found raw type: Map
    [javac]   public void createWeight(Map context, IndexSearcher searcher) throws IOException {
    [javac]                            ^
    [javac]   missing type arguments for generic class Map<K,V>
    [javac]   where K,V are type-variables:
    [javac]     K extends Object declared in interface Map
    [javac]     V extends Object declared in interface Map
    [javac] /export/home/jenkins/workspace/Lucene-Solr-7.x-Solaris/lucene/queries/src/java/org/apache/lucene/queries/function/ValueSource.java:84: warning: [rawtypes] found raw type: Map
    [javac]   public static Map newContext(IndexSearcher searcher) {
    [javac]                 ^
    [javac]   missing type arguments for generic class Map<K,V>
    [javac]   where K,V are type-variables:
    [javac]     K extends Object declared in interface Map
    [javac]     V extends Object declared in interface Map
    [javac] /export/home/jenkins/workspace/Lucene-Solr-7.x-Solaris/lucene/queries/src/java/org/apache/lucene/queries/function/ValueSource.java:85: warning: [rawtypes] found raw type: Map
    [javac]     Map context = new IdentityHashMap();
    [javac]     ^
    [javac]   missing type arguments for generic class Map<K,V>
    [javac]   where K,V are type-variables:
    [javac]     K extends Object declared in interface Map
    [javac]     V extends Object declared in interface Map
    [javac] /export/home/jenkins/workspace/Lucene-Solr-7.x-Solaris/lucene/queries/src/java/org/apache/lucene/queries/function/ValueSource.java:85: warning: [rawtypes] found raw type: IdentityHashMap
    [javac]     Map context = new IdentityHashMap();
    [javac]                       ^
    [javac]   missing type arguments for generic class IdentityHashMap<K,V>
    [javac]   where K,V are type-variables:
    [javac]     K extends Object declared in class IdentityHashMap
    [javac]     V extends Object declared in class IdentityHashMap
    [javac] /export/home/jenkins/workspace/Lucene-Solr-7.x-Solaris/lucene/queries/src/java/org/apache/lucene/queries/function/ValueSource.java:86: warning: [unchecked] unchecked call to put(K,V) as a member of the raw type Map
    [javac]     context.put("searcher", searcher);
    [javac]                ^
    [javac]   where K,V are type-variables:
    [javac]     K extends Object declared in interface Map
    [javac]     V extends Object declared in interface Map
    [javac] /export/home/jenkins/workspace/Lucene-Solr-7.x-Solaris/lucene/queries/src/java/org/apache/lucene/queries/function/ValueSource.java:132: warning: [rawtypes] found raw type: Map
    [javac]       Map context = new IdentityHashMap<>();
    [javac]       ^
    [javac]   missing type arguments for generic class Map<K,V>
    [javac]   where K,V are type-variables:
    [javac]     K extends Object declared in interface Map
    [javac]     V extends Object declared in interface Map
    [javac] /export/home/jenkins/workspace/Lucene-Solr-7.x-Solaris/lucene/queries/src/java/org/apache/lucene/queries/function/ValueSource.java:134: warning: [unchecked] unchecked call to put(K,V) as a member of the raw type Map
    [javac]       context.put("scorer", scorer);
    [javac]                  ^
    [javac]   where K,V are type-variables:
    [javac]     K extends Object declared in interface Map
    [javac]     V extends Object declared in interface Map
    [javac] /export/home/jenkins/workspace/Lucene-Solr-7.x-Solaris/lucene/queries/src/java/org/apache/lucene/queries/function/ValueSource.java:208: warning: [rawtypes] found raw type: Map
    [javac]       Map context = new HashMap<>();
    [javac]       ^
    [javac]   missing type arguments for generic class Map<K,V>
    [javac]   where K,V are type-variables:
    [javac]     K extends Object declared in interface Map
    [javac]     V extends Object declared in interface Map
    [javac] /export/home/jenkins/workspace/Lucene-Solr-7.x-Solaris/lucene/queries/src/java/org/apache/lucene/queries/function/ValueSource.java:210: warning: [unchecked] unchecked call to put(K,V) as a member of the raw type Map
    [javac]       context.put("scorer", scorer);
    [javac]                  ^
    [javac]   where K,V are type-variables:
    [javac]     K extends Object declared in interface Map
    [javac]     V extends Object declared in interface Map
    [javac] /export/home/jenkins/workspace/Lucene-Solr-7.x-Solaris/lucene/queries/src/java/org/apache/lucene/queries/function/ValueSource.java:211: warning: [unchecked] unchecked call to put(K,V) as a member of the raw type Map
    [javac]       context.put("searcher", searcher);
    [javac]                  ^
    [javac]   where K,V are type-variables:
    [javac]     K extends Object declared in interface Map
    [javac]     V extends Object declared in interface Map
    [javac] /export/home/jenkins/workspace/Lucene-Solr-7.x-Solaris/lucene/queries/src/java/org/apache/lucene/queries/function/ValueSource.java:245: warning: [rawtypes] found raw type: Map
    [javac]       Map context = new HashMap<>();
    [javac]       ^
    [javac]   missing type arguments for generic class Map<K,V>
    [javac]   where K,V are type-variables:
    [javac]     K extends Object declared in interface Map
    [javac]     V extends Object declared in interface Map
    [javac] /export/home/jenkins/workspace/Lucene-Solr-7.x-Solaris/lucene/queries/src/java/org/apache/lucene/queries/function/ValueSource.java:248: warning: [unchecked] unchecked call to put(K,V) as a member of the raw type Map
    [javac]       context.put("scorer", scorer);
    [javac]                  ^
    [javac]   where K,V are type-variables:
    [javac]     K extends Object declared in interface Map
    [javac]     V extends Object declared in interface Map
    [javac] /export/home/jenkins/workspace/Lucene-Solr-7.x-Solaris/lucene/queries/src/java/org/apache/lucene/queries/function/ValueSource.java:249: warning: [unchecked] unchecked call to put(K,V) as a member of the raw type Map
    [javac]       context.put("searcher", searcher);
    [javac]                  ^
    [javac]   where K,V are type-variables:
    [javac]     K extends Object declared in interface Map
    [javac]     V extends Object declared in interface Map
    [javac] /export/home/jenkins/workspace/Lucene-Solr-7.x-Solaris/lucene/queries/src/java/org/apache/lucene/queries/function/ValueSource.java:293: warning: [rawtypes] found raw type: Map
    [javac]     public FunctionValues getValues(Map context, LeafReaderContext readerContext) throws IOException {
    [javac]                                     ^
    [javac]   missing type arguments for generic class Map<K,V>
    [javac]   where K,V are type-variables:
    [javac]     K extends Object declared in interface Map
    [javac]     V extends Object declared in interface Map
    [javac] /export/home/jenkins/workspace/Lucene-Solr-7.x-Solaris/lucene/queries/src/java/org/apache/lucene/queries/function/ValueSource.java:375: warning: [rawtypes] found raw type: Map
    [javac]       Map context = newContext(searcher);
    [javac]       ^
    [javac]   missing type arguments for generic class Map<K,V>
    [javac]   where K,V are type-variables:
    [javac]     K extends Object declared in interface Map
    [javac]     V extends Object declared in interface Map
    [javac] /export/home/jenkins/workspace/Lucene-Solr-7.x-Solaris/lucene/queries/src/java/org/apache/lucene/queries/function/ValueSource.java:382: warning: [rawtypes] found raw type: Map
    [javac]     private final Map context;
    [javac]                   ^
    [javac]   missing type arguments for generic class Map<K,V>
    [javac]   where K,V are type-variables:
    [javac]     K extends Object declared in interface Map
    [javac]     V extends Object declared in interface Map
    [javac] /export/home/jenkins/workspace/Lucene-Solr-7.x-Solaris/lucene/queries/src/java/org/apache/lucene/queries/function/ValueSource.java:384: warning: [rawtypes] found raw type: Map
    [javac]     public ValueSourceComparatorSource(Map context) {
    [javac]                                        ^
    [javac]   missing type arguments for generic class Map<K,V>
    [javac]   where K,V are type-variables:
    [javac]     K extends Object declared in interface Map
    [javac]     V extends Object declared in interface Map
    [javac] /export/home/jenkins/workspace/Lucene-Solr-7.x-Solaris/lucene/queries/src/java/org/apache/lucene/queries/function/ValueSource.java:404: warning: [rawtypes] found raw type: Map
    [javac]     private final Map fcontext;
    [javac]                   ^
    [javac]   missing type arguments for generic class Map<K,V>
    [javac]   where K,V are type-variables:
    [javac]     K extends Object declared in interface Map
    [javac]     V extends Object declared in interface Map
    [javac] /export/home/jenkins/workspace/Lucene-Solr-7.x-Solaris/lucene/queries/src/java/org/apache/lucene/queries/function/ValueSource.java:407: warning: [rawtypes] found raw type: Map
    [javac]     ValueSourceComparator(Map fcontext, int numHits) {
    [javac]                           ^
    [javac]   missing type arguments for generic class Map<K,V>
    [javac]   where K,V are type-variables:
    [javac]     K extends Object declared in interface Map
    [javac]     V extends Object declared in interface Map
    [javac] /export/home/jenkins/workspace/Lucene-Solr-7.x-Solaris/lucene/queries/src/java/org/apache/lucene/queries/function/BoostedQuery.java:70: warning: [rawtypes] found raw type: Map
    [javac]     Map fcontext;
    [javac]     ^
    [javac]   missing type arguments for generic class Map<K,V>
    [javac]   where K,V are type-variables:
    [javac]     K extends Object declared in interface Map
    [javac]     V extends Object declared in interface Map
    [javac] /export/home/jenkins/workspace/Lucene-Solr-7.x-Solaris/lucene/queries/src/java/org/apache/lucene/queries/function/valuesource/BytesRefFieldSource.java:44: warning: [rawtypes] found raw type: Map
    [javac]   public FunctionValues getValues(Map context, LeafReaderContext readerContext) throws IOException {
    [javac]                                   ^
    [javac]   missing type arguments for generic class Map<K,V>
    [javac]   where K,V are type-variables:
    [javac]     K extends Object declared in interface Map
    [javac]     V extends Object declared in interface Map
    [javac] /export/home/jenkins/workspace/Lucene-Solr-7.x-Solaris/lucene/queries/src/java/org/apache/lucene/queries/function/valuesource/ComparisonBoolFunction.java:53: warning: [rawtypes] found raw type: Map
    [javac]   public FunctionValues getValues(Map context, LeafReaderContext readerContext) throws IOException {
    [javac]                                   ^
    [javac]   missing type arguments for generic class Map<K,V>
    [javac]   where K,V are type-variables:
    [javac]     K extends Object declared in interface Map
    [javac]     V extends Object declared in interface Map
    [javac] /export/home/jenkins/workspace/Lucene-Solr-7.x-Solaris/lucene/queries/src/java/org/apache/lucene/queries/function/valuesource/ComparisonBoolFunction.java:100: warning: [rawtypes] found raw type: Map
    [javac]   public void createWeight(Map context, IndexSearcher searcher) throws IOException {
    [javac]                            ^
    [javac]   missing type arguments for generic class Map<K,V>
    [javac]   where K,V are type-variables:
    [javac]     K extends Object declared in interface Map
    [javac]     V extends Object declared in interface Map
    [javac] /export/home/jenkins/workspace/Lucene-Solr-7.x-Solaris/lucene/queries/src/java/org/apache/lucene/queries/function/valuesource/ConstValueSource.java:44: warning: [rawtypes] found raw type: Map
    [javac]   public FunctionValues getValues(Map context, LeafReaderContext readerContext) throws IOException {
    [javac]                                   ^
    [javac]   missing type arguments for generic class Map<K,V>
    [javac]   where K,V are type-variables:
    [javac]     K extends Object declared in interface Map
    [javac]     V extends Object declared in interface Map
    [javac] /export/home/jenkins/workspace/Lucene-Solr-7.x-Solaris/lucene/queries/src/java/org/apache/lucene/queries/function/valuesource/MultiFunction.java:115: warning: [rawtypes] found raw type: Map
    [javac]   public static FunctionValues[] valsArr(List<ValueSource> sources, Map fcontext, LeafReaderContext readerContext) throws IOException {
    [javac]                                                                     ^
    [javac]   missing type arguments for generic class Map<K,V>
    [javac]   where K,V are type-variables:
    [javac]     K extends Object declared in interface Map
    [javac]     V extends Object declared in interface Map
    [javac] /export/home/jenkins/workspace/Lucene-Solr-7.x-Solaris/lucene/queries/src/java/org/apache/lucene/queries/function/valuesource/MultiFunction.java:160: warning: [rawtypes] found raw type: Map
    [javac]   public void createWeight(Map context, IndexSearcher searcher) throws IOException {
    [javac]                            ^
    [javac]   missing type arguments for generic class Map<K,V>
    [javac]   where K,V are type-variables:
    [javac]     K extends Object declared in interface Map
    [javac]     V extends Object declared in interface Map
    [javac] /export/home/jenkins/workspace/Lucene-Solr-7.x-Solaris/lucene/queries/src/java/org/apache/lucene/queries/function/valuesource/DefFunction.java:45: warning: [rawtypes] found raw type: Map
    [javac]   public FunctionValues getValues(Map fcontext, LeafReaderContext readerContext) throws IOException {
    [javac]                                   ^
    [javac]   missing type arguments for generic class Map<K,V>
    [javac]   where K,V are type-variables:
    [javac]     K extends Object declared in interface Map
    [javac]     V extends Object declared in interface Map
    [javac] /export/home/jenkins/workspace/Lucene-Solr-7.x-Solaris/lucene/queries/src/java/org/apache/lucene/queries/function/valuesource/DualFloatFunction.java:54: warning: [rawtypes] found raw type: Map
    [javac]   public FunctionValues getValues(Map context, LeafReaderContext readerContext) throws IOException {
    [javac]                                   ^
    [javac]   missing type arguments for generic class Map<K,V>
    [javac]   where K,V are type-variables:
    [javac]     K extends Object declared in interface Map
    [javac]     V extends Object declared in interface Map
    [javac] /export/home/jenkins/workspace/Lucene-Solr-7.x-Solaris/lucene/queries/src/java/org/apache/lucene/queries/function/valuesource/DualFloatFunction.java:78: warning: [rawtypes] found raw type: Map
    [javac]   public void createWeight(Map context, IndexSearcher searcher) throws IOException {
    [javac]                            ^
    [javac]   missing type arguments for generic class Map<K,V>
    [javac]   where K,V are type-variables:
    [javac]     K extends Object declared in interface Map
    [javac]     V extends Object declared in interface Map
    [javac] /export/home/jenkins/workspace/Lucene-Solr-7.x-Solaris/lucene/queries/src/java/org/apache/lucene/queries/function/valuesource/DocFreqValueSource.java:148: warning: [rawtypes] found raw type: Map
    [javac]   public FunctionValues getValues(Map context, LeafReaderContext readerContext) throws IOException {
    [javac]                                   ^
    [javac]   missing type arguments for generic class Map<K,V>
    [javac]   where K,V are type-variables:
    [javac]     K extends Object declared in interface Map
    [javac]     V extends Object declared in interface Map
    [javac] /export/home/jenkins/workspace/Lucene-Solr-7.x-Solaris/lucene/queries/src/java/org/apache/lucene/queries/function/valuesource/DocFreqValueSource.java:155: warning: [rawtypes] found raw type: Map
    [javac]   public void createWeight(Map context, IndexSearcher searcher) throws IOException {
    [javac]                            ^
    [javac]   missing type arguments for generic class Map<K,V>
    [javac]   where K,V are type-variables:
    [javac]     K extends Object declared in interface Map
    [javac]     V extends Object declared in interface Map
    [javac] /export/home/jenkins/workspace/Lucene-Solr-7.x-Solaris/lucene/queries/src/java/org/apache/lucene/queries/function/valuesource/DocFreqValueSource.java:156: warning: [unchecked] unchecked call to put(K,V) as a member of the raw type Map
    [javac]     context.put("searcher",searcher);
    [javac]                ^
    [javac]   where K,V are type-variables:
    [javac]     K extends Object declared in interface Map
    [javac]     V extends Object declared in interface Map
    [javac] /export/home/jenkins/workspace/Lucene-Solr-7.x-Solaris/lucene/queries/src/java/org/apache/lucene/queries/function/valuesource/DoubleConstValueSource.java:46: warning: [rawtypes] found raw type: Map
    [javac]   public FunctionValues getValues(Map context, LeafReaderContext readerContext) throws IOException {
    [javac]                                   ^
    [javac]   missing type arguments for generic class Map<K,V>
    [javac]   where K,V are type-variables:
    [javac]     K extends Object declared in interface Map
    [javac]     V extends Object declared in interface Map
    [javac] /export/home/jenkins/workspace/Lucene-Solr-7.x-Solaris/lucene/queries/src/java/org/apache/lucene/queries/function/valuesource/DoubleFieldSource.java:53: warning: [rawtypes] found raw type: Map
    [javac]   public FunctionValues getValues(Map context, LeafReaderContext readerContext) throws IOException {
    [javac]                                   ^
    [javac]   missing type arguments for generic class Map<K,V>
    [javac]   where K,V are type-variables:
    [javac]     K extends Object declared in interface Map
    [javac]     V extends Object declared in interface Map
    [javac] /export/home/jenkins/workspace/Lucene-Solr-7.x-Solaris/lucene/queries/src/java/org/apache/lucene/queries/function/valuesource/DoubleFieldSource.java:107: warning: [rawtypes] found raw type: Map
    [javac]   protected NumericDocValues getNumericDocValues(Map context, LeafReaderContext readerContext) throws IOException {
    [javac]                                                  ^
    [javac]   missing type arguments for generic class Map<K,V>
    [javac]   where K,V are type-variables:
    [javac]     K extends Object declared in interface Map
    [javac]     V extends Object declared in interface Map
    [javac] /export/home/jenkins/workspace/Lucene-Solr-7.x-Solaris/lucene/queries/src/java/org/apache/lucene/queries/function/valuesource/EnumFieldSource.java:96: warning: [rawtypes] found raw type: Map
    [javac]   public FunctionValues getValues(Map context, LeafReaderContext readerContext) throws IOException {
    [javac]                                   ^
    [javac]   missing type arguments for generic class Map<K,V>
    [javac]   where K,V are type-variables:
    [javac]     K extends Object declared in interface Map
    [javac]     V extends Object declared in interface Map
    [javac] /export/home/jenkins/workspace/Lucene-Solr-7.x-Solaris/lucene/queries/src/java/org/apache/lucene/queries/function/valuesource/FloatFieldSource.java:53: warning: [rawtypes] found raw type: Map
    [javac]   public FunctionValues getValues(Map context, LeafReaderContext readerContext) throws IOException {
    [javac]                                   ^
    [javac]   missing type arguments for generic class Map<K,V>
    [javac]   where K,V are type-variables:
    [javac]     K extends Object declared in interface Map
    [javac]     V extends Object declared in interface Map
    [javac] /export/home/jenkins/workspace/Lucene-Solr-7.x-Solaris/lucene/queries/src/java/org/apache/lucene/queries/function/valuesource/FloatFieldSource.java:108: warning: [rawtypes] found raw type: Map
    [javac]   protected NumericDocValues getNumericDocValues(Map context, LeafReaderContext readerContext) throws IOException {
    [javac]                                                  ^
    [javac]   missing type arguments for generic class Map<K,V>
    [javac]   where K,V are type-variables:
    [javac]     K extends Object declared in interface Map
    [javac]     V extends Object declared in interface Map
    [javac] /export/home/jenkins/workspace/Lucene-Solr-7.x-Solaris/lucene/queries/src/java/org/apache/lucene/queries/function/valuesource/IDFValueSource.java:48: warning: [rawtypes] found raw type: Map
    [javac]   public FunctionValues getValues(Map context, LeafReaderContext readerContext) throws IOException {
    [javac]                                   ^
    [javac]   missing type arguments for generic class Map<K,V>
    [javac]   where K,V are type-variables:
    [javac]     K extends Object declared in interface Map
    [javac]     V extends Object declared in interface Map
    [javac] /export/home/jenkins/workspace/Lucene-Solr-7.x-Solaris/lucene/queries/src/java/org/apache/lucene/queries/function/valuesource/IDFValueSource.java:56: warning: auxiliary class ConstDoubleDocValues in /export/home/jenkins/workspace/Lucene-Solr-7.x-Solaris/lucene/queries/src/java/org/apache/lucene/queries/function/valuesource/DocFreqValueSource.java should not be accessed from outside its own source file
    [javac]     return new ConstDoubleDocValues(idf, this);
    [javac]                ^
    [javac] /export/home/jenkins/workspace/Lucene-Solr-7.x-Solaris/lucene/queries/src/java/org/apache/lucene/queries/function/valuesource/IfFunction.java:46: warning: [rawtypes] found raw type: Map
    [javac]   public FunctionValues getValues(Map context, LeafReaderContext readerContext) throws IOException {
    [javac]                                   ^
    [javac]   missing type arguments for generic class Map<K,V>
    [javac]   where K,V are type-variables:
    [javac]     K extends Object declared in interface Map
    [javac]     V extends Object declared in interface Map
    [javac] /export/home/jenkins/workspace/Lucene-Solr-7.x-Solaris/lucene/queries/src/java/org/apache/lucene/queries/function/valuesource/IfFunction.java:145: warning: [rawtypes] found raw type: Map
    [javac]   public void createWeight(Map context, IndexSearcher searcher) throws IOException {
    [javac]                            ^
    [javac]   missing type arguments for generic class Map<K,V>
    [javac]   where K,V are type-variables:
    [javac]     K extends Object declared in interface Map
    [javac]     V extends Object declared in interface Map
    [javac] /export/home/jenkins/workspace/Lucene-Solr-7.x-Solaris/lucene/queries/src/java/org/apache/lucene/queries/function/valuesource/IntFieldSource.java:53: warning: [rawtypes] found raw type: Map
    [javac]   public FunctionValues getValues(Map context, LeafReaderContext readerContext) throws IOException {
    [javac]                                   ^
    [javac]   missing type arguments for generic class Map<K,V>
    [javac]   where K,V are type-variables:
    [javac]     K extends Object declared in interface Map
    [javac]     V extends Object declared in interface Map
    [javac] /export/home/jenkins/workspace/Lucene-Solr-7.x-Solaris/lucene/queries/src/java/org/apache/lucene/queries/function/valuesource/IntFieldSource.java:112: warning: [rawtypes] found raw type: Map
    [javac]   protected NumericDocValues getNumericDocValues(Map context, LeafReaderContext readerContext) throws IOException {
    [javac]                                                  ^
    [javac]   missing type arguments for generic class Map<K,V>
    [javac]   where K,V are type-variables:
    [javac]     K extends Object declared in interface Map
    [javac]     V extends Object declared in interface Map
    [javac] /export/home/jenkins/workspace/Lucene-Solr-7.x-Solaris/lucene/queries/src/java/org/apache/lucene/queries/function/valuesource/JoinDocFreqValueSource.java:56: warning: [rawtypes] found raw type: Map
    [javac]   public FunctionValues getValues(Map context, LeafReaderContext readerContext) throws IOException
    [javac]                                   ^
    [javac]   missing type arguments for generic class Map<K,V>
    [javac]   

[...truncated too long message...]

2> 	at com.lmax.disruptor.TimeoutBlockingWaitStrategy.waitFor(TimeoutBlockingWaitStrategy.java:38)
   [junit4]   2> 	at com.lmax.disruptor.ProcessingSequenceBarrier.waitFor(ProcessingSequenceBarrier.java:56)
   [junit4]   2> 	at com.lmax.disruptor.BatchEventProcessor.run(BatchEventProcessor.java:128)
   [junit4]   2> 	at java.lang.Thread.run(Thread.java:748)
   [junit4]   2> AsyncLogger error handling event seq=3, value='null':
   [junit4]   2> java.lang.InterruptedException
   [junit4]   2> 	at java.util.concurrent.locks.AbstractQueuedSynchronizer$ConditionObject.reportInterruptAfterWait(AbstractQueuedSynchronizer.java:2014)
   [junit4]   2> 	at java.util.concurrent.locks.AbstractQueuedSynchronizer$ConditionObject.awaitNanos(AbstractQueuedSynchronizer.java:2088)
   [junit4]   2> 	at com.lmax.disruptor.TimeoutBlockingWaitStrategy.waitFor(TimeoutBlockingWaitStrategy.java:38)
   [junit4]   2> 	at com.lmax.disruptor.ProcessingSequenceBarrier.waitFor(ProcessingSequenceBarrier.java:56)
   [junit4]   2> 	at com.lmax.disruptor.BatchEventProcessor.run(BatchEventProcessor.java:128)
   [junit4]   2> 	at java.lang.Thread.run(Thread.java:748)
   [junit4]   2> AsyncLogger error handling event seq=4, value='null':
   [junit4]   2> java.lang.InterruptedException
   [junit4]   2> 	at java.util.concurrent.locks.AbstractQueuedSynchronizer$ConditionObject.reportInterruptAfterWait(AbstractQueuedSynchronizer.java:2014)
   [junit4]   2> 	at java.util.concurrent.locks.AbstractQueuedSynchronizer$ConditionObject.awaitNanos(AbstractQueuedSynchronizer.java:2088)
   [junit4]   2> 	at com.lmax.disruptor.TimeoutBlockingWaitStrategy.waitFor(TimeoutBlockingWaitStrategy.java:38)
   [junit4]   2> 	at com.lmax.disruptor.ProcessingSequenceBarrier.waitFor(ProcessingSequenceBarrier.java:56)
   [junit4]   2> 	at com.lmax.disruptor.BatchEventProcessor.run(BatchEventProcessor.java:128)
   [junit4]   2> 	at java.lang.Thread.run(Thread.java:748)
   [junit4]   2> AsyncLogger error handling event seq=5, value='null':
   [junit4]   2> java.lang.InterruptedException
   [junit4]   2> 	at java.util.concurrent.locks.AbstractQueuedSynchronizer$ConditionObject.reportInterruptAfterWait(AbstractQueuedSynchronizer.java:2014)
   [junit4]   2> 	at java.util.concurrent.locks.AbstractQueuedSynchronizer$ConditionObject.awaitNanos(AbstractQueuedSynchronizer.java:2088)
   [junit4]   2> 	at com.lmax.disruptor.TimeoutBlockingWaitStrategy.waitFor(TimeoutBlockingWaitStrategy.java:38)
   [junit4]   2> 	at com.lmax.disruptor.ProcessingSequenceBarrier.waitFor(ProcessingSequenceBarrier.java:56)
   [junit4]   2> 	at com.lmax.disruptor.BatchEventProcessor.run(BatchEventProcessor.java:128)
   [junit4]   2> 	at java.lang.Thread.run(Thread.java:748)
   [junit4]   2> Sep 03, 2018 6:22:20 AM com.carrotsearch.randomizedtesting.ThreadLeakControl tryToInterruptAll
   [junit4]   2> SEVERE: There are still zombie threads that couldn't be terminated:
   [junit4]   2>    1) Thread[id=13, name=Log4j2-TF-1-AsyncLoggerConfig--1, state=TIMED_WAITING, group=TGRP-SignificantTermsQParserPluginTest]
   [junit4]   2>         at sun.misc.Unsafe.park(Native Method)
   [junit4]   2>         at java.util.concurrent.locks.LockSupport.parkNanos(LockSupport.java:215)
   [junit4]   2>         at java.util.concurrent.locks.AbstractQueuedSynchronizer$ConditionObject.awaitNanos(AbstractQueuedSynchronizer.java:2078)
   [junit4]   2>         at com.lmax.disruptor.TimeoutBlockingWaitStrategy.waitFor(TimeoutBlockingWaitStrategy.java:38)
   [junit4]   2>         at com.lmax.disruptor.ProcessingSequenceBarrier.waitFor(ProcessingSequenceBarrier.java:56)
   [junit4]   2>         at com.lmax.disruptor.BatchEventProcessor.run(BatchEventProcessor.java:128)
   [junit4]   2>         at java.lang.Thread.run(Thread.java:748)
   [junit4]   2> NOTE: test params are: codec=Asserting(Lucene70): {}, docValues:{}, maxPointsInLeafNode=1348, maxMBSortInHeap=6.4924904157215995, sim=RandomSimilarity(queryNorm=false): {}, locale=ar-AE, timezone=Asia/Damascus
   [junit4]   2> NOTE: SunOS 5.11 amd64/Oracle Corporation 1.8.0_172 (64-bit)/cpus=3,threads=2,free=68583016,total=97320960
   [junit4]   2> NOTE: All tests run in this JVM: [SignificantTermsQParserPluginTest]
   [junit4]   2> NOTE: reproduce with: ant test  -Dtestcase=SignificantTermsQParserPluginTest -Dtests.seed=9D483F8C0B2F559C -Dtests.slow=true -Dtests.badapples=true -Dtests.locale=ar-AE -Dtests.timezone=Asia/Damascus -Dtests.asserts=true -Dtests.file.encoding=UTF-8
   [junit4] ERROR   0.00s J0 | SignificantTermsQParserPluginTest (suite) <<<
   [junit4]    > Throwable #1: com.carrotsearch.randomizedtesting.ThreadLeakError: 1 thread leaked from SUITE scope at org.apache.solr.search.SignificantTermsQParserPluginTest: 
   [junit4]    >    1) Thread[id=13, name=Log4j2-TF-1-AsyncLoggerConfig--1, state=TIMED_WAITING, group=TGRP-SignificantTermsQParserPluginTest]
   [junit4]    >         at sun.misc.Unsafe.park(Native Method)
   [junit4]    >         at java.util.concurrent.locks.LockSupport.parkNanos(LockSupport.java:215)
   [junit4]    >         at java.util.concurrent.locks.AbstractQueuedSynchronizer$ConditionObject.awaitNanos(AbstractQueuedSynchronizer.java:2078)
   [junit4]    >         at com.lmax.disruptor.TimeoutBlockingWaitStrategy.waitFor(TimeoutBlockingWaitStrategy.java:38)
   [junit4]    >         at com.lmax.disruptor.ProcessingSequenceBarrier.waitFor(ProcessingSequenceBarrier.java:56)
   [junit4]    >         at com.lmax.disruptor.BatchEventProcessor.run(BatchEventProcessor.java:128)
   [junit4]    >         at java.lang.Thread.run(Thread.java:748)
   [junit4]    > 	at __randomizedtesting.SeedInfo.seed([9D483F8C0B2F559C]:0)Throwable #2: com.carrotsearch.randomizedtesting.ThreadLeakError: There are still zombie threads that couldn't be terminated:
   [junit4]    >    1) Thread[id=13, name=Log4j2-TF-1-AsyncLoggerConfig--1, state=TIMED_WAITING, group=TGRP-SignificantTermsQParserPluginTest]
   [junit4]    >         at sun.misc.Unsafe.park(Native Method)
   [junit4]    >         at java.util.concurrent.locks.LockSupport.parkNanos(LockSupport.java:215)
   [junit4]    >         at java.util.concurrent.locks.AbstractQueuedSynchronizer$ConditionObject.awaitNanos(AbstractQueuedSynchronizer.java:2078)
   [junit4]    >         at com.lmax.disruptor.TimeoutBlockingWaitStrategy.waitFor(TimeoutBlockingWaitStrategy.java:38)
   [junit4]    >         at com.lmax.disruptor.ProcessingSequenceBarrier.waitFor(ProcessingSequenceBarrier.java:56)
   [junit4]    >         at com.lmax.disruptor.BatchEventProcessor.run(BatchEventProcessor.java:128)
   [junit4]    >         at java.lang.Thread.run(Thread.java:748)
   [junit4]    > 	at __randomizedtesting.SeedInfo.seed([9D483F8C0B2F559C]:0)
   [junit4] Completed [2/5 (2!)] on J0 in 25.18s, 1 test, 2 errors <<< FAILURES!
   [junit4] 
   [junit4] Duplicate suite name used with XML reports: org.apache.solr.search.SignificantTermsQParserPluginTest. This may confuse tools that process XML reports. Set 'ignoreDuplicateSuites' to true to skip this message.
   [junit4] Suite: org.apache.solr.search.SignificantTermsQParserPluginTest
   [junit4] Completed [3/5 (2!)] on J0 in 0.01s, 1 test, 1 skipped
   [junit4] 
   [junit4] Suite: org.apache.solr.search.SignificantTermsQParserPluginTest
   [junit4] Completed [4/5 (2!)] on J1 in 0.00s, 1 test, 1 skipped
   [junit4] 
   [junit4] Suite: org.apache.solr.search.SignificantTermsQParserPluginTest
   [junit4] Completed [5/5 (2!)] on J0 in 0.00s, 1 test, 1 skipped
   [junit4] 
   [junit4] 
   [junit4] Tests with failures [seed: 9D483F8C0B2F559C]:
   [junit4]   - org.apache.solr.search.SignificantTermsQParserPluginTest (suite)
   [junit4]   - org.apache.solr.search.SignificantTermsQParserPluginTest (suite)
   [junit4] 
   [junit4] 
   [junit4] JVM J0:     0.72 ..    26.80 =    26.07s
   [junit4] JVM J1:     0.70 ..    26.78 =    26.08s
   [junit4] Execution time total: 26 seconds
   [junit4] Tests summary: 5 suites, 5 tests, 4 suite-level errors, 3 ignored

BUILD FAILED
/export/home/jenkins/workspace/Lucene-Solr-7.x-Solaris/lucene/common-build.xml:1568: The following error occurred while executing this line:
/export/home/jenkins/workspace/Lucene-Solr-7.x-Solaris/lucene/common-build.xml:1092: There were test failures: 5 suites, 5 tests, 4 suite-level errors, 3 ignored [seed: 9D483F8C0B2F559C]

Total time: 29 seconds

[repro] Setting last failure code to 256

[repro] Failures:
[repro]   2/5 failed: org.apache.solr.search.SignificantTermsQParserPluginTest
[repro] Exiting with code 256
+ mv lucene/build lucene/build.repro
+ mv solr/build solr/build.repro
+ mv lucene/build.orig lucene/build
+ mv solr/build.orig solr/build
Archiving artifacts
Setting ANT_1_8_2_HOME=/export/home/jenkins/tools/hudson.tasks.Ant_AntInstallation/ANT_1.8.2
[WARNINGS] Parsing warnings in console log with parser Java Compiler (javac)
Setting ANT_1_8_2_HOME=/export/home/jenkins/tools/hudson.tasks.Ant_AntInstallation/ANT_1.8.2
Setting ANT_1_8_2_HOME=/export/home/jenkins/tools/hudson.tasks.Ant_AntInstallation/ANT_1.8.2
<Git Blamer> Using GitBlamer to create author and commit information for all warnings.
<Git Blamer> GIT_COMMIT=d35b615c66e8974363b7a938abc0d74a85a798dd, workspace=/export/home/jenkins/workspace/Lucene-Solr-7.x-Solaris
[WARNINGS] Computing warning deltas based on reference build #795
Recording test results
Setting ANT_1_8_2_HOME=/export/home/jenkins/tools/hudson.tasks.Ant_AntInstallation/ANT_1.8.2
Build step 'Publish JUnit test result report' changed build result to UNSTABLE
Email was triggered for: Unstable (Test Failures)
Sending email for trigger: Unstable (Test Failures)
Setting ANT_1_8_2_HOME=/export/home/jenkins/tools/hudson.tasks.Ant_AntInstallation/ANT_1.8.2
Setting ANT_1_8_2_HOME=/export/home/jenkins/tools/hudson.tasks.Ant_AntInstallation/ANT_1.8.2
Setting ANT_1_8_2_HOME=/export/home/jenkins/tools/hudson.tasks.Ant_AntInstallation/ANT_1.8.2
Setting ANT_1_8_2_HOME=/export/home/jenkins/tools/hudson.tasks.Ant_AntInstallation/ANT_1.8.2

Mime
View raw message