lucene-dev mailing list archives

Site index · List index
Message view « Date » · « Thread »
Top « Date » · « Thread »
From Policeman Jenkins Server <jenk...@thetaphi.de>
Subject [JENKINS-EA] Lucene-Solr-7.x-Linux (64bit/jdk-11-ea+28) - Build # 2759 - Unstable!
Date Mon, 17 Sep 2018 15:53:43 GMT
Build: https://jenkins.thetaphi.de/job/Lucene-Solr-7.x-Linux/2759/
Java: 64bit/jdk-11-ea+28 -XX:-UseCompressedOops -XX:+UseParallelGC

1 tests failed.
FAILED:  org.apache.solr.TestDistributedGrouping.test

Error Message:
Error from server at https://127.0.0.1:44101/i_/i/collection1: ERROR: [doc=1] unknown field 'a_idv'

Stack Trace:
org.apache.solr.client.solrj.impl.HttpSolrClient$RemoteSolrException: Error from server at https://127.0.0.1:44101/i_/i/collection1: ERROR: [doc=1] unknown field 'a_idv'
	at __randomizedtesting.SeedInfo.seed([9A800F53024D591C:12D43089ACB134E4]:0)
	at org.apache.solr.client.solrj.impl.HttpSolrClient.executeMethod(HttpSolrClient.java:643)
	at org.apache.solr.client.solrj.impl.HttpSolrClient.request(HttpSolrClient.java:255)
	at org.apache.solr.client.solrj.impl.HttpSolrClient.request(HttpSolrClient.java:244)
	at org.apache.solr.client.solrj.SolrRequest.process(SolrRequest.java:194)
	at org.apache.solr.client.solrj.SolrClient.add(SolrClient.java:173)
	at org.apache.solr.client.solrj.SolrClient.add(SolrClient.java:138)
	at org.apache.solr.client.solrj.SolrClient.add(SolrClient.java:152)
	at org.apache.solr.BaseDistributedSearchTestCase.indexDoc(BaseDistributedSearchTestCase.java:483)
	at org.apache.solr.BaseDistributedSearchTestCase.indexr(BaseDistributedSearchTestCase.java:465)
	at org.apache.solr.TestDistributedGrouping.test(TestDistributedGrouping.java:75)
	at java.base/jdk.internal.reflect.NativeMethodAccessorImpl.invoke0(Native Method)
	at java.base/jdk.internal.reflect.NativeMethodAccessorImpl.invoke(NativeMethodAccessorImpl.java:62)
	at java.base/jdk.internal.reflect.DelegatingMethodAccessorImpl.invoke(DelegatingMethodAccessorImpl.java:43)
	at java.base/java.lang.reflect.Method.invoke(Method.java:566)
	at com.carrotsearch.randomizedtesting.RandomizedRunner.invoke(RandomizedRunner.java:1742)
	at com.carrotsearch.randomizedtesting.RandomizedRunner$8.evaluate(RandomizedRunner.java:935)
	at com.carrotsearch.randomizedtesting.RandomizedRunner$9.evaluate(RandomizedRunner.java:971)
	at com.carrotsearch.randomizedtesting.RandomizedRunner$10.evaluate(RandomizedRunner.java:985)
	at org.apache.solr.BaseDistributedSearchTestCase$ShardsRepeatRule$ShardsRepeatStatement.callStatement(BaseDistributedSearchTestCase.java:1034)
	at org.apache.solr.BaseDistributedSearchTestCase$ShardsRepeatRule$ShardsStatement.evaluate(BaseDistributedSearchTestCase.java:983)
	at com.carrotsearch.randomizedtesting.rules.SystemPropertiesRestoreRule$1.evaluate(SystemPropertiesRestoreRule.java:57)
	at org.apache.lucene.util.TestRuleSetupTeardownChained$1.evaluate(TestRuleSetupTeardownChained.java:49)
	at org.apache.lucene.util.AbstractBeforeAfterRule$1.evaluate(AbstractBeforeAfterRule.java:45)
	at org.apache.lucene.util.TestRuleThreadAndTestName$1.evaluate(TestRuleThreadAndTestName.java:48)
	at org.apache.lucene.util.TestRuleIgnoreAfterMaxFailures$1.evaluate(TestRuleIgnoreAfterMaxFailures.java:64)
	at org.apache.lucene.util.TestRuleMarkFailure$1.evaluate(TestRuleMarkFailure.java:47)
	at com.carrotsearch.randomizedtesting.rules.StatementAdapter.evaluate(StatementAdapter.java:36)
	at com.carrotsearch.randomizedtesting.ThreadLeakControl$StatementRunner.run(ThreadLeakControl.java:368)
	at com.carrotsearch.randomizedtesting.ThreadLeakControl.forkTimeoutingTask(ThreadLeakControl.java:817)
	at com.carrotsearch.randomizedtesting.ThreadLeakControl$3.evaluate(ThreadLeakControl.java:468)
	at com.carrotsearch.randomizedtesting.RandomizedRunner.runSingleTest(RandomizedRunner.java:944)
	at com.carrotsearch.randomizedtesting.RandomizedRunner$5.evaluate(RandomizedRunner.java:830)
	at com.carrotsearch.randomizedtesting.RandomizedRunner$6.evaluate(RandomizedRunner.java:880)
	at com.carrotsearch.randomizedtesting.RandomizedRunner$7.evaluate(RandomizedRunner.java:891)
	at com.carrotsearch.randomizedtesting.rules.StatementAdapter.evaluate(StatementAdapter.java:36)
	at com.carrotsearch.randomizedtesting.rules.SystemPropertiesRestoreRule$1.evaluate(SystemPropertiesRestoreRule.java:57)
	at org.apache.lucene.util.AbstractBeforeAfterRule$1.evaluate(AbstractBeforeAfterRule.java:45)
	at com.carrotsearch.randomizedtesting.rules.StatementAdapter.evaluate(StatementAdapter.java:36)
	at org.apache.lucene.util.TestRuleStoreClassName$1.evaluate(TestRuleStoreClassName.java:41)
	at com.carrotsearch.randomizedtesting.rules.NoShadowingOrOverridesOnMethodsRule$1.evaluate(NoShadowingOrOverridesOnMethodsRule.java:40)
	at com.carrotsearch.randomizedtesting.rules.NoShadowingOrOverridesOnMethodsRule$1.evaluate(NoShadowingOrOverridesOnMethodsRule.java:40)
	at com.carrotsearch.randomizedtesting.rules.StatementAdapter.evaluate(StatementAdapter.java:36)
	at com.carrotsearch.randomizedtesting.rules.StatementAdapter.evaluate(StatementAdapter.java:36)
	at org.apache.lucene.util.TestRuleAssertionsRequired$1.evaluate(TestRuleAssertionsRequired.java:53)
	at org.apache.lucene.util.TestRuleMarkFailure$1.evaluate(TestRuleMarkFailure.java:47)
	at org.apache.lucene.util.TestRuleIgnoreAfterMaxFailures$1.evaluate(TestRuleIgnoreAfterMaxFailures.java:64)
	at org.apache.lucene.util.TestRuleIgnoreTestSuites$1.evaluate(TestRuleIgnoreTestSuites.java:54)
	at com.carrotsearch.randomizedtesting.rules.StatementAdapter.evaluate(StatementAdapter.java:36)
	at com.carrotsearch.randomizedtesting.ThreadLeakControl$StatementRunner.run(ThreadLeakControl.java:368)
	at java.base/java.lang.Thread.run(Thread.java:834)




Build Log:
[...truncated 13638 lines...]
   [junit4] Suite: org.apache.solr.TestDistributedGrouping
   [junit4]   2> Creating dataDir: /home/jenkins/workspace/Lucene-Solr-7.x-Linux/solr/build/solr-core/test/J2/temp/solr.TestDistributedGrouping_9A800F53024D591C-001/init-core-data-001
   [junit4]   2> 1016099 WARN  (SUITE-TestDistributedGrouping-seed#[9A800F53024D591C]-worker) [    ] o.a.s.SolrTestCaseJ4 startTrackingSearchers: numOpens=21 numCloses=21
   [junit4]   2> 1016105 INFO  (SUITE-TestDistributedGrouping-seed#[9A800F53024D591C]-worker) [    ] o.a.s.SolrTestCaseJ4 Using TrieFields (NUMERIC_POINTS_SYSPROP=false) w/NUMERIC_DOCVALUES_SYSPROP=false
   [junit4]   2> 1016106 INFO  (SUITE-TestDistributedGrouping-seed#[9A800F53024D591C]-worker) [    ] o.a.s.SolrTestCaseJ4 Randomized ssl (true) and clientAuth (true) via: @org.apache.solr.util.RandomizeSSL(reason="", ssl=0.0/0.0, value=0.0/0.0, clientAuth=0.0/0.0)
   [junit4]   2> 1016107 INFO  (SUITE-TestDistributedGrouping-seed#[9A800F53024D591C]-worker) [    ] o.a.s.SolrTestCaseJ4 SecureRandom sanity checks: test.solr.allowed.securerandom=null & java.security.egd=file:/dev/./urandom
   [junit4]   2> 1016107 INFO  (SUITE-TestDistributedGrouping-seed#[9A800F53024D591C]-worker) [    ] o.a.s.BaseDistributedSearchTestCase Setting hostContext system property: /i_/i
   [junit4]   2> 1016244 INFO  (TEST-TestDistributedGrouping.test-seed#[9A800F53024D591C]) [    ] o.a.s.SolrTestCaseJ4 Writing core.properties file to /home/jenkins/workspace/Lucene-Solr-7.x-Linux/solr/build/solr-core/test/J2/temp/solr.TestDistributedGrouping_9A800F53024D591C-001/tempDir-001/control/cores/collection1
   [junit4]   2> 1016246 INFO  (TEST-TestDistributedGrouping.test-seed#[9A800F53024D591C]) [    ] o.e.j.s.Server jetty-9.4.11.v20180605; built: 2018-06-05T18:24:03.829Z; git: d5fc0523cfa96bfebfbda19606cad384d772f04c; jvm 11+28
   [junit4]   2> 1016276 INFO  (TEST-TestDistributedGrouping.test-seed#[9A800F53024D591C]) [    ] o.e.j.s.session DefaultSessionIdManager workerName=node0
   [junit4]   2> 1016276 INFO  (TEST-TestDistributedGrouping.test-seed#[9A800F53024D591C]) [    ] o.e.j.s.session No SessionScavenger set, using defaults
   [junit4]   2> 1016276 INFO  (TEST-TestDistributedGrouping.test-seed#[9A800F53024D591C]) [    ] o.e.j.s.session node0 Scavenging every 660000ms
   [junit4]   2> 1016286 INFO  (TEST-TestDistributedGrouping.test-seed#[9A800F53024D591C]) [    ] o.e.j.s.h.ContextHandler Started o.e.j.s.ServletContextHandler@7c6e3341{/i_/i,null,AVAILABLE}
   [junit4]   2> 1016287 INFO  (TEST-TestDistributedGrouping.test-seed#[9A800F53024D591C]) [    ] o.e.j.s.AbstractConnector Started ServerConnector@3d23a7f8{SSL,[ssl, http/1.1]}{127.0.0.1:44101}
   [junit4]   2> 1016287 INFO  (TEST-TestDistributedGrouping.test-seed#[9A800F53024D591C]) [    ] o.e.j.s.Server Started @1016308ms
   [junit4]   2> 1016287 INFO  (TEST-TestDistributedGrouping.test-seed#[9A800F53024D591C]) [    ] o.a.s.c.s.e.JettySolrRunner Jetty properties: {schema=schema-sql.xml, hostContext=/i_/i, hostPort=44101, coreRootDirectory=/home/jenkins/workspace/Lucene-Solr-7.x-Linux/solr/build/solr-core/test/J2/temp/solr.TestDistributedGrouping_9A800F53024D591C-001/tempDir-001/control/cores}
   [junit4]   2> 1016287 ERROR (TEST-TestDistributedGrouping.test-seed#[9A800F53024D591C]) [    ] o.a.s.u.StartupLoggingUtils Missing Java Option solr.log.dir. Logging may be missing or incomplete.
   [junit4]   2> 1016287 INFO  (TEST-TestDistributedGrouping.test-seed#[9A800F53024D591C]) [    ] o.a.s.s.SolrDispatchFilter Using logger factory org.apache.logging.slf4j.Log4jLoggerFactory
   [junit4]   2> 1016287 INFO  (TEST-TestDistributedGrouping.test-seed#[9A800F53024D591C]) [    ] o.a.s.s.SolrDispatchFilter  ___      _       Welcome to Apache Solr? version 7.6.0
   [junit4]   2> 1016287 INFO  (TEST-TestDistributedGrouping.test-seed#[9A800F53024D591C]) [    ] o.a.s.s.SolrDispatchFilter / __| ___| |_ _   Starting in standalone mode on port null
   [junit4]   2> 1016287 INFO  (TEST-TestDistributedGrouping.test-seed#[9A800F53024D591C]) [    ] o.a.s.s.SolrDispatchFilter \__ \/ _ \ | '_|  Install dir: null
   [junit4]   2> 1016287 INFO  (TEST-TestDistributedGrouping.test-seed#[9A800F53024D591C]) [    ] o.a.s.s.SolrDispatchFilter |___/\___/_|_|    Start time: 2018-09-17T14:53:22.077927Z
   [junit4]   2> 1016288 INFO  (TEST-TestDistributedGrouping.test-seed#[9A800F53024D591C]) [    ] o.a.s.c.SolrXmlConfig Loading container configuration from /home/jenkins/workspace/Lucene-Solr-7.x-Linux/solr/build/solr-core/test/J2/temp/solr.TestDistributedGrouping_9A800F53024D591C-001/tempDir-001/control/solr.xml
   [junit4]   2> 1016289 INFO  (TEST-TestDistributedGrouping.test-seed#[9A800F53024D591C]) [    ] o.a.s.c.SolrXmlConfig Configuration parameter autoReplicaFailoverWorkLoopDelay is ignored
   [junit4]   2> 1016290 INFO  (TEST-TestDistributedGrouping.test-seed#[9A800F53024D591C]) [    ] o.a.s.c.SolrXmlConfig Configuration parameter autoReplicaFailoverBadNodeExpiration is ignored
   [junit4]   2> 1016290 INFO  (TEST-TestDistributedGrouping.test-seed#[9A800F53024D591C]) [    ] o.a.s.c.SolrXmlConfig MBean server found: com.sun.jmx.mbeanserver.JmxMBeanServer@686a899a, but no JMX reporters were configured - adding default JMX reporter.
   [junit4]   2> 1016367 INFO  (TEST-TestDistributedGrouping.test-seed#[9A800F53024D591C]) [    ] o.a.s.c.TransientSolrCoreCacheDefault Allocating transient cache for 4 transient cores
   [junit4]   2> 1016367 INFO  (TEST-TestDistributedGrouping.test-seed#[9A800F53024D591C]) [    ] o.a.s.h.a.MetricsHistoryHandler No .system collection, keeping metrics history in memory.
   [junit4]   2> 1016381 INFO  (TEST-TestDistributedGrouping.test-seed#[9A800F53024D591C]) [    ] o.a.s.m.r.SolrJmxReporter JMX monitoring for 'solr.node' (registry 'solr.node') enabled at server: com.sun.jmx.mbeanserver.JmxMBeanServer@686a899a
   [junit4]   2> 1016390 INFO  (TEST-TestDistributedGrouping.test-seed#[9A800F53024D591C]) [    ] o.a.s.m.r.SolrJmxReporter JMX monitoring for 'solr.jvm' (registry 'solr.jvm') enabled at server: com.sun.jmx.mbeanserver.JmxMBeanServer@686a899a
   [junit4]   2> 1016390 INFO  (TEST-TestDistributedGrouping.test-seed#[9A800F53024D591C]) [    ] o.a.s.m.r.SolrJmxReporter JMX monitoring for 'solr.jetty' (registry 'solr.jetty') enabled at server: com.sun.jmx.mbeanserver.JmxMBeanServer@686a899a
   [junit4]   2> 1016391 INFO  (TEST-TestDistributedGrouping.test-seed#[9A800F53024D591C]) [    ] o.a.s.c.CorePropertiesLocator Found 1 core definitions underneath /home/jenkins/workspace/Lucene-Solr-7.x-Linux/solr/build/solr-core/test/J2/temp/solr.TestDistributedGrouping_9A800F53024D591C-001/tempDir-001/control/cores
   [junit4]   2> 1016391 INFO  (TEST-TestDistributedGrouping.test-seed#[9A800F53024D591C]) [    ] o.a.s.c.CorePropertiesLocator Cores are: [collection1]
   [junit4]   2> 1016392 INFO  (coreLoadExecutor-4280-thread-1) [    x:collection1] o.a.s.c.SolrResourceLoader [null] Added 2 libs to classloader, from paths: [/home/jenkins/workspace/Lucene-Solr-7.x-Linux/solr/core/src/test-files/solr/collection1/lib, /home/jenkins/workspace/Lucene-Solr-7.x-Linux/solr/core/src/test-files/solr/collection1/lib/classes]
   [junit4]   2> 1016429 INFO  (coreLoadExecutor-4280-thread-1) [    x:collection1] o.a.s.c.SolrConfig Using Lucene MatchVersion: 7.6.0
   [junit4]   2> 1016475 INFO  (coreLoadExecutor-4280-thread-1) [    x:collection1] o.a.s.s.IndexSchema [collection1] Schema name=test
   [junit4]   2> 1016568 WARN  (coreLoadExecutor-4280-thread-1) [    x:collection1] o.a.s.s.IndexSchema Field lowerfilt1and2 is not multivalued and destination for multiple copyFields (2)
   [junit4]   2> 1016568 WARN  (coreLoadExecutor-4280-thread-1) [    x:collection1] o.a.s.s.IndexSchema Field text is not multivalued and destination for multiple copyFields (3)
   [junit4]   2> 1016569 INFO  (coreLoadExecutor-4280-thread-1) [    x:collection1] o.a.s.s.IndexSchema Loaded schema test/1.6 with uniqueid field id
   [junit4]   2> 1016569 INFO  (coreLoadExecutor-4280-thread-1) [    x:collection1] o.a.s.c.CoreContainer Creating SolrCore 'collection1' using configuration from configset /home/jenkins/workspace/Lucene-Solr-7.x-Linux/solr/core/src/test-files/solr/collection1, trusted=true
   [junit4]   2> 1016569 INFO  (coreLoadExecutor-4280-thread-1) [    x:collection1] o.a.s.m.r.SolrJmxReporter JMX monitoring for 'solr.core.collection1' (registry 'solr.core.collection1') enabled at server: com.sun.jmx.mbeanserver.JmxMBeanServer@686a899a
   [junit4]   2> 1016569 INFO  (coreLoadExecutor-4280-thread-1) [    x:collection1] o.a.s.c.SolrCore [[collection1] ] Opening new SolrCore at [/home/jenkins/workspace/Lucene-Solr-7.x-Linux/solr/core/src/test-files/solr/collection1], dataDir=[/home/jenkins/workspace/Lucene-Solr-7.x-Linux/solr/build/solr-core/test/J2/temp/solr.TestDistributedGrouping_9A800F53024D591C-001/tempDir-001/control/cores/collection1/data/]
   [junit4]   2> 1016570 INFO  (coreLoadExecutor-4280-thread-1) [    x:collection1] o.a.s.u.RandomMergePolicy RandomMergePolicy wrapping class org.apache.lucene.index.AlcoholicMergePolicy: [AlcoholicMergePolicy: minMergeSize=0, mergeFactor=10, maxMergeSize=86307987, maxMergeSizeForForcedMerge=9223372036854775807, calibrateSizeByDeletes=true, maxMergeDocs=2147483647, maxCFSSegmentSizeMB=8.796093022207999E12, noCFSRatio=0.1]
   [junit4]   2> 1016653 INFO  (coreLoadExecutor-4280-thread-1) [    x:collection1] o.a.s.u.UpdateHandler Using UpdateLog implementation: org.apache.solr.update.UpdateLog
   [junit4]   2> 1016653 INFO  (coreLoadExecutor-4280-thread-1) [    x:collection1] o.a.s.u.UpdateLog Initializing UpdateLog: dataDir= defaultSyncLevel=FLUSH numRecordsToKeep=100 maxNumLogsToKeep=10 numVersionBuckets=65536
   [junit4]   2> 1016655 INFO  (coreLoadExecutor-4280-thread-1) [    x:collection1] o.a.s.u.CommitTracker Hard AutoCommit: disabled
   [junit4]   2> 1016655 INFO  (coreLoadExecutor-4280-thread-1) [    x:collection1] o.a.s.u.CommitTracker Soft AutoCommit: disabled
   [junit4]   2> 1016658 INFO  (coreLoadExecutor-4280-thread-1) [    x:collection1] o.a.s.u.RandomMergePolicy RandomMergePolicy wrapping class org.apache.lucene.index.TieredMergePolicy: [TieredMergePolicy: maxMergeAtOnce=38, maxMergeAtOnceExplicit=47, maxMergedSegmentMB=82.26953125, floorSegmentMB=1.29296875, forceMergeDeletesPctAllowed=14.884424553308937, segmentsPerTier=47.0, maxCFSSegmentSizeMB=8.796093022207999E12, noCFSRatio=0.26577496366333914, deletesPctAllowed=48.2403452703754
   [junit4]   2> 1016659 INFO  (coreLoadExecutor-4280-thread-1) [    x:collection1] o.a.s.s.SolrIndexSearcher Opening [Searcher@2dc6663[collection1] main]
   [junit4]   2> 1016659 INFO  (coreLoadExecutor-4280-thread-1) [    x:collection1] o.a.s.h.c.SpellCheckComponent Initializing spell checkers
   [junit4]   2> 1016730 INFO  (coreLoadExecutor-4280-thread-1) [    x:collection1] o.a.s.s.DirectSolrSpellChecker init: {name=direct,classname=DirectSolrSpellChecker,field=lowerfilt,minQueryLength=3}
   [junit4]   2> 1016835 INFO  (coreLoadExecutor-4280-thread-1) [    x:collection1] o.a.s.h.ReplicationHandler Commits will be reserved for 10000ms.
   [junit4]   2> 1016835 INFO  (coreLoadExecutor-4280-thread-1) [    x:collection1] o.a.s.u.UpdateLog Could not find max version in index or recent updates, using new clock 1611866835648512000
   [junit4]   2> 1016837 INFO  (searcherExecutor-4281-thread-1-processing-x:collection1) [    x:collection1] o.a.s.h.c.SpellCheckComponent Loading spell index for spellchecker: default
   [junit4]   2> 1016838 INFO  (searcherExecutor-4281-thread-1-processing-x:collection1) [    x:collection1] o.a.s.h.c.SpellCheckComponent Loading spell index for spellchecker: direct
   [junit4]   2> 1016838 INFO  (searcherExecutor-4281-thread-1-processing-x:collection1) [    x:collection1] o.a.s.h.c.SpellCheckComponent Loading spell index for spellchecker: wordbreak
   [junit4]   2> 1016838 INFO  (searcherExecutor-4281-thread-1-processing-x:collection1) [    x:collection1] o.a.s.h.c.SpellCheckComponent Loading spell index for spellchecker: multipleFields
   [junit4]   2> 1016839 INFO  (searcherExecutor-4281-thread-1-processing-x:collection1) [    x:collection1] o.a.s.h.c.SpellCheckComponent Loading spell index for spellchecker: jarowinkler
   [junit4]   2> 1016839 INFO  (searcherExecutor-4281-thread-1-processing-x:collection1) [    x:collection1] o.a.s.h.c.SpellCheckComponent Loading spell index for spellchecker: external
   [junit4]   2> 1016839 INFO  (searcherExecutor-4281-thread-1-processing-x:collection1) [    x:collection1] o.a.s.h.c.SpellCheckComponent Loading spell index for spellchecker: freq
   [junit4]   2> 1016839 INFO  (searcherExecutor-4281-thread-1-processing-x:collection1) [    x:collection1] o.a.s.h.c.SpellCheckComponent Loading spell index for spellchecker: fqcn
   [junit4]   2> 1016840 INFO  (searcherExecutor-4281-thread-1-processing-x:collection1) [    x:collection1] o.a.s.h.c.SpellCheckComponent Loading spell index for spellchecker: perDict
   [junit4]   2> 1016840 INFO  (searcherExecutor-4281-thread-1-processing-x:collection1) [    x:collection1] o.a.s.c.SolrCore [collection1] Registered new searcher Searcher@2dc6663[collection1] main{ExitableDirectoryReader(UninvertingDirectoryReader())}
   [junit4]   2> 1016969 INFO  (TEST-TestDistributedGrouping.test-seed#[9A800F53024D591C]) [    ] o.a.s.SolrTestCaseJ4 Writing core.properties file to /home/jenkins/workspace/Lucene-Solr-7.x-Linux/solr/build/solr-core/test/J2/temp/solr.TestDistributedGrouping_9A800F53024D591C-001/tempDir-001/shard0/cores/collection1
   [junit4]   2> 1016971 INFO  (TEST-TestDistributedGrouping.test-seed#[9A800F53024D591C]) [    ] o.e.j.s.Server jetty-9.4.11.v20180605; built: 2018-06-05T18:24:03.829Z; git: d5fc0523cfa96bfebfbda19606cad384d772f04c; jvm 11+28
   [junit4]   2> 1017018 INFO  (TEST-TestDistributedGrouping.test-seed#[9A800F53024D591C]) [    ] o.e.j.s.session DefaultSessionIdManager workerName=node0
   [junit4]   2> 1017018 INFO  (TEST-TestDistributedGrouping.test-seed#[9A800F53024D591C]) [    ] o.e.j.s.session No SessionScavenger set, using defaults
   [junit4]   2> 1017018 INFO  (TEST-TestDistributedGrouping.test-seed#[9A800F53024D591C]) [    ] o.e.j.s.session node0 Scavenging every 660000ms
   [junit4]   2> 1017033 INFO  (TEST-TestDistributedGrouping.test-seed#[9A800F53024D591C]) [    ] o.e.j.s.h.ContextHandler Started o.e.j.s.ServletContextHandler@193f17c8{/i_/i,null,AVAILABLE}
   [junit4]   2> 1017034 INFO  (TEST-TestDistributedGrouping.test-seed#[9A800F53024D591C]) [    ] o.e.j.s.AbstractConnector Started ServerConnector@767ab3f0{SSL,[ssl, http/1.1]}{127.0.0.1:36801}
   [junit4]   2> 1017034 INFO  (TEST-TestDistributedGrouping.test-seed#[9A800F53024D591C]) [    ] o.e.j.s.Server Started @1017055ms
   [junit4]   2> 1017034 INFO  (TEST-TestDistributedGrouping.test-seed#[9A800F53024D591C]) [    ] o.a.s.c.s.e.JettySolrRunner Jetty properties: {schema=schema-sql.xml, hostContext=/i_/i, hostPort=36801, coreRootDirectory=/home/jenkins/workspace/Lucene-Solr-7.x-Linux/solr/build/solr-core/test/J2/temp/solr.TestDistributedGrouping_9A800F53024D591C-001/tempDir-001/shard0/cores}
   [junit4]   2> 1017035 ERROR (TEST-TestDistributedGrouping.test-seed#[9A800F53024D591C]) [    ] o.a.s.u.StartupLoggingUtils Missing Java Option solr.log.dir. Logging may be missing or incomplete.
   [junit4]   2> 1017048 INFO  (TEST-TestDistributedGrouping.test-seed#[9A800F53024D591C]) [    ] o.a.s.s.SolrDispatchFilter Using logger factory org.apache.logging.slf4j.Log4jLoggerFactory
   [junit4]   2> 1017049 INFO  (TEST-TestDistributedGrouping.test-seed#[9A800F53024D591C]) [    ] o.a.s.s.SolrDispatchFilter  ___      _       Welcome to Apache Solr? version 7.6.0
   [junit4]   2> 1017049 INFO  (TEST-TestDistributedGrouping.test-seed#[9A800F53024D591C]) [    ] o.a.s.s.SolrDispatchFilter / __| ___| |_ _   Starting in standalone mode on port null
   [junit4]   2> 1017049 INFO  (TEST-TestDistributedGrouping.test-seed#[9A800F53024D591C]) [    ] o.a.s.s.SolrDispatchFilter \__ \/ _ \ | '_|  Install dir: null
   [junit4]   2> 1017049 INFO  (TEST-TestDistributedGrouping.test-seed#[9A800F53024D591C]) [    ] o.a.s.s.SolrDispatchFilter |___/\___/_|_|    Start time: 2018-09-17T14:53:22.839292Z
   [junit4]   2> 1017049 INFO  (TEST-TestDistributedGrouping.test-seed#[9A800F53024D591C]) [    ] o.a.s.c.SolrXmlConfig Loading container configuration from /home/jenkins/workspace/Lucene-Solr-7.x-Linux/solr/build/solr-core/test/J2/temp/solr.TestDistributedGrouping_9A800F53024D591C-001/tempDir-001/shard0/solr.xml
   [junit4]   2> 1017052 INFO  (TEST-TestDistributedGrouping.test-seed#[9A800F53024D591C]) [    ] o.a.s.c.SolrXmlConfig Configuration parameter autoReplicaFailoverWorkLoopDelay is ignored
   [junit4]   2> 1017052 INFO  (TEST-TestDistributedGrouping.test-seed#[9A800F53024D591C]) [    ] o.a.s.c.SolrXmlConfig Configuration parameter autoReplicaFailoverBadNodeExpiration is ignored
   [junit4]   2> 1017053 INFO  (TEST-TestDistributedGrouping.test-seed#[9A800F53024D591C]) [    ] o.a.s.c.SolrXmlConfig MBean server found: com.sun.jmx.mbeanserver.JmxMBeanServer@686a899a, but no JMX reporters were configured - adding default JMX reporter.
   [junit4]   2> 1017315 INFO  (TEST-TestDistributedGrouping.test-seed#[9A800F53024D591C]) [    ] o.a.s.c.TransientSolrCoreCacheDefault Allocating transient cache for 4 transient cores
   [junit4]   2> 1017315 INFO  (TEST-TestDistributedGrouping.test-seed#[9A800F53024D591C]) [    ] o.a.s.h.a.MetricsHistoryHandler No .system collection, keeping metrics history in memory.
   [junit4]   2> 1017331 INFO  (TEST-TestDistributedGrouping.test-seed#[9A800F53024D591C]) [    ] o.a.s.m.r.SolrJmxReporter JMX monitoring for 'solr.node' (registry 'solr.node') enabled at server: com.sun.jmx.mbeanserver.JmxMBeanServer@686a899a
   [junit4]   2> 1017351 INFO  (TEST-TestDistributedGrouping.test-seed#[9A800F53024D591C]) [    ] o.a.s.m.r.SolrJmxReporter JMX monitoring for 'solr.jvm' (registry 'solr.jvm') enabled at server: com.sun.jmx.mbeanserver.JmxMBeanServer@686a899a
   [junit4]   2> 1017351 INFO  (TEST-TestDistributedGrouping.test-seed#[9A800F53024D591C]) [    ] o.a.s.m.r.SolrJmxReporter JMX monitoring for 'solr.jetty' (registry 'solr.jetty') enabled at server: com.sun.jmx.mbeanserver.JmxMBeanServer@686a899a
   [junit4]   2> 1017353 INFO  (TEST-TestDistributedGrouping.test-seed#[9A800F53024D591C]) [    ] o.a.s.c.CorePropertiesLocator Found 1 core definitions underneath /home/jenkins/workspace/Lucene-Solr-7.x-Linux/solr/build/solr-core/test/J2/temp/solr.TestDistributedGrouping_9A800F53024D591C-001/tempDir-001/shard0/cores
   [junit4]   2> 1017353 INFO  (TEST-TestDistributedGrouping.test-seed#[9A800F53024D591C]) [    ] o.a.s.c.CorePropertiesLocator Cores are: [collection1]
   [junit4]   2> 1017374 INFO  (coreLoadExecutor-4294-thread-1) [    x:collection1] o.a.s.c.SolrResourceLoader [null] Added 2 libs to classloader, from paths: [/home/jenkins/workspace/Lucene-Solr-7.x-Linux/solr/core/src/test-files/solr/collection1/lib, /home/jenkins/workspace/Lucene-Solr-7.x-Linux/solr/core/src/test-files/solr/collection1/lib/classes]
   [junit4]   2> 1017463 INFO  (coreLoadExecutor-4294-thread-1) [    x:collection1] o.a.s.c.SolrConfig Using Lucene MatchVersion: 7.6.0
   [junit4]   2> 1017495 INFO  (coreLoadExecutor-4294-thread-1) [    x:collection1] o.a.s.s.IndexSchema [collection1] Schema name=test
   [junit4]   2> 1017552 WARN  (coreLoadExecutor-4294-thread-1) [    x:collection1] o.a.s.s.IndexSchema Field lowerfilt1and2 is not multivalued and destination for multiple copyFields (2)
   [junit4]   2> 1017552 WARN  (coreLoadExecutor-4294-thread-1) [    x:collection1] o.a.s.s.IndexSchema Field text is not multivalued and destination for multiple copyFields (3)
   [junit4]   2> 1017552 INFO  (coreLoadExecutor-4294-thread-1) [    x:collection1] o.a.s.s.IndexSchema Loaded schema test/1.6 with uniqueid field id
   [junit4]   2> 1017552 INFO  (coreLoadExecutor-4294-thread-1) [    x:collection1] o.a.s.c.CoreContainer Creating SolrCore 'collection1' using configuration from configset /home/jenkins/workspace/Lucene-Solr-7.x-Linux/solr/core/src/test-files/solr/collection1, trusted=true
   [junit4]   2> 1017552 INFO  (coreLoadExecutor-4294-thread-1) [    x:collection1] o.a.s.m.r.SolrJmxReporter JMX monitoring for 'solr.core.collection1' (registry 'solr.core.collection1') enabled at server: com.sun.jmx.mbeanserver.JmxMBeanServer@686a899a
   [junit4]   2> 1017552 INFO  (coreLoadExecutor-4294-thread-1) [    x:collection1] o.a.s.c.SolrCore [[collection1] ] Opening new SolrCore at [/home/jenkins/workspace/Lucene-Solr-7.x-Linux/solr/core/src/test-files/solr/collection1], dataDir=[/home/jenkins/workspace/Lucene-Solr-7.x-Linux/solr/build/solr-core/test/J2/temp/solr.TestDistributedGrouping_9A800F53024D591C-001/tempDir-001/shard0/cores/collection1/data/]
   [junit4]   2> 1017554 INFO  (coreLoadExecutor-4294-thread-1) [    x:collection1] o.a.s.u.RandomMergePolicy RandomMergePolicy wrapping class org.apache.lucene.index.AlcoholicMergePolicy: [AlcoholicMergePolicy: minMergeSize=0, mergeFactor=10, maxMergeSize=86307987, maxMergeSizeForForcedMerge=9223372036854775807, calibrateSizeByDeletes=true, maxMergeDocs=2147483647, maxCFSSegmentSizeMB=8.796093022207999E12, noCFSRatio=0.1]
   [junit4]   2> 1017618 INFO  (coreLoadExecutor-4294-thread-1) [    x:collection1] o.a.s.u.UpdateHandler Using UpdateLog implementation: org.apache.solr.update.UpdateLog
   [junit4]   2> 1017618 INFO  (coreLoadExecutor-4294-thread-1) [    x:collection1] o.a.s.u.UpdateLog Initializing UpdateLog: dataDir= defaultSyncLevel=FLUSH numRecordsToKeep=100 maxNumLogsToKeep=10 numVersionBuckets=65536
   [junit4]   2> 1017619 INFO  (coreLoadExecutor-4294-thread-1) [    x:collection1] o.a.s.u.CommitTracker Hard AutoCommit: disabled
   [junit4]   2> 1017619 INFO  (coreLoadExecutor-4294-thread-1) [    x:collection1] o.a.s.u.CommitTracker Soft AutoCommit: disabled
   [junit4]   2> 1017620 INFO  (coreLoadExecutor-4294-thread-1) [    x:collection1] o.a.s.u.RandomMergePolicy RandomMergePolicy wrapping class org.apache.lucene.index.TieredMergePolicy: [TieredMergePolicy: maxMergeAtOnce=38, maxMergeAtOnceExplicit=47, maxMergedSegmentMB=82.26953125, floorSegmentMB=1.29296875, forceMergeDeletesPctAllowed=14.884424553308937, segmentsPerTier=47.0, maxCFSSegmentSizeMB=8.796093022207999E12, noCFSRatio=0.26577496366333914, deletesPctAllowed=48.2403452703754
   [junit4]   2> 1017621 INFO  (coreLoadExecutor-4294-thread-1) [    x:collection1] o.a.s.s.SolrIndexSearcher Opening [Searcher@6e02bba9[collection1] main]
   [junit4]   2> 1017621 INFO  (coreLoadExecutor-4294-thread-1) [    x:collection1] o.a.s.h.c.SpellCheckComponent Initializing spell checkers
   [junit4]   2> 1017675 INFO  (coreLoadExecutor-4294-thread-1) [    x:collection1] o.a.s.s.DirectSolrSpellChecker init: {name=direct,classname=DirectSolrSpellChecker,field=lowerfilt,minQueryLength=3}
   [junit4]   2> 1017796 INFO  (coreLoadExecutor-4294-thread-1) [    x:collection1] o.a.s.h.ReplicationHandler Commits will be reserved for 10000ms.
   [junit4]   2> 1017796 INFO  (coreLoadExecutor-4294-thread-1) [    x:collection1] o.a.s.u.UpdateLog Could not find max version in index or recent updates, using new clock 1611866836656193536
   [junit4]   2> 1017796 INFO  (searcherExecutor-4295-thread-1-processing-x:collection1) [    x:collection1] o.a.s.h.c.SpellCheckComponent Loading spell index for spellchecker: default
   [junit4]   2> 1017797 INFO  (searcherExecutor-4295-thread-1-processing-x:collection1) [    x:collection1] o.a.s.h.c.SpellCheckComponent Loading spell index for spellchecker: direct
   [junit4]   2> 1017797 INFO  (searcherExecutor-4295-thread-1-processing-x:collection1) [    x:collection1] o.a.s.h.c.SpellCheckComponent Loading spell index for spellchecker: wordbreak
   [junit4]   2> 1017797 INFO  (searcherExecutor-4295-thread-1-processing-x:collection1) [    x:collection1] o.a.s.h.c.SpellCheckComponent Loading spell index for spellchecker: multipleFields
   [junit4]   2> 1017804 INFO  (searcherExecutor-4295-thread-1-processing-x:collection1) [    x:collection1] o.a.s.h.c.SpellCheckComponent Loading spell index for spellchecker: jarowinkler
   [junit4]   2> 1017804 INFO  (searcherExecutor-4295-thread-1-processing-x:collection1) [    x:collection1] o.a.s.h.c.SpellCheckComponent Loading spell index for spellchecker: external
   [junit4]   2> 1017804 INFO  (searcherExecutor-4295-thread-1-processing-x:collection1) [    x:collection1] o.a.s.h.c.SpellCheckComponent Loading spell index for spellchecker: freq
   [junit4]   2> 1017804 INFO  (searcherExecutor-4295-thread-1-processing-x:collection1) [    x:collection1] o.a.s.h.c.SpellCheckComponent Loading spell index for spellchecker: fqcn
   [junit4]   2> 1017805 INFO  (searcherExecutor-4295-thread-1-processing-x:collection1) [    x:collection1] o.a.s.h.c.SpellCheckComponent Loading spell index for spellchecker: perDict
   [junit4]   2> 1017806 INFO  (searcherExecutor-4295-thread-1-processing-x:collection1) [    x:collection1] o.a.s.c.SolrCore [collection1] Registered new searcher Searcher@6e02bba9[collection1] main{ExitableDirectoryReader(UninvertingDirectoryReader())}
   [junit4]   2> 1017811 INFO  (TEST-TestDistributedGrouping.test-seed#[9A800F53024D591C]) [    ] o.a.s.SolrTestCaseJ4 ###Starting test
   [junit4]   2> 1017833 INFO  (qtp1857156499-8835) [    x:collection1] o.a.s.u.p.LogUpdateProcessorFactory [collection1]  webapp=/i_/i path=/update params={wt=javabin&version=2}{deleteByQuery=*:* (-1611866836692893696)} 0 1
   [junit4]   2> 1017850 INFO  (qtp1679204099-8850) [    x:collection1] o.a.s.u.p.LogUpdateProcessorFactory [collection1]  webapp=/i_/i path=/update params={wt=javabin&version=2}{deleteByQuery=*:* (-1611866836710719488)} 0 1
   [junit4]   2> 1017851 INFO  (qtp1857156499-8834) [    x:collection1] o.a.s.u.DirectUpdateHandler2 start commit{_version_=1611866836713865216,optimize=false,openSearcher=true,waitSearcher=true,expungeDeletes=false,softCommit=false,prepareCommit=false}
   [junit4]   2> 1017851 INFO  (qtp1857156499-8834) [    x:collection1] o.a.s.u.DirectUpdateHandler2 No uncommitted changes. Skipping IW.commit.
   [junit4]   2> 1017852 INFO  (qtp1857156499-8834) [    x:collection1] o.a.s.u.DirectUpdateHandler2 end_commit_flush
   [junit4]   2> 1017852 INFO  (qtp1857156499-8834) [    x:collection1] o.a.s.u.p.LogUpdateProcessorFactory [collection1]  webapp=/i_/i path=/update params={waitSearcher=true&commit=true&softCommit=false&wt=javabin&version=2}{commit=} 0 1
   [junit4]   2> 1017853 INFO  (qtp1679204099-8854) [    x:collection1] o.a.s.u.DirectUpdateHandler2 start commit{_version_=1611866836715962368,optimize=false,openSearcher=true,waitSearcher=true,expungeDeletes=false,softCommit=false,prepareCommit=false}
   [junit4]   2> 1017855 INFO  (qtp1679204099-8854) [    x:collection1] o.a.s.u.DirectUpdateHandler2 No uncommitted changes. Skipping IW.commit.
   [junit4]   2> 1017856 INFO  (qtp1679204099-8854) [    x:collection1] o.a.s.u.DirectUpdateHandler2 end_commit_flush
   [junit4]   2> 1017856 INFO  (qtp1679204099-8854) [    x:collection1] o.a.s.u.p.LogUpdateProcessorFactory [collection1]  webapp=/i_/i path=/update params={waitSearcher=true&commit=true&softCommit=false&wt=javabin&version=2}{commit=} 0 3
   [junit4]   2> 1017861 INFO  (qtp1857156499-8835) [    x:collection1] o.a.s.c.S.Request [collection1]  webapp=/i_/i path=/select params={q=*:*&distrib=false&fl=id,a_i1&group.limit=-1&sort=a_i1+asc,+id+asc&rows=100&wt=javabin&version=2&group.field=a_i1&group=true} hits=0 status=0 QTime=4
   [junit4]   2> 1017888 INFO  (qtp1679204099-8856) [    x:collection1] o.a.s.c.S.Request [collection1]  webapp=/i_/i path=/select params={df=text&group.distributed.first=true&distrib=false&fl=id&group.limit=-1&shards.purpose=2048&start=0&sort=a_i1+asc,+id+asc&shard.url=https://127.0.0.1:36801/i_/i/collection1|[ff01::114]:33332/i_/i|[ff01::083]:33332/i_/i|[ff01::213]:33332/i_/i&rows=100&version=2&q=*:*&NOW=1537196003652&isShard=true&wt=javabin&group.field=a_i1&group=true} status=0 QTime=5
   [junit4]   2> 1017893 INFO  (qtp1679204099-8855) [    x:collection1] o.a.s.c.S.Request [collection1]  webapp=/i_/i path=/select params={q=*:*&shards=https://127.0.0.1:36801/i_/i/collection1|[ff01::114]:33332/i_/i|[ff01::083]:33332/i_/i|[ff01::213]:33332/i_/i&fl=id,a_i1&group.limit=-1&sort=a_i1+asc,+id+asc&rows=100&wt=javabin&version=2&group.field=a_i1&group=true} status=0 QTime=30
   [junit4]   2> 1017894 INFO  (qtp1857156499-8834) [    x:collection1] o.a.s.c.S.Request [collection1]  webapp=/i_/i path=/select params={q=*:*&distrib=false&hl=true&fl=id,a_i1&group.limit=-1&sort=a_i1+asc,+id+asc&hl.fl=a_t&rows=100&wt=javabin&version=2&group.field=a_i1&group=true} hits=0 status=0 QTime=1
   [junit4]   2> 1017896 INFO  (qtp1679204099-8872) [    x:collection1] o.a.s.c.S.Request [collection1]  webapp=/i_/i path=/select params={df=text&group.distributed.first=true&distrib=false&hl=false&fl=id&group.limit=-1&shards.purpose=2048&start=0&sort=a_i1+asc,+id+asc&shard.url=https://127.0.0.1:36801/i_/i/collection1&rows=100&version=2&q=*:*&NOW=1537196003685&isShard=true&hl.fl=a_t&wt=javabin&group.field=a_i1&group=true} status=0 QTime=0
   [junit4]   2> 1017897 INFO  (qtp1679204099-8854) [    x:collection1] o.a.s.c.S.Request [collection1]  webapp=/i_/i path=/select params={q=*:*&shards=https://127.0.0.1:36801/i_/i/collection1&hl=true&fl=id,a_i1&group.limit=-1&sort=a_i1+asc,+id+asc&hl.fl=a_t&rows=100&wt=javabin&version=2&group.field=a_i1&group=true} status=0 QTime=2
   [junit4]   2> 1017898 INFO  (qtp1857156499-8834) [    x:collection1] o.a.s.c.S.Request [collection1]  webapp=/i_/i path=/select params={q=*:*&facet.field=a_t&distrib=false&fl=id,a_i1&group.limit=-1&sort=a_i1+asc,+id+asc&rows=100&facet=true&wt=javabin&version=2&group.field=a_i1&group=true} hits=0 status=0 QTime=0
   [junit4]   2> 1017916 INFO  (qtp1679204099-8856) [    x:collection1] o.a.s.c.S.Request [collection1]  webapp=/i_/i path=/select params={facet.field=a_t&df=text&group.distributed.first=true&distrib=false&fl=id&group.limit=-1&shards.purpose=2048&start=0&sort=a_i1+asc,+id+asc&shard.url=[ff01::083]:33332/i_/i|[ff01::213]:33332/i_/i|[ff01::114]:33332/i_/i|https://127.0.0.1:36801/i_/i/collection1&rows=100&version=2&q=*:*&NOW=1537196003696&isShard=true&facet=false&wt=javabin&group.field=a_i1&group=true} status=0 QTime=0
   [junit4]   2> 1017920 INFO  (qtp1679204099-8872) [    x:collection1] o.a.s.c.S.Request [collection1]  webapp=/i_/i path=/select params={facet.field=a_t&df=text&distrib=false&fl=id&group.limit=-1&shards.purpose=20&start=0&f.a_t.facet.mincount=0&sort=a_i1+asc,+id+asc&shard.url=[ff01::083]:33332/i_/i|[ff01::213]:33332/i_/i|[ff01::114]:33332/i_/i|https://127.0.0.1:36801/i_/i/collection1&rows=100&version=2&group.distributed.second=true&q=*:*&f.a_t.facet.limit=160&NOW=1537196003696&isShard=true&facet=true&wt=javabin&group.field=a_i1&group=true} status=0 QTime=3
   [junit4]   2> 1017923 INFO  (qtp1679204099-8855) [    x:collection1] o.a.s.c.S.Request [collection1]  webapp=/i_/i path=/select params={q=*:*&shards=[ff01::083]:33332/i_/i|[ff01::213]:33332/i_/i|[ff01::114]:33332/i_/i|https://127.0.0.1:36801/i_/i/collection1&facet.field=a_t&fl=id,a_i1&group.limit=-1&sort=a_i1+asc,+id+asc&rows=100&facet=true&wt=javabin&version=2&group.field=a_i1&group=true} status=0 QTime=17
   [junit4]   2> 1017924 INFO  (qtp1857156499-8834) [    x:collection1] o.a.s.c.S.Request [collection1]  webapp=/i_/i path=/select params={q=*:*&distrib=false&stats=true&fl=id,a_i1&group.limit=-1&sort=a_i1+asc,+id+asc&rows=100&wt=javabin&version=2&group.field=a_i1&group=true&stats.field=a_i1} hits=0 status=0 QTime=0
   [junit4]   2> 1017926 INFO  (qtp1679204099-8856) [    x:collection1] o.a.s.c.S.Request [collection1]  webapp=/i_/i path=/select params={df=text&group.distributed.first=true&distrib=false&fl=id&group.limit=-1&shards.purpose=2048&start=0&sort=a_i1+asc,+id+asc&shard.url=https://127.0.0.1:36801/i_/i/collection1|[ff01::213]:33332/i_/i&rows=100&version=2&q=*:*&stats=false&NOW=1537196003715&isShard=true&wt=javabin&group.field=a_i1&group=true&stats.field=a_i1} status=0 QTime=0
   [junit4]   2> 1017929 INFO  (qtp1679204099-8856) [    x:collection1] o.a.s.c.S.Request [collection1]  webapp=/i_/i path=/select params={df=text&distrib=false&fl=id&group.limit=-1&shards.purpose=516&start=0&sort=a_i1+asc,+id+asc&shard.url=https://127.0.0.1:36801/i_/i/collection1|[ff01::213]:33332/i_/i&rows=100&version=2&group.distributed.second=true&q=*:*&stats=true&NOW=1537196003715&isShard=true&wt=javabin&group.field=a_i1&group=true&stats.field=a_i1} status=0 QTime=0
   [junit4]   2> 1017930 INFO  (qtp1679204099-8854) [    x:collection1] o.a.s.c.S.Request [collection1]  webapp=/i_/i path=/select params={q=*:*&shards=https://127.0.0.1:36801/i_/i/collection1|[ff01::213]:33332/i_/i&stats=true&fl=id,a_i1&group.limit=-1&sort=a_i1+asc,+id+asc&rows=100&wt=javabin&version=2&group.field=a_i1&group=true&stats.field=a_i1} status=0 QTime=4
   [junit4]   2> 1017931 INFO  (qtp1857156499-8835) [    x:collection1] o.a.s.c.S.Request [collection1]  webapp=/i_/i path=/select params={df=subject&distrib=false&qt=spellCheckCompRH&fl=id,a_i1&group.limit=-1&sort=a_i1+asc,+id+asc&rows=100&version=2&spellcheck.build=true&q=kings&spellcheck=true&wt=javabin&group.field=a_i1&group=true} hits=0 status=0 QTime=0
   [junit4]   2> 1017933 INFO  (qtp1679204099-8856) [    x:collection1] o.a.s.c.S.Request [collection1]  webapp=/i_/i path=/select params={df=subject&group.distributed.first=true&distrib=false&qt=spellCheckCompRH&fl=id&group.limit=-1&shards.purpose=2048&start=0&sort=a_i1+asc,+id+asc&shard.url=https://127.0.0.1:36801/i_/i/collection1|[ff01::114]:33332/i_/i|[ff01::213]:33332/i_/i&rows=100&version=2&spellcheck.build=true&q=kings&spellcheck=true&NOW=1537196003721&isShard=true&wt=javabin&group.field=a_i1&group=true} status=0 QTime=0
   [junit4]   2> 1017934 INFO  (qtp1679204099-8854) [    x:collection1] o.a.s.c.S.Request [collection1]  webapp=/i_/i path=/select params={df=subject&qt=spellCheckCompRH&fl=id,a_i1&group.limit=-1&sort=a_i1+asc,+id+asc&rows=100&version=2&spellcheck.build=true&q=kings&shards=https://127.0.0.1:36801/i_/i/collection1|[ff01::114]:33332/i_/i|[ff01::213]:33332/i_/i&spellcheck=true&wt=javabin&group.field=a_i1&group=true} status=0 QTime=2
   [junit4]   2> 1017937 INFO  (qtp1857156499-8835) [    x:collection1] o.a.s.c.S.Request [collection1]  webapp=/i_/i path=/select params={facet.field=a_t&distrib=false&fl=id,a_i1&group.limit=-1&fq=a_s:a&sort=a_i1+asc,+id+asc&rows=100&version=2&q=*:*&group.truncate=true&facet=true&wt=javabin&group.field=a_i1&group=true} hits=0 status=0 QTime=2
   [junit4]   2> 1017938 INFO  (qtp1679204099-8856) [    x:collection1] o.a.s.c.S.Request [collection1]  webapp=/i_/i path=/select params={facet.field=a_t&df=text&group.distributed.first=true&distrib=false&fl=id&group.limit=-1&shards.purpose=2048&start=0&fq=a_s:a&sort=a_i1+asc,+id+asc&shard.url=[ff01::083]:33332/i_/i|https://127.0.0.1:36801/i_/i/collection1|[ff01::114]:33332/i_/i|[ff01::213]:33332/i_/i&rows=100&version=2&q=*:*&group.truncate=true&NOW=1537196003727&isShard=true&facet=false&wt=javabin&group.field=a_i1&group=true} status=0 QTime=0
   [junit4]   2> 1017940 INFO  (qtp1679204099-8856) [    x:collection1] o.a.s.c.S.Request [collection1]  webapp=/i_/i path=/select params={facet.field=a_t&df=text&distrib=false&fl=id&group.limit=-1&shards.purpose=20&start=0&f.a_t.facet.mincount=0&fq=a_s:a&sort=a_i1+asc,+id+asc&shard.url=[ff01::083]:33332/i_/i|https://127.0.0.1:36801/i_/i/collection1|[ff01::114]:33332/i_/i|[ff01::213]:33332/i_/i&rows=100&version=2&group.distributed.second=true&q=*:*&f.a_t.facet.limit=160&group.truncate=true&NOW=1537196003727&isShard=true&facet=true&wt=javabin&group.field=a_i1&group=true} status=0 QTime=0
   [junit4]   2> 1017940 INFO  (qtp1679204099-8872) [    x:collection1] o.a.s.c.S.Request [collection1]  webapp=/i_/i path=/select params={facet.field=a_t&fl=id,a_i1&group.limit=-1&fq=a_s:a&sort=a_i1+asc,+id+asc&rows=100&version=2&q=*:*&shards=[ff01::083]:33332/i_/i|https://127.0.0.1:36801/i_/i/collection1|[ff01::114]:33332/i_/i|[ff01::213]:33332/i_/i&group.truncate=true&facet=true&wt=javabin&group.field=a_i1&group=true} status=0 QTime=2
   [junit4]   2> 1017941 INFO  (qtp1857156499-8835) [    x:collection1] o.a.s.u.p.LogUpdateProcessorFactory [collection1]  webapp=/i_/i path=/update params={wt=javabin&version=2}{} 0 0
   [junit4]   2> 1017941 ERROR (qtp1857156499-8835) [    x:collection1] o.a.s.h.RequestHandlerBase org.apache.solr.common.SolrException: ERROR: [doc=1] unknown field 'a_idv'
   [junit4]   2> 	at org.apache.solr.update.DocumentBuilder.toDocument(DocumentBuilder.java:226)
   [junit4]   2> 	at org.apache.solr.update.AddUpdateCommand.getLuceneDocument(AddUpdateCommand.java:102)
   [junit4]   2> 	at org.apache.solr.update.DirectUpdateHandler2.updateDocOrDocValues(DirectUpdateHandler2.java:962)
   [junit4]   2> 	at org.apache.solr.update.DirectUpdateHandler2.doNormalUpdate(DirectUpdateHandler2.java:341)
   [junit4]   2> 	at org.apache.solr.update.DirectUpdateHandler2.addDoc0(DirectUpdateHandler2.java:288)
   [junit4]   2> 	at org.apache.solr.update.DirectUpdateHandler2.addDoc(DirectUpdateHandler2.java:235)
   [junit4]   2> 	at org.apache.solr.update.processor.RunUpdateProcessor.processAdd(RunUpdateProcessorFactory.java:67)
   [junit4]   2> 	at org.apache.solr.update.processor.UpdateRequestProcessor.processAdd(UpdateRequestProcessor.java:55)
   [junit4]   2> 	at org.apache.solr.update.processor.DistributedUpdateProcessor.doLocalAdd(DistributedUpdateProcessor.java:970)
   [junit4]   2> 	at org.apache.solr.update.processor.DistributedUpdateProcessor.versionAdd(DistributedUpdateProcessor.java:1186)
   [junit4]   2> 	at org.apache.solr.update.processor.DistributedUpdateProcessor.processAdd(DistributedUpdateProcessor.java:653)
   [junit4]   2> 	at org.apache.solr.update.processor.LogUpdateProcessorFactory$LogUpdateProcessor.processAdd(LogUpdateProcessorFactory.java:103)
   [junit4]   2> 	at org.apache.solr.handler.loader.JavabinLoader$1.update(JavabinLoader.java:98)
   [junit4]   2> 	at org.apache.solr.client.solrj.request.JavaBinUpdateRequestCodec$1.readOuterMostDocIterator(JavaBinUpdateRequestCodec.java:188)
   [junit4]   2> 	at org.apache.solr.client.solrj.request.JavaBinUpdateRequestCodec$1.readIterator(JavaBinUpdateRequestCodec.java:144)
   [junit4]   2> 	at org.apache.solr.common.util.JavaBinCodec.readObject(JavaBinCodec.java:311)
   [junit4]   2> 	at org.apache.solr.common.util.JavaBinCodec.readVal(JavaBinCodec.java:256)
   [junit4]   2> 	at org.apache.solr.client.solrj.request.JavaBinUpdateRequestCodec$1.readNamedList(JavaBinUpdateRequestCodec.java:130)
   [junit4]   2> 	at org.apache.solr.common.util.JavaBinCodec.readObject(JavaBinCodec.java:276)
   [junit4]   2> 	at org.apache.solr.common.util.JavaBinCodec.readVal(JavaBinCodec.java:256)
   [junit4]   2> 	at org.apache.solr.common.util.JavaBinCodec.unmarshal(JavaBinCodec.java:178)
   [junit4]   2> 	at org.apache.solr.client.solrj.request.JavaBinUpdateRequestCodec.unmarshal(JavaBinUpdateRequestCodec.java:195)
   [junit4]   2> 	at org.apache.solr.handler.loader.JavabinLoader.parseAndLoadDocs(JavabinLoader.java:109)
   [junit4]   2> 	at org.apache.solr.handler.loader.JavabinLoader.load(JavabinLoader.java:55)
   [junit4]   2> 	at org.apache.solr.handler.UpdateRequestHandler$1.load(UpdateRequestHandler.java:97)
   [junit4]   2> 	at org.apache.solr.handler.ContentStreamHandlerBase.handleRequestBody(ContentStreamHandlerBase.java:68)
   [junit4]   2> 	at org.apache.solr.handler.RequestHandlerBase.handleRequest(RequestHandlerBase.java:199)
   [junit4]   2> 	at org.apache.solr.core.SolrCore.execute(SolrCore.java:2541)
   [junit4]   2> 	at org.apache.solr.servlet.HttpSolrCall.execute(HttpSolrCall.java:709)
   [junit4]   2> 	at org.apache.solr.servlet.HttpSolrCall.call(HttpSolrCall.java:515)
   [junit4]   2> 	at org.apache.solr.servlet.SolrDispatchFilter.doFilter(SolrDispatchFilter.java:377)
   [junit4]   2> 	at org.apache.solr.servlet.SolrDispatchFilter.doFilter(SolrDispatchFilter.java:323)
   [junit4]   2> 	at org.eclipse.jetty.servlet.ServletHandler$CachedChain.doFilter(ServletHandler.java:1642)
   [junit4]   2> 	at org.apache.solr.client.solrj.embedded.JettySolrRunner$DebugFilter.doFilter(JettySolrRunner.java:139)
   [junit4]   2> 	at org.eclipse.jetty.servlet.ServletHandler$CachedChain.doFilter(ServletHandler.java:1642)
   [junit4]   2> 	at org.eclipse.jetty.servlet.ServletHandler.doHandle(ServletHandler.java:533)
   [junit4]   2> 	at org.eclipse.jetty.server.handler.ScopedHandler.nextHandle(ScopedHandler.java:255)
   [junit4]   2> 	at org.eclipse.jetty.server.session.SessionHandler.doHandle(SessionHandler.java:1595)
   [junit4]   2> 	at org.eclipse.jetty.server.handler.ScopedHandler.nextHandle(ScopedHandler.java:255)
   [junit4]   2> 	at org.eclipse.jetty.server.handler.ContextHandler.doHandle(ContextHandler.java:1317)
   [junit4]   2> 	at org.eclipse.jetty.server.handler.ScopedHandler.nextScope(ScopedHandler.java:203)
   [junit4]   2> 	at org.eclipse.jetty.servlet.ServletHandler.doScope(ServletHandler.java:473)
   [junit4]   2> 	at org.eclipse.jetty.server.session.SessionHandler.doScope(SessionHandler.java:1564)
   [junit4]   2> 	at org.eclipse.jetty.server.handler.ScopedHandler.nextScope(ScopedHandler.java:201)
   [junit4]   2> 	at org.eclipse.jetty.server.handler.ContextHandler.doScope(ContextHandler.java:1219)
   [junit4]   2> 	at org.eclipse.jetty.server.handler.ScopedHandler.handle(ScopedHandler.java:144)
   [junit4]   2> 	at org.eclipse.jetty.server.handler.gzip.GzipHandler.handle(GzipHandler.java:674)
   [junit4]   2> 	at org.eclipse.jetty.server.handler.HandlerWrapper.handle(HandlerWrapper.java:132)
   [junit4]   2> 	at org.eclipse.jetty.server.Server.handle(Server.java:531)
   [junit4]   2> 	at org.eclipse.jetty.server.HttpChannel.handle(HttpChannel.java:352)
   [junit4]   2> 	at org.eclipse.jetty.server.HttpConnection.onFillable(HttpConnection.java:260)
   [junit4]   2> 	at org.eclipse.jetty.io.AbstractConnection$ReadCallback.succeeded(AbstractConnection.java:281)
   [junit4]   2> 	at org.eclipse.jetty.io.FillInterest.fillable(FillInterest.java:102)
   [junit4]   2> 	at org.eclipse.jetty.io.ssl.SslConnection.onFillable(SslConnection.java:291)
   [junit4]   2> 	at org.eclipse.jetty.io.ssl.SslConnection$3.succeeded(SslConnection.java:151)
   [junit4]   2> 	at org.eclipse.jetty.io.FillInterest.fillable(FillInterest.java:102)
   [junit4]   2> 	at org.eclipse.jetty.io.ChannelEndPoint$2.run(ChannelEndPoint.java:118)
   [junit4]   2> 	at org.eclipse.jetty.util.thread.strategy.EatWhatYouKill.runTask(EatWhatYouKill.java:333)
   [junit4]   2> 	at org.eclipse.jetty.util.thread.strategy.EatWhatYouKill.doProduce(EatWhatYouKill.java:310)
   [junit4]   2> 	at org.eclipse.jetty.util.thread.strategy.EatWhatYouKill.tryProduce(EatWhatYouKill.java:168)
   [junit4]   2> 	at org.eclipse.jetty.util.thread.strategy.EatWhatYouKill.run(EatWhatYouKill.java:126)
   [junit4]   2> 	at org.eclipse.jetty.util.thread.ReservedThreadExecutor$ReservedThread.run(ReservedThreadExecutor.java:366)
   [junit4]   2> 	at org.eclipse.jetty.util.thread.QueuedThreadPool.runJob(QueuedThreadPool.java:762)
   [junit4]   2> 	at org.eclipse.jetty.util.thread.QueuedThreadPool$2.run(QueuedThreadPool.java:680)
   [junit4]   2> 	at java.base/java.lang.Thread.run(Thread.java:834)
   [junit4]   2> 
   [junit4]   2> 1017948 INFO  (TEST-TestDistributedGrouping.test-seed#[9A800F53024D591C]) [    ] o.a.s.SolrTestCaseJ4 ###Ending test
   [junit4]   2> 1017953 INFO  (TEST-TestDistributedGrouping.test-seed#[9A800F53024D591C]) [    ] o.e.j.s.AbstractConnector Stopped ServerConnector@3d23a7f8{SSL,[ssl, http/1.1]}{127.0.0.1:0}
   [junit4]   2> 1017954 INFO  (TEST-TestDistributedGrouping.test-seed#[9A800F53024D591C]) [    ] o.a.s.c.CoreContainer Shutting down CoreContainer instance=1484199436
   [junit4]   2> 1017954 INFO  (TEST-TestDistributedGrouping.test-seed#[9A800F53024D591C]) [    ] o.a.s.m.SolrMetricManager Closing metric reporters for registry=solr.node, tag=null
   [junit4]   2> 1017954 INFO  (TEST-TestDistributedGrouping.test-seed#[9A800F53024D591C]) [    ] o.a.s.m.r.SolrJmxReporter Closing reporter [org.apache.solr.metrics.reporters.SolrJmxReporter@735e4310: rootName = null, domain = solr.node, service url = null, agent id = null] for registry solr.node / com.codahale.metrics.MetricRegistry@1308855d
   [junit4]   2> 1017959 INFO  (TEST-TestDistributedGrouping.test-seed#[9A800F53024D591C]) [    ] o.a.s.m.SolrMetricManager Closing metric reporters for registry=solr.jvm, tag=null
   [junit4]   2> 1017959 INFO  (TEST-TestDistributedGrouping.test-seed#[9A800F53024D591C]) [    ] o.a.s.m.r.SolrJmxReporter Closing reporter [org.apache.solr.metrics.reporters.SolrJmxReporter@6a2a51bb: rootName = null, domain = solr.jvm, service url = null, agent id = null] for registry solr.jvm / com.codahale.metrics.MetricRegistry@32e5358f
   [junit4]   2> 1017962 INFO  (TEST-TestDistributedGrouping.test-seed#[9A800F53024D591C]) [    ] o.a.s.m.SolrMetricManager Closing metric reporters for registry=solr.jetty, tag=null
   [junit4]   2> 1017962 INFO  (TEST-TestDistributedGrouping.test-seed#[9A800F53024D591C]) [    ] o.a.s.m.r.SolrJmxReporter Closing reporter [org.apache.solr.metrics.reporters.SolrJmxReporter@4540d5e3: rootName = null, domain = solr.jetty, service url = null, agent id = null] for registry solr.jetty / com.codahale.metrics.MetricRegistry@6074ad9f
   [junit4]   2> 1017971 INFO  (coreCloseExecutor-4300-thread-1) [    x:collection1] o.a.s.c.SolrCore [collection1]  CLOSING SolrCore org.apache.solr.core.SolrCore@59594f25
   [junit4]   2> 1017971 INFO  (coreCloseExecutor-4300-thread-1) [    x:collection1] o.a.s.m.SolrMetricManager Closing metric reporters for registry=solr.core.collection1, tag=59594f25
   [junit4]   2> 1017971 INFO  (coreCloseExecutor-4300-thread-1) [    x:collection1] o.a.s.m.r.SolrJmxReporter Closing reporter [org.apache.solr.metrics.reporters.SolrJmxReporter@1c9ba461: rootName = null, domain = solr.core.collection1, service url = null, agent id = null] for registry solr.core.collection1 / com.codahale.metrics.MetricRegistry@70dae13a
   [junit4]   2> 1018026 INFO  (TEST-TestDistributedGrouping.test-seed#[9A800F53024D591C]) [    ] o.e.j.s.h.ContextHandler Stopped o.e.j.s.ServletContextHandler@7c6e3341{/i_/i,null,UNAVAILABLE}
   [junit4]   2> 1018026 INFO  (TEST-TestDistributedGrouping.test-seed#[9A800F53024D591C]) [    ] o.e.j.s.session node0 Stopped scavenging
   [junit4]   2> 1018027 INFO  (TEST-TestDistributedGrouping.test-seed#[9A800F53024D591C]) [    ] o.e.j.s.AbstractConnector Stopped ServerConnector@767ab3f0{SSL,[ssl, http/1.1]}{127.0.0.1:0}
   [junit4]   2> 1018028 INFO  (TEST-TestDistributedGrouping.test-seed#[9A800F53024D591C]) [    ] o.a.s.c.CoreContainer Shutting down CoreContainer instance=1763582417
   [junit4]   2> 1018028 INFO  (TEST-TestDistributedGrouping.test-seed#[9A800F53024D591C]) [    ] o.a.s.m.SolrMetricManager Closing metric reporters for registry=solr.node, tag=null
   [junit4]   2> 1018028 INFO  (TEST-TestDistributedGrouping.test-seed#[9A800F53024D591C]) [    ] o.a.s.m.r.SolrJmxReporter Closing reporter [org.apache.solr.metrics.reporters.SolrJmxReporter@44ef2ea: rootName = null, domain = solr.node, service url = null, agent id = null] for registry solr.node / com.codahale.metrics.MetricRegistry@4580f905
   [junit4]   2> 1018037 INFO  (TEST-TestDistributedGrouping.test-seed#[9A800F53024D591C]) [    ] o.a.s.m.SolrMetricManager Closing metric reporters for registry=solr.jvm, tag=null
   [junit4]   2> 1018037 INFO  (TEST-TestDistributedGrouping.test-seed#[9A800F53024D591C]) [    ] o.a.s.m.r.SolrJmxReporter Closing reporter [org.apache.solr.metrics.reporters.SolrJmxReporter@1e7b9d97: rootName = null, domain = solr.jvm, service url = null, agent id = null] for registry solr.jvm / com.codahale.metrics.MetricRegistry@32e5358f
   [junit4]   2> 1018046 INFO  (TEST-TestDistributedGrouping.test-seed#[9A800F53024D591C]) [    ] o.a.s.m.SolrMetricManager Closing metric reporters for registry=solr.jetty, tag=null
   [junit4]   2> 1018046 INFO  (TEST-TestDistributedGrouping.test-seed#[9A800F53024D591C]) [    ] o.a.s.m.r.SolrJmxReporter Closing reporter [org.apache.solr.metrics.reporters.SolrJmxReporter@2f7dce7c: rootName = null, domain = solr.jetty, service url = null, agent id = null] for registry solr.jetty / com.codahale.metrics.MetricRegistry@6074ad9f
   [junit4]   2> 1018068 INFO  (coreCloseExecutor-4302-thread-1) [    x:collection1] o.a.s.c.SolrCore [collection1]  CLOSING SolrCore org.apache.solr.core.SolrCore@5019ef2f
   [junit4]   2> 1018068 INFO  (coreCloseExecutor-4302-thread-1) [    x:collection1] o.a.s.m.SolrMetricManager Closing metric reporters for registry=solr.core.collection1, tag=5019ef2f
   [junit4]   2> 1018068 INFO  (coreCloseExecutor-4302-thread-1) [    x:collection1] o.a.s.m.r.SolrJmxReporter Closing reporter [org.apache.solr.metrics.reporters.SolrJmxReporter@14f9aea9: rootName = null, domain = solr.core.collection1, service url = null, agent id = null] for registry solr.core.collection1 / com.codahale.metrics.MetricRegistry@184a3e83
   [junit4]   2> 1018106 INFO  (TEST-TestDistributedGrouping.test-seed#[9A800F53024D591C]) [    ] o.e.j.s.h.ContextHandler Stopped o.e.j.s.ServletContextHandler@193f17c8{/i_/i,null,UNAVAILABLE}
   [junit4]   2> 1018106 INFO  (TEST-TestDistributedGrouping.test-seed#[9A800F53024D591C]) [    ] o.e.j.s.session node0 Stopped scavenging
   [junit4]   2> NOTE: reproduce with: ant test  -Dtestcase=TestDistributedGrouping -Dtests.method=test -Dtests.seed=9A800F53024D591C -Dtests.multiplier=3 -Dtests.slow=true -Dtests.locale=so-KE -Dtests.timezone=Antarctica/Rothera -Dtests.asserts=true -Dtests.file.encoding=US-ASCII
   [junit4] ERROR   2.01s J2 | TestDistributedGrouping.test <<<
   [junit4]    > Throwable #1: org.apache.solr.client.solrj.impl.HttpSolrClient$RemoteSolrException: Error from server at https://127.0.0.1:44101/i_/i/collection1: ERROR: [doc=1] unknown field 'a_idv'
   [junit4]    > 	at __randomizedtesting.SeedInfo.seed([9A800F53024D591C:12D43089ACB134E4]:0)
   [junit4]    > 	at org.apache.solr.client.solrj.impl.HttpSolrClient.executeMethod(HttpSolrClient.java:643)
   [junit4]    > 	at org.apache.solr.client.solrj.impl.HttpSolrClient.request(HttpSolrClient.java:255)
   [junit4]    > 	at org.apache.solr.client.solrj.impl.HttpSolrClient.request(HttpSolrClient.java:244)
   [junit4]    > 	at org.apache.solr.client.solrj.SolrRequest.process(SolrRequest.java:194)
   [junit4]    > 	at org.apache.solr.client.solrj.SolrClient.add(SolrClient.java:173)
   [junit4]    > 	at org.apache.solr.client.solrj.SolrClient.add(SolrClient.java:138)
   [junit4]    > 	at org.apache.solr.client.solrj.SolrClient.add(SolrClient.java:152)
   [junit4]    > 	at org.apache.solr.BaseDistributedSearchTestCase.indexDoc(BaseDistributedSearchTestCase.java:483)
   [junit4]    > 	at org.apache.solr.BaseDistributedSearchTestCase.indexr(BaseDistributedSearchTestCase.java:465)
   [junit4]    > 	at org.apache.solr.TestDistributedGrouping.test(TestDistributedGrouping.java:75)
   [junit4]    > 	at java.base/jdk.internal.reflect.NativeMethodAccessorImpl.invoke0(Native Method)
   [junit4]    > 	at java.base/jdk.internal.reflect.NativeMethodAccessorImpl.invoke(NativeMethodAccessorImpl.java:62)
   [junit4]    > 	at java.base/jdk.internal.reflect.DelegatingMethodAccessorImpl.invoke(DelegatingMethodAccessorImpl.java:43)
   [junit4]    > 	at java.base/java.lang.reflect.Method.invoke(Method.java:566)
   [junit4]    > 	at org.apache.solr.BaseDistributedSearchTestCase$ShardsRepeatRule$ShardsRepeatStatement.callStatement(BaseDistributedSearchTestCase.java:1034)
   [junit4]    > 	at org.apache.solr.BaseDistributedSearchTestCase$ShardsRepeatRule$ShardsStatement.evaluate(BaseDistributedSearchTestCase.java:983)
   [junit4]    > 	at java.base/java.lang.Thread.run(Thread.java:834)
   [junit4]   2> NOTE: leaving temporary files on disk at: /home/jenkins/workspace/Lucene-Solr-7.x-Linux/solr/build/solr-core/test/J2/temp/solr.TestDistributedGrouping_9A800F53024D591C-001
   [junit4]   2> NOTE: test params are: codec=Asserting(Lucene70): {}, docValues:{}, maxPointsInLeafNode=1679, maxMBSortInHeap=7.180532265458718, sim=RandomSimilarity(queryNorm=false): {}, locale=so-KE, timezone=Antarctica/Rothera
   [junit4]   2> NOTE: Linux 4.15.0-32-generic amd64/Oracle Corporation 11 (64-bit)/cpus=8,threads=1,free=307559336,total=494403584
   [junit4]   2> NOTE: All tests run in this JVM: [TestPolicyCloud, TestAddFieldRealTimeGet, TestNoOpRegenerator, AnalyticsQueryTest, TestSolrConfigHandler, TestScoreJoinQPScore, MigrateRouteKeyTest, IndexSchemaRuntimeFieldTest, LeaderVoteWaitTimeoutTest, TestBlendedInfixSuggestions, DateRangeFieldTest, TestLockTree, AlternateDirectoryTest, TestJettySolrRunner, SolrShardReporterTest, AsyncCallRequestStatusResponseTest, Tagger2Test, BigEndianAscendingWordDeserializerTest, TestCloudConsistency, ConcurrentDeleteAndCreateCollectionTest, TestDocSet, TestNRTOpen, BasicZkTest, TestCoreBackup, HdfsDirectoryTest, TestSolrQueryResponse, TestManagedResource, DistribCursorPagingTest, SolrIndexSplitterTest, AnalysisErrorHandlingTest, TestQueryUtils, TestPivotHelperCode, QueryElevationComponentTest, DistanceFunctionTest, SpatialRPTFieldTypeTest, IndexSizeTriggerTest, TestSolrCloudWithHadoopAuthPlugin, TestPartialUpdateDeduplication, TestCoreDiscovery, TestManagedSynonymFilterFactory, TestFieldTypeCollectionResource, TestFiltering, SchemaApiFailureTest, TestTlogReplica, TestDeleteCollectionOnDownNodes, DeleteReplicaTest, TestSerializedLuceneMatchVersion, TestHashQParserPlugin, TestSha256AuthenticationProvider, DocValuesTest, TestFuzzyAnalyzedSuggestions, TestConfigSetsAPIExclusivity, CollectionsAPISolrJTest, LeaderFailoverAfterPartitionTest, TestUnifiedSolrHighlighter, ShardRoutingCustomTest, ExecutePlanActionTest, TestCharFilters, SearchHandlerTest, CdcrRequestHandlerTest, DistributedQueryComponentCustomSortTest, DistributedFacetPivotLargeTest, TestCloudPivotFacet, SearchRateTriggerIntegrationTest, TestTestInjection, SpellingQueryConverterTest, FacetPivotSmallTest, ZkSolrClientTest, TestPrepRecovery, TestNumericRangeQuery64, TestUtilizeNode, TestFieldCacheWithThreads, SOLR749Test, SpellCheckCollatorTest, SuggesterWFSTTest, SuggesterFSTTest, TestSolrIndexConfig, TestSchemalessBufferedUpdates, TestSort, ChaosMonkeySafeLeaderTest, OverriddenZkACLAndCredentialsProvidersTest, TestBulkSchemaAPI, DirectSolrConnectionTest, TestTrie, SystemInfoHandlerTest, TestSQLHandler, TestDistributedGrouping]
   [junit4] Completed [355/833 (1!)] on J2 in 2.06s, 1 test, 1 error <<< FAILURES!

[...truncated 44045 lines...]
[repro] Jenkins log URL: https://jenkins.thetaphi.de/job/Lucene-Solr-7.x-Linux/2759/consoleText

[repro] Revision: d38e90b85495610a7411305745b50e24201babb6

[repro] Ant options: "-Dargs=-XX:-UseCompressedOops -XX:+UseParallelGC"
[repro] Repro line:  ant test  -Dtestcase=TestDistributedGrouping -Dtests.method=test -Dtests.seed=9A800F53024D591C -Dtests.multiplier=3 -Dtests.slow=true -Dtests.locale=so-KE -Dtests.timezone=Antarctica/Rothera -Dtests.asserts=true -Dtests.file.encoding=US-ASCII

[repro] ant clean

[...truncated 6 lines...]
[repro] Test suites by module:
[repro]    solr/core
[repro]       TestDistributedGrouping
[repro] ant compile-test

[...truncated 3442 lines...]
[repro] ant test-nocompile -Dtests.dups=5 -Dtests.maxfailures=5 -Dtests.class="*.TestDistributedGrouping" -Dtests.showOutput=onerror "-Dargs=-XX:-UseCompressedOops -XX:+UseParallelGC" -Dtests.seed=9A800F53024D591C -Dtests.multiplier=3 -Dtests.slow=true -Dtests.locale=so-KE -Dtests.timezone=Antarctica/Rothera -Dtests.asserts=true -Dtests.file.encoding=US-ASCII

[...truncated 76 lines...]
[repro] Failures:
[repro]   0/5 failed: org.apache.solr.TestDistributedGrouping
[repro] Exiting with code 0

[...truncated 40 lines...]

Mime
View raw message