lucene-dev mailing list archives

Site index · List index
Message view « Date » · « Thread »
Top « Date » · « Thread »
From Policeman Jenkins Server <jenk...@thetaphi.de>
Subject [JENKINS] Lucene-Solr-master-Windows (32bit/jdk1.8.0_172) - Build # 7525 - Still Unstable!
Date Sat, 15 Sep 2018 18:33:49 GMT
Build: https://jenkins.thetaphi.de/job/Lucene-Solr-master-Windows/7525/
Java: 32bit/jdk1.8.0_172 -client -XX:+UseG1GC

2 tests failed.
FAILED:  junit.framework.TestSuite.org.apache.solr.cloud.autoscaling.sim.TestSimNodeLostTrigger

Error Message:
1 thread leaked from SUITE scope at org.apache.solr.cloud.autoscaling.sim.TestSimNodeLostTrigger:
    1) Thread[id=14064, name=Simulated OverseerAutoScalingTriggerThread, state=WAITING, group=Simulated
Overseer autoscaling triggers]         at sun.misc.Unsafe.park(Native Method)         at java.util.concurrent.locks.LockSupport.park(LockSupport.java:175)
        at java.util.concurrent.locks.AbstractQueuedSynchronizer.parkAndCheckInterrupt(AbstractQueuedSynchronizer.java:836)
        at java.util.concurrent.locks.AbstractQueuedSynchronizer.acquireQueued(AbstractQueuedSynchronizer.java:870)
        at java.util.concurrent.locks.AbstractQueuedSynchronizer.acquire(AbstractQueuedSynchronizer.java:1199)
        at java.util.concurrent.locks.ReentrantLock$NonfairSync.lock(ReentrantLock.java:209)
        at java.util.concurrent.locks.ReentrantLock.lock(ReentrantLock.java:285)         at
org.apache.solr.cloud.autoscaling.OverseerTriggerThread.refreshAutoScalingConf(OverseerTriggerThread.java:322)
        at org.apache.solr.cloud.autoscaling.OverseerTriggerThread.access$000(OverseerTriggerThread.java:56)
        at org.apache.solr.cloud.autoscaling.OverseerTriggerThread$AutoScalingWatcher.process(OverseerTriggerThread.java:307)
        at org.apache.solr.cloud.autoscaling.sim.SimDistribStateManager$Node.setData(SimDistribStateManager.java:128)
        at org.apache.solr.cloud.autoscaling.sim.SimDistribStateManager.setData(SimDistribStateManager.java:506)
        at org.apache.solr.cloud.autoscaling.OverseerTriggerThread.run(OverseerTriggerThread.java:136)
        at java.lang.Thread.run(Thread.java:748)

Stack Trace:
com.carrotsearch.randomizedtesting.ThreadLeakError: 1 thread leaked from SUITE scope at org.apache.solr.cloud.autoscaling.sim.TestSimNodeLostTrigger:

   1) Thread[id=14064, name=Simulated OverseerAutoScalingTriggerThread, state=WAITING, group=Simulated
Overseer autoscaling triggers]
        at sun.misc.Unsafe.park(Native Method)
        at java.util.concurrent.locks.LockSupport.park(LockSupport.java:175)
        at java.util.concurrent.locks.AbstractQueuedSynchronizer.parkAndCheckInterrupt(AbstractQueuedSynchronizer.java:836)
        at java.util.concurrent.locks.AbstractQueuedSynchronizer.acquireQueued(AbstractQueuedSynchronizer.java:870)
        at java.util.concurrent.locks.AbstractQueuedSynchronizer.acquire(AbstractQueuedSynchronizer.java:1199)
        at java.util.concurrent.locks.ReentrantLock$NonfairSync.lock(ReentrantLock.java:209)
        at java.util.concurrent.locks.ReentrantLock.lock(ReentrantLock.java:285)
        at org.apache.solr.cloud.autoscaling.OverseerTriggerThread.refreshAutoScalingConf(OverseerTriggerThread.java:322)
        at org.apache.solr.cloud.autoscaling.OverseerTriggerThread.access$000(OverseerTriggerThread.java:56)
        at org.apache.solr.cloud.autoscaling.OverseerTriggerThread$AutoScalingWatcher.process(OverseerTriggerThread.java:307)
        at org.apache.solr.cloud.autoscaling.sim.SimDistribStateManager$Node.setData(SimDistribStateManager.java:128)
        at org.apache.solr.cloud.autoscaling.sim.SimDistribStateManager.setData(SimDistribStateManager.java:506)
        at org.apache.solr.cloud.autoscaling.OverseerTriggerThread.run(OverseerTriggerThread.java:136)
        at java.lang.Thread.run(Thread.java:748)
	at __randomizedtesting.SeedInfo.seed([593E390BB7B55AE9]:0)


FAILED:  junit.framework.TestSuite.org.apache.solr.cloud.autoscaling.sim.TestSimNodeLostTrigger

Error Message:
There are still zombie threads that couldn't be terminated:    1) Thread[id=14064, name=Simulated
OverseerAutoScalingTriggerThread, state=WAITING, group=Simulated Overseer autoscaling triggers]
        at sun.misc.Unsafe.park(Native Method)         at java.util.concurrent.locks.LockSupport.park(LockSupport.java:175)
        at java.util.concurrent.locks.AbstractQueuedSynchronizer.parkAndCheckInterrupt(AbstractQueuedSynchronizer.java:836)
        at java.util.concurrent.locks.AbstractQueuedSynchronizer.acquireQueued(AbstractQueuedSynchronizer.java:870)
        at java.util.concurrent.locks.AbstractQueuedSynchronizer.acquire(AbstractQueuedSynchronizer.java:1199)
        at java.util.concurrent.locks.ReentrantLock$NonfairSync.lock(ReentrantLock.java:209)
        at java.util.concurrent.locks.ReentrantLock.lock(ReentrantLock.java:285)         at
org.apache.solr.cloud.autoscaling.OverseerTriggerThread.refreshAutoScalingConf(OverseerTriggerThread.java:322)
        at org.apache.solr.cloud.autoscaling.OverseerTriggerThread.access$000(OverseerTriggerThread.java:56)
        at org.apache.solr.cloud.autoscaling.OverseerTriggerThread$AutoScalingWatcher.process(OverseerTriggerThread.java:307)
        at org.apache.solr.cloud.autoscaling.sim.SimDistribStateManager$Node.setData(SimDistribStateManager.java:128)
        at org.apache.solr.cloud.autoscaling.sim.SimDistribStateManager.setData(SimDistribStateManager.java:506)
        at org.apache.solr.cloud.autoscaling.OverseerTriggerThread.run(OverseerTriggerThread.java:136)
        at java.lang.Thread.run(Thread.java:748)

Stack Trace:
com.carrotsearch.randomizedtesting.ThreadLeakError: There are still zombie threads that couldn't
be terminated:
   1) Thread[id=14064, name=Simulated OverseerAutoScalingTriggerThread, state=WAITING, group=Simulated
Overseer autoscaling triggers]
        at sun.misc.Unsafe.park(Native Method)
        at java.util.concurrent.locks.LockSupport.park(LockSupport.java:175)
        at java.util.concurrent.locks.AbstractQueuedSynchronizer.parkAndCheckInterrupt(AbstractQueuedSynchronizer.java:836)
        at java.util.concurrent.locks.AbstractQueuedSynchronizer.acquireQueued(AbstractQueuedSynchronizer.java:870)
        at java.util.concurrent.locks.AbstractQueuedSynchronizer.acquire(AbstractQueuedSynchronizer.java:1199)
        at java.util.concurrent.locks.ReentrantLock$NonfairSync.lock(ReentrantLock.java:209)
        at java.util.concurrent.locks.ReentrantLock.lock(ReentrantLock.java:285)
        at org.apache.solr.cloud.autoscaling.OverseerTriggerThread.refreshAutoScalingConf(OverseerTriggerThread.java:322)
        at org.apache.solr.cloud.autoscaling.OverseerTriggerThread.access$000(OverseerTriggerThread.java:56)
        at org.apache.solr.cloud.autoscaling.OverseerTriggerThread$AutoScalingWatcher.process(OverseerTriggerThread.java:307)
        at org.apache.solr.cloud.autoscaling.sim.SimDistribStateManager$Node.setData(SimDistribStateManager.java:128)
        at org.apache.solr.cloud.autoscaling.sim.SimDistribStateManager.setData(SimDistribStateManager.java:506)
        at org.apache.solr.cloud.autoscaling.OverseerTriggerThread.run(OverseerTriggerThread.java:136)
        at java.lang.Thread.run(Thread.java:748)
	at __randomizedtesting.SeedInfo.seed([593E390BB7B55AE9]:0)




Build Log:
[...truncated 13359 lines...]
   [junit4] Suite: org.apache.solr.cloud.autoscaling.sim.TestSimNodeLostTrigger
   [junit4]   2> Creating dataDir: C:\Users\jenkins\workspace\Lucene-Solr-master-Windows\solr\build\solr-core\test\J1\temp\solr.cloud.autoscaling.sim.TestSimNodeLostTrigger_593E390BB7B55AE9-001\init-core-data-001
   [junit4]   2> 1776341 WARN  (SUITE-TestSimNodeLostTrigger-seed#[593E390BB7B55AE9]-worker)
[    ] o.a.s.SolrTestCaseJ4 startTrackingSearchers: numOpens=34 numCloses=34
   [junit4]   2> 1776341 INFO  (SUITE-TestSimNodeLostTrigger-seed#[593E390BB7B55AE9]-worker)
[    ] o.a.s.SolrTestCaseJ4 Using PointFields (NUMERIC_POINTS_SYSPROP=true) w/NUMERIC_DOCVALUES_SYSPROP=true
   [junit4]   2> 1776351 INFO  (SUITE-TestSimNodeLostTrigger-seed#[593E390BB7B55AE9]-worker)
[    ] o.a.s.SolrTestCaseJ4 Randomized ssl (false) and clientAuth (false) via: @org.apache.solr.util.RandomizeSSL(reason=,
value=NaN, ssl=NaN, clientAuth=NaN)
   [junit4]   2> 1776351 INFO  (SUITE-TestSimNodeLostTrigger-seed#[593E390BB7B55AE9]-worker)
[    ] o.a.s.SolrTestCaseJ4 SecureRandom sanity checks: test.solr.allowed.securerandom=null
& java.security.egd=file:/dev/./urandom
   [junit4]   2> 1776380 INFO  (SUITE-TestSimNodeLostTrigger-seed#[593E390BB7B55AE9]-worker)
[    ] o.a.s.h.a.MetricsHistoryHandler No .system collection, keeping metrics history in memory.
   [junit4]   2> 1776385 INFO  (TEST-TestSimNodeLostTrigger.testListenerAcceptance-seed#[593E390BB7B55AE9])
[    ] o.a.s.SolrTestCaseJ4 ###Starting testListenerAcceptance
   [junit4]   2> 1776386 INFO  (TEST-TestSimNodeLostTrigger.testListenerAcceptance-seed#[593E390BB7B55AE9])
[    ] o.a.s.c.a.s.SimCloudManager === Restarting OverseerTriggerThread and clearing object
cache...
   [junit4]   2> 1776386 WARN  (Simulated OverseerAutoScalingTriggerThread) [    ] o.a.s.c.a.OverseerTriggerThread
OverseerTriggerThread has been closed, exiting.
   [junit4]   2> 1776490 INFO  (TEST-TestSimNodeLostTrigger.testListenerAcceptance-seed#[593E390BB7B55AE9])
[    ] o.a.s.SolrTestCaseJ4 ###Ending testListenerAcceptance
   [junit4]   2> 1776492 INFO  (TEST-TestSimNodeLostTrigger.testListenerAcceptance-seed#[593E390BB7B55AE9])
[    ] o.a.s.c.a.s.SimSolrCloudTestCase #######################################
   [junit4]   2> ############ CLUSTER STATE ############
   [junit4]   2> #######################################
   [junit4]   2> ## Live nodes:		5
   [junit4]   2> ## Empty nodes:	5
   [junit4]   2> ## Dead nodes:		1
   [junit4]   2> ##		127.0.0.1:10005_solr
   [junit4]   2> ## Collections:	[]
   [junit4]   2> ## Max replicas per node:	0
   [junit4]   2> ## Min replicas per node:	0
   [junit4]   2> ## Total replicas:		0
   [junit4]   2> ######### Solr op counts ##########
   [junit4]   2> ######### Autoscaling event counts ###########
   [junit4]   2> 
   [junit4]   2> 1776494 INFO  (TEST-TestSimNodeLostTrigger.testActionLifecycle-seed#[593E390BB7B55AE9])
[    ] o.a.s.SolrTestCaseJ4 ###Starting testActionLifecycle
   [junit4]   2> 1776495 INFO  (TEST-TestSimNodeLostTrigger.testActionLifecycle-seed#[593E390BB7B55AE9])
[    ] o.a.s.c.a.s.SimCloudManager === Restarting OverseerTriggerThread and clearing object
cache...
   [junit4]   2> 1776597 INFO  (TEST-TestSimNodeLostTrigger.testActionLifecycle-seed#[593E390BB7B55AE9])
[    ] o.a.s.SolrTestCaseJ4 ###Ending testActionLifecycle
   [junit4]   2> 1776597 INFO  (TEST-TestSimNodeLostTrigger.testActionLifecycle-seed#[593E390BB7B55AE9])
[    ] o.a.s.c.a.s.SimSolrCloudTestCase #######################################
   [junit4]   2> ############ CLUSTER STATE ############
   [junit4]   2> #######################################
   [junit4]   2> ## Live nodes:		5
   [junit4]   2> ## Empty nodes:	5
   [junit4]   2> ## Dead nodes:		0
   [junit4]   2> ## Collections:	[]
   [junit4]   2> ## Max replicas per node:	0
   [junit4]   2> ## Min replicas per node:	0
   [junit4]   2> ## Total replicas:		0
   [junit4]   2> ######### Solr op counts ##########
   [junit4]   2> ######### Autoscaling event counts ###########
   [junit4]   2> 
   [junit4]   2> 1776601 INFO  (TEST-TestSimNodeLostTrigger.testRestoreState-seed#[593E390BB7B55AE9])
[    ] o.a.s.SolrTestCaseJ4 ###Starting testRestoreState
   [junit4]   2> 1776601 INFO  (TEST-TestSimNodeLostTrigger.testRestoreState-seed#[593E390BB7B55AE9])
[    ] o.a.s.c.a.s.SimCloudManager === Restarting OverseerTriggerThread and clearing object
cache...
   [junit4]   2> 1776601 WARN  (Simulated OverseerAutoScalingTriggerThread) [    ] o.a.s.c.a.OverseerTriggerThread
OverseerTriggerThread woken up but we are closed, exiting.
   [junit4]   2> 1776765 INFO  (TEST-TestSimNodeLostTrigger.testRestoreState-seed#[593E390BB7B55AE9])
[    ] o.a.s.SolrTestCaseJ4 ###Ending testRestoreState
   [junit4]   2> 1776765 INFO  (TEST-TestSimNodeLostTrigger.testRestoreState-seed#[593E390BB7B55AE9])
[    ] o.a.s.c.a.s.SimSolrCloudTestCase #######################################
   [junit4]   2> ############ CLUSTER STATE ############
   [junit4]   2> #######################################
   [junit4]   2> ## Live nodes:		5
   [junit4]   2> ## Empty nodes:	5
   [junit4]   2> ## Dead nodes:		1
   [junit4]   2> ##		127.0.0.1:10006_solr
   [junit4]   2> ## Collections:	[]
   [junit4]   2> ## Max replicas per node:	0
   [junit4]   2> ## Min replicas per node:	0
   [junit4]   2> ## Total replicas:		0
   [junit4]   2> ######### Solr op counts ##########
   [junit4]   2> ######### Autoscaling event counts ###########
   [junit4]   2> 
   [junit4]   2> 1776769 INFO  (TEST-TestSimNodeLostTrigger.testTrigger-seed#[593E390BB7B55AE9])
[    ] o.a.s.SolrTestCaseJ4 ###Starting testTrigger
   [junit4]   2> 1776770 INFO  (TEST-TestSimNodeLostTrigger.testTrigger-seed#[593E390BB7B55AE9])
[    ] o.a.s.c.a.s.SimCloudManager === Restarting OverseerTriggerThread and clearing object
cache...
   [junit4]   2> 1776770 WARN  (Simulated OverseerAutoScalingTriggerThread) [    ] o.a.s.c.a.OverseerTriggerThread
Interrupted
   [junit4]   2> java.lang.InterruptedException: null
   [junit4]   2> 	at java.util.concurrent.locks.AbstractQueuedSynchronizer.acquireInterruptibly(AbstractQueuedSynchronizer.java:1220)
~[?:1.8.0_172]
   [junit4]   2> 	at java.util.concurrent.locks.ReentrantLock.lockInterruptibly(ReentrantLock.java:335)
~[?:1.8.0_172]
   [junit4]   2> 	at org.apache.solr.cloud.autoscaling.OverseerTriggerThread.run(OverseerTriggerThread.java:177)
[java/:?]
   [junit4]   2> 	at java.lang.Thread.run(Thread.java:748) [?:1.8.0_172]
   [junit4]   2> 1777080 INFO  (TEST-TestSimNodeLostTrigger.testTrigger-seed#[593E390BB7B55AE9])
[    ] o.a.s.SolrTestCaseJ4 ###Ending testTrigger
   [junit4]   2> 1777080 INFO  (TEST-TestSimNodeLostTrigger.testTrigger-seed#[593E390BB7B55AE9])
[    ] o.a.s.c.a.s.SimSolrCloudTestCase #######################################
   [junit4]   2> ############ CLUSTER STATE ############
   [junit4]   2> #######################################
   [junit4]   2> ## Live nodes:		3
   [junit4]   2> ## Empty nodes:	3
   [junit4]   2> ## Dead nodes:		2
   [junit4]   2> ##		127.0.0.1:10001_solr
   [junit4]   2> ##		127.0.0.1:10004_solr
   [junit4]   2> ## Collections:	[]
   [junit4]   2> ## Max replicas per node:	0
   [junit4]   2> ## Min replicas per node:	0
   [junit4]   2> ## Total replicas:		0
   [junit4]   2> ######### Solr op counts ##########
   [junit4]   2> ######### Autoscaling event counts ###########
   [junit4]   2> 
   [junit4]   2> 1777080 WARN  (Simulated OverseerAutoScalingTriggerThread) [    ] o.a.s.c.a.OverseerTriggerThread
Interrupted
   [junit4]   2> java.lang.InterruptedException: null
   [junit4]   2> 	at java.util.concurrent.locks.AbstractQueuedSynchronizer$ConditionObject.reportInterruptAfterWait(AbstractQueuedSynchronizer.java:2014)
~[?:1.8.0_172]
   [junit4]   2> 	at java.util.concurrent.locks.AbstractQueuedSynchronizer$ConditionObject.await(AbstractQueuedSynchronizer.java:2048)
~[?:1.8.0_172]
   [junit4]   2> 	at org.apache.solr.cloud.autoscaling.OverseerTriggerThread.run(OverseerTriggerThread.java:189)
[java/:?]
   [junit4]   2> 	at java.lang.Thread.run(Thread.java:748) [?:1.8.0_172]
   [junit4]   2> 1777082 INFO  (SUITE-TestSimNodeLostTrigger-seed#[593E390BB7B55AE9]-worker)
[    ] o.a.s.SolrTestCaseJ4 ------------------------------------------------------- Done waiting
for tracked resources to be released
   [junit4]   2> Sep 15, 2018 5:59:36 PM com.carrotsearch.randomizedtesting.ThreadLeakControl
checkThreadLeaks
   [junit4]   2> WARNING: Will linger awaiting termination of 1 leaked thread(s).
   [junit4]   2> Sep 15, 2018 6:00:56 PM com.carrotsearch.randomizedtesting.ThreadLeakControl
checkThreadLeaks
   [junit4]   2> SEVERE: 1 thread leaked from SUITE scope at org.apache.solr.cloud.autoscaling.sim.TestSimNodeLostTrigger:

   [junit4]   2>    1) Thread[id=14064, name=Simulated OverseerAutoScalingTriggerThread,
state=WAITING, group=Simulated Overseer autoscaling triggers]
   [junit4]   2>         at sun.misc.Unsafe.park(Native Method)
   [junit4]   2>         at java.util.concurrent.locks.LockSupport.park(LockSupport.java:175)
   [junit4]   2>         at java.util.concurrent.locks.AbstractQueuedSynchronizer.parkAndCheckInterrupt(AbstractQueuedSynchronizer.java:836)
   [junit4]   2>         at java.util.concurrent.locks.AbstractQueuedSynchronizer.acquireQueued(AbstractQueuedSynchronizer.java:870)
   [junit4]   2>         at java.util.concurrent.locks.AbstractQueuedSynchronizer.acquire(AbstractQueuedSynchronizer.java:1199)
   [junit4]   2>         at java.util.concurrent.locks.ReentrantLock$NonfairSync.lock(ReentrantLock.java:209)
   [junit4]   2>         at java.util.concurrent.locks.ReentrantLock.lock(ReentrantLock.java:285)
   [junit4]   2>         at org.apache.solr.cloud.autoscaling.OverseerTriggerThread.refreshAutoScalingConf(OverseerTriggerThread.java:322)
   [junit4]   2>         at org.apache.solr.cloud.autoscaling.OverseerTriggerThread.access$000(OverseerTriggerThread.java:56)
   [junit4]   2>         at org.apache.solr.cloud.autoscaling.OverseerTriggerThread$AutoScalingWatcher.process(OverseerTriggerThread.java:307)
   [junit4]   2>         at org.apache.solr.cloud.autoscaling.sim.SimDistribStateManager$Node.setData(SimDistribStateManager.java:128)
   [junit4]   2>         at org.apache.solr.cloud.autoscaling.sim.SimDistribStateManager.setData(SimDistribStateManager.java:506)
   [junit4]   2>         at org.apache.solr.cloud.autoscaling.OverseerTriggerThread.run(OverseerTriggerThread.java:136)
   [junit4]   2>         at java.lang.Thread.run(Thread.java:748)
   [junit4]   2> Sep 15, 2018 6:00:56 PM com.carrotsearch.randomizedtesting.ThreadLeakControl
tryToInterruptAll
   [junit4]   2> INFO: Starting to interrupt leaked threads:
   [junit4]   2>    1) Thread[id=14064, name=Simulated OverseerAutoScalingTriggerThread,
state=WAITING, group=Simulated Overseer autoscaling triggers]
   [junit4]   2> Sep 15, 2018 6:00:59 PM com.carrotsearch.randomizedtesting.ThreadLeakControl
tryToInterruptAll
   [junit4]   2> SEVERE: There are still zombie threads that couldn't be terminated:
   [junit4]   2>    1) Thread[id=14064, name=Simulated OverseerAutoScalingTriggerThread,
state=WAITING, group=Simulated Overseer autoscaling triggers]
   [junit4]   2>         at sun.misc.Unsafe.park(Native Method)
   [junit4]   2>         at java.util.concurrent.locks.LockSupport.park(LockSupport.java:175)
   [junit4]   2>         at java.util.concurrent.locks.AbstractQueuedSynchronizer.parkAndCheckInterrupt(AbstractQueuedSynchronizer.java:836)
   [junit4]   2>         at java.util.concurrent.locks.AbstractQueuedSynchronizer.acquireQueued(AbstractQueuedSynchronizer.java:870)
   [junit4]   2>         at java.util.concurrent.locks.AbstractQueuedSynchronizer.acquire(AbstractQueuedSynchronizer.java:1199)
   [junit4]   2>         at java.util.concurrent.locks.ReentrantLock$NonfairSync.lock(ReentrantLock.java:209)
   [junit4]   2>         at java.util.concurrent.locks.ReentrantLock.lock(ReentrantLock.java:285)
   [junit4]   2>         at org.apache.solr.cloud.autoscaling.OverseerTriggerThread.refreshAutoScalingConf(OverseerTriggerThread.java:322)
   [junit4]   2>         at org.apache.solr.cloud.autoscaling.OverseerTriggerThread.access$000(OverseerTriggerThread.java:56)
   [junit4]   2>         at org.apache.solr.cloud.autoscaling.OverseerTriggerThread$AutoScalingWatcher.process(OverseerTriggerThread.java:307)
   [junit4]   2>         at org.apache.solr.cloud.autoscaling.sim.SimDistribStateManager$Node.setData(SimDistribStateManager.java:128)
   [junit4]   2>         at org.apache.solr.cloud.autoscaling.sim.SimDistribStateManager.setData(SimDistribStateManager.java:506)
   [junit4]   2>         at org.apache.solr.cloud.autoscaling.OverseerTriggerThread.run(OverseerTriggerThread.java:136)
   [junit4]   2>         at java.lang.Thread.run(Thread.java:748)
   [junit4]   2> NOTE: test params are: codec=Asserting(Lucene80): {}, docValues:{}, maxPointsInLeafNode=946,
maxMBSortInHeap=7.726020552381849, sim=Asserting(org.apache.lucene.search.similarities.AssertingSimilarity@155351d),
locale=es-PA, timezone=Pacific/Majuro
   [junit4]   2> NOTE: Windows 10 10.0 x86/Oracle Corporation 1.8.0_172 (32-bit)/cpus=3,threads=2,free=141053896,total=536870912
   [junit4]   2> NOTE: All tests run in this JVM: [ConfigSetsAPITest, TestComponentsName,
TestCursorMarkWithoutUniqueKey, CdcrBidirectionalTest, PeerSyncTest, TestCustomDocTransformer,
TriggerCooldownIntegrationTest, TestDynamicURP, TestDownShardTolerantSearch, MinimalSchemaTest,
SolrTestCaseJ4Test, HdfsLockFactoryTest, CreateCollectionCleanupTest, TestHighlightDedupGrouping,
BigEndianAscendingWordDeserializerTest, TestNumericRangeQuery32, TestShortCircuitedRequests,
TestCorePropertiesReload, OverseerRolesTest, SuggestComponentTest, CSVRequestHandlerTest,
SynonymTokenizerTest, CloudMLTQParserTest, TestConfigsApi, TestApiFramework, TestLeaderElectionZkExpiry,
TestIndexSearcher, TestGraphTermsQParserPlugin, JvmMetricsTest, BlockJoinFacetRandomTest,
AddReplicaTest, TestXIncludeConfig, TestSafeXMLParsing, TestFieldCacheReopen, OutOfBoxZkACLAndCredentialsProvidersTest,
TestCloudInspectUtil, ConfigureRecoveryStrategyTest, HdfsCollectionsAPIDistributedZkTest,
DistribJoinFromCollectionTest, TestSSLRandomization, TestHttpShardHandlerFactory, TestSolrDeletionPolicy1,
TestDistributedMissingSort, TestNamedUpdateProcessors, HttpSolrCallGetCoreTest, TestXmlQParserPlugin,
TestDirectoryFactory, TestComplexPhraseLeadingWildcard, ZkControllerTest, RecoveryZkTest,
SliceStateTest, URLClassifyProcessorTest, SolrIndexMetricsTest, CursorPagingTest, TestSystemCollAutoCreate,
TestCSVLoader, IndexSizeTriggerTest, RAMDirectoryFactoryTest, DocumentBuilderTest, TestConfigSetProperties,
TestSubQueryTransformer, CollectionsAPIAsyncDistributedZkTest, LIRRollingUpdatesTest, TestBlendedInfixSuggestions,
TestStressRecovery, TestMissingGroups, HLLUtilTest, PeerSyncWithIndexFingerprintCachingTest,
HdfsWriteToMultipleCollectionsTest, TestUseDocValuesAsStored, TestStressCloudBlindAtomicUpdates,
ClusterStateTest, TestUnifiedSolrHighlighter, TestSimClusterStateProvider, TestNumericTerms32,
TestTolerantUpdateProcessorCloud, TestMinMaxOnMultiValuedField, GraphQueryTest, TestLRUStatsCache,
TestJmxIntegration, TestManagedSynonymGraphFilterFactory, CircularListTest, TestLockTree,
StatelessScriptUpdateProcessorFactoryTest, DistributedFacetExistsSmallTest, TestSmileRequest,
ResponseHeaderTest, DistributedFacetPivotLongTailTest, TestPHPSerializedResponseWriter, CursorMarkTest,
SampleTest, PluginInfoTest, TestDocTermOrdsUninvertLimit, TestFreeTextSuggestions, RollingRestartTest,
TestLFUCache, TestSearcherReuse, TestUtils, TestMacroExpander, SolrCoreCheckLockOnStartupTest,
DataDrivenBlockJoinTest, DistributedDebugComponentTest, TestCodecSupport, SuggesterTest, RangeFacetCloudTest,
TestRebalanceLeaders, TestEmbeddedSolrServerAdminHandler, TestSQLHandler, ChangedSchemaMergeTest,
TestSolrConfigHandlerCloud, TestScoreJoinQPScore, DocExpirationUpdateProcessorFactoryTest,
TestBulkSchemaConcurrent, TestValueSourceCache, DefaultValueUpdateProcessorTest, TestPseudoReturnFields,
HdfsBasicDistributedZk2Test, SolrMetricReporterTest, TestSurroundQueryParser, TestRetrieveFieldsOptimizer,
QueryElevationComponentTest, TestAuthorizationFramework, TokenizerChainTest, TestSchemalessBufferedUpdates,
HealthCheckHandlerTest, TestManagedSchema, TestConfigOverlay, SyncSliceTest, HttpPartitionTest,
TestSimNodeLostTrigger]
   [junit4]   2> NOTE: reproduce with: ant test  -Dtestcase=TestSimNodeLostTrigger -Dtests.seed=593E390BB7B55AE9
-Dtests.slow=true -Dtests.locale=es-PA -Dtests.timezone=Pacific/Majuro -Dtests.asserts=true
-Dtests.file.encoding=ISO-8859-1
   [junit4] ERROR   0.00s J1 | TestSimNodeLostTrigger (suite) <<<
   [junit4]    > Throwable #1: com.carrotsearch.randomizedtesting.ThreadLeakError: 1 thread
leaked from SUITE scope at org.apache.solr.cloud.autoscaling.sim.TestSimNodeLostTrigger: 
   [junit4]    >    1) Thread[id=14064, name=Simulated OverseerAutoScalingTriggerThread,
state=WAITING, group=Simulated Overseer autoscaling triggers]
   [junit4]    >         at sun.misc.Unsafe.park(Native Method)
   [junit4]    >         at java.util.concurrent.locks.LockSupport.park(LockSupport.java:175)
   [junit4]    >         at java.util.concurrent.locks.AbstractQueuedSynchronizer.parkAndCheckInterrupt(AbstractQueuedSynchronizer.java:836)
   [junit4]    >         at java.util.concurrent.locks.AbstractQueuedSynchronizer.acquireQueued(AbstractQueuedSynchronizer.java:870)
   [junit4]    >         at java.util.concurrent.locks.AbstractQueuedSynchronizer.acquire(AbstractQueuedSynchronizer.java:1199)
   [junit4]    >         at java.util.concurrent.locks.ReentrantLock$NonfairSync.lock(ReentrantLock.java:209)
   [junit4]    >         at java.util.concurrent.locks.ReentrantLock.lock(ReentrantLock.java:285)
   [junit4]    >         at org.apache.solr.cloud.autoscaling.OverseerTriggerThread.refreshAutoScalingConf(OverseerTriggerThread.java:322)
   [junit4]    >         at org.apache.solr.cloud.autoscaling.OverseerTriggerThread.access$000(OverseerTriggerThread.java:56)
   [junit4]    >         at org.apache.solr.cloud.autoscaling.OverseerTriggerThread$AutoScalingWatcher.process(OverseerTriggerThread.java:307)
   [junit4]    >         at org.apache.solr.cloud.autoscaling.sim.SimDistribStateManager$Node.setData(SimDistribStateManager.java:128)
   [junit4]    >         at org.apache.solr.cloud.autoscaling.sim.SimDistribStateManager.setData(SimDistribStateManager.java:506)
   [junit4]    >         at org.apache.solr.cloud.autoscaling.OverseerTriggerThread.run(OverseerTriggerThread.java:136)
   [junit4]    >         at java.lang.Thread.run(Thread.java:748)
   [junit4]    > 	at __randomizedtesting.SeedInfo.seed([593E390BB7B55AE9]:0)Throwable #2:
com.carrotsearch.randomizedtesting.ThreadLeakError: There are still zombie threads that couldn't
be terminated:
   [junit4]    >    1) Thread[id=14064, name=Simulated OverseerAutoScalingTriggerThread,
state=WAITING, group=Simulated Overseer autoscaling triggers]
   [junit4]    >         at sun.misc.Unsafe.park(Native Method)
   [junit4]    >         at java.util.concurrent.locks.LockSupport.park(LockSupport.java:175)
   [junit4]    >         at java.util.concurrent.locks.AbstractQueuedSynchronizer.parkAndCheckInterrupt(AbstractQueuedSynchronizer.java:836)
   [junit4]    >         at java.util.concurrent.locks.AbstractQueuedSynchronizer.acquireQueued(AbstractQueuedSynchronizer.java:870)
   [junit4]    >         at java.util.concurrent.locks.AbstractQueuedSynchronizer.acquire(AbstractQueuedSynchronizer.java:1199)
   [junit4]    >         at java.util.concurrent.locks.ReentrantLock$NonfairSync.lock(ReentrantLock.java:209)
   [junit4]    >         at java.util.concurrent.locks.ReentrantLock.lock(ReentrantLock.java:285)
   [junit4]    >         at org.apache.solr.cloud.autoscaling.OverseerTriggerThread.refreshAutoScalingConf(OverseerTriggerThread.java:322)
   [junit4]    >         at org.apache.solr.cloud.autoscaling.OverseerTriggerThread.access$000(OverseerTriggerThread.java:56)
   [junit4]    >         at org.apache.solr.cloud.autoscaling.OverseerTriggerThread$AutoScalingWatcher.process(OverseerTriggerThread.java:307)
   [junit4]    >         at org.apache.solr.cloud.autoscaling.sim.SimDistribStateManager$Node.setData(SimDistribStateManager.java:128)
   [junit4]    >         at org.apache.solr.cloud.autoscaling.sim.SimDistribStateManager.setData(SimDistribStateManager.java:506)
   [junit4]    >         at org.apache.solr.cloud.autoscaling.OverseerTriggerThread.run(OverseerTriggerThread.java:136)
   [junit4]    >         at java.lang.Thread.run(Thread.java:748)
   [junit4]    > 	at __randomizedtesting.SeedInfo.seed([593E390BB7B55AE9]:0)
   [junit4] Completed [282/834 (1!)] on J1 in 84.05s, 4 tests, 2 errors <<< FAILURES!

[...truncated 46487 lines...]
[repro] Jenkins log URL: https://jenkins.thetaphi.de/job/Lucene-Solr-master-Windows/7525/consoleText

[repro] Revision: 39733cbf5ff9d8587d418007bd13087a434a1aa2

[repro] Ant options: "-Dargs=-client -XX:+UseG1GC"

[repro] ant clean

[...truncated 6 lines...]
[repro] Test suites by module:
[repro]    solr\core
[repro]       TestSimNodeLostTrigger
[repro] ant compile-test

[...truncated 3445 lines...]
[repro] ant test-nocompile -Dtests.dups=5 -Dtests.maxfailures=5 -Dtests.class="*.TestSimNodeLostTrigger"
-Dtests.showOutput=onerror "-Dargs=-client -XX:+UseG1GC" -Dtests.seed=593E390BB7B55AE9 -Dtests.slow=true
-Dtests.locale=es-PA -Dtests.timezone=Pacific/Majuro -Dtests.asserts=true -Dtests.file.encoding=ISO-8859-1

[...truncated 84 lines...]
[repro] Failures:
[repro]   0/5 failed: org.apache.solr.cloud.autoscaling.sim.TestSimNodeLostTrigger
[repro] Exiting with code 0

[...truncated 75 lines...]

Mime
View raw message