lucene-dev mailing list archives

Site index · List index
Message view « Date » · « Thread »
Top « Date » · « Thread »
From Policeman Jenkins Server <jenk...@thetaphi.de>
Subject [JENKINS-EA] Lucene-Solr-7.x-Linux (64bit/jdk-11-ea+28) - Build # 2685 - Still Unstable!
Date Tue, 04 Sep 2018 09:30:49 GMT
Build: https://jenkins.thetaphi.de/job/Lucene-Solr-7.x-Linux/2685/
Java: 64bit/jdk-11-ea+28 -XX:+UseCompressedOops -XX:+UseParallelGC

9 tests failed.
FAILED:  junit.framework.TestSuite.org.apache.solr.handler.TestSQLHandler

Error Message:
1 thread leaked from SUITE scope at org.apache.solr.handler.TestSQLHandler:     1) Thread[id=2380, name=Connection evictor, state=TIMED_WAITING, group=TGRP-TestSQLHandler]         at java.base@11/java.lang.Thread.sleep(Native Method)         at app//org.apache.http.impl.client.IdleConnectionEvictor$1.run(IdleConnectionEvictor.java:66)         at java.base@11/java.lang.Thread.run(Thread.java:834)

Stack Trace:
com.carrotsearch.randomizedtesting.ThreadLeakError: 1 thread leaked from SUITE scope at org.apache.solr.handler.TestSQLHandler: 
   1) Thread[id=2380, name=Connection evictor, state=TIMED_WAITING, group=TGRP-TestSQLHandler]
        at java.base@11/java.lang.Thread.sleep(Native Method)
        at app//org.apache.http.impl.client.IdleConnectionEvictor$1.run(IdleConnectionEvictor.java:66)
        at java.base@11/java.lang.Thread.run(Thread.java:834)
	at __randomizedtesting.SeedInfo.seed([BF21BCB4179C3D3F]:0)


FAILED:  junit.framework.TestSuite.org.apache.solr.handler.TestSQLHandler

Error Message:
1 thread leaked from SUITE scope at org.apache.solr.handler.TestSQLHandler:     1) Thread[id=2317, name=Connection evictor, state=TIMED_WAITING, group=TGRP-TestSQLHandler]         at java.base@11/java.lang.Thread.sleep(Native Method)         at app//org.apache.http.impl.client.IdleConnectionEvictor$1.run(IdleConnectionEvictor.java:66)         at java.base@11/java.lang.Thread.run(Thread.java:834)

Stack Trace:
com.carrotsearch.randomizedtesting.ThreadLeakError: 1 thread leaked from SUITE scope at org.apache.solr.handler.TestSQLHandler: 
   1) Thread[id=2317, name=Connection evictor, state=TIMED_WAITING, group=TGRP-TestSQLHandler]
        at java.base@11/java.lang.Thread.sleep(Native Method)
        at app//org.apache.http.impl.client.IdleConnectionEvictor$1.run(IdleConnectionEvictor.java:66)
        at java.base@11/java.lang.Thread.run(Thread.java:834)
	at __randomizedtesting.SeedInfo.seed([BF21BCB4179C3D3F]:0)


FAILED:  junit.framework.TestSuite.org.apache.solr.handler.TestSQLHandler

Error Message:
1 thread leaked from SUITE scope at org.apache.solr.handler.TestSQLHandler:     1) Thread[id=38608, name=Connection evictor, state=TIMED_WAITING, group=TGRP-TestSQLHandler]         at java.base@11/java.lang.Thread.sleep(Native Method)         at app//org.apache.http.impl.client.IdleConnectionEvictor$1.run(IdleConnectionEvictor.java:66)         at java.base@11/java.lang.Thread.run(Thread.java:834)

Stack Trace:
com.carrotsearch.randomizedtesting.ThreadLeakError: 1 thread leaked from SUITE scope at org.apache.solr.handler.TestSQLHandler: 
   1) Thread[id=38608, name=Connection evictor, state=TIMED_WAITING, group=TGRP-TestSQLHandler]
        at java.base@11/java.lang.Thread.sleep(Native Method)
        at app//org.apache.http.impl.client.IdleConnectionEvictor$1.run(IdleConnectionEvictor.java:66)
        at java.base@11/java.lang.Thread.run(Thread.java:834)
	at __randomizedtesting.SeedInfo.seed([BF21BCB4179C3D3F]:0)


FAILED:  junit.framework.TestSuite.org.apache.solr.search.TestXmlQParser

Error Message:
1 thread leaked from SUITE scope at org.apache.solr.search.TestXmlQParser:     1) Thread[id=16, name=Log4j2-TF-1-AsyncLoggerConfig--1, state=TIMED_WAITING, group=TGRP-TestXmlQParser]         at java.base@11/jdk.internal.misc.Unsafe.park(Native Method)         at java.base@11/java.util.concurrent.locks.LockSupport.parkNanos(LockSupport.java:234)         at java.base@11/java.util.concurrent.locks.AbstractQueuedSynchronizer$ConditionObject.awaitNanos(AbstractQueuedSynchronizer.java:2123)         at app//com.lmax.disruptor.TimeoutBlockingWaitStrategy.waitFor(TimeoutBlockingWaitStrategy.java:38)         at app//com.lmax.disruptor.ProcessingSequenceBarrier.waitFor(ProcessingSequenceBarrier.java:56)         at app//com.lmax.disruptor.BatchEventProcessor.run(BatchEventProcessor.java:128)         at java.base@11/java.lang.Thread.run(Thread.java:834)

Stack Trace:
com.carrotsearch.randomizedtesting.ThreadLeakError: 1 thread leaked from SUITE scope at org.apache.solr.search.TestXmlQParser: 
   1) Thread[id=16, name=Log4j2-TF-1-AsyncLoggerConfig--1, state=TIMED_WAITING, group=TGRP-TestXmlQParser]
        at java.base@11/jdk.internal.misc.Unsafe.park(Native Method)
        at java.base@11/java.util.concurrent.locks.LockSupport.parkNanos(LockSupport.java:234)
        at java.base@11/java.util.concurrent.locks.AbstractQueuedSynchronizer$ConditionObject.awaitNanos(AbstractQueuedSynchronizer.java:2123)
        at app//com.lmax.disruptor.TimeoutBlockingWaitStrategy.waitFor(TimeoutBlockingWaitStrategy.java:38)
        at app//com.lmax.disruptor.ProcessingSequenceBarrier.waitFor(ProcessingSequenceBarrier.java:56)
        at app//com.lmax.disruptor.BatchEventProcessor.run(BatchEventProcessor.java:128)
        at java.base@11/java.lang.Thread.run(Thread.java:834)
	at __randomizedtesting.SeedInfo.seed([BF21BCB4179C3D3F]:0)


FAILED:  junit.framework.TestSuite.org.apache.solr.search.TestXmlQParser

Error Message:
There are still zombie threads that couldn't be terminated:    1) Thread[id=16, name=Log4j2-TF-1-AsyncLoggerConfig--1, state=TIMED_WAITING, group=TGRP-TestXmlQParser]         at java.base@11/jdk.internal.misc.Unsafe.park(Native Method)         at java.base@11/java.util.concurrent.locks.LockSupport.parkNanos(LockSupport.java:234)         at java.base@11/java.util.concurrent.locks.AbstractQueuedSynchronizer$ConditionObject.awaitNanos(AbstractQueuedSynchronizer.java:2123)         at app//com.lmax.disruptor.TimeoutBlockingWaitStrategy.waitFor(TimeoutBlockingWaitStrategy.java:38)         at app//com.lmax.disruptor.ProcessingSequenceBarrier.waitFor(ProcessingSequenceBarrier.java:56)         at app//com.lmax.disruptor.BatchEventProcessor.run(BatchEventProcessor.java:128)         at java.base@11/java.lang.Thread.run(Thread.java:834)

Stack Trace:
com.carrotsearch.randomizedtesting.ThreadLeakError: There are still zombie threads that couldn't be terminated:
   1) Thread[id=16, name=Log4j2-TF-1-AsyncLoggerConfig--1, state=TIMED_WAITING, group=TGRP-TestXmlQParser]
        at java.base@11/jdk.internal.misc.Unsafe.park(Native Method)
        at java.base@11/java.util.concurrent.locks.LockSupport.parkNanos(LockSupport.java:234)
        at java.base@11/java.util.concurrent.locks.AbstractQueuedSynchronizer$ConditionObject.awaitNanos(AbstractQueuedSynchronizer.java:2123)
        at app//com.lmax.disruptor.TimeoutBlockingWaitStrategy.waitFor(TimeoutBlockingWaitStrategy.java:38)
        at app//com.lmax.disruptor.ProcessingSequenceBarrier.waitFor(ProcessingSequenceBarrier.java:56)
        at app//com.lmax.disruptor.BatchEventProcessor.run(BatchEventProcessor.java:128)
        at java.base@11/java.lang.Thread.run(Thread.java:834)
	at __randomizedtesting.SeedInfo.seed([BF21BCB4179C3D3F]:0)


FAILED:  junit.framework.TestSuite.org.apache.solr.search.TestXmlQParser

Error Message:
The test or suite printed 4374150 bytes to stdout and stderr, even though the limit was set to 8192 bytes. Increase the limit with @Limit, ignore it completely with @SuppressSysoutChecks or run with -Dtests.verbose=true

Stack Trace:
java.lang.AssertionError: The test or suite printed 4374150 bytes to stdout and stderr, even though the limit was set to 8192 bytes. Increase the limit with @Limit, ignore it completely with @SuppressSysoutChecks or run with -Dtests.verbose=true
	at __randomizedtesting.SeedInfo.seed([BF21BCB4179C3D3F]:0)
	at org.apache.lucene.util.TestRuleLimitSysouts.afterIfSuccessful(TestRuleLimitSysouts.java:211)
	at com.carrotsearch.randomizedtesting.rules.TestRuleAdapter$1.afterIfSuccessful(TestRuleAdapter.java:36)
	at com.carrotsearch.randomizedtesting.rules.StatementAdapter.evaluate(StatementAdapter.java:37)
	at org.apache.lucene.util.TestRuleAssertionsRequired$1.evaluate(TestRuleAssertionsRequired.java:53)
	at org.apache.lucene.util.TestRuleMarkFailure$1.evaluate(TestRuleMarkFailure.java:47)
	at org.apache.lucene.util.TestRuleIgnoreAfterMaxFailures$1.evaluate(TestRuleIgnoreAfterMaxFailures.java:64)
	at org.apache.lucene.util.TestRuleIgnoreTestSuites$1.evaluate(TestRuleIgnoreTestSuites.java:54)
	at com.carrotsearch.randomizedtesting.rules.StatementAdapter.evaluate(StatementAdapter.java:36)
	at com.carrotsearch.randomizedtesting.ThreadLeakControl$StatementRunner.run(ThreadLeakControl.java:368)
	at java.base/java.lang.Thread.run(Thread.java:834)


FAILED:  org.apache.solr.handler.TestSQLHandler.doTest

Error Message:
--> https://127.0.0.1:41321/collection1_shard2_replica_n41:Failed to execute sqlQuery 'select year_i, sum(item_i) from collection1 group by year_i order by year_i desc' against JDBC connection 'jdbc:calcitesolr:'. Error while executing SQL "select year_i, sum(item_i) from collection1 group by year_i order by year_i desc": java.io.IOException: java.util.concurrent.ExecutionException: java.io.IOException: --> https://127.0.0.1:38569/collection1_shard1_replica_n43/:java.util.concurrent.ExecutionException: java.io.IOException: params fl=year_i,item_i&q=*:*&wt=javabin&qt=/export&partitionKeys=year_i&sort=year_i+desc&distrib=false

Stack Trace:
java.io.IOException: --> https://127.0.0.1:41321/collection1_shard2_replica_n41:Failed to execute sqlQuery 'select year_i, sum(item_i) from collection1 group by year_i order by year_i desc' against JDBC connection 'jdbc:calcitesolr:'.
Error while executing SQL "select year_i, sum(item_i) from collection1 group by year_i order by year_i desc": java.io.IOException: java.util.concurrent.ExecutionException: java.io.IOException: --> https://127.0.0.1:38569/collection1_shard1_replica_n43/:java.util.concurrent.ExecutionException: java.io.IOException: params fl=year_i,item_i&q=*:*&wt=javabin&qt=/export&partitionKeys=year_i&sort=year_i+desc&distrib=false
	at __randomizedtesting.SeedInfo.seed([BF21BCB4179C3D3F:186504107A272E86]:0)
	at org.apache.solr.client.solrj.io.stream.SolrStream.read(SolrStream.java:215)
	at org.apache.solr.handler.TestSQLHandler.getTuples(TestSQLHandler.java:2712)
	at org.apache.solr.handler.TestSQLHandler.testParallelTimeSeriesGrouping(TestSQLHandler.java:2616)
	at org.apache.solr.handler.TestSQLHandler.doTest(TestSQLHandler.java:101)
	at java.base/jdk.internal.reflect.NativeMethodAccessorImpl.invoke0(Native Method)
	at java.base/jdk.internal.reflect.NativeMethodAccessorImpl.invoke(NativeMethodAccessorImpl.java:62)
	at java.base/jdk.internal.reflect.DelegatingMethodAccessorImpl.invoke(DelegatingMethodAccessorImpl.java:43)
	at java.base/java.lang.reflect.Method.invoke(Method.java:566)
	at com.carrotsearch.randomizedtesting.RandomizedRunner.invoke(RandomizedRunner.java:1737)
	at com.carrotsearch.randomizedtesting.RandomizedRunner$8.evaluate(RandomizedRunner.java:934)
	at com.carrotsearch.randomizedtesting.RandomizedRunner$9.evaluate(RandomizedRunner.java:970)
	at com.carrotsearch.randomizedtesting.RandomizedRunner$10.evaluate(RandomizedRunner.java:984)
	at org.apache.solr.BaseDistributedSearchTestCase$ShardsRepeatRule$ShardsFixedStatement.callStatement(BaseDistributedSearchTestCase.java:1008)
	at org.apache.solr.BaseDistributedSearchTestCase$ShardsRepeatRule$ShardsStatement.evaluate(BaseDistributedSearchTestCase.java:983)
	at com.carrotsearch.randomizedtesting.rules.SystemPropertiesRestoreRule$1.evaluate(SystemPropertiesRestoreRule.java:57)
	at org.apache.lucene.util.TestRuleSetupTeardownChained$1.evaluate(TestRuleSetupTeardownChained.java:49)
	at org.apache.lucene.util.AbstractBeforeAfterRule$1.evaluate(AbstractBeforeAfterRule.java:45)
	at org.apache.lucene.util.TestRuleThreadAndTestName$1.evaluate(TestRuleThreadAndTestName.java:48)
	at org.apache.lucene.util.TestRuleIgnoreAfterMaxFailures$1.evaluate(TestRuleIgnoreAfterMaxFailures.java:64)
	at org.apache.lucene.util.TestRuleMarkFailure$1.evaluate(TestRuleMarkFailure.java:47)
	at com.carrotsearch.randomizedtesting.rules.StatementAdapter.evaluate(StatementAdapter.java:36)
	at com.carrotsearch.randomizedtesting.ThreadLeakControl$StatementRunner.run(ThreadLeakControl.java:368)
	at com.carrotsearch.randomizedtesting.ThreadLeakControl.forkTimeoutingTask(ThreadLeakControl.java:817)
	at com.carrotsearch.randomizedtesting.ThreadLeakControl$3.evaluate(ThreadLeakControl.java:468)
	at com.carrotsearch.randomizedtesting.RandomizedRunner.runSingleTest(RandomizedRunner.java:943)
	at com.carrotsearch.randomizedtesting.RandomizedRunner$5.evaluate(RandomizedRunner.java:829)
	at com.carrotsearch.randomizedtesting.RandomizedRunner$6.evaluate(RandomizedRunner.java:879)
	at com.carrotsearch.randomizedtesting.RandomizedRunner$7.evaluate(RandomizedRunner.java:890)
	at com.carrotsearch.randomizedtesting.rules.StatementAdapter.evaluate(StatementAdapter.java:36)
	at com.carrotsearch.randomizedtesting.rules.SystemPropertiesRestoreRule$1.evaluate(SystemPropertiesRestoreRule.java:57)
	at org.apache.lucene.util.AbstractBeforeAfterRule$1.evaluate(AbstractBeforeAfterRule.java:45)
	at com.carrotsearch.randomizedtesting.rules.StatementAdapter.evaluate(StatementAdapter.java:36)
	at org.apache.lucene.util.TestRuleStoreClassName$1.evaluate(TestRuleStoreClassName.java:41)
	at com.carrotsearch.randomizedtesting.rules.NoShadowingOrOverridesOnMethodsRule$1.evaluate(NoShadowingOrOverridesOnMethodsRule.java:40)
	at com.carrotsearch.randomizedtesting.rules.NoShadowingOrOverridesOnMethodsRule$1.evaluate(NoShadowingOrOverridesOnMethodsRule.java:40)
	at com.carrotsearch.randomizedtesting.rules.StatementAdapter.evaluate(StatementAdapter.java:36)
	at com.carrotsearch.randomizedtesting.rules.StatementAdapter.evaluate(StatementAdapter.java:36)
	at org.apache.lucene.util.TestRuleAssertionsRequired$1.evaluate(TestRuleAssertionsRequired.java:53)
	at org.apache.lucene.util.TestRuleMarkFailure$1.evaluate(TestRuleMarkFailure.java:47)
	at org.apache.lucene.util.TestRuleIgnoreAfterMaxFailures$1.evaluate(TestRuleIgnoreAfterMaxFailures.java:64)
	at org.apache.lucene.util.TestRuleIgnoreTestSuites$1.evaluate(TestRuleIgnoreTestSuites.java:54)
	at com.carrotsearch.randomizedtesting.rules.StatementAdapter.evaluate(StatementAdapter.java:36)
	at com.carrotsearch.randomizedtesting.ThreadLeakControl$StatementRunner.run(ThreadLeakControl.java:368)
	at java.base/java.lang.Thread.run(Thread.java:834)


FAILED:  org.apache.solr.handler.TestSQLHandler.doTest

Error Message:
--> https://127.0.0.1:40401/collection1_shard2_replica_n41:Failed to execute sqlQuery 'select distinct str_s, field_i from collection1' against JDBC connection 'jdbc:calcitesolr:'. Error while executing SQL "select distinct str_s, field_i from collection1": java.io.IOException: java.util.concurrent.ExecutionException: java.io.IOException: --> https://127.0.0.1:33205/collection1_shard1_replica_n43/:java.util.concurrent.ExecutionException: java.io.IOException: params fl=str_s,field_i&q=*:*&wt=javabin&qt=/export&partitionKeys=str_s,field_i&sort=str_s+asc,field_i+asc&distrib=false

Stack Trace:
java.io.IOException: --> https://127.0.0.1:40401/collection1_shard2_replica_n41:Failed to execute sqlQuery 'select distinct str_s, field_i from collection1' against JDBC connection 'jdbc:calcitesolr:'.
Error while executing SQL "select distinct str_s, field_i from collection1": java.io.IOException: java.util.concurrent.ExecutionException: java.io.IOException: --> https://127.0.0.1:33205/collection1_shard1_replica_n43/:java.util.concurrent.ExecutionException: java.io.IOException: params fl=str_s,field_i&q=*:*&wt=javabin&qt=/export&partitionKeys=str_s,field_i&sort=str_s+asc,field_i+asc&distrib=false
	at __randomizedtesting.SeedInfo.seed([BF21BCB4179C3D3F:186504107A272E86]:0)
	at org.apache.solr.client.solrj.io.stream.SolrStream.read(SolrStream.java:215)
	at org.apache.solr.handler.TestSQLHandler.getTuples(TestSQLHandler.java:2712)
	at org.apache.solr.handler.TestSQLHandler.testParallelSelectDistinct(TestSQLHandler.java:1677)
	at org.apache.solr.handler.TestSQLHandler.doTest(TestSQLHandler.java:100)
	at java.base/jdk.internal.reflect.NativeMethodAccessorImpl.invoke0(Native Method)
	at java.base/jdk.internal.reflect.NativeMethodAccessorImpl.invoke(NativeMethodAccessorImpl.java:62)
	at java.base/jdk.internal.reflect.DelegatingMethodAccessorImpl.invoke(DelegatingMethodAccessorImpl.java:43)
	at java.base/java.lang.reflect.Method.invoke(Method.java:566)
	at com.carrotsearch.randomizedtesting.RandomizedRunner.invoke(RandomizedRunner.java:1737)
	at com.carrotsearch.randomizedtesting.RandomizedRunner$8.evaluate(RandomizedRunner.java:934)
	at com.carrotsearch.randomizedtesting.RandomizedRunner$9.evaluate(RandomizedRunner.java:970)
	at com.carrotsearch.randomizedtesting.RandomizedRunner$10.evaluate(RandomizedRunner.java:984)
	at org.apache.solr.BaseDistributedSearchTestCase$ShardsRepeatRule$ShardsFixedStatement.callStatement(BaseDistributedSearchTestCase.java:1008)
	at org.apache.solr.BaseDistributedSearchTestCase$ShardsRepeatRule$ShardsStatement.evaluate(BaseDistributedSearchTestCase.java:983)
	at com.carrotsearch.randomizedtesting.rules.SystemPropertiesRestoreRule$1.evaluate(SystemPropertiesRestoreRule.java:57)
	at org.apache.lucene.util.TestRuleSetupTeardownChained$1.evaluate(TestRuleSetupTeardownChained.java:49)
	at org.apache.lucene.util.AbstractBeforeAfterRule$1.evaluate(AbstractBeforeAfterRule.java:45)
	at org.apache.lucene.util.TestRuleThreadAndTestName$1.evaluate(TestRuleThreadAndTestName.java:48)
	at org.apache.lucene.util.TestRuleIgnoreAfterMaxFailures$1.evaluate(TestRuleIgnoreAfterMaxFailures.java:64)
	at org.apache.lucene.util.TestRuleMarkFailure$1.evaluate(TestRuleMarkFailure.java:47)
	at com.carrotsearch.randomizedtesting.rules.StatementAdapter.evaluate(StatementAdapter.java:36)
	at com.carrotsearch.randomizedtesting.ThreadLeakControl$StatementRunner.run(ThreadLeakControl.java:368)
	at com.carrotsearch.randomizedtesting.ThreadLeakControl.forkTimeoutingTask(ThreadLeakControl.java:817)
	at com.carrotsearch.randomizedtesting.ThreadLeakControl$3.evaluate(ThreadLeakControl.java:468)
	at com.carrotsearch.randomizedtesting.RandomizedRunner.runSingleTest(RandomizedRunner.java:943)
	at com.carrotsearch.randomizedtesting.RandomizedRunner$5.evaluate(RandomizedRunner.java:829)
	at com.carrotsearch.randomizedtesting.RandomizedRunner$6.evaluate(RandomizedRunner.java:879)
	at com.carrotsearch.randomizedtesting.RandomizedRunner$7.evaluate(RandomizedRunner.java:890)
	at com.carrotsearch.randomizedtesting.rules.StatementAdapter.evaluate(StatementAdapter.java:36)
	at com.carrotsearch.randomizedtesting.rules.SystemPropertiesRestoreRule$1.evaluate(SystemPropertiesRestoreRule.java:57)
	at org.apache.lucene.util.AbstractBeforeAfterRule$1.evaluate(AbstractBeforeAfterRule.java:45)
	at com.carrotsearch.randomizedtesting.rules.StatementAdapter.evaluate(StatementAdapter.java:36)
	at org.apache.lucene.util.TestRuleStoreClassName$1.evaluate(TestRuleStoreClassName.java:41)
	at com.carrotsearch.randomizedtesting.rules.NoShadowingOrOverridesOnMethodsRule$1.evaluate(NoShadowingOrOverridesOnMethodsRule.java:40)
	at com.carrotsearch.randomizedtesting.rules.NoShadowingOrOverridesOnMethodsRule$1.evaluate(NoShadowingOrOverridesOnMethodsRule.java:40)
	at com.carrotsearch.randomizedtesting.rules.StatementAdapter.evaluate(StatementAdapter.java:36)
	at com.carrotsearch.randomizedtesting.rules.StatementAdapter.evaluate(StatementAdapter.java:36)
	at org.apache.lucene.util.TestRuleAssertionsRequired$1.evaluate(TestRuleAssertionsRequired.java:53)
	at org.apache.lucene.util.TestRuleMarkFailure$1.evaluate(TestRuleMarkFailure.java:47)
	at org.apache.lucene.util.TestRuleIgnoreAfterMaxFailures$1.evaluate(TestRuleIgnoreAfterMaxFailures.java:64)
	at org.apache.lucene.util.TestRuleIgnoreTestSuites$1.evaluate(TestRuleIgnoreTestSuites.java:54)
	at com.carrotsearch.randomizedtesting.rules.StatementAdapter.evaluate(StatementAdapter.java:36)
	at com.carrotsearch.randomizedtesting.ThreadLeakControl$StatementRunner.run(ThreadLeakControl.java:368)
	at java.base/java.lang.Thread.run(Thread.java:834)


FAILED:  org.apache.solr.handler.TestSQLHandler.doTest

Error Message:
--> https://127.0.0.1:38227/collection1_shard2_replica_n41:Failed to execute sqlQuery 'select year_i, month_i, day_i, sum(item_i) from collection1 group by year_i, month_i, day_i order by year_i desc, month_i desc, day_i desc' against JDBC connection 'jdbc:calcitesolr:'. Error while executing SQL "select year_i, month_i, day_i, sum(item_i) from collection1 group by year_i, month_i, day_i order by year_i desc, month_i desc, day_i desc": java.io.IOException: java.util.concurrent.ExecutionException: java.io.IOException: --> https://127.0.0.1:41793/collection1_shard1_replica_n43/:java.util.concurrent.ExecutionException: java.io.IOException: params fl=year_i,item_i,day_i,month_i&q=*:*&wt=javabin&qt=/export&partitionKeys=year_i,month_i,day_i&sort=year_i+desc,month_i+desc,day_i+desc&distrib=false

Stack Trace:
java.io.IOException: --> https://127.0.0.1:38227/collection1_shard2_replica_n41:Failed to execute sqlQuery 'select year_i, month_i, day_i, sum(item_i) from collection1 group by year_i, month_i, day_i order by year_i desc, month_i desc, day_i desc' against JDBC connection 'jdbc:calcitesolr:'.
Error while executing SQL "select year_i, month_i, day_i, sum(item_i) from collection1 group by year_i, month_i, day_i order by year_i desc, month_i desc, day_i desc": java.io.IOException: java.util.concurrent.ExecutionException: java.io.IOException: --> https://127.0.0.1:41793/collection1_shard1_replica_n43/:java.util.concurrent.ExecutionException: java.io.IOException: params fl=year_i,item_i,day_i,month_i&q=*:*&wt=javabin&qt=/export&partitionKeys=year_i,month_i,day_i&sort=year_i+desc,month_i+desc,day_i+desc&distrib=false
	at __randomizedtesting.SeedInfo.seed([BF21BCB4179C3D3F:186504107A272E86]:0)
	at org.apache.solr.client.solrj.io.stream.SolrStream.read(SolrStream.java:215)
	at org.apache.solr.handler.TestSQLHandler.getTuples(TestSQLHandler.java:2712)
	at org.apache.solr.handler.TestSQLHandler.testParallelTimeSeriesGrouping(TestSQLHandler.java:2663)
	at org.apache.solr.handler.TestSQLHandler.doTest(TestSQLHandler.java:101)
	at java.base/jdk.internal.reflect.NativeMethodAccessorImpl.invoke0(Native Method)
	at java.base/jdk.internal.reflect.NativeMethodAccessorImpl.invoke(NativeMethodAccessorImpl.java:62)
	at java.base/jdk.internal.reflect.DelegatingMethodAccessorImpl.invoke(DelegatingMethodAccessorImpl.java:43)
	at java.base/java.lang.reflect.Method.invoke(Method.java:566)
	at com.carrotsearch.randomizedtesting.RandomizedRunner.invoke(RandomizedRunner.java:1737)
	at com.carrotsearch.randomizedtesting.RandomizedRunner$8.evaluate(RandomizedRunner.java:934)
	at com.carrotsearch.randomizedtesting.RandomizedRunner$9.evaluate(RandomizedRunner.java:970)
	at com.carrotsearch.randomizedtesting.RandomizedRunner$10.evaluate(RandomizedRunner.java:984)
	at org.apache.solr.BaseDistributedSearchTestCase$ShardsRepeatRule$ShardsFixedStatement.callStatement(BaseDistributedSearchTestCase.java:1008)
	at org.apache.solr.BaseDistributedSearchTestCase$ShardsRepeatRule$ShardsStatement.evaluate(BaseDistributedSearchTestCase.java:983)
	at com.carrotsearch.randomizedtesting.rules.SystemPropertiesRestoreRule$1.evaluate(SystemPropertiesRestoreRule.java:57)
	at org.apache.lucene.util.TestRuleSetupTeardownChained$1.evaluate(TestRuleSetupTeardownChained.java:49)
	at org.apache.lucene.util.AbstractBeforeAfterRule$1.evaluate(AbstractBeforeAfterRule.java:45)
	at org.apache.lucene.util.TestRuleThreadAndTestName$1.evaluate(TestRuleThreadAndTestName.java:48)
	at org.apache.lucene.util.TestRuleIgnoreAfterMaxFailures$1.evaluate(TestRuleIgnoreAfterMaxFailures.java:64)
	at org.apache.lucene.util.TestRuleMarkFailure$1.evaluate(TestRuleMarkFailure.java:47)
	at com.carrotsearch.randomizedtesting.rules.StatementAdapter.evaluate(StatementAdapter.java:36)
	at com.carrotsearch.randomizedtesting.ThreadLeakControl$StatementRunner.run(ThreadLeakControl.java:368)
	at com.carrotsearch.randomizedtesting.ThreadLeakControl.forkTimeoutingTask(ThreadLeakControl.java:817)
	at com.carrotsearch.randomizedtesting.ThreadLeakControl$3.evaluate(ThreadLeakControl.java:468)
	at com.carrotsearch.randomizedtesting.RandomizedRunner.runSingleTest(RandomizedRunner.java:943)
	at com.carrotsearch.randomizedtesting.RandomizedRunner$5.evaluate(RandomizedRunner.java:829)
	at com.carrotsearch.randomizedtesting.RandomizedRunner$6.evaluate(RandomizedRunner.java:879)
	at com.carrotsearch.randomizedtesting.RandomizedRunner$7.evaluate(RandomizedRunner.java:890)
	at com.carrotsearch.randomizedtesting.rules.StatementAdapter.evaluate(StatementAdapter.java:36)
	at com.carrotsearch.randomizedtesting.rules.SystemPropertiesRestoreRule$1.evaluate(SystemPropertiesRestoreRule.java:57)
	at org.apache.lucene.util.AbstractBeforeAfterRule$1.evaluate(AbstractBeforeAfterRule.java:45)
	at com.carrotsearch.randomizedtesting.rules.StatementAdapter.evaluate(StatementAdapter.java:36)
	at org.apache.lucene.util.TestRuleStoreClassName$1.evaluate(TestRuleStoreClassName.java:41)
	at com.carrotsearch.randomizedtesting.rules.NoShadowingOrOverridesOnMethodsRule$1.evaluate(NoShadowingOrOverridesOnMethodsRule.java:40)
	at com.carrotsearch.randomizedtesting.rules.NoShadowingOrOverridesOnMethodsRule$1.evaluate(NoShadowingOrOverridesOnMethodsRule.java:40)
	at com.carrotsearch.randomizedtesting.rules.StatementAdapter.evaluate(StatementAdapter.java:36)
	at com.carrotsearch.randomizedtesting.rules.StatementAdapter.evaluate(StatementAdapter.java:36)
	at org.apache.lucene.util.TestRuleAssertionsRequired$1.evaluate(TestRuleAssertionsRequired.java:53)
	at org.apache.lucene.util.TestRuleMarkFailure$1.evaluate(TestRuleMarkFailure.java:47)
	at org.apache.lucene.util.TestRuleIgnoreAfterMaxFailures$1.evaluate(TestRuleIgnoreAfterMaxFailures.java:64)
	at org.apache.lucene.util.TestRuleIgnoreTestSuites$1.evaluate(TestRuleIgnoreTestSuites.java:54)
	at com.carrotsearch.randomizedtesting.rules.StatementAdapter.evaluate(StatementAdapter.java:36)
	at com.carrotsearch.randomizedtesting.ThreadLeakControl$StatementRunner.run(ThreadLeakControl.java:368)
	at java.base/java.lang.Thread.run(Thread.java:834)




Build Log:
[...truncated 14569 lines...]
   [junit4] Suite: org.apache.solr.handler.TestSQLHandler
   [junit4]   2> Creating dataDir: /home/jenkins/workspace/Lucene-Solr-7.x-Linux/solr/build/solr-core/test/J0/temp/solr.handler.TestSQLHandler_BF21BCB4179C3D3F-001/init-core-data-001
   [junit4]   2> 2429034 WARN  (SUITE-TestSQLHandler-seed#[BF21BCB4179C3D3F]-worker) [    ] o.a.s.SolrTestCaseJ4 startTrackingSearchers: numOpens=7 numCloses=7
   [junit4]   2> 2429034 INFO  (SUITE-TestSQLHandler-seed#[BF21BCB4179C3D3F]-worker) [    ] o.a.s.SolrTestCaseJ4 Using PointFields (NUMERIC_POINTS_SYSPROP=true) w/NUMERIC_DOCVALUES_SYSPROP=false
   [junit4]   2> 2429035 INFO  (SUITE-TestSQLHandler-seed#[BF21BCB4179C3D3F]-worker) [    ] o.a.s.SolrTestCaseJ4 Randomized ssl (true) and clientAuth (false) via: @org.apache.solr.util.RandomizeSSL(reason="", ssl=0.0/0.0, value=0.0/0.0, clientAuth=0.0/0.0)
   [junit4]   2> 2429035 INFO  (SUITE-TestSQLHandler-seed#[BF21BCB4179C3D3F]-worker) [    ] o.a.s.SolrTestCaseJ4 SecureRandom sanity checks: test.solr.allowed.securerandom=null & java.security.egd=file:/dev/./urandom
   [junit4]   2> 2429035 INFO  (SUITE-TestSQLHandler-seed#[BF21BCB4179C3D3F]-worker) [    ] o.a.s.BaseDistributedSearchTestCase Setting hostContext system property: /
   [junit4]   2> 2429038 INFO  (TEST-TestSQLHandler.doTest-seed#[BF21BCB4179C3D3F]) [    ] o.a.s.c.ZkTestServer STARTING ZK TEST SERVER
   [junit4]   2> 2429038 INFO  (Thread-6540) [    ] o.a.s.c.ZkTestServer client port:0.0.0.0/0.0.0.0:0
   [junit4]   2> 2429038 INFO  (Thread-6540) [    ] o.a.s.c.ZkTestServer Starting server
   [junit4]   2> 2429041 ERROR (Thread-6540) [    ] o.a.z.s.ZooKeeperServer ZKShutdownHandler is not registered, so ZooKeeper server won't take any action on ERROR or SHUTDOWN server state changes
   [junit4]   2> 2429138 INFO  (TEST-TestSQLHandler.doTest-seed#[BF21BCB4179C3D3F]) [    ] o.a.s.c.ZkTestServer start zk server on port:36113
   [junit4]   2> 2429139 INFO  (zkConnectionManagerCallback-14929-thread-1) [    ] o.a.s.c.c.ConnectionManager zkClient has connected
   [junit4]   2> 2429141 INFO  (zkConnectionManagerCallback-14931-thread-1) [    ] o.a.s.c.c.ConnectionManager zkClient has connected
   [junit4]   2> 2429142 INFO  (TEST-TestSQLHandler.doTest-seed#[BF21BCB4179C3D3F]) [    ] o.a.s.c.AbstractZkTestCase put /home/jenkins/workspace/Lucene-Solr-7.x-Linux/solr/core/src/test-files/solr/collection1/conf/solrconfig-sql.xml to /configs/conf1/solrconfig.xml
   [junit4]   2> 2429143 INFO  (TEST-TestSQLHandler.doTest-seed#[BF21BCB4179C3D3F]) [    ] o.a.s.c.AbstractZkTestCase put /home/jenkins/workspace/Lucene-Solr-7.x-Linux/solr/core/src/test-files/solr/collection1/conf/schema-sql.xml to /configs/conf1/schema.xml
   [junit4]   2> 2429144 INFO  (TEST-TestSQLHandler.doTest-seed#[BF21BCB4179C3D3F]) [    ] o.a.s.c.AbstractZkTestCase put /home/jenkins/workspace/Lucene-Solr-7.x-Linux/solr/core/src/test-files/solr/collection1/conf/solrconfig.snippet.randomindexconfig.xml to /configs/conf1/solrconfig.snippet.randomindexconfig.xml
   [junit4]   2> 2429144 INFO  (TEST-TestSQLHandler.doTest-seed#[BF21BCB4179C3D3F]) [    ] o.a.s.c.AbstractZkTestCase put /home/jenkins/workspace/Lucene-Solr-7.x-Linux/solr/core/src/test-files/solr/collection1/conf/stopwords.txt to /configs/conf1/stopwords.txt
   [junit4]   2> 2429144 INFO  (TEST-TestSQLHandler.doTest-seed#[BF21BCB4179C3D3F]) [    ] o.a.s.c.AbstractZkTestCase put /home/jenkins/workspace/Lucene-Solr-7.x-Linux/solr/core/src/test-files/solr/collection1/conf/protwords.txt to /configs/conf1/protwords.txt
   [junit4]   2> 2429145 INFO  (TEST-TestSQLHandler.doTest-seed#[BF21BCB4179C3D3F]) [    ] o.a.s.c.AbstractZkTestCase put /home/jenkins/workspace/Lucene-Solr-7.x-Linux/solr/core/src/test-files/solr/collection1/conf/currency.xml to /configs/conf1/currency.xml
   [junit4]   2> 2429145 INFO  (TEST-TestSQLHandler.doTest-seed#[BF21BCB4179C3D3F]) [    ] o.a.s.c.AbstractZkTestCase put /home/jenkins/workspace/Lucene-Solr-7.x-Linux/solr/core/src/test-files/solr/collection1/conf/enumsConfig.xml to /configs/conf1/enumsConfig.xml
   [junit4]   2> 2429146 INFO  (TEST-TestSQLHandler.doTest-seed#[BF21BCB4179C3D3F]) [    ] o.a.s.c.AbstractZkTestCase put /home/jenkins/workspace/Lucene-Solr-7.x-Linux/solr/core/src/test-files/solr/collection1/conf/open-exchange-rates.json to /configs/conf1/open-exchange-rates.json
   [junit4]   2> 2429146 INFO  (TEST-TestSQLHandler.doTest-seed#[BF21BCB4179C3D3F]) [    ] o.a.s.c.AbstractZkTestCase put /home/jenkins/workspace/Lucene-Solr-7.x-Linux/solr/core/src/test-files/solr/collection1/conf/mapping-ISOLatin1Accent.txt to /configs/conf1/mapping-ISOLatin1Accent.txt
   [junit4]   2> 2429146 INFO  (TEST-TestSQLHandler.doTest-seed#[BF21BCB4179C3D3F]) [    ] o.a.s.c.AbstractZkTestCase put /home/jenkins/workspace/Lucene-Solr-7.x-Linux/solr/core/src/test-files/solr/collection1/conf/old_synonyms.txt to /configs/conf1/old_synonyms.txt
   [junit4]   2> 2429147 INFO  (TEST-TestSQLHandler.doTest-seed#[BF21BCB4179C3D3F]) [    ] o.a.s.c.AbstractZkTestCase put /home/jenkins/workspace/Lucene-Solr-7.x-Linux/solr/core/src/test-files/solr/collection1/conf/synonyms.txt to /configs/conf1/synonyms.txt
   [junit4]   2> 2429148 INFO  (zkConnectionManagerCallback-14935-thread-1) [    ] o.a.s.c.c.ConnectionManager zkClient has connected
   [junit4]   2> 2429149 INFO  (TEST-TestSQLHandler.doTest-seed#[BF21BCB4179C3D3F]) [    ] o.a.s.c.AbstractFullDistribZkTestBase Will use NRT replicas unless explicitly asked otherwise
   [junit4]   2> 2429237 INFO  (TEST-TestSQLHandler.doTest-seed#[BF21BCB4179C3D3F]) [    ] o.e.j.s.Server jetty-9.4.11.v20180605; built: 2018-06-05T18:24:03.829Z; git: d5fc0523cfa96bfebfbda19606cad384d772f04c; jvm 11+28
   [junit4]   2> 2429238 INFO  (TEST-TestSQLHandler.doTest-seed#[BF21BCB4179C3D3F]) [    ] o.e.j.s.session DefaultSessionIdManager workerName=node0
   [junit4]   2> 2429238 INFO  (TEST-TestSQLHandler.doTest-seed#[BF21BCB4179C3D3F]) [    ] o.e.j.s.session No SessionScavenger set, using defaults
   [junit4]   2> 2429238 INFO  (TEST-TestSQLHandler.doTest-seed#[BF21BCB4179C3D3F]) [    ] o.e.j.s.session node0 Scavenging every 660000ms
   [junit4]   2> 2429238 INFO  (TEST-TestSQLHandler.doTest-seed#[BF21BCB4179C3D3F]) [    ] o.e.j.s.h.ContextHandler Started o.e.j.s.ServletContextHandler@45e5cc1e{/,null,AVAILABLE}
   [junit4]   2> 2429239 INFO  (TEST-TestSQLHandler.doTest-seed#[BF21BCB4179C3D3F]) [    ] o.e.j.s.AbstractConnector Started ServerConnector@5229ada{SSL,[ssl, http/1.1]}{127.0.0.1:35199}
   [junit4]   2> 2429239 INFO  (TEST-TestSQLHandler.doTest-seed#[BF21BCB4179C3D3F]) [    ] o.e.j.s.Server Started @2429277ms
   [junit4]   2> 2429239 INFO  (TEST-TestSQLHandler.doTest-seed#[BF21BCB4179C3D3F]) [    ] o.a.s.c.s.e.JettySolrRunner Jetty properties: {hostContext=/, solr.data.dir=/home/jenkins/workspace/Lucene-Solr-7.x-Linux/solr/build/solr-core/test/J0/temp/solr.handler.TestSQLHandler_BF21BCB4179C3D3F-001/tempDir-001/control/data, hostPort=35199, coreRootDirectory=/home/jenkins/workspace/Lucene-Solr-7.x-Linux/solr/build/solr-core/test/J0/../../../../../../../../../home/jenkins/workspace/Lucene-Solr-7.x-Linux/solr/build/solr-core/test/J0/temp/solr.handler.TestSQLHandler_BF21BCB4179C3D3F-001/control-001/cores, replicaType=NRT}
   [junit4]   2> 2429239 ERROR (TEST-TestSQLHandler.doTest-seed#[BF21BCB4179C3D3F]) [    ] o.a.s.u.StartupLoggingUtils Missing Java Option solr.log.dir. Logging may be missing or incomplete.
   [junit4]   2> 2429239 INFO  (TEST-TestSQLHandler.doTest-seed#[BF21BCB4179C3D3F]) [    ] o.a.s.s.SolrDispatchFilter Using logger factory org.apache.logging.slf4j.Log4jLoggerFactory
   [junit4]   2> 2429239 INFO  (TEST-TestSQLHandler.doTest-seed#[BF21BCB4179C3D3F]) [    ] o.a.s.s.SolrDispatchFilter  ___      _       Welcome to Apache Solr™ version 7.5.0
   [junit4]   2> 2429239 INFO  (TEST-TestSQLHandler.doTest-seed#[BF21BCB4179C3D3F]) [    ] o.a.s.s.SolrDispatchFilter / __| ___| |_ _   Starting in cloud mode on port null
   [junit4]   2> 2429239 INFO  (TEST-TestSQLHandler.doTest-seed#[BF21BCB4179C3D3F]) [    ] o.a.s.s.SolrDispatchFilter \__ \/ _ \ | '_|  Install dir: null
   [junit4]   2> 2429239 INFO  (TEST-TestSQLHandler.doTest-seed#[BF21BCB4179C3D3F]) [    ] o.a.s.s.SolrDispatchFilter |___/\___/_|_|    Start time: 2018-09-04T09:09:23.753333Z
   [junit4]   2> 2429240 INFO  (zkConnectionManagerCallback-14937-thread-1) [    ] o.a.s.c.c.ConnectionManager zkClient has connected
   [junit4]   2> 2429240 INFO  (TEST-TestSQLHandler.doTest-seed#[BF21BCB4179C3D3F]) [    ] o.a.s.s.SolrDispatchFilter Loading solr.xml from SolrHome (not found in ZooKeeper)
   [junit4]   2> 2429240 INFO  (TEST-TestSQLHandler.doTest-seed#[BF21BCB4179C3D3F]) [    ] o.a.s.c.SolrXmlConfig Loading container configuration from /home/jenkins/workspace/Lucene-Solr-7.x-Linux/solr/build/solr-core/test/J0/temp/solr.handler.TestSQLHandler_BF21BCB4179C3D3F-001/control-001/solr.xml
   [junit4]   2> 2429242 INFO  (TEST-TestSQLHandler.doTest-seed#[BF21BCB4179C3D3F]) [    ] o.a.s.c.SolrXmlConfig Configuration parameter autoReplicaFailoverWorkLoopDelay is ignored
   [junit4]   2> 2429242 INFO  (TEST-TestSQLHandler.doTest-seed#[BF21BCB4179C3D3F]) [    ] o.a.s.c.SolrXmlConfig Configuration parameter autoReplicaFailoverBadNodeExpiration is ignored
   [junit4]   2> 2429242 INFO  (TEST-TestSQLHandler.doTest-seed#[BF21BCB4179C3D3F]) [    ] o.a.s.c.SolrXmlConfig MBean server found: com.sun.jmx.mbeanserver.JmxMBeanServer@37b214bf, but no JMX reporters were configured - adding default JMX reporter.
   [junit4]   2> 2429445 INFO  (TEST-TestSQLHandler.doTest-seed#[BF21BCB4179C3D3F]) [    ] o.a.s.c.ZkContainer Zookeeper client=127.0.0.1:36113/solr
   [junit4]   2> 2429446 INFO  (zkConnectionManagerCallback-14941-thread-1) [    ] o.a.s.c.c.ConnectionManager zkClient has connected
   [junit4]   2> 2429447 INFO  (zkConnectionManagerCallback-14943-thread-1) [    ] o.a.s.c.c.ConnectionManager zkClient has connected
   [junit4]   2> 2429481 INFO  (TEST-TestSQLHandler.doTest-seed#[BF21BCB4179C3D3F]) [n:127.0.0.1:35199_    ] o.a.s.c.OverseerElectionContext I am going to be the leader 127.0.0.1:35199_
   [junit4]   2> 2429481 INFO  (TEST-TestSQLHandler.doTest-seed#[BF21BCB4179C3D3F]) [n:127.0.0.1:35199_    ] o.a.s.c.Overseer Overseer (id=72165586957565957-127.0.0.1:35199_-n_0000000000) starting
   [junit4]   2> 2429484 INFO  (zkConnectionManagerCallback-14950-thread-1) [    ] o.a.s.c.c.ConnectionManager zkClient has connected
   [junit4]   2> 2429485 INFO  (TEST-TestSQLHandler.doTest-seed#[BF21BCB4179C3D3F]) [n:127.0.0.1:35199_    ] o.a.s.c.s.i.ZkClientClusterStateProvider Cluster at 127.0.0.1:36113/solr ready
   [junit4]   2> 2429485 INFO  (OverseerStateUpdate-72165586957565957-127.0.0.1:35199_-n_0000000000) [n:127.0.0.1:35199_    ] o.a.s.c.Overseer Starting to work on the main queue : 127.0.0.1:35199_
   [junit4]   2> 2429485 INFO  (TEST-TestSQLHandler.doTest-seed#[BF21BCB4179C3D3F]) [n:127.0.0.1:35199_    ] o.a.s.c.ZkController Register node as live in ZooKeeper:/live_nodes/127.0.0.1:35199_
   [junit4]   2> 2429486 INFO  (zkCallback-14942-thread-1) [    ] o.a.s.c.c.ZkStateReader Updated live nodes from ZooKeeper... (0) -> (1)
   [junit4]   2> 2429486 INFO  (zkCallback-14949-thread-1) [    ] o.a.s.c.c.ZkStateReader Updated live nodes from ZooKeeper... (0) -> (1)
   [junit4]   2> 2429495 INFO  (TEST-TestSQLHandler.doTest-seed#[BF21BCB4179C3D3F]) [n:127.0.0.1:35199_    ] o.a.s.h.a.MetricsHistoryHandler No .system collection, keeping metrics history in memory.
   [junit4]   2> 2429505 INFO  (TEST-TestSQLHandler.doTest-seed#[BF21BCB4179C3D3F]) [n:127.0.0.1:35199_    ] o.a.s.m.r.SolrJmxReporter JMX monitoring for 'solr.node' (registry 'solr.node') enabled at server: com.sun.jmx.mbeanserver.JmxMBeanServer@37b214bf
   [junit4]   2> 2429511 INFO  (TEST-TestSQLHandler.doTest-seed#[BF21BCB4179C3D3F]) [n:127.0.0.1:35199_    ] o.a.s.m.r.SolrJmxReporter JMX monitoring for 'solr.jvm' (registry 'solr.jvm') enabled at server: com.sun.jmx.mbeanserver.JmxMBeanServer@37b214bf
   [junit4]   2> 2429511 INFO  (TEST-TestSQLHandler.doTest-seed#[BF21BCB4179C3D3F]) [n:127.0.0.1:35199_    ] o.a.s.m.r.SolrJmxReporter JMX monitoring for 'solr.jetty' (registry 'solr.jetty') enabled at server: com.sun.jmx.mbeanserver.JmxMBeanServer@37b214bf
   [junit4]   2> 2429512 INFO  (TEST-TestSQLHandler.doTest-seed#[BF21BCB4179C3D3F]) [n:127.0.0.1:35199_    ] o.a.s.c.CorePropertiesLocator Found 0 core definitions underneath /home/jenkins/workspace/Lucene-Solr-7.x-Linux/solr/build/solr-core/test/J0/../../../../../../../../../home/jenkins/workspace/Lucene-Solr-7.x-Linux/solr/build/solr-core/test/J0/temp/solr.handler.TestSQLHandler_BF21BCB4179C3D3F-001/control-001/cores
   [junit4]   2> 2429522 INFO  (zkConnectionManagerCallback-14956-thread-1) [    ] o.a.s.c.c.ConnectionManager zkClient has connected
   [junit4]   2> 2429522 INFO  (TEST-TestSQLHandler.doTest-seed#[BF21BCB4179C3D3F]) [    ] o.a.s.c.c.ZkStateReader Updated live nodes from ZooKeeper... (0) -> (1)
   [junit4]   2> 2429523 INFO  (TEST-TestSQLHandler.doTest-seed#[BF21BCB4179C3D3F]) [    ] o.a.s.c.s.i.ZkClientClusterStateProvider Cluster at 127.0.0.1:36113/solr ready
   [junit4]   2> 2429532 INFO  (qtp714597590-36200) [n:127.0.0.1:35199_    ] o.a.s.h.a.CollectionsHandler Invoked Collection Action :create with params collection.configName=conf1&name=control_collection&nrtReplicas=1&action=CREATE&numShards=1&createNodeSet=127.0.0.1:35199_&wt=javabin&version=2 and sendToOCPQueue=true
   [junit4]   2> 2429533 INFO  (OverseerThreadFactory-9022-thread-1-processing-n:127.0.0.1:35199_) [n:127.0.0.1:35199_    ] o.a.s.c.a.c.CreateCollectionCmd Create collection control_collection
   [junit4]   2> 2429643 INFO  (qtp714597590-36201) [n:127.0.0.1:35199_    x:control_collection_shard1_replica_n1] o.a.s.h.a.CoreAdminOperation core create command qt=/admin/cores&collection.configName=conf1&newCollection=true&name=control_collection_shard1_replica_n1&action=CREATE&numShards=1&collection=control_collection&shard=shard1&wt=javabin&version=2&replicaType=NRT
   [junit4]   2> 2429643 INFO  (qtp714597590-36201) [n:127.0.0.1:35199_    x:control_collection_shard1_replica_n1] o.a.s.c.TransientSolrCoreCacheDefault Allocating transient cache for 4 transient cores
   [junit4]   2> 2430684 INFO  (qtp714597590-36201) [n:127.0.0.1:35199_ c:control_collection s:shard1  x:control_collection_shard1_replica_n1] o.a.s.c.SolrConfig Using Lucene MatchVersion: 7.5.0
   [junit4]   2> 2430688 INFO  (qtp714597590-36201) [n:127.0.0.1:35199_ c:control_collection s:shard1  x:control_collection_shard1_replica_n1] o.a.s.s.IndexSchema [control_collection_shard1_replica_n1] Schema name=test
   [junit4]   2> 2430719 WARN  (qtp714597590-36201) [n:127.0.0.1:35199_ c:control_collection s:shard1  x:control_collection_shard1_replica_n1] o.a.s.s.IndexSchema Field lowerfilt1and2 is not multivalued and destination for multiple copyFields (2)
   [junit4]   2> 2430719 WARN  (qtp714597590-36201) [n:127.0.0.1:35199_ c:control_collection s:shard1  x:control_collection_shard1_replica_n1] o.a.s.s.IndexSchema Field text is not multivalued and destination for multiple copyFields (3)
   [junit4]   2> 2430719 INFO  (qtp714597590-36201) [n:127.0.0.1:35199_ c:control_collection s:shard1  x:control_collection_shard1_replica_n1] o.a.s.s.IndexSchema Loaded schema test/1.6 with uniqueid field id
   [junit4]   2> 2430719 INFO  (qtp714597590-36201) [n:127.0.0.1:35199_ c:control_collection s:shard1  x:control_collection_shard1_replica_n1] o.a.s.c.CoreContainer Creating SolrCore 'control_collection_shard1_replica_n1' using configuration from collection control_collection, trusted=true
   [junit4]   2> 2430719 INFO  (qtp714597590-36201) [n:127.0.0.1:35199_ c:control_collection s:shard1  x:control_collection_shard1_replica_n1] o.a.s.m.r.SolrJmxReporter JMX monitoring for 'solr.core.control_collection.shard1.replica_n1' (registry 'solr.core.control_collection.shard1.replica_n1') enabled at server: com.sun.jmx.mbeanserver.JmxMBeanServer@37b214bf
   [junit4]   2> 2430719 INFO  (qtp714597590-36201) [n:127.0.0.1:35199_ c:control_collection s:shard1  x:control_collection_shard1_replica_n1] o.a.s.c.SolrCore solr.RecoveryStrategy.Builder
   [junit4]   2> 2430719 INFO  (qtp714597590-36201) [n:127.0.0.1:35199_ c:control_collection s:shard1  x:control_collection_shard1_replica_n1] o.a.s.c.SolrCore [[control_collection_shard1_replica_n1] ] Opening new SolrCore at [/home/jenkins/workspace/Lucene-Solr-7.x-Linux/solr/build/solr-core/test/J0/temp/solr.handler.TestSQLHandler_BF21BCB4179C3D3F-001/control-001/cores/control_collection_shard1_replica_n1], dataDir=[/home/jenkins/workspace/Lucene-Solr-7.x-Linux/solr/build/solr-core/test/J0/../../../../../../../../../home/jenkins/workspace/Lucene-Solr-7.x-Linux/solr/build/solr-core/test/J0/temp/solr.handler.TestSQLHandler_BF21BCB4179C3D3F-001/control-001/cores/control_collection_shard1_replica_n1/data/]
   [junit4]   2> 2430747 INFO  (qtp714597590-36201) [n:127.0.0.1:35199_ c:control_collection s:shard1  x:control_collection_shard1_replica_n1] o.a.s.u.UpdateHandler Using UpdateLog implementation: org.apache.solr.update.UpdateLog
   [junit4]   2> 2430747 INFO  (qtp714597590-36201) [n:127.0.0.1:35199_ c:control_collection s:shard1  x:control_collection_shard1_replica_n1] o.a.s.u.UpdateLog Initializing UpdateLog: dataDir= defaultSyncLevel=FLUSH numRecordsToKeep=100 maxNumLogsToKeep=10 numVersionBuckets=65536
   [junit4]   2> 2430748 INFO  (qtp714597590-36201) [n:127.0.0.1:35199_ c:control_collection s:shard1  x:control_collection_shard1_replica_n1] o.a.s.u.CommitTracker Hard AutoCommit: disabled
   [junit4]   2> 2430748 INFO  (qtp714597590-36201) [n:127.0.0.1:35199_ c:control_collection s:shard1  x:control_collection_shard1_replica_n1] o.a.s.u.CommitTracker Soft AutoCommit: disabled
   [junit4]   2> 2430749 INFO  (qtp714597590-36201) [n:127.0.0.1:35199_ c:control_collection s:shard1  x:control_collection_shard1_replica_n1] o.a.s.s.SolrIndexSearcher Opening [Searcher@7969816c[control_collection_shard1_replica_n1] main]
   [junit4]   2> 2430750 INFO  (qtp714597590-36201) [n:127.0.0.1:35199_ c:control_collection s:shard1  x:control_collection_shard1_replica_n1] o.a.s.r.ManagedResourceStorage Configured ZooKeeperStorageIO with znodeBase: /configs/conf1
   [junit4]   2> 2430750 INFO  (qtp714597590-36201) [n:127.0.0.1:35199_ c:control_collection s:shard1  x:control_collection_shard1_replica_n1] o.a.s.r.ManagedResourceStorage Loaded null at path _rest_managed.json using ZooKeeperStorageIO:path=/configs/conf1
   [junit4]   2> 2430751 INFO  (qtp714597590-36201) [n:127.0.0.1:35199_ c:control_collection s:shard1  x:control_collection_shard1_replica_n1] o.a.s.u.UpdateLog Could not find max version in index or recent updates, using new clock 1610667435244912640
   [junit4]   2> 2430751 INFO  (searcherExecutor-9027-thread-1-processing-n:127.0.0.1:35199_ x:control_collection_shard1_replica_n1 c:control_collection s:shard1) [n:127.0.0.1:35199_ c:control_collection s:shard1  x:control_collection_shard1_replica_n1] o.a.s.c.SolrCore [control_collection_shard1_replica_n1] Registered new searcher Searcher@7969816c[control_collection_shard1_replica_n1] main{ExitableDirectoryReader(UninvertingDirectoryReader())}
   [junit4]   2> 2430754 INFO  (qtp714597590-36201) [n:127.0.0.1:35199_ c:control_collection s:shard1  x:control_collection_shard1_replica_n1] o.a.s.c.ZkShardTerms Successful update of terms at /collections/control_collection/terms/shard1 to Terms{values={core_node2=0}, version=0}
   [junit4]   2> 2430756 INFO  (qtp714597590-36201) [n:127.0.0.1:35199_ c:control_collection s:shard1  x:control_collection_shard1_replica_n1] o.a.s.c.ShardLeaderElectionContext Enough replicas found to continue.
   [junit4]   2> 2430756 INFO  (qtp714597590-36201) [n:127.0.0.1:35199_ c:control_collection s:shard1  x:control_collection_shard1_replica_n1] o.a.s.c.ShardLeaderElectionContext I may be the new leader - try and sync
   [junit4]   2> 2430756 INFO  (qtp714597590-36201) [n:127.0.0.1:35199_ c:control_collection s:shard1  x:control_collection_shard1_replica_n1] o.a.s.c.SyncStrategy Sync replicas to https://127.0.0.1:35199/control_collection_shard1_replica_n1/
   [junit4]   2> 2430756 INFO  (qtp714597590-36201) [n:127.0.0.1:35199_ c:control_collection s:shard1  x:control_collection_shard1_replica_n1] o.a.s.c.SyncStrategy Sync Success - now sync replicas to me
   [junit4]   2> 2430756 INFO  (qtp714597590-36201) [n:127.0.0.1:35199_ c:control_collection s:shard1  x:control_collection_shard1_replica_n1] o.a.s.c.SyncStrategy https://127.0.0.1:35199/control_collection_shard1_replica_n1/ has no replicas
   [junit4]   2> 2430756 INFO  (qtp714597590-36201) [n:127.0.0.1:35199_ c:control_collection s:shard1  x:control_collection_shard1_replica_n1] o.a.s.c.ShardLeaderElectionContext Found all replicas participating in election, clear LIR
   [junit4]   2> 2430758 INFO  (qtp714597590-36201) [n:127.0.0.1:35199_ c:control_collection s:shard1  x:control_collection_shard1_replica_n1] o.a.s.c.ShardLeaderElectionContext I am the new leader: https://127.0.0.1:35199/control_collection_shard1_replica_n1/ shard1
   [junit4]   2> 2430859 INFO  (qtp714597590-36201) [n:127.0.0.1:35199_ c:control_collection s:shard1  x:control_collection_shard1_replica_n1] o.a.s.c.ZkController I am the leader, no recovery necessary
   [junit4]   2> 2430860 INFO  (qtp714597590-36201) [n:127.0.0.1:35199_ c:control_collection s:shard1  x:control_collection_shard1_replica_n1] o.a.s.s.HttpSolrCall [admin] webapp=null path=/admin/cores params={qt=/admin/cores&collection.configName=conf1&newCollection=true&name=control_collection_shard1_replica_n1&action=CREATE&numShards=1&collection=control_collection&shard=shard1&wt=javabin&version=2&replicaType=NRT} status=0 QTime=1218
   [junit4]   2> 2430862 INFO  (qtp714597590-36200) [n:127.0.0.1:35199_    ] o.a.s.h.a.CollectionsHandler Wait for new collection to be active for at most 30 seconds. Check all shard replicas
   [junit4]   2> 2430960 INFO  (zkCallback-14942-thread-1) [    ] o.a.s.c.c.ZkStateReader A cluster state change: [WatchedEvent state:SyncConnected type:NodeDataChanged path:/collections/control_collection/state.json] for collection [control_collection] has occurred - updating... (live nodes size: [1])
   [junit4]   2> 2431535 INFO  (OverseerCollectionConfigSetProcessor-72165586957565957-127.0.0.1:35199_-n_0000000000) [n:127.0.0.1:35199_    ] o.a.s.c.OverseerTaskQueue Response ZK path: /overseer/collection-queue-work/qnr-0000000000 doesn't exist.  Requestor may have disconnected from ZooKeeper
   [junit4]   2> 2431862 INFO  (qtp714597590-36200) [n:127.0.0.1:35199_    ] o.a.s.s.HttpSolrCall [admin] webapp=null path=/admin/collections params={collection.configName=conf1&name=control_collection&nrtReplicas=1&action=CREATE&numShards=1&createNodeSet=127.0.0.1:35199_&wt=javabin&version=2} status=0 QTime=2330
   [junit4]   2> 2431865 INFO  (zkConnectionManagerCallback-14961-thread-1) [    ] o.a.s.c.c.ConnectionManager zkClient has connected
   [junit4]   2> 2431866 INFO  (TEST-TestSQLHandler.doTest-seed#[BF21BCB4179C3D3F]) [    ] o.a.s.c.c.ZkStateReader Updated live nodes from ZooKeeper... (0) -> (1)
   [junit4]   2> 2431866 INFO  (TEST-TestSQLHandler.doTest-seed#[BF21BCB4179C3D3F]) [    ] o.a.s.c.s.i.ZkClientClusterStateProvider Cluster at 127.0.0.1:36113/solr ready
   [junit4]   2> 2431867 INFO  (TEST-TestSQLHandler.doTest-seed#[BF21BCB4179C3D3F]) [    ] o.a.s.c.ChaosMonkey monkey: init - expire sessions:false cause connection loss:false
   [junit4]   2> 2431879 INFO  (qtp714597590-36201) [n:127.0.0.1:35199_    ] o.a.s.h.a.CollectionsHandler Invoked Collection Action :create with params collection.configName=conf1&name=collection1&nrtReplicas=1&action=CREATE&numShards=2&createNodeSet=&stateFormat=2&wt=javabin&version=2 and sendToOCPQueue=true
   [junit4]   2> 2431880 INFO  (OverseerThreadFactory-9022-thread-2-processing-n:127.0.0.1:35199_) [n:127.0.0.1:35199_    ] o.a.s.c.a.c.CreateCollectionCmd Create collection collection1
   [junit4]   2> 2432083 WARN  (OverseerThreadFactory-9022-thread-2-processing-n:127.0.0.1:35199_) [n:127.0.0.1:35199_    ] o.a.s.c.a.c.CreateCollectionCmd It is unusual to create a collection (collection1) without cores.
   [junit4]   2> 2432083 INFO  (qtp714597590-36201) [n:127.0.0.1:35199_    ] o.a.s.h.a.CollectionsHandler Wait for new collection to be active for at most 30 seconds. Check all shard replicas
   [junit4]   2> 2432084 INFO  (qtp714597590-36201) [n:127.0.0.1:35199_    ] o.a.s.s.HttpSolrCall [admin] webapp=null path=/admin/collections params={collection.configName=conf1&name=collection1&nrtReplicas=1&action=CREATE&numShards=2&createNodeSet=&stateFormat=2&wt=javabin&version=2} status=0 QTime=204
   [junit4]   2> 2432194 INFO  (TEST-TestSQLHandler.doTest-seed#[BF21BCB4179C3D3F]) [    ] o.a.s.c.AbstractFullDistribZkTestBase create jetty 1 in directory /home/jenkins/workspace/Lucene-Solr-7.x-Linux/solr/build/solr-core/test/J0/temp/solr.handler.TestSQLHandler_BF21BCB4179C3D3F-001/shard-1-001 of type NRT
   [junit4]   2> 2432195 INFO  (TEST-TestSQLHandler.doTest-seed#[BF21BCB4179C3D3F]) [    ] o.e.j.s.Server jetty-9.4.11.v20180605; built: 2018-06-05T18:24:03.829Z; git: d5fc0523cfa96bfebfbda19606cad384d772f04c; jvm 11+28
   [junit4]   2> 2432195 INFO  (TEST-TestSQLHandler.doTest-seed#[BF21BCB4179C3D3F]) [    ] o.e.j.s.session DefaultSessionIdManager workerName=node0
   [junit4]   2> 2432195 INFO  (TEST-TestSQLHandler.doTest-seed#[BF21BCB4179C3D3F]) [    ] o.e.j.s.session No SessionScavenger set, using defaults
   [junit4]   2> 2432195 INFO  (TEST-TestSQLHandler.doTest-seed#[BF21BCB4179C3D3F]) [    ] o.e.j.s.session node0 Scavenging every 600000ms
   [junit4]   2> 2432196 INFO  (TEST-TestSQLHandler.doTest-seed#[BF21BCB4179C3D3F]) [    ] o.e.j.s.h.ContextHandler Started o.e.j.s.ServletContextHandler@9e6e7a4{/,null,AVAILABLE}
   [junit4]   2> 2432196 INFO  (TEST-TestSQLHandler.doTest-seed#[BF21BCB4179C3D3F]) [    ] o.e.j.s.AbstractConnector Started ServerConnector@5220253a{SSL,[ssl, http/1.1]}{127.0.0.1:38227}
   [junit4]   2> 2432196 INFO  (TEST-TestSQLHandler.doTest-seed#[BF21BCB4179C3D3F]) [    ] o.e.j.s.Server Started @2432234ms
   [junit4]   2> 2432196 INFO  (TEST-TestSQLHandler.doTest-seed#[BF21BCB4179C3D3F]) [    ] o.a.s.c.s.e.JettySolrRunner Jetty properties: {hostContext=/, solrconfig=solrconfig.xml, solr.data.dir=/home/jenkins/workspace/Lucene-Solr-7.x-Linux/solr/build/solr-core/test/J0/temp/solr.handler.TestSQLHandler_BF21BCB4179C3D3F-001/tempDir-001/jetty1, hostPort=38227, coreRootDirectory=/home/jenkins/workspace/Lucene-Solr-7.x-Linux/solr/build/solr-core/test/J0/temp/solr.handler.TestSQLHandler_BF21BCB4179C3D3F-001/shard-1-001/cores}
   [junit4]   2> 2432196 ERROR (TEST-TestSQLHandler.doTest-seed#[BF21BCB4179C3D3F]) [    ] o.a.s.u.StartupLoggingUtils Missing Java Option solr.log.dir. Logging may be missing or incomplete.
   [junit4]   2> 2432196 INFO  (TEST-TestSQLHandler.doTest-seed#[BF21BCB4179C3D3F]) [    ] o.a.s.s.SolrDispatchFilter Using logger factory org.apache.logging.slf4j.Log4jLoggerFactory
   [junit4]   2> 2432196 INFO  (TEST-TestSQLHandler.doTest-seed#[BF21BCB4179C3D3F]) [    ] o.a.s.s.SolrDispatchFilter  ___      _       Welcome to Apache Solr™ version 7.5.0
   [junit4]   2> 2432196 INFO  (TEST-TestSQLHandler.doTest-seed#[BF21BCB4179C3D3F]) [    ] o.a.s.s.SolrDispatchFilter / __| ___| |_ _   Starting in cloud mode on port null
   [junit4]   2> 2432196 INFO  (TEST-TestSQLHandler.doTest-seed#[BF21BCB4179C3D3F]) [    ] o.a.s.s.SolrDispatchFilter \__ \/ _ \ | '_|  Install dir: null
   [junit4]   2> 2432196 INFO  (TEST-TestSQLHandler.doTest-seed#[BF21BCB4179C3D3F]) [    ] o.a.s.s.SolrDispatchFilter |___/\___/_|_|    Start time: 2018-09-04T09:09:26.710701Z
   [junit4]   2> 2432197 INFO  (zkConnectionManagerCallback-14963-thread-1) [    ] o.a.s.c.c.ConnectionManager zkClient has connected
   [junit4]   2> 2432198 INFO  (TEST-TestSQLHandler.doTest-seed#[BF21BCB4179C3D3F]) [    ] o.a.s.s.SolrDispatchFilter Loading solr.xml from SolrHome (not found in ZooKeeper)
   [junit4]   2> 2432198 INFO  (TEST-TestSQLHandler.doTest-seed#[BF21BCB4179C3D3F]) [    ] o.a.s.c.SolrXmlConfig Loading container configuration from /home/jenkins/workspace/Lucene-Solr-7.x-Linux/solr/build/solr-core/test/J0/temp/solr.handler.TestSQLHandler_BF21BCB4179C3D3F-001/shard-1-001/solr.xml
   [junit4]   2> 2432200 INFO  (TEST-TestSQLHandler.doTest-seed#[BF21BCB4179C3D3F]) [    ] o.a.s.c.SolrXmlConfig Configuration parameter autoReplicaFailoverWorkLoopDelay is ignored
   [junit4]   2> 2432200 INFO  (TEST-TestSQLHandler.doTest-seed#[BF21BCB4179C3D3F]) [    ] o.a.s.c.SolrXmlConfig Configuration parameter autoReplicaFailoverBadNodeExpiration is ignored
   [junit4]   2> 2432201 INFO  (TEST-TestSQLHandler.doTest-seed#[BF21BCB4179C3D3F]) [    ] o.a.s.c.SolrXmlConfig MBean server found: com.sun.jmx.mbeanserver.JmxMBeanServer@37b214bf, but no JMX reporters were configured - adding default JMX reporter.
   [junit4]   2> 2432272 INFO  (TEST-TestSQLHandler.doTest-seed#[BF21BCB4179C3D3F]) [    ] o.a.s.c.ZkContainer Zookeeper client=127.0.0.1:36113/solr
   [junit4]   2> 2432273 INFO  (zkConnectionManagerCallback-14967-thread-1) [    ] o.a.s.c.c.ConnectionManager zkClient has connected
   [junit4]   2> 2432274 INFO  (zkConnectionManagerCallback-14969-thread-1) [    ] o.a.s.c.c.ConnectionManager zkClient has connected
   [junit4]   2> 2432277 INFO  (TEST-TestSQLHandler.doTest-seed#[BF21BCB4179C3D3F]) [    ] o.a.s.c.c.ZkStateReader Updated live nodes from ZooKeeper... (0) -> (1)
   [junit4]   2> 2432279 INFO  (TEST-TestSQLHandler.doTest-seed#[BF21BCB4179C3D3F]) [    ] o.a.s.c.TransientSolrCoreCacheDefault Allocating transient cache for 4 transient cores
   [junit4]   2> 2432279 INFO  (TEST-TestSQLHandler.doTest-seed#[BF21BCB4179C3D3F]) [    ] o.a.s.c.ZkController Register node as live in ZooKeeper:/live_nodes/127.0.0.1:38227_
   [junit4]   2> 2432279 INFO  (zkCallback-14942-thread-2) [    ] o.a.s.c.c.ZkStateReader Updated live nodes from ZooKeeper... (1) -> (2)
   [junit4]   2> 2432279 INFO  (zkCallback-14949-thread-1) [    ] o.a.s.c.c.ZkStateReader Updated live nodes from ZooKeeper... (1) -> (2)
   [junit4]   2> 2432280 INFO  (zkCallback-14960-thread-1) [    ] o.a.s.c.c.ZkStateReader Updated live nodes from ZooKeeper... (1) -> (2)
   [junit4]   2> 2432280 INFO  (zkCallback-14968-thread-1) [    ] o.a.s.c.c.ZkStateReader Updated live nodes from ZooKeeper... (1) -> (2)
   [junit4]   2> 2432295 INFO  (zkConnectionManagerCallback-14976-thread-1) [    ] o.a.s.c.c.ConnectionManager zkClient has connected
   [junit4]   2> 2432295 INFO  (TEST-TestSQLHandler.doTest-seed#[BF21BCB4179C3D3F]) [    ] o.a.s.c.c.ZkStateReader Updated live nodes from ZooKeeper... (0) -> (2)
   [junit4]   2> 2432296 INFO  (TEST-TestSQLHandler.doTest-seed#[BF21BCB4179C3D3F]) [    ] o.a.s.c.s.i.ZkClientClusterStateProvider Cluster at 127.0.0.1:36113/solr ready
   [junit4]   2> 2432296 INFO  (TEST-TestSQLHandler.doTest-seed#[BF21BCB4179C3D3F]) [    ] o.a.s.h.a.MetricsHistoryHandler No .system collection, keeping metrics history in memory.
   [junit4]   2> 2432307 INFO  (TEST-TestSQLHandler.doTest-seed#[BF21BCB4179C3D3F]) [    ] o.a.s.m.r.SolrJmxReporter JMX monitoring for 'solr.node' (registry 'solr.node') enabled at server: com.sun.jmx.mbeanserver.JmxMBeanServer@37b214bf
   [junit4]   2> 2432313 INFO  (TEST-TestSQLHandler.doTest-seed#[BF21BCB4179C3D3F]) [    ] o.a.s.m.r.SolrJmxReporter JMX monitoring for 'solr.jvm' (registry 'solr.jvm') enabled at server: com.sun.jmx.mbeanserver.JmxMBeanServer@37b214bf
   [junit4]   2> 2432314 INFO  (TEST-TestSQLHandler.doTest-seed#[BF21BCB4179C3D3F]) [    ] o.a.s.m.r.SolrJmxReporter JMX monitoring for 'solr.jetty' (registry 'solr.jetty') enabled at server: com.sun.jmx.mbeanserver.JmxMBeanServer@37b214bf
   [junit4]   2> 2432315 INFO  (TEST-TestSQLHandler.doTest-seed#[BF21BCB4179C3D3F]) [    ] o.a.s.c.CorePropertiesLocator Found 0 core definitions underneath /home/jenkins/workspace/Lucene-Solr-7.x-Linux/solr/build/solr-core/test/J0/temp/solr.handler.TestSQLHandler_BF21BCB4179C3D3F-001/shard-1-001/cores
   [junit4]   2> 2432329 INFO  (qtp714597590-36199) [n:127.0.0.1:35199_    ] o.a.s.h.a.CollectionsHandler Invoked Collection Action :addreplica with params node=127.0.0.1:38227_&action=ADDREPLICA&collection=collection1&shard=shard2&type=NRT&wt=javabin&version=2 and sendToOCPQueue=true
   [junit4]   2> 2432331 INFO  (OverseerCollectionConfigSetProcessor-72165586957565957-127.0.0.1:35199_-n_0000000000) [n:127.0.0.1:35199_    ] o.a.s.c.OverseerTaskQueue Response ZK path: /overseer/collection-queue-work/qnr-0000000002 doesn't exist.  Requestor may have disconnected from ZooKeeper
   [junit4]   2> 2432331 INFO  (OverseerThreadFactory-9022-thread-3-processing-n:127.0.0.1:35199_) [n:127.0.0.1:35199_ c:collection1 s:shard2  ] o.a.s.c.a.c.AddReplicaCmd Node Identified 127.0.0.1:38227_ for creating new replica of shard shard2
   [junit4]   2> 2432342 INFO  (qtp743979941-36257) [n:127.0.0.1:38227_    x:collection1_shard2_replica_n41] o.a.s.h.a.CoreAdminOperation core create command qt=/admin/cores&collection.configName=conf1&name=collection1_shard2_replica_n41&action=CREATE&collection=collection1&shard=shard2&wt=javabin&version=2&replicaType=NRT
   [junit4]   2> 2433348 INFO  (qtp743979941-36257) [n:127.0.0.1:38227_ c:collection1 s:shard2  x:collection1_shard2_replica_n41] o.a.s.c.SolrConfig Using Lucene MatchVersion: 7.5.0
   [junit4]   2> 2433359 INFO  (qtp743979941-36257) [n:127.0.0.1:38227_ c:collection1 s:shard2  x:collection1_shard2_replica_n41] o.a.s.s.IndexSchema [collection1_shard2_replica_n41] Schema name=test
   [junit4]   2> 2433399 WARN  (qtp743979941-36257) [n:127.0.0.1:38227_ c:collection1 s:shard2  x:collection1_shard2_replica_n41] o.a.s.s.IndexSchema Field lowerfilt1and2 is not multivalued and destination for multiple copyFields (2)
   [junit4]   2> 2433399 WARN  (qtp743979941-36257) [n:127.0.0.1:38227_ c:collection1 s:shard2  x:collection1_shard2_replica_n41] o.a.s.s.IndexSchema Field text is not multivalued and destination for multiple copyFields (3)
   [junit4]   2> 2433399 INFO  (qtp743979941-36257) [n:127.0.0.1:38227_ c:collection1 s:shard2  x:collection1_shard2_replica_n41] o.a.s.s.IndexSchema Loaded schema test/1.6 with uniqueid field id
   [junit4]   2> 2433399 INFO  (qtp743979941-36257) [n:127.0.0.1:38227_ c:collection1 s:shard2  x:collection1_shard2_replica_n41] o.a.s.c.CoreContainer Creating SolrCore 'collection1_shard2_replica_n41' using configuration from collection collection1, trusted=true
   [junit4]   2> 2433399 INFO  (qtp743979941-36257) [n:127.0.0.1:38227_ c:collection1 s:shard2  x:collection1_shard2_replica_n41] o.a.s.m.r.SolrJmxReporter JMX monitoring for 'solr.core.collection1.shard2.replica_n41' (registry 'solr.core.collection1.shard2.replica_n41') enabled at server: com.sun.jmx.mbeanserver.JmxMBeanServer@37b214bf
   [junit4]   2> 2433399 INFO  (qtp743979941-36257) [n:127.0.0.1:38227_ c:collection1 s:shard2  x:collection1_shard2_replica_n41] o.a.s.c.SolrCore solr.RecoveryStrategy.Builder
   [junit4]   2> 2433399 INFO  (qtp743979941-36257) [n:127.0.0.1:38227_ c:collection1 s:shard2  x:collection1_shard2_replica_n41] o.a.s.c.SolrCore [[collection1_shard2_replica_n41] ] Opening new SolrCore at [/home/jenkins/workspace/Lucene-Solr-7.x-Linux/solr/build/solr-core/test/J0/temp/solr.handler.TestSQLHandler_BF21BCB4179C3D3F-001/shard-1-001/cores/collection1_shard2_replica_n41], dataDir=[/home/jenkins/workspace/Lucene-Solr-7.x-Linux/solr/build/solr-core/test/J0/temp/solr.handler.TestSQLHandler_BF21BCB4179C3D3F-001/shard-1-001/cores/collection1_shard2_replica_n41/data/]
   [junit4]   2> 2433447 INFO  (qtp743979941-36257) [n:127.0.0.1:38227_ c:collection1 s:shard2  x:collection1_shard2_replica_n41] o.a.s.u.UpdateHandler Using UpdateLog implementation: org.apache.solr.update.UpdateLog
   [junit4]   2> 2433447 INFO  (qtp743979941-36257) [n:127.0.0.1:38227_ c:collection1 s:shard2  x:collection1_shard2_replica_n41] o.a.s.u.UpdateLog Initializing UpdateLog: dataDir= defaultSyncLevel=FLUSH numRecordsToKeep=100 maxNumLogsToKeep=10 numVersionBuckets=65536
   [junit4]   2> 2433448 INFO  (qtp743979941-36257) [n:127.0.0.1:38227_ c:collection1 s:shard2  x:collection1_shard2_replica_n41] o.a.s.u.CommitTracker Hard AutoCommit: disabled
   [junit4]   2> 2433448 INFO  (qtp743979941-36257) [n:127.0.0.1:38227_ c:collection1 s:shard2  x:collection1_shard2_replica_n41] o.a.s.u.CommitTracker Soft AutoCommit: disabled
   [junit4]   2> 2433449 INFO  (qtp743979941-36257) [n:127.0.0.1:38227_ c:collection1 s:shard2  x:collection1_shard2_replica_n41] o.a.s.s.SolrIndexSearcher Opening [Searcher@3c75756b[collection1_shard2_replica_n41] main]
   [junit4]   2> 2433450 INFO  (qtp743979941-36257) [n:127.0.0.1:38227_ c:collection1 s:shard2  x:collection1_shard2_replica_n41] o.a.s.r.ManagedResourceStorage Configured ZooKeeperStorageIO with znodeBase: /configs/conf1
   [junit4]   2> 2433450 INFO  (qtp743979941-36257) [n:127.0.0.1:38227_ c:collection1 s:shard2  x:collection1_shard2_replica_n41] o.a.s.r.ManagedResourceStorage Loaded null at path _rest_managed.json using ZooKeeperStorageIO:path=/configs/conf1
   [junit4]   2> 2433451 INFO  (qtp743979941-36257) [n:127.0.0.1:38227_ c:collection1 s:shard2  x:collection1_shard2_replica_n41] o.a.s.u.UpdateLog Could not find max version in index or recent updates, using new clock 1610667438076067840
   [junit4]   2> 2433451 INFO  (searcherExecutor-9040-thread-1-processing-n:127.0.0.1:38227_ x:collection1_shard2_replica_n41 c:collection1 s:shard2) [n:127.0.0.1:38227_ c:collection1 s:shard2  x:collection1_shard2_replica_n41] o.a.s.c.SolrCore [collection1_shard2_replica_n41] Registered new searcher Searcher@3c75756b[collection1_shard2_replica_n41] main{ExitableDirectoryReader(UninvertingDirectoryReader())}
   [junit4]   2> 2433455 INFO  (qtp743979941-36257) [n:127.0.0.1:38227_ c:collection1 s:shard2  x:collection1_shard2_replica_n41] o.a.s.c.ZkShardTerms Successful update of terms at /collections/collection1/terms/shard2 to Terms{values={core_node42=0}, version=0}
   [junit4]   2> 2433457 INFO  (qtp743979941-36257) [n:127.0.0.1:38227_ c:collection1 s:shard2  x:collection1_shard2_replica_n41] o.a.s.c.ShardLeaderElectionContext Enough replicas found to continue.
   [junit4]   2> 2433457 INFO  (qtp743979941-36257) [n:127.0.0.1:38227_ c:collection1 s:shard2  x:collection1_shard2_replica_n41] o.a.s.c.ShardLeaderElectionContext I may be the new leader - try and sync
   [junit4]   2> 2433457 INFO  (qtp743979941-36257) [n:127.0.0.1:38227_ c:collection1 s:shard2  x:collection1_shard2_replica_n41] o.a.s.c.SyncStrategy Sync replicas to https://127.0.0.1:38227/collection1_shard2_replica_n41/
   [junit4]   2> 2433457 INFO  (qtp743979941-36257) [n:127.0.0.1:38227_ c:collection1 s:shard2  x:collection1_shard2_replica_n41] o.a.s.c.SyncStrategy Sync Success - now sync replicas to me
   [junit4]   2> 2433457 INFO  (qtp743979941-36257) [n:127.0.0.1:38227_ c:collection1 s:shard2  x:collection1_shard2_replica_n41] o.a.s.c.SyncStrategy https://127.0.0.1:38227/collection1_shard2_replica_n41/ has no replicas
   [junit4]   2> 2433457 INFO  (qtp743979941-36257) [n:127.0.0.1:38227_ c:collection1 s:shard2  x:collection1_shard2_replica_n41] o.a.s.c.ShardLeaderElectionContext Found all replicas participating in election, clear LIR
   [junit4]   2> 2433458 INFO  (qtp743979941-36257) [n:127.0.0.1:38227_ c:collection1 s:shard2  x:collection1_shard2_replica_n41] o.a.s.c.ShardLeaderElectionContext I am the new leader: https://127.0.0.1:38227/collection1_shard2_replica_n41/ shard2
   [junit4]   2> 2433560 INFO  (qtp743979941-36257) [n:127.0.0.1:38227_ c:collection1 s:shard2  x:collection1_shard2_replica_n41] o.a.s.c.ZkController I am the leader, no recovery necessary
   [junit4]   2> 2433561 INFO  (qtp743979941-36257) [n:127.0.0.1:38227_ c:collection1 s:shard2  x:collection1_shard2_replica_n41] o.a.s.s.HttpSolrCall [admin] webapp=null path=/admin/cores params={qt=/admin/cores&collection.configName=conf1&name=collection1_shard2_replica_n41&action=CREATE&collection=collection1&shard=shard2&wt=javabin&version=2&replicaType=NRT} status=0 QTime=1219
   [junit4]   2> 2433563 INFO  (qtp714597590-36199) [n:127.0.0.1:35199_ c:collection1   ] o.a.s.s.HttpSolrCall [admin] webapp=null path=/admin/collections params={node=127.0.0.1:38227_&action=ADDREPLICA&collection=collection1&shard=shard2&type=NRT&wt=javabin&version=2} status=0 QTime=1233
   [junit4]   2> 2433661 INFO  (zkCallback-14968-thread-1) [    ] o.a.s.c.c.ZkStateReader A cluster state change: [WatchedEvent state:SyncConnected type:NodeDataChanged path:/collections/collection1/state.json] for collection [collection1] has occurred - updating... (live nodes size: [2])
   [junit4]   2> 2433663 INFO  (TEST-TestSQLHandler.doTest-seed#[BF21BCB4179C3D3F]) [    ] o.a.s.c.AbstractFullDistribZkTestBase create jetty 2 in directory /home/jenkins/workspace/Lucene-Solr-7.x-Linux/solr/build/solr-core/test/J0/temp/solr.handler.TestSQLHandler_BF21BCB4179C3D3F-001/shard-2-001 of type NRT
   [junit4]   2> 2433663 INFO  (TEST-TestSQLHandler.doTest-seed#[BF21BCB4179C3D3F]) [    ] o.e.j.s.Server jetty-9.4.11.v20180605; built: 2018-06-05T18:24:03.829Z; git: d5fc0523cfa96bfebfbda19606cad384d772f04c; jvm 11+28
   [junit4]   2> 2433664 INFO  (TEST-TestSQLHandler.doTest-seed#[BF21BCB4179C3D3F]) [    ] o.e.j.s.session DefaultSessionIdManager workerName=node0
   [junit4]   2> 2433664 INFO  (TEST-TestSQLHandler.doTest-seed#[BF21BCB4179C3D3F]) [    ] o.e.j.s.session No SessionScavenger set, using defaults
   [junit4]   2> 2433664 INFO  (TEST-TestSQLHandler.doTest-seed#[BF21BCB4179C3D3F]) [    ] o.e.j.s.session node0 Scavenging every 660000ms
   [junit4]   2> 2433664 INFO  (TEST-TestSQLHandler.doTest-seed#[BF21BCB4179C3D3F]) [    ] o.e.j.s.h.ContextHandler Started o.e.j.s.ServletContextHandler@40f61ec9{/,null,AVAILABLE}
   [junit4]   2> 2433665 INFO  (TEST-TestSQLHandler.doTest-seed#[BF21BCB4179C3D3F]) [    ] o.e.j.s.AbstractConnector Started ServerConnector@2a3fa2{SSL,[ssl, http/1.1]}{127.0.0.1:41793}
   [junit4]   2> 2433665 INFO  (TEST-TestSQLHandler.doTest-seed#[BF21BCB4179C3D3F]) [    ] o.e.j.s.Server Started @2433703ms
   [junit4]   2> 2433665 INFO  (TEST-TestSQLHandler.doTest-seed#[BF21BCB4179C3D3F]) [    ] o.a.s.c.s.e.JettySolrRunner Jetty properties: {hostContext=/, solrconfig=solrconfig.xml, solr.data.dir=/home/jenkins/workspace/Lucene-Solr-7.x-Linux/solr/build/solr-core/test/J0/temp/solr.handler.TestSQLHandler_BF21BCB4179C3D3F-001/tempDir-001/jetty2, hostPort=41793, coreRootDirectory=/home/jenkins/workspace/Lucene-Solr-7.x-Linux/solr/build/solr-core/test/J0/../../../../../../../../../home/jenkins/workspace/Lucene-Solr-7.x-Linux/solr/build/solr-core/test/J0/temp/solr.handler.TestSQLHandler_BF21BCB4179C3D3F-001/shard-2-001/cores, replicaType=NRT}
   [junit4]   2> 2433665 ERROR (TEST-TestSQLHandler.doTest-seed#[BF21BCB4179C3D3F]) [    ] o.a.s.u.StartupLoggingUtils Missing Java Option solr.log.dir. Logging may be missing or incomplete.
   [junit4]   2> 2433665 INFO  (TEST-TestSQLHandler.doTest-seed#[BF21BCB4179C3D3F]) [    ] o.a.s.s.SolrDispatchFilter Using logger factory org.apache.logging.slf4j.Log4jLoggerFactory
   [junit4]   2> 2433665 INFO  (TEST-TestSQLHandler.doTest-seed#[BF21BCB4179C3D3F]) [    ] o.a.s.s.SolrDispatchFilter  ___      _       Welcome to Apache Solr™ version 7.5.0
   [junit4]   2> 2433665 INFO  (TEST-TestSQLHandler.doTest-seed#[BF21BCB4179C3D3F]) [    ] o.a.s.s.SolrDispatchFilter / __| ___| |_ _   Starting in cloud mode on port null
   [junit4]   2> 2433665 INFO  (TEST-TestSQLHandler.doTest-seed#[BF21BCB4179C3D3F]) [    ] o.a.s.s.SolrDispatchFilter \__ \/ _ \ | '_|  Install dir: null
   [junit4]   2> 2433665 INFO  (TEST-TestSQLHandler.doTest-seed#[BF21BCB4179C3D3F]) [    ] o.a.s.s.SolrDispatchFilter |___/\___/_|_|    Start time: 2018-09-04T09:09:28.179423Z
   [junit4]   2> 2433666 INFO  (zkConnectionManagerCallback-14979-thread-1) [    ] o.a.s.c.c.ConnectionManager zkClient has connected
   [junit4]   2> 2433667 INFO  (TEST-TestSQLHandler.doTest-seed#[BF21BCB4179C3D3F]) [    ] o.a.s.s.SolrDispatchFilter Loading solr.xml from SolrHome (not found in ZooKeeper)
   [junit4]   2> 2433667 INFO  (TEST-TestSQLHandler.doTest-seed#[BF21BCB4179C3D3F]) [    ] o.a.s.c.SolrXmlConfig Loading container configuration from /home/jenkins/workspace/Lucene-Solr-7.x-Linux/solr/build/solr-core/test/J0/temp/solr.handler.TestSQLHandler_BF21BCB4179C3D3F-001/shard-2-001/solr.xml
   [junit4]   2> 2433668 INFO  (TEST-TestSQLHandler.doTest-seed#[BF21BCB4179C3D3F]) [    ] o.a.s.c.SolrXmlConfig Configuration parameter autoReplicaFailoverWorkLoopDelay is ignored
   [junit4]   2> 2433668 INFO  (TEST-TestSQLHandler.doTest-seed#[BF21BCB4179C3D3F]) [    ] o.a.s.c.SolrXmlConfig Configuration parameter autoReplicaFailoverBadNodeExpiration is ignored
   [junit4]   2> 2433669 INFO  (TEST-TestSQLHandler.doTest-seed#[BF21BCB4179C3D3F]) [    ] o.a.s.c.SolrXmlConfig MBean server found: com.sun.jmx.mbeanserver.JmxMBeanServer@37b214bf, but no JMX reporters were configured - adding default JMX reporter.
   [junit4]   2> 2433774 INFO  (TEST-TestSQLHandler.doTest-seed#[BF21BCB4179C3D3F]) [    ] o.a.s.c.ZkContainer Zookeeper client=127.0.0.1:36113/solr
   [junit4]   2> 2433775 INFO  (zkConnectionManagerCallback-14983-thread-1) [    ] o.a.s.c.c.ConnectionManager zkClient has connected
   [junit4]   2> 2433776 INFO  (zkConnectionManagerCallback-14985-thread-1) [    ] o.a.s.c.c.ConnectionManager zkClient has connected
   [junit4]   2> 2433779 INFO  (TEST-TestSQLHandler.doTest-seed#[BF21BCB4179C3D3F]) [    ] o.a.s.c.c.ZkStateReader Updated live nodes from ZooKeeper... (0) -> (2)
   [junit4]   2> 2433780 INFO  (TEST-TestSQLHandler.doTest-seed#[BF21BCB4179C3D3F]) [    ] o.a.s.c.TransientSolrCoreCacheDefault Allocating transient cache for 4 transient cores
   [junit4]   2> 2433780 INFO  (TEST-TestSQLHandler.doTest-seed#[BF21BCB4179C3D3F]) [    ] o.a.s.c.ZkController Register node as live in ZooKeeper:/live_nodes/127.0.0.1:41793_
   [junit4]   2> 2433781 INFO  (zkCallback-14960-thread-1) [    ] o.a.s.c.c.ZkStateReader Updated live nodes from ZooKeeper... (2) -> (3)
   [junit4]   2> 2433781 INFO  (zkCallback-14968-thread-1) [    ] o.a.s.c.c.ZkStateReader Updated live nodes from ZooKeeper... (2) -> (3)
   [junit4]   2> 2433781 INFO  (zkCallback-14942-thread-2) [    ] o.a.s.c.c.ZkStateReader Updated live nodes from ZooKeeper... (2) -> (3)
   [junit4]   2> 2433781 INFO  (zkCallback-14949-thread-1) [    ] o.a.s.c.c.ZkStateReader Updated live nodes from ZooKeeper... (2) -> (3)
   [junit4]   2> 2433781 INFO  (zkCallback-14984-thread-1) [    ] o.a.s.c.c.ZkStateReader Updated live nodes from ZooKeeper... (2) -> (3)
   [junit4]   2> 2433781 INFO  (zkCallback-14975-thread-1) [    ] o.a.s.c.c.ZkStateReader Updated live nodes from ZooKeeper... (2) -> (3)
   [junit4]   2> 2433790 INFO  (zkConnectionManagerCallback-14992-thread-1) [    ] o.a.s.c.c.ConnectionManager zkClient has connected
   [junit4]   2> 2433792 INFO  (TEST-TestSQLHandler.doTest-seed#[BF21BCB4179C3D3F]) [    ] o.a.s.c.c.ZkStateReader Updated live nodes from ZooKeeper... (0) -> (3)
   [junit4]   2> 2433792 INFO  (TEST-TestSQLHandler.doTest-seed#[BF21BCB4179C3D3F]) [    ] o.a.s.c.s.i.ZkClientClusterStateProvider Cluster at 127.0.0.1:36113/solr ready
   [junit4]   2> 2433792 INFO  (TEST-TestSQLHandler.doTest-seed#[BF21BCB4179C3D3F]) [    ] o.a.s.h.a.MetricsHistoryHandler No .system collection, keeping metrics history in memory.
   [junit4]   2> 2433803 INFO  (TEST-TestSQLHandler.doTest-seed#[BF21BCB4179C3D3F]) [    ] o.a.s.m.r.SolrJmxReporter JMX monitoring for 'solr.node' (registry 'solr.node') enabled at server: com.sun.jmx.mbeanserver.JmxMBeanServer@37b214bf
   [junit4]   2> 2433810 INFO  (TEST-TestSQLHandler.doTest-seed#[BF21BCB4179C3D3F]) [    ] o.a.s.m.r.SolrJmxReporter JMX monitoring for 'solr.jvm' (registry 'solr.jvm') enabled at server: com.sun.jmx.mbeanserver.JmxMBeanServer@37b214bf
   [junit4]   2> 2433810 INFO  (TEST-TestSQLHandler.doTest-seed#[BF21BCB4179C3D3F]) [    ] o.a.s.m.r.SolrJmxReporter JMX monitoring for 'solr.jetty' (registry 'solr.jetty') enabled at server: com.sun.jmx.mbeanserver.JmxMBeanServer@37b214bf
   [junit4]   2> 2433811 INFO  (TEST-TestSQLHandler.doTest-seed#[BF21BCB4179C3D3F]) [    ] o.a.s.c.CorePropertiesLocator Found 0 core definitions underneath /home/jenkins/workspace/Lucene-Solr-7.x-Linux/solr/build/solr-core/test/J0/../../../../../../../../../home/jenkins/workspace/Lucene-Solr-7.x-Linux/solr/build/solr-core/test/J0/temp/solr.handler.TestSQLHandler_BF21BCB4179C3D3F-001/shard-2-001/cores
   [junit4]   2> 2433832 INFO  (qtp714597590-36201) [n:127.0.0.1:35199_    ] o.a.s.h.a.CollectionsHandler Invoked Collection Action :addreplica with params node=127.0.0.1:41793_&action=ADDREPLICA&collection=collection1&shard=shard1&type=NRT&wt=javabin&version=2 and sendToOCPQueue=true
   [junit4]   2> 2433833 INFO  (OverseerCollectionConfigSetProcessor-72165586957565957-127.0.0.1:35199_-n_0000000000) [n:127.0.0.1:35199_    ] o.a.s.c.OverseerTaskQueue Response ZK path: /overseer/collection-queue-work/qnr-0000000004 doesn't exist.  Requestor may have disconnected from ZooKeeper
   [junit4]   2> 2433833 INFO  (OverseerThreadFactory-9022-thread-4-processing-n:127.0.0.1:35199_) [n:127.0.0.1:35199_ c:collection1 s:shard1  ] o.a.s.c.a.c.AddReplicaCmd Node Identified 127.0.0.1:41793_ for creating new replica of shard shard1
   [junit4]   2> 2433844 INFO  (qtp739990108-36295) [n:127.0.0.1:41793_    x:collection1_shard1_replica_n43] o.a.s.h.a.CoreAdminOperation core create command qt=/admin/cores&collection.configName=conf1&name=collection1_shard1_replica_n43&action=CREATE&collection=collection1&shard=shard1&wt=javabin&version=2&replicaType=NRT
   [junit4]   2> 2433946 INFO  (zkCallback-14968-thread-1) [    ] o.a.s.c.c.ZkStateReader A cluster state change: [WatchedEvent state:SyncConnected type:NodeDataChanged path:/collections/collection1/state.json] for collection [collection1] has occurred - updating... (live nodes size: [3])
   [junit4]   2> 2434881 INFO  (qtp739990108-36295) [n:127.0.0.1:41793_ c:collection1 s:shard1  x:collection1_shard1_replica_n43] o.a.s.c.SolrConfig Using Lucene MatchVersion: 7.5.0
   [junit4]   2> 2434893 INFO  (qtp739990108-36295) [n:127.0.0.1:41793_ c:collection1 s:shard1  x:collection1_shard1_replica_n43] o.a.s.s.IndexSchema [collection1_shard1_replica_n43] Schema name=test
   [junit4]   2> 2434931 WARN  (qtp739990108-36295) [n:127.0.0.1:41793_ c:collection1 s:shard1  x:collection1_shard1_replica_n43] o.a.s.s.IndexSchema Field lowerfilt1and2 is not multivalued and destination for multiple copyFields (2)
   [junit4]   2> 2434931 WARN  (qtp739990108-36295) [n:127.0.0.1:41793_ c:collection1 s:shard1  x:collection1_shard1_replica_n43] o.a.s.s.IndexSchema Field text is not multivalued and destination for multiple copyFields (3)
   [junit4]   2> 2434931 INFO  (qtp739990108-36295) [n:127.0.0.1:41793_ c:collection1 s:shard1  x:collection1_shard1_replica_n43] o.a.s.s.IndexSchema Loaded schema test/1.6 with uniqueid field id
   [junit4]   2> 2434931 INFO  (qtp739990108-36295) [n:127.0.0.1:41793_ c:collection1 s:shard1  x:collection1_shard1_replica_n43] o.a.s.c.CoreContainer Creating SolrCore 'collection1_shard1_replica_n43' using configuration from collection collection1, trusted=true
   [junit4]   2> 2434932 INFO  (qtp739990108-36295) [n:127.0.0.1:41793_ c:collection1 s:shard1  x:collection1_shard1_replica_n43] o.a.s.m.r.SolrJmxReporter JMX monitoring for 'solr.core.collection1.shard1.replica_n43' (registry 'solr.core.collection1.shard1.replica_n43') enabled at server: com.sun.jmx.mbeanserver.JmxMBeanServer@37b214bf
   [junit4]   2> 2434932 INFO  (qtp739990108-36295) [n:127.0.0.1:41793_ c:collection1 s:shard1  x:collection1_shard1_replica_n43] o.a.s.c.SolrCore solr.RecoveryStrategy.Builder
   [junit4]   2> 2434932 INFO  (qtp739990108-36295) [n:127.0.0.1:41793_ c:collection1 s:shard1  x:collection1_shard1_replica_n43] o.a.s.c.SolrCore [[collection1_shard1_replica_n43] ] Opening new SolrCore at [/home/jenkins/workspace/Lucene-Solr-7.x-Linux/solr/build/solr-core/test/J0/temp/solr.handler.TestSQLHandler_BF21BCB4179C3D3F-001/shard-2-001/cores/collection1_shard1_replica_n43], dataDir=[/home/jenkins/workspace/Lucene-Solr-7.x-Linux/solr/build/solr-core/test/J0/../../../../../../../../../home/jenkins/workspace/Lucene-Solr-7.x-Linux/solr/build/solr-core/test/J0/temp/solr.handler.TestSQLHandler_BF21BCB4179C3D3F-001/shard-2-001/cores/collection1_shard1_replica_n43/data/]
   [junit4]   2> 2434979 INFO  (qtp739990108-36295) [n:127.0.0.1:41793_ c:collection1 s:shard1  x:collection1_shard1_replica_n43] o.a.s.u.UpdateHandler Using UpdateLog implementation: org.apache.solr.update.UpdateLog
   [junit4]   2> 2434979 INFO  (qtp739990108-36295) [n:127.0.0.1:41793_ c:collection1 s:shard1  x:collection1_shard1_replica_n43] o.a.s.u.UpdateLog Initializing UpdateLog: dataDir= defaultSyncLevel=FLUSH numRecordsToKeep=100 maxNumLogsToKeep=10 numVersionBuckets=65536
   [junit4]   2> 2434980 INFO  (qtp739990108-36295) [n:127.0.0.1:41793_ c:collection1 s:shard1  x:collection1_shard1_replica_n43] o.a.s.u.CommitTracker Hard AutoCommit: disabled
   [junit4]   2> 2434980 INFO  (qtp739990108-36295) [n:127.0.0.1:41793_ c:collection1 s:shard1  x:collection1_shard1_replica_n43] o.a.s.u.CommitTracker Soft AutoCommit: disabled
   [junit4]   2> 2434980 INFO  (qtp739990108-36295) [n:127.0.0.1:41793_ c:collection1 s:shard1  x:collection1_shard1_replica_n43] o.a.s.s.SolrIndexSearcher Opening [Searcher@46a156e7[collection1_shard1_replica_n43] main]
   [junit4]   2> 2434981 INFO  (qtp739990108-36295) [n:127.0.0.1:41793_ c:collection1 s:shard1  x:collection1_shard1_replica_n43] o.a.s.r.ManagedResourceStorage Configured ZooKeeperStorageIO with znodeBase: /configs/conf1
   [junit4]   2> 2434981 INFO  (qtp739990108-36295) [n:127.0.0.1:41793_ c:collection1 s:shard1  x:collection1_shard1_replica_n43] o.a.s.r.ManagedResourceStorage Loaded null at path _rest_managed.json using ZooKeeperStorageIO:path=/configs/conf1
   [junit4]   2> 2434982 INFO  (qtp739990108-36295) [n:127.0.0.1:41793_ c:collection1 s:shard1  x:collection1_shard1_replica_n43] o.a.s.u.UpdateLog Could not find max version in index or recent updates, using new clock 1610667439681437696
   [junit4]   2> 2434982 INFO  (searcherExecutor-9053-thread-1-processing-n:127.0.0.1:41793_ x:collection1_shard1_replica_n43 c:collection1 s:shard1) [n:127.0.0.1:41793_ c:collection1 s:shard1  x:collection1_shard1_replica_n43] o.a.s.c.SolrCore [collection1_shard1_replica_n43] Registered new searcher Searcher@46a156e7[collection1_shard1_replica_n43] main{ExitableDirectoryReader(UninvertingDirectoryReader())}
   [junit4]   2> 2434985 INFO  (qtp739990108-36295) [n:127.0.0.1:41793_ c:collection1 s:shard1  x:collection1_shard1_replica_n43] o.a.s.c.ZkShardTerms Successful update of terms at /collections/collection1/terms/shard1 to Terms{values={core_node44=0}, version=0}
   [junit4]   2> 2434986 INFO  (qtp739990108-36295) [n:127.0.0.1:41793_ c:collection1 s:shard1  x:collection1_shard1_replica_n43] o.a.s.c.ShardLeaderElectionContext Enough replicas found to continue.
   [junit4]   2> 2434986 INFO  (qtp739990108-36295) [n:127.0.0.1:41793_ c:collection1 s:shard1  x:collection1_shard1_replica_n43] o.a.s.c.ShardLeaderElectionContext I may be the new leader - try and sync
   [junit4]   2> 2434986 INFO  (qtp739990108-36295) [n:127.0.0.1:41793_ c:collection1 s:shard1  x:collection1_shard1_replica_n43] o.a.s.c.SyncStrategy Sync replicas to https://127.0.0.1:41793/collection1_shard1_replica_n43/
   [junit4]   2> 2434986 INFO  (qtp739990108-36295) [n:127.0.0.1:41793_ c:collection1 s:shard1  x:collection1_shard1_replica_n43] o.a.s.c.SyncStrategy Sync Success - now sync replicas to me
   [junit4]   2> 2434986 INFO  (qtp739990108-36295) [n:127.0.0.1:41793_ c:collection1 s:shard1  x:collection1_shard1_replica_n43] o.a.s.c.SyncStrategy https://127.0.0.1:41793/collection1_shard1_replica_n43/ has no replicas
   [junit4]   2> 2434986 INFO  (qtp739990108-36295) [n:127.0.0.1:41793_ c:collection1 s:shard1  x:collection1_shard1_replica_n43] o.a.s.c.ShardLeaderElectionContext Found all replicas participating in election, clear LIR
   [junit4]   2> 2434988 INFO  (qtp739990108-36295) [n:127.0.0.1:41793_ c:collection1 s:shard1  x:collection1_shard1_replica_n43] o.a.s.c.ShardLeaderElectionContext I am the new leader: https://127.0.0.1:41793/collection1_shard1_replica_n43/ shard1
   [junit4]   2> 2435093 INFO  (zkCallback-14968-thread-1) [    ] o.a.s.c.c.ZkStateReader A cluster state change: [WatchedEvent state:SyncConnected type:NodeDataChanged path:/collections/collection1/state.json] for collection [collection1] has occurred - updating... (live nodes size: [3])
   [junit4]   2> 2435142 INFO  (qtp739990108-36295) [n:127.0.0.1:41793_ c:collection1 s:shard1  x:collection1_shard1_replica_n43] o.a.s.c.ZkController I am the leader, no recovery necessary
   [junit4]   2> 2435153 INFO  (qtp739990108-36295) [n:127.0.0.1:41793_ c:collection1 s:shard1  x:collection1_shard1_replica_n43] o.a.s.s.HttpSolrCall [admin] webapp=null path=/admin/cores params={qt=/admin/cores&collection.configName=conf1&name=collection1_shard1_replica_n43&action=CREATE&collection=collection1&shard=shard1&wt=javabin&version=2&replicaType=NRT} status=0 QTime=1309
   [junit4]   2> 2435155 INFO  (qtp714597590-36201) [n:127.0.0.1:35199_ c:collection1   ] o.a.s.s.HttpSolrCall [admin] webapp=null path=/admin/collections params={node=127.0.0.1:41793_&action=ADDREPLICA&collection=collection1&shard=shard1&type=NRT&wt=javabin&version=2} status=0 QTime=1323
   [junit4]   2> 2435254 INFO  (zkCallback-14968-thread-1) [    ] o.a.s.c.c.ZkStateReader A cluster state change: [WatchedEvent state:SyncConnected type:NodeDataChanged path:/collections/collection1/state.json] for collection [collection1] has occurred - updating... (live nodes size: [3])
   [junit4]   2> 2435254 INFO  (zkCallback-14984-thread-1) [    ] o.a.s.c.c.ZkStateReader A cluster state change: [WatchedEvent state:SyncConnected type:NodeDataChanged path:/collections/collection1/state.json] for collection [collection1] has occurred - updating... (live nodes size: [3])
   [junit4]   2> 2435284 INFO  (TEST-TestSQLHandler.doTest-seed#[BF21BCB4179C3D3F]) [    ] o.a.s.c.AbstractFullDistribZkTestBase create jetty 3 in directory /home/jenkins/workspace/Lucene-Solr-7.x-Linux/solr/build/solr-core/test/J0/temp/solr.handler.TestSQLHandler_BF21BCB4179C3D3F-001/shard-3-001 of type NRT
   [junit4]   2> 2435285 INFO  (TEST-TestSQLHandler.doTest-seed#[BF21BCB4179C3D3F]) [    ] o.e.j.s.Server jetty-9.4.11.v20180605; built: 2018-06-05T18:24:03.829Z; git: d5fc0523cfa96bfebfbda19606cad384d772f04c; jvm 11+28
   [junit4]   2> 2435285 INFO  (TEST-TestSQLHandler.doTest-seed#[BF21BCB4179C3D3F]) [    ] o.e.j.s.session DefaultSessionIdManager workerName=node0
   [junit4]   2> 2435285 INFO  (TEST-TestSQLHandler.doTest-seed#[BF21BCB4179C3D3F]) [    ] o.e.j.s.session No SessionScavenger set, using defaults
   [junit4]   2> 2435285 INFO  (TEST-TestSQLHandler.doTest-seed#[BF21BCB4179C3D3F]) [    ] o.e.j.s.session node0 Scavenging every 600000ms
   [junit4]   2> 2435285 INFO  (TEST-TestSQLHandler.doTest-seed#[BF21BCB4179C3D3F]) [    ] o.e.j.s.h.ContextHandler Started o.e.j.s.ServletContextHandler@70d1efb{/,null,AVAILABLE}
   [junit4]   2> 2435286 INFO  (TEST-TestSQLHandler.doTest-seed#[BF21BCB4179C3D3F]) [    ] o.e.j.s.AbstractConnector Started ServerConnector@20e9070f{SSL,[ssl, http/1.1]}{127.0.0.1:46851}
   [junit4]   2> 2435286 INFO  (TEST-TestSQLHandler.doTest-seed#[BF21BCB4179C3D3F]) [    ] o.e.j.s.Server Started @2435324ms
   [junit4]   2> 2435286 INFO  (TEST-TestSQLHandler.doTest-seed#[BF21BCB4179C3D3F]) [    ] o.a.s.c.s.e.JettySolrRunner Jetty properties: {hostContext=/, solrconfig=solrconfig.xml, solr.data.dir=/home/jenkins/workspace/Lucene-Solr-7.x-Linux/solr/build/solr-core/test/J0/temp/solr.handler.TestSQLHandler_BF21BCB4179C3D3F-001/tempDir-001/jetty3, hostPort=46851, coreRootDirectory=/home/jenkins/workspace/Lucene-Solr-7.x-Linux/solr/build/solr-core/test/J0/temp/solr.handler.TestSQLHandler_BF21BCB4179C3D3F-001/shard-3-001/cores}
   [junit4]   2> 2435286 ERROR (TEST-TestSQLHandler.doTest-seed#[BF21BCB4179C3D3F]) [    ] o.a.s.u.StartupLoggingUtils Missing Java Option solr.log.dir. Logging may be missing or incomplete.
   [junit4]   2> 2435286 INFO  (TEST-TestSQLHandler.doTest-seed#[BF21BCB4179C3D3F]) [    ] o.a.s.s.SolrDispatchFilter Using logger factory org.apache.logging.slf4j.Log4jLoggerFactory
   [junit4]   2> 2435286 INFO  (TEST-TestSQLHandler.doTest-seed#[BF21BCB4179C3D3F]) [    ] o.a.s.s.SolrDispatchFilter  ___      _       Welcome to Apache Solr™ version 7.5.0
   [junit4]   2> 2435286 INFO  (TEST-TestSQLHandler.doTest-seed#[BF21BCB4179C3D3F]) [    ] o.a.s.s.SolrDispatchFilter / __| ___| |_ _   Starting in cloud mode on port null
   [junit4]   2> 2435286 INFO  (TEST-TestSQLHandler.doTest-seed#[BF21BCB4179C3D3F]) [    ] o.a.s.s.SolrDispatchFilter \__ \/ _ \ | '_|  Install dir: null
   [junit4]   2> 2435286 INFO  (TEST-TestSQLHandler.doTest-seed#[BF21BCB4179C3D3F]) [    ] o.a.s.s.SolrDispatchFilter |___/\___/_|_|    Start time: 2018-09-04T09:09:29.800608Z
   [junit4]   2> 2435287 INFO  (zkConnectionManagerCallback-14995-thread-1) [    ] o.a.s.c.c.ConnectionManager zkClient has connected
   [junit4]   2> 2435288 INFO  (TEST-TestSQLHandler.doTest-seed#[BF21BCB4179C3D3F]) [    ] o.a.s.s.SolrDispatchFilter Loading solr.xml from SolrHome (not found in ZooKeeper)
   [junit4]   2> 2435288 INFO  (TEST-TestSQLHandler.doTest-seed#[BF21BCB4179C3D3F]) [    ] o.a.s.c.SolrXmlConfig Loading container configuration from /home/jenkins/workspace/Lucene-Solr-7.x-Linux/solr/build/solr-core/test/J0/temp/solr.handler.TestSQLHandler_BF21BCB4179C3D3F-001/shard-3-001/solr.xml
   [junit4]   2> 2435290 INFO  (TEST-TestSQLHandler.doTest-seed#[BF21BCB4179C3D3F]) [    ] o.a.s.c.SolrXmlConfig Configuration parameter autoReplicaFailoverWorkLoopDelay is ignored
   [junit4]   2> 2435290 INFO  (TEST-TestSQLHandler.doTest-seed#[BF21BCB4179C3D3F]) [    ] o.a.s.c.SolrXmlConfig Configuration parameter autoReplicaFailoverBadNodeExpiration is ignored
   [junit4]   2> 2435290 INFO  (TEST-TestSQLHandler.doTest-seed#[BF21BCB4179C3D3F]) [    ] o.a.s.c.SolrXmlConfig MBean server found: com.sun.jmx.mbeanserver.JmxMBeanServer@37b214bf, but no JMX reporters were configured - adding default JMX reporter.
   [junit4]   2> 2435452 INFO  (TEST-TestSQLHandler.doTest-seed#[BF21BCB4179C3D3F]) [    ] o.a.s.c.ZkContainer Zookeeper client=127.0.0.1:36113/solr
   [junit4]   2> 2435454 INFO  (zkConnectionManagerCallback-14999-thread-1) [    ] o.a.s.c.c.ConnectionManager zkClient has connected
   [junit4]   2> 2435472 INFO  (zkConnectionManagerCallback-15001-thread-1) [    ] o.a.s.c.c.ConnectionManager zkClient has connected
   [junit4]   2> 2435480 INFO  (TEST-TestSQLHandler.doTest-seed#[BF21BCB4179C3D3F]) [    ] o.a.s.c.c.ZkStateReader Updated live nodes from ZooKeeper... (0) -> (3)
   [junit4]   2> 2435482 INFO  (TEST-TestSQLHandler.doTest-seed#[BF21BCB4179C3D3F]) [    ] o.a.s.c.TransientSolrCoreCacheDefault Allocating transient cache for 4 transient cores
   [junit4]   2> 2435483 INFO  (TEST-TestSQLHandler.doTest-seed#[BF21BCB4179C3D3F]) [    ] o.a.s.c.ZkController Register node as live in ZooKeeper:/live_nodes/127.0.0.1:46851_
   [junit4]   2> 2435483 INFO  (zkCallback-14968-thread-1) [    ] o.a.s.c.c.ZkStateReader Updated live nodes from ZooKeeper... (3) -> (4)
   [juni

[...truncated too long message...]

ing
   [junit4]   2> 44874 ERROR (TEST-TestSQLHandler.doTest-seed#[BF21BCB4179C3D3F]) [    ] o.a.z.s.ZooKeeperServer ZKShutdownHandler is not registered, so ZooKeeper server won't take any action on ERROR or SHUTDOWN server state changes
   [junit4]   2> 44875 INFO  (TEST-TestSQLHandler.doTest-seed#[BF21BCB4179C3D3F]) [    ] o.a.s.c.ZkTestServer connecting to 127.0.0.1:38053 38053
   [junit4]   2> 45750 INFO  (Thread-0) [    ] o.a.s.c.ZkTestServer connecting to 127.0.0.1:38053 38053
   [junit4]   2> 45751 WARN  (Thread-0) [    ] o.a.s.c.ZkTestServer Watch limit violations: 
   [junit4]   2> Maximum concurrent create/delete watches above limit:
   [junit4]   2> 
   [junit4]   2> 	469	/solr/aliases.json
   [junit4]   2> 	11	/solr/collections/collection1/terms/shard1
   [junit4]   2> 	11	/solr/collections/collection1/terms/shard2
   [junit4]   2> 	5	/solr/security.json
   [junit4]   2> 	5	/solr/configs/conf1
   [junit4]   2> 	3	/solr/collections/control_collection/terms/shard1
   [junit4]   2> 
   [junit4]   2> Maximum concurrent data watches above limit:
   [junit4]   2> 
   [junit4]   2> 	469	/solr/clusterstate.json
   [junit4]   2> 	469	/solr/clusterprops.json
   [junit4]   2> 	19	/solr/collections/collection1/state.json
   [junit4]   2> 	3	/solr/autoscaling.json
   [junit4]   2> 
   [junit4]   2> Maximum concurrent children watches above limit:
   [junit4]   2> 
   [junit4]   2> 	469	/solr/live_nodes
   [junit4]   2> 	469	/solr/collections
   [junit4]   2> 	3	/solr/overseer/queue
   [junit4]   2> 	3	/solr/autoscaling/events/.scheduled_maintenance
   [junit4]   2> 	3	/solr/autoscaling/events/.auto_add_replicas
   [junit4]   2> 	3	/solr/overseer/queue-work
   [junit4]   2> 	3	/solr/overseer/collection-queue-work
   [junit4]   2> 
   [junit4]   2> NOTE: reproduce with: ant test  -Dtestcase=TestSQLHandler -Dtests.method=doTest -Dtests.seed=BF21BCB4179C3D3F -Dtests.multiplier=3 -Dtests.slow=true -Dtests.badapples=true -Dtests.locale=ta -Dtests.timezone=Asia/Omsk -Dtests.asserts=true -Dtests.file.encoding=UTF-8
   [junit4] ERROR   42.8s J1 | TestSQLHandler.doTest <<<
   [junit4]    > Throwable #1: java.io.IOException: --> https://127.0.0.1:40401/collection1_shard2_replica_n41:Failed to execute sqlQuery 'select distinct str_s, field_i from collection1' against JDBC connection 'jdbc:calcitesolr:'.
   [junit4]    > Error while executing SQL "select distinct str_s, field_i from collection1": java.io.IOException: java.util.concurrent.ExecutionException: java.io.IOException: --> https://127.0.0.1:33205/collection1_shard1_replica_n43/:java.util.concurrent.ExecutionException: java.io.IOException: params fl=str_s,field_i&q=*:*&wt=javabin&qt=/export&partitionKeys=str_s,field_i&sort=str_s+asc,field_i+asc&distrib=false
   [junit4]    > 	at __randomizedtesting.SeedInfo.seed([BF21BCB4179C3D3F:186504107A272E86]:0)
   [junit4]    > 	at org.apache.solr.client.solrj.io.stream.SolrStream.read(SolrStream.java:215)
   [junit4]    > 	at org.apache.solr.handler.TestSQLHandler.getTuples(TestSQLHandler.java:2712)
   [junit4]    > 	at org.apache.solr.handler.TestSQLHandler.testParallelSelectDistinct(TestSQLHandler.java:1677)
   [junit4]    > 	at org.apache.solr.handler.TestSQLHandler.doTest(TestSQLHandler.java:100)
   [junit4]    > 	at java.base/jdk.internal.reflect.NativeMethodAccessorImpl.invoke0(Native Method)
   [junit4]    > 	at java.base/jdk.internal.reflect.NativeMethodAccessorImpl.invoke(NativeMethodAccessorImpl.java:62)
   [junit4]    > 	at java.base/jdk.internal.reflect.DelegatingMethodAccessorImpl.invoke(DelegatingMethodAccessorImpl.java:43)
   [junit4]    > 	at java.base/java.lang.reflect.Method.invoke(Method.java:566)
   [junit4]    > 	at org.apache.solr.BaseDistributedSearchTestCase$ShardsRepeatRule$ShardsFixedStatement.callStatement(BaseDistributedSearchTestCase.java:1008)
   [junit4]    > 	at org.apache.solr.BaseDistributedSearchTestCase$ShardsRepeatRule$ShardsStatement.evaluate(BaseDistributedSearchTestCase.java:983)
   [junit4]    > 	at java.base/java.lang.Thread.run(Thread.java:834)
   [junit4]   2> NOTE: leaving temporary files on disk at: /home/jenkins/workspace/Lucene-Solr-7.x-Linux/solr/build/solr-core/test/J1/temp/solr.handler.TestSQLHandler_BF21BCB4179C3D3F-001
   [junit4]   2> Sep 04, 2018 9:24:06 AM com.carrotsearch.randomizedtesting.ThreadLeakControl checkThreadLeaks
   [junit4]   2> WARNING: Will linger awaiting termination of 1 leaked thread(s).
   [junit4]   2> Sep 04, 2018 9:25:26 AM com.carrotsearch.randomizedtesting.ThreadLeakControl checkThreadLeaks
   [junit4]   2> SEVERE: 1 thread leaked from SUITE scope at org.apache.solr.handler.TestSQLHandler: 
   [junit4]   2>    1) Thread[id=2317, name=Connection evictor, state=TIMED_WAITING, group=TGRP-TestSQLHandler]
   [junit4]   2>         at java.base@11/java.lang.Thread.sleep(Native Method)
   [junit4]   2>         at app//org.apache.http.impl.client.IdleConnectionEvictor$1.run(IdleConnectionEvictor.java:66)
   [junit4]   2>         at java.base@11/java.lang.Thread.run(Thread.java:834)
   [junit4]   2> Sep 04, 2018 9:25:26 AM com.carrotsearch.randomizedtesting.ThreadLeakControl tryToInterruptAll
   [junit4]   2> INFO: Starting to interrupt leaked threads:
   [junit4]   2>    1) Thread[id=2317, name=Connection evictor, state=TIMED_WAITING, group=TGRP-TestSQLHandler]
   [junit4]   2> Sep 04, 2018 9:25:26 AM com.carrotsearch.randomizedtesting.ThreadLeakControl tryToInterruptAll
   [junit4]   2> INFO: All leaked threads terminated.
   [junit4]   2> NOTE: test params are: codec=Asserting(Lucene70): {rnd_b=PostingsFormat(name=Asserting), a_s=Lucene50(blocksize=128), multiDefault=BlockTreeOrds(blocksize=128), id=PostingsFormat(name=Asserting), text=Lucene50(blocksize=128), Text_t=FSTOrd50, Str_s=Lucene50(blocksize=128), str_s=Lucene50(blocksize=128)}, docValues:{item_i=DocValuesFormat(name=Lucene70), multiDefault=DocValuesFormat(name=Lucene70), Field_i=DocValuesFormat(name=Lucene70), intDefault=DocValuesFormat(name=Direct), a_f=DocValuesFormat(name=Lucene70), day_i=DocValuesFormat(name=Direct), a_i=DocValuesFormat(name=Lucene70), Str_s=DocValuesFormat(name=Asserting), field_i=DocValuesFormat(name=Lucene70), str_s=DocValuesFormat(name=Asserting), n_f1=DocValuesFormat(name=Lucene70), year_i=DocValuesFormat(name=Asserting), a_s=DocValuesFormat(name=Asserting), _version_=DocValuesFormat(name=Direct), field_l_p=DocValuesFormat(name=Lucene70), field_i_p=DocValuesFormat(name=Asserting), id=DocValuesFormat(name=Lucene70), field_f_p=DocValuesFormat(name=Direct), field_d_p=DocValuesFormat(name=Lucene70), month_i=DocValuesFormat(name=Direct)}, maxPointsInLeafNode=88, maxMBSortInHeap=5.447665846268286, sim=RandomSimilarity(queryNorm=true): {}, locale=ta, timezone=Asia/Omsk
   [junit4]   2> NOTE: Linux 4.15.0-32-generic amd64/Oracle Corporation 11 (64-bit)/cpus=8,threads=2,free=302412656,total=529006592
   [junit4]   2> NOTE: All tests run in this JVM: [TestSQLHandler]
   [junit4]   2> NOTE: reproduce with: ant test  -Dtestcase=TestSQLHandler -Dtests.seed=BF21BCB4179C3D3F -Dtests.multiplier=3 -Dtests.slow=true -Dtests.badapples=true -Dtests.locale=ta -Dtests.timezone=Asia/Omsk -Dtests.asserts=true -Dtests.file.encoding=UTF-8
   [junit4] ERROR   0.00s J1 | TestSQLHandler (suite) <<<
   [junit4]    > Throwable #1: com.carrotsearch.randomizedtesting.ThreadLeakError: 1 thread leaked from SUITE scope at org.apache.solr.handler.TestSQLHandler: 
   [junit4]    >    1) Thread[id=2317, name=Connection evictor, state=TIMED_WAITING, group=TGRP-TestSQLHandler]
   [junit4]    >         at java.base@11/java.lang.Thread.sleep(Native Method)
   [junit4]    >         at app//org.apache.http.impl.client.IdleConnectionEvictor$1.run(IdleConnectionEvictor.java:66)
   [junit4]    >         at java.base@11/java.lang.Thread.run(Thread.java:834)
   [junit4]    > 	at __randomizedtesting.SeedInfo.seed([BF21BCB4179C3D3F]:0)
   [junit4] Completed [10/10 (3!)] on J1 in 125.15s, 1 test, 2 errors <<< FAILURES!

[...truncated 15 lines...]
BUILD FAILED
/home/jenkins/workspace/Lucene-Solr-7.x-Linux/lucene/common-build.xml:1568: The following error occurred while executing this line:
/home/jenkins/workspace/Lucene-Solr-7.x-Linux/lucene/common-build.xml:1092: There were test failures: 10 suites, 100 tests, 4 suite-level errors, 2 errors, 79 ignored [seed: BF21BCB4179C3D3F]

Total time: 2 minutes 8 seconds

[repro] Setting last failure code to 256

[repro] Failures:
[repro]   1/5 failed: org.apache.solr.search.TestXmlQParser
[repro]   2/5 failed: org.apache.solr.handler.TestSQLHandler
[repro] Exiting with code 256
+ mv lucene/build lucene/build.repro
+ mv solr/build solr/build.repro
+ mv lucene/build.orig lucene/build
+ mv solr/build.orig solr/build
Archiving artifacts
Setting ANT_1_8_2_HOME=/var/lib/jenkins/tools/hudson.tasks.Ant_AntInstallation/ANT_1.8.2
[WARNINGS] Parsing warnings in console log with parser Java Compiler (javac)
Setting ANT_1_8_2_HOME=/var/lib/jenkins/tools/hudson.tasks.Ant_AntInstallation/ANT_1.8.2
Setting ANT_1_8_2_HOME=/var/lib/jenkins/tools/hudson.tasks.Ant_AntInstallation/ANT_1.8.2
<Git Blamer> Using GitBlamer to create author and commit information for all warnings.
<Git Blamer> GIT_COMMIT=9c0075be562b323942c52026bf89265e6ba2543e, workspace=/var/lib/jenkins/workspace/Lucene-Solr-7.x-Linux
[WARNINGS] Computing warning deltas based on reference build #2684
Recording test results
Setting ANT_1_8_2_HOME=/var/lib/jenkins/tools/hudson.tasks.Ant_AntInstallation/ANT_1.8.2
Build step 'Publish JUnit test result report' changed build result to UNSTABLE
Email was triggered for: Unstable (Test Failures)
Sending email for trigger: Unstable (Test Failures)
Setting ANT_1_8_2_HOME=/var/lib/jenkins/tools/hudson.tasks.Ant_AntInstallation/ANT_1.8.2
Setting ANT_1_8_2_HOME=/var/lib/jenkins/tools/hudson.tasks.Ant_AntInstallation/ANT_1.8.2
Setting ANT_1_8_2_HOME=/var/lib/jenkins/tools/hudson.tasks.Ant_AntInstallation/ANT_1.8.2
Setting ANT_1_8_2_HOME=/var/lib/jenkins/tools/hudson.tasks.Ant_AntInstallation/ANT_1.8.2

Mime
View raw message