lucene-dev mailing list archives

Site index · List index
Message view « Date » · « Thread »
Top « Date » · « Thread »
From Apache Jenkins Server <jenk...@builds.apache.org>
Subject [JENKINS] Lucene-Solr-Tests-master - Build # 2769 - Still Unstable
Date Tue, 04 Sep 2018 05:37:13 GMT
Build: https://builds.apache.org/job/Lucene-Solr-Tests-master/2769/

1 tests failed.
FAILED:  org.apache.solr.cloud.MoveReplicaHDFSTest.testFailedMove

Error Message:
No live SolrServers available to handle this request:[http://127.0.0.1:35761/solr/MoveReplicaHDFSTest_failed_coll_true, http://127.0.0.1:35359/solr/MoveReplicaHDFSTest_failed_coll_true]

Stack Trace:
org.apache.solr.client.solrj.SolrServerException: No live SolrServers available to handle this request:[http://127.0.0.1:35761/solr/MoveReplicaHDFSTest_failed_coll_true, http://127.0.0.1:35359/solr/MoveReplicaHDFSTest_failed_coll_true]
	at __randomizedtesting.SeedInfo.seed([252E3C66407D4211:8FE3EF94F7AE97C1]:0)
	at org.apache.solr.client.solrj.impl.LBHttpSolrClient.request(LBHttpSolrClient.java:462)
	at org.apache.solr.client.solrj.impl.CloudSolrClient.sendRequest(CloudSolrClient.java:1109)
	at org.apache.solr.client.solrj.impl.CloudSolrClient.requestWithRetryOnStaleState(CloudSolrClient.java:886)
	at org.apache.solr.client.solrj.impl.CloudSolrClient.requestWithRetryOnStaleState(CloudSolrClient.java:996)
	at org.apache.solr.client.solrj.impl.CloudSolrClient.request(CloudSolrClient.java:819)
	at org.apache.solr.client.solrj.SolrRequest.process(SolrRequest.java:194)
	at org.apache.solr.client.solrj.SolrClient.query(SolrClient.java:942)
	at org.apache.solr.cloud.MoveReplicaTest.testFailedMove(MoveReplicaTest.java:291)
	at sun.reflect.NativeMethodAccessorImpl.invoke0(Native Method)
	at sun.reflect.NativeMethodAccessorImpl.invoke(NativeMethodAccessorImpl.java:62)
	at sun.reflect.DelegatingMethodAccessorImpl.invoke(DelegatingMethodAccessorImpl.java:43)
	at java.lang.reflect.Method.invoke(Method.java:498)
	at com.carrotsearch.randomizedtesting.RandomizedRunner.invoke(RandomizedRunner.java:1737)
	at com.carrotsearch.randomizedtesting.RandomizedRunner$8.evaluate(RandomizedRunner.java:934)
	at com.carrotsearch.randomizedtesting.RandomizedRunner$9.evaluate(RandomizedRunner.java:970)
	at com.carrotsearch.randomizedtesting.RandomizedRunner$10.evaluate(RandomizedRunner.java:984)
	at com.carrotsearch.randomizedtesting.rules.SystemPropertiesRestoreRule$1.evaluate(SystemPropertiesRestoreRule.java:57)
	at org.apache.lucene.util.TestRuleSetupTeardownChained$1.evaluate(TestRuleSetupTeardownChained.java:49)
	at org.apache.lucene.util.AbstractBeforeAfterRule$1.evaluate(AbstractBeforeAfterRule.java:45)
	at org.apache.lucene.util.TestRuleThreadAndTestName$1.evaluate(TestRuleThreadAndTestName.java:48)
	at org.apache.lucene.util.TestRuleIgnoreAfterMaxFailures$1.evaluate(TestRuleIgnoreAfterMaxFailures.java:64)
	at org.apache.lucene.util.TestRuleMarkFailure$1.evaluate(TestRuleMarkFailure.java:47)
	at com.carrotsearch.randomizedtesting.rules.StatementAdapter.evaluate(StatementAdapter.java:36)
	at com.carrotsearch.randomizedtesting.ThreadLeakControl$StatementRunner.run(ThreadLeakControl.java:368)
	at com.carrotsearch.randomizedtesting.ThreadLeakControl.forkTimeoutingTask(ThreadLeakControl.java:817)
	at com.carrotsearch.randomizedtesting.ThreadLeakControl$3.evaluate(ThreadLeakControl.java:468)
	at com.carrotsearch.randomizedtesting.RandomizedRunner.runSingleTest(RandomizedRunner.java:943)
	at com.carrotsearch.randomizedtesting.RandomizedRunner$5.evaluate(RandomizedRunner.java:829)
	at com.carrotsearch.randomizedtesting.RandomizedRunner$6.evaluate(RandomizedRunner.java:879)
	at com.carrotsearch.randomizedtesting.RandomizedRunner$7.evaluate(RandomizedRunner.java:890)
	at com.carrotsearch.randomizedtesting.rules.StatementAdapter.evaluate(StatementAdapter.java:36)
	at com.carrotsearch.randomizedtesting.rules.SystemPropertiesRestoreRule$1.evaluate(SystemPropertiesRestoreRule.java:57)
	at org.apache.lucene.util.AbstractBeforeAfterRule$1.evaluate(AbstractBeforeAfterRule.java:45)
	at com.carrotsearch.randomizedtesting.rules.StatementAdapter.evaluate(StatementAdapter.java:36)
	at org.apache.lucene.util.TestRuleStoreClassName$1.evaluate(TestRuleStoreClassName.java:41)
	at com.carrotsearch.randomizedtesting.rules.NoShadowingOrOverridesOnMethodsRule$1.evaluate(NoShadowingOrOverridesOnMethodsRule.java:40)
	at com.carrotsearch.randomizedtesting.rules.NoShadowingOrOverridesOnMethodsRule$1.evaluate(NoShadowingOrOverridesOnMethodsRule.java:40)
	at com.carrotsearch.randomizedtesting.rules.StatementAdapter.evaluate(StatementAdapter.java:36)
	at com.carrotsearch.randomizedtesting.rules.StatementAdapter.evaluate(StatementAdapter.java:36)
	at com.carrotsearch.randomizedtesting.rules.StatementAdapter.evaluate(StatementAdapter.java:36)
	at org.apache.lucene.util.TestRuleAssertionsRequired$1.evaluate(TestRuleAssertionsRequired.java:53)
	at org.apache.lucene.util.TestRuleMarkFailure$1.evaluate(TestRuleMarkFailure.java:47)
	at org.apache.lucene.util.TestRuleIgnoreAfterMaxFailures$1.evaluate(TestRuleIgnoreAfterMaxFailures.java:64)
	at org.apache.lucene.util.TestRuleIgnoreTestSuites$1.evaluate(TestRuleIgnoreTestSuites.java:54)
	at com.carrotsearch.randomizedtesting.rules.StatementAdapter.evaluate(StatementAdapter.java:36)
	at com.carrotsearch.randomizedtesting.ThreadLeakControl$StatementRunner.run(ThreadLeakControl.java:368)
	at java.lang.Thread.run(Thread.java:748)
Caused by: org.apache.solr.client.solrj.impl.HttpSolrClient$RemoteSolrException: Error from server at http://127.0.0.1:35359/solr/MoveReplicaHDFSTest_failed_coll_true: no servers hosting shard: shard1
	at org.apache.solr.client.solrj.impl.HttpSolrClient.executeMethod(HttpSolrClient.java:643)
	at org.apache.solr.client.solrj.impl.HttpSolrClient.request(HttpSolrClient.java:255)
	at org.apache.solr.client.solrj.impl.HttpSolrClient.request(HttpSolrClient.java:244)
	at org.apache.solr.client.solrj.impl.LBHttpSolrClient.doRequest(LBHttpSolrClient.java:483)
	at org.apache.solr.client.solrj.impl.LBHttpSolrClient.request(LBHttpSolrClient.java:436)
	... 46 more




Build Log:
[...truncated 13705 lines...]
   [junit4] Suite: org.apache.solr.cloud.MoveReplicaHDFSTest
   [junit4]   2> Creating dataDir: /x1/jenkins/jenkins-slave/workspace/Lucene-Solr-Tests-master/solr/build/solr-core/test/J0/temp/solr.cloud.MoveReplicaHDFSTest_252E3C66407D4211-001/init-core-data-001
   [junit4]   2> 1380127 WARN  (SUITE-MoveReplicaHDFSTest-seed#[252E3C66407D4211]-worker) [    ] o.a.s.SolrTestCaseJ4 startTrackingSearchers: numOpens=6 numCloses=6
   [junit4]   2> 1380127 INFO  (SUITE-MoveReplicaHDFSTest-seed#[252E3C66407D4211]-worker) [    ] o.a.s.SolrTestCaseJ4 Using PointFields (NUMERIC_POINTS_SYSPROP=true) w/NUMERIC_DOCVALUES_SYSPROP=false
   [junit4]   2> 1380129 INFO  (SUITE-MoveReplicaHDFSTest-seed#[252E3C66407D4211]-worker) [    ] o.a.s.SolrTestCaseJ4 Randomized ssl (false) and clientAuth (true) via: @org.apache.solr.util.RandomizeSSL(reason=, ssl=NaN, value=NaN, clientAuth=NaN)
   [junit4]   2> 1380129 INFO  (SUITE-MoveReplicaHDFSTest-seed#[252E3C66407D4211]-worker) [    ] o.a.s.SolrTestCaseJ4 SecureRandom sanity checks: test.solr.allowed.securerandom=null & java.security.egd=file:/dev/./urandom
   [junit4]   2> 1380129 INFO  (SUITE-MoveReplicaHDFSTest-seed#[252E3C66407D4211]-worker) [    ] o.a.s.c.MiniSolrCloudCluster Starting cluster of 4 servers in /x1/jenkins/jenkins-slave/workspace/Lucene-Solr-Tests-master/solr/build/solr-core/test/J0/temp/solr.cloud.MoveReplicaHDFSTest_252E3C66407D4211-001/tempDir-001
   [junit4]   2> 1380129 INFO  (SUITE-MoveReplicaHDFSTest-seed#[252E3C66407D4211]-worker) [    ] o.a.s.c.ZkTestServer STARTING ZK TEST SERVER
   [junit4]   2> 1380129 INFO  (Thread-2955) [    ] o.a.s.c.ZkTestServer client port:0.0.0.0/0.0.0.0:0
   [junit4]   2> 1380129 INFO  (Thread-2955) [    ] o.a.s.c.ZkTestServer Starting server
   [junit4]   2> 1380138 ERROR (Thread-2955) [    ] o.a.z.s.ZooKeeperServer ZKShutdownHandler is not registered, so ZooKeeper server won't take any action on ERROR or SHUTDOWN server state changes
   [junit4]   2> 1380229 INFO  (SUITE-MoveReplicaHDFSTest-seed#[252E3C66407D4211]-worker) [    ] o.a.s.c.ZkTestServer start zk server on port:37908
   [junit4]   2> 1380234 INFO  (zkConnectionManagerCallback-4243-thread-1) [    ] o.a.s.c.c.ConnectionManager zkClient has connected
   [junit4]   2> 1380238 INFO  (jetty-launcher-4240-thread-1) [    ] o.e.j.s.Server jetty-9.4.11.v20180605; built: 2018-06-05T18:24:03.829Z; git: d5fc0523cfa96bfebfbda19606cad384d772f04c; jvm 1.8.0_172-b11
   [junit4]   2> 1380239 INFO  (jetty-launcher-4240-thread-3) [    ] o.e.j.s.Server jetty-9.4.11.v20180605; built: 2018-06-05T18:24:03.829Z; git: d5fc0523cfa96bfebfbda19606cad384d772f04c; jvm 1.8.0_172-b11
   [junit4]   2> 1380239 INFO  (jetty-launcher-4240-thread-2) [    ] o.e.j.s.Server jetty-9.4.11.v20180605; built: 2018-06-05T18:24:03.829Z; git: d5fc0523cfa96bfebfbda19606cad384d772f04c; jvm 1.8.0_172-b11
   [junit4]   2> 1380239 INFO  (jetty-launcher-4240-thread-4) [    ] o.e.j.s.Server jetty-9.4.11.v20180605; built: 2018-06-05T18:24:03.829Z; git: d5fc0523cfa96bfebfbda19606cad384d772f04c; jvm 1.8.0_172-b11
   [junit4]   2> 1380241 INFO  (jetty-launcher-4240-thread-4) [    ] o.e.j.s.session DefaultSessionIdManager workerName=node0
   [junit4]   2> 1380241 INFO  (jetty-launcher-4240-thread-4) [    ] o.e.j.s.session No SessionScavenger set, using defaults
   [junit4]   2> 1380241 INFO  (jetty-launcher-4240-thread-4) [    ] o.e.j.s.session node0 Scavenging every 600000ms
   [junit4]   2> 1380241 INFO  (jetty-launcher-4240-thread-1) [    ] o.e.j.s.session DefaultSessionIdManager workerName=node0
   [junit4]   2> 1380241 INFO  (jetty-launcher-4240-thread-1) [    ] o.e.j.s.session No SessionScavenger set, using defaults
   [junit4]   2> 1380241 INFO  (jetty-launcher-4240-thread-1) [    ] o.e.j.s.session node0 Scavenging every 600000ms
   [junit4]   2> 1380241 INFO  (jetty-launcher-4240-thread-3) [    ] o.e.j.s.session DefaultSessionIdManager workerName=node0
   [junit4]   2> 1380241 INFO  (jetty-launcher-4240-thread-3) [    ] o.e.j.s.session No SessionScavenger set, using defaults
   [junit4]   2> 1380241 INFO  (jetty-launcher-4240-thread-3) [    ] o.e.j.s.session node0 Scavenging every 600000ms
   [junit4]   2> 1380241 INFO  (jetty-launcher-4240-thread-1) [    ] o.e.j.s.h.ContextHandler Started o.e.j.s.ServletContextHandler@591a1ad2{/solr,null,AVAILABLE}
   [junit4]   2> 1380242 INFO  (jetty-launcher-4240-thread-1) [    ] o.e.j.s.AbstractConnector Started ServerConnector@484d7420{HTTP/1.1,[http/1.1]}{127.0.0.1:38657}
   [junit4]   2> 1380242 INFO  (jetty-launcher-4240-thread-1) [    ] o.e.j.s.Server Started @1380287ms
   [junit4]   2> 1380242 INFO  (jetty-launcher-4240-thread-1) [    ] o.a.s.c.s.e.JettySolrRunner Jetty properties: {hostContext=/solr, hostPort=38657}
   [junit4]   2> 1380242 ERROR (jetty-launcher-4240-thread-1) [    ] o.a.s.u.StartupLoggingUtils Missing Java Option solr.log.dir. Logging may be missing or incomplete.
   [junit4]   2> 1380242 INFO  (jetty-launcher-4240-thread-1) [    ] o.a.s.s.SolrDispatchFilter Using logger factory org.apache.logging.slf4j.Log4jLoggerFactory
   [junit4]   2> 1380242 INFO  (jetty-launcher-4240-thread-1) [    ] o.a.s.s.SolrDispatchFilter  ___      _       Welcome to Apache Solr™ version 8.0.0
   [junit4]   2> 1380242 INFO  (jetty-launcher-4240-thread-1) [    ] o.a.s.s.SolrDispatchFilter / __| ___| |_ _   Starting in cloud mode on port null
   [junit4]   2> 1380242 INFO  (jetty-launcher-4240-thread-1) [    ] o.a.s.s.SolrDispatchFilter \__ \/ _ \ | '_|  Install dir: null
   [junit4]   2> 1380242 INFO  (jetty-launcher-4240-thread-1) [    ] o.a.s.s.SolrDispatchFilter |___/\___/_|_|    Start time: 2018-09-04T04:55:27.238Z
   [junit4]   2> 1380249 INFO  (jetty-launcher-4240-thread-4) [    ] o.e.j.s.h.ContextHandler Started o.e.j.s.ServletContextHandler@4e198234{/solr,null,AVAILABLE}
   [junit4]   2> 1380249 INFO  (jetty-launcher-4240-thread-2) [    ] o.e.j.s.session DefaultSessionIdManager workerName=node0
   [junit4]   2> 1380249 INFO  (jetty-launcher-4240-thread-2) [    ] o.e.j.s.session No SessionScavenger set, using defaults
   [junit4]   2> 1380249 INFO  (jetty-launcher-4240-thread-2) [    ] o.e.j.s.session node0 Scavenging every 600000ms
   [junit4]   2> 1380249 INFO  (jetty-launcher-4240-thread-3) [    ] o.e.j.s.h.ContextHandler Started o.e.j.s.ServletContextHandler@3d7efd77{/solr,null,AVAILABLE}
   [junit4]   2> 1380249 INFO  (zkConnectionManagerCallback-4245-thread-1) [    ] o.a.s.c.c.ConnectionManager zkClient has connected
   [junit4]   2> 1380250 INFO  (jetty-launcher-4240-thread-2) [    ] o.e.j.s.h.ContextHandler Started o.e.j.s.ServletContextHandler@5055af88{/solr,null,AVAILABLE}
   [junit4]   2> 1380250 INFO  (jetty-launcher-4240-thread-1) [    ] o.a.s.s.SolrDispatchFilter solr.xml found in ZooKeeper. Loading...
   [junit4]   2> 1380250 INFO  (jetty-launcher-4240-thread-2) [    ] o.e.j.s.AbstractConnector Started ServerConnector@1d22f621{HTTP/1.1,[http/1.1]}{127.0.0.1:33683}
   [junit4]   2> 1380250 INFO  (jetty-launcher-4240-thread-2) [    ] o.e.j.s.Server Started @1380295ms
   [junit4]   2> 1380250 INFO  (jetty-launcher-4240-thread-2) [    ] o.a.s.c.s.e.JettySolrRunner Jetty properties: {hostContext=/solr, hostPort=33683}
   [junit4]   2> 1380250 ERROR (jetty-launcher-4240-thread-2) [    ] o.a.s.u.StartupLoggingUtils Missing Java Option solr.log.dir. Logging may be missing or incomplete.
   [junit4]   2> 1380250 INFO  (jetty-launcher-4240-thread-2) [    ] o.a.s.s.SolrDispatchFilter Using logger factory org.apache.logging.slf4j.Log4jLoggerFactory
   [junit4]   2> 1380250 INFO  (jetty-launcher-4240-thread-2) [    ] o.a.s.s.SolrDispatchFilter  ___      _       Welcome to Apache Solr™ version 8.0.0
   [junit4]   2> 1380250 INFO  (jetty-launcher-4240-thread-2) [    ] o.a.s.s.SolrDispatchFilter / __| ___| |_ _   Starting in cloud mode on port null
   [junit4]   2> 1380250 INFO  (jetty-launcher-4240-thread-2) [    ] o.a.s.s.SolrDispatchFilter \__ \/ _ \ | '_|  Install dir: null
   [junit4]   2> 1380250 INFO  (jetty-launcher-4240-thread-2) [    ] o.a.s.s.SolrDispatchFilter |___/\___/_|_|    Start time: 2018-09-04T04:55:27.246Z
   [junit4]   2> 1380251 INFO  (jetty-launcher-4240-thread-4) [    ] o.e.j.s.AbstractConnector Started ServerConnector@15f38c0b{HTTP/1.1,[http/1.1]}{127.0.0.1:35761}
   [junit4]   2> 1380251 INFO  (jetty-launcher-4240-thread-4) [    ] o.e.j.s.Server Started @1380296ms
   [junit4]   2> 1380251 INFO  (jetty-launcher-4240-thread-4) [    ] o.a.s.c.s.e.JettySolrRunner Jetty properties: {hostContext=/solr, hostPort=35761}
   [junit4]   2> 1380251 ERROR (jetty-launcher-4240-thread-4) [    ] o.a.s.u.StartupLoggingUtils Missing Java Option solr.log.dir. Logging may be missing or incomplete.
   [junit4]   2> 1380251 INFO  (jetty-launcher-4240-thread-4) [    ] o.a.s.s.SolrDispatchFilter Using logger factory org.apache.logging.slf4j.Log4jLoggerFactory
   [junit4]   2> 1380251 INFO  (jetty-launcher-4240-thread-4) [    ] o.a.s.s.SolrDispatchFilter  ___      _       Welcome to Apache Solr™ version 8.0.0
   [junit4]   2> 1380251 INFO  (jetty-launcher-4240-thread-4) [    ] o.a.s.s.SolrDispatchFilter / __| ___| |_ _   Starting in cloud mode on port null
   [junit4]   2> 1380251 INFO  (jetty-launcher-4240-thread-4) [    ] o.a.s.s.SolrDispatchFilter \__ \/ _ \ | '_|  Install dir: null
   [junit4]   2> 1380251 INFO  (jetty-launcher-4240-thread-4) [    ] o.a.s.s.SolrDispatchFilter |___/\___/_|_|    Start time: 2018-09-04T04:55:27.247Z
   [junit4]   2> 1380251 INFO  (jetty-launcher-4240-thread-3) [    ] o.e.j.s.AbstractConnector Started ServerConnector@7612cce9{HTTP/1.1,[http/1.1]}{127.0.0.1:45489}
   [junit4]   2> 1380251 INFO  (jetty-launcher-4240-thread-3) [    ] o.e.j.s.Server Started @1380297ms
   [junit4]   2> 1380251 INFO  (jetty-launcher-4240-thread-3) [    ] o.a.s.c.s.e.JettySolrRunner Jetty properties: {hostContext=/solr, hostPort=45489}
   [junit4]   2> 1380251 ERROR (jetty-launcher-4240-thread-3) [    ] o.a.s.u.StartupLoggingUtils Missing Java Option solr.log.dir. Logging may be missing or incomplete.
   [junit4]   2> 1380252 INFO  (jetty-launcher-4240-thread-3) [    ] o.a.s.s.SolrDispatchFilter Using logger factory org.apache.logging.slf4j.Log4jLoggerFactory
   [junit4]   2> 1380252 INFO  (jetty-launcher-4240-thread-3) [    ] o.a.s.s.SolrDispatchFilter  ___      _       Welcome to Apache Solr™ version 8.0.0
   [junit4]   2> 1380252 INFO  (jetty-launcher-4240-thread-3) [    ] o.a.s.s.SolrDispatchFilter / __| ___| |_ _   Starting in cloud mode on port null
   [junit4]   2> 1380252 INFO  (jetty-launcher-4240-thread-3) [    ] o.a.s.s.SolrDispatchFilter \__ \/ _ \ | '_|  Install dir: null
   [junit4]   2> 1380252 INFO  (jetty-launcher-4240-thread-3) [    ] o.a.s.s.SolrDispatchFilter |___/\___/_|_|    Start time: 2018-09-04T04:55:27.248Z
   [junit4]   2> 1380255 INFO  (zkConnectionManagerCallback-4247-thread-1) [    ] o.a.s.c.c.ConnectionManager zkClient has connected
   [junit4]   2> 1380255 INFO  (zkConnectionManagerCallback-4249-thread-1) [    ] o.a.s.c.c.ConnectionManager zkClient has connected
   [junit4]   2> 1380255 INFO  (jetty-launcher-4240-thread-2) [    ] o.a.s.s.SolrDispatchFilter solr.xml found in ZooKeeper. Loading...
   [junit4]   2> 1380255 INFO  (jetty-launcher-4240-thread-4) [    ] o.a.s.s.SolrDispatchFilter solr.xml found in ZooKeeper. Loading...
   [junit4]   2> 1380264 WARN  (NIOServerCxn.Factory:0.0.0.0/0.0.0.0:0) [    ] o.a.z.s.NIOServerCnxn Unable to read additional data from client sessionid 0x100c639edcf0002, likely client has closed socket
   [junit4]   2> 1380274 INFO  (zkConnectionManagerCallback-4251-thread-1) [    ] o.a.s.c.c.ConnectionManager zkClient has connected
   [junit4]   2> 1380274 INFO  (jetty-launcher-4240-thread-3) [    ] o.a.s.s.SolrDispatchFilter solr.xml found in ZooKeeper. Loading...
   [junit4]   2> 1380341 INFO  (jetty-launcher-4240-thread-1) [    ] o.a.s.c.ZkContainer Zookeeper client=127.0.0.1:37908/solr
   [junit4]   2> 1380348 INFO  (zkConnectionManagerCallback-4255-thread-1) [    ] o.a.s.c.c.ConnectionManager zkClient has connected
   [junit4]   2> 1380349 DEBUG (jetty-launcher-4240-thread-1) [n:127.0.0.1:38657_solr    ] o.a.s.c.ZkController Added new OnReconnect listener org.apache.solr.cloud.ZkController$$Lambda$132/757785742@19e660b0
   [junit4]   2> 1380374 INFO  (zkConnectionManagerCallback-4257-thread-1) [    ] o.a.s.c.c.ConnectionManager zkClient has connected
   [junit4]   2> 1380400 INFO  (jetty-launcher-4240-thread-2) [    ] o.a.s.c.ZkContainer Zookeeper client=127.0.0.1:37908/solr
   [junit4]   2> 1380401 INFO  (zkConnectionManagerCallback-4264-thread-1) [    ] o.a.s.c.c.ConnectionManager zkClient has connected
   [junit4]   2> 1380403 DEBUG (jetty-launcher-4240-thread-2) [n:127.0.0.1:33683_solr    ] o.a.s.c.ZkController Added new OnReconnect listener org.apache.solr.cloud.ZkController$$Lambda$132/757785742@42e60f39
   [junit4]   2> 1380403 INFO  (jetty-launcher-4240-thread-3) [    ] o.a.s.c.ZkContainer Zookeeper client=127.0.0.1:37908/solr
   [junit4]   2> 1380404 INFO  (zkConnectionManagerCallback-4267-thread-1) [    ] o.a.s.c.c.ConnectionManager zkClient has connected
   [junit4]   2> 1380409 DEBUG (SyncThread:0) [    ] o.a.s.c.ZkTestServer Watch added: create/delete: /solr/clusterprops.json
   [junit4]   2> 1380410 DEBUG (SyncThread:0) [    ] o.a.s.c.ZkTestServer Watch added: children: /solr/live_nodes
   [junit4]   2> 1380410 DEBUG (SyncThread:0) [    ] o.a.s.c.ZkTestServer Watch added: data: /solr/clusterstate.json
   [junit4]   2> 1380410 DEBUG (SyncThread:0) [    ] o.a.s.c.ZkTestServer Watch added: children: /solr/collections
   [junit4]   2> 1380410 DEBUG (SyncThread:0) [    ] o.a.s.c.ZkTestServer Watch added: create/delete: /solr/aliases.json
   [junit4]   2> 1380411 DEBUG (SyncThread:0) [    ] o.a.s.c.ZkTestServer Watch added: create/delete: /solr/security.json
   [junit4]   2> 1380413 DEBUG (jetty-launcher-4240-thread-2) [n:127.0.0.1:33683_solr    ] o.a.s.c.LeaderElector Joined leadership election with path: /overseer_elect/election/72275546143129608-127.0.0.1:33683_solr-n_0000000000
   [junit4]   2> 1380413 INFO  (jetty-launcher-4240-thread-2) [n:127.0.0.1:33683_solr    ] o.a.s.c.OverseerElectionContext I am going to be the leader 127.0.0.1:33683_solr
   [junit4]   2> 1380414 INFO  (jetty-launcher-4240-thread-2) [n:127.0.0.1:33683_solr    ] o.a.s.c.Overseer Overseer (id=72275546143129608-127.0.0.1:33683_solr-n_0000000000) starting
   [junit4]   2> 1380418 INFO  (zkConnectionManagerCallback-4269-thread-1) [    ] o.a.s.c.c.ConnectionManager zkClient has connected
   [junit4]   2> 1380420 DEBUG (jetty-launcher-4240-thread-3) [n:127.0.0.1:45489_solr    ] o.a.s.c.ZkController Added new OnReconnect listener org.apache.solr.cloud.ZkController$$Lambda$132/757785742@1407b063
   [junit4]   2> 1380425 INFO  (zkConnectionManagerCallback-4278-thread-1) [    ] o.a.s.c.c.ConnectionManager zkClient has connected
   [junit4]   2> 1380426 INFO  (zkConnectionManagerCallback-4274-thread-1) [    ] o.a.s.c.c.ConnectionManager zkClient has connected
   [junit4]   2> 1380426 DEBUG (SyncThread:0) [    ] o.a.s.c.ZkTestServer Watch added: create/delete: /solr/clusterprops.json
   [junit4]   2> 1380426 DEBUG (SyncThread:0) [    ] o.a.s.c.ZkTestServer Watch added: children: /solr/live_nodes
   [junit4]   2> 1380426 DEBUG (SyncThread:0) [    ] o.a.s.c.ZkTestServer Watch added: data: /solr/clusterstate.json
   [junit4]   2> 1380427 DEBUG (SyncThread:0) [    ] o.a.s.c.ZkTestServer Watch added: children: /solr/collections
   [junit4]   2> 1380427 DEBUG (SyncThread:0) [    ] o.a.s.c.ZkTestServer Watch added: create/delete: /solr/aliases.json
   [junit4]   2> 1380427 INFO  (jetty-launcher-4240-thread-2) [n:127.0.0.1:33683_solr    ] o.a.s.c.s.i.ZkClientClusterStateProvider Cluster at 127.0.0.1:37908/solr ready
   [junit4]   2> 1380428 INFO  (OverseerStateUpdate-72275546143129608-127.0.0.1:33683_solr-n_0000000000) [n:127.0.0.1:33683_solr    ] o.a.s.c.Overseer Starting to work on the main queue : 127.0.0.1:33683_solr
   [junit4]   2> 1380429 DEBUG (OverseerCollectionConfigSetProcessor-72275546143129608-127.0.0.1:33683_solr-n_0000000000) [n:127.0.0.1:33683_solr    ] o.a.s.c.OverseerTaskProcessor Process current queue of overseer operations
   [junit4]   2> 1380429 INFO  (jetty-launcher-4240-thread-2) [n:127.0.0.1:33683_solr    ] o.a.s.c.ZkController Register node as live in ZooKeeper:/live_nodes/127.0.0.1:33683_solr
   [junit4]   2> 1380430 DEBUG (SyncThread:0) [    ] o.a.s.c.ZkTestServer Watch fired: children: /solr/live_nodes
   [junit4]   2> 1380430 DEBUG (SyncThread:0) [    ] o.a.s.c.ZkTestServer Watch fired: children: /solr/live_nodes
   [junit4]   2> 1380430 DEBUG (SyncThread:0) [    ] o.a.s.c.ZkTestServer Watch added: children: /solr/overseer/queue-work
   [junit4]   2> 1380436 DEBUG (SyncThread:0) [    ] o.a.s.c.ZkTestServer Watch added: children: /solr/overseer/queue
   [junit4]   2> 1380436 DEBUG (SyncThread:0) [    ] o.a.s.c.ZkTestServer Watch added: children: /solr/live_nodes
   [junit4]   2> 1380436 DEBUG (OverseerCollectionConfigSetProcessor-72275546143129608-127.0.0.1:33683_solr-n_0000000000) [n:127.0.0.1:33683_solr    ] o.a.s.c.OverseerTaskProcessor Cleaning up work-queue. #Running tasks: 0
   [junit4]   2> 1380436 DEBUG (OverseerCollectionConfigSetProcessor-72275546143129608-127.0.0.1:33683_solr-n_0000000000) [n:127.0.0.1:33683_solr    ] o.a.s.c.OverseerTaskProcessor RunningTasks: []
   [junit4]   2> 1380436 DEBUG (OverseerCollectionConfigSetProcessor-72275546143129608-127.0.0.1:33683_solr-n_0000000000) [n:127.0.0.1:33683_solr    ] o.a.s.c.OverseerTaskProcessor BlockedTasks: []
   [junit4]   2> 1380436 DEBUG (OverseerCollectionConfigSetProcessor-72275546143129608-127.0.0.1:33683_solr-n_0000000000) [n:127.0.0.1:33683_solr    ] o.a.s.c.OverseerTaskProcessor CompletedTasks: []
   [junit4]   2> 1380436 DEBUG (OverseerCollectionConfigSetProcessor-72275546143129608-127.0.0.1:33683_solr-n_0000000000) [n:127.0.0.1:33683_solr    ] o.a.s.c.OverseerTaskProcessor RunningZKTasks: []
   [junit4]   2> 1380436 DEBUG (OverseerCollectionConfigSetProcessor-72275546143129608-127.0.0.1:33683_solr-n_0000000000) [n:127.0.0.1:33683_solr    ] o.a.s.c.OverseerTaskQueue Peeking for top 100 elements. ExcludeSet: []
   [junit4]   2> 1380437 DEBUG (SyncThread:0) [    ] o.a.s.c.ZkTestServer Watch added: children: /solr/overseer/collection-queue-work
   [junit4]   2> 1380438 DEBUG (SyncThread:0) [    ] o.a.s.c.ZkTestServer Watch added: create/delete: /solr/clusterprops.json
   [junit4]   2> 1380438 DEBUG (SyncThread:0) [    ] o.a.s.c.ZkTestServer Watch added: children: /solr/live_nodes
   [junit4]   2> 1380438 INFO  (jetty-launcher-4240-thread-3) [n:127.0.0.1:45489_solr    ] o.a.s.c.c.ZkStateReader Updated live nodes from ZooKeeper... (0) -> (1)
   [junit4]   2> 1380438 DEBUG (SyncThread:0) [    ] o.a.s.c.ZkTestServer Watch added: data: /solr/clusterstate.json
   [junit4]   2> 1380438 DEBUG (SyncThread:0) [    ] o.a.s.c.ZkTestServer Watch added: children: /solr/collections
   [junit4]   2> 1380438 DEBUG (SyncThread:0) [    ] o.a.s.c.ZkTestServer Watch added: create/delete: /solr/aliases.json
   [junit4]   2> 1380439 DEBUG (SyncThread:0) [    ] o.a.s.c.ZkTestServer Watch added: create/delete: /solr/security.json
   [junit4]   2> 1380440 DEBUG (jetty-launcher-4240-thread-3) [n:127.0.0.1:45489_solr    ] o.a.s.c.LeaderElector Joined leadership election with path: /overseer_elect/election/72275546143129611-127.0.0.1:45489_solr-n_0000000001
   [junit4]   2> 1380441 INFO  (zkCallback-4266-thread-1) [    ] o.a.s.c.c.ZkStateReader Updated live nodes from ZooKeeper... (0) -> (1)
   [junit4]   2> 1380441 DEBUG (SyncThread:0) [    ] o.a.s.c.ZkTestServer Watch added: data: /solr/overseer_elect/election/72275546143129608-127.0.0.1:33683_solr-n_0000000000
   [junit4]   2> 1380441 DEBUG (jetty-launcher-4240-thread-3) [n:127.0.0.1:45489_solr    ] o.a.s.c.LeaderElector Watching path /overseer_elect/election/72275546143129608-127.0.0.1:33683_solr-n_0000000000 to know if I could be the leader
   [junit4]   2> 1380441 DEBUG (jetty-launcher-4240-thread-3) [n:127.0.0.1:45489_solr    ] o.a.s.c.ZkController Publish node=127.0.0.1:45489_solr as DOWN
   [junit4]   2> 1380442 DEBUG (SyncThread:0) [    ] o.a.s.c.ZkTestServer Watch fired: children: /solr/overseer/queue
   [junit4]   2> 1380442 INFO  (jetty-launcher-4240-thread-3) [n:127.0.0.1:45489_solr    ] o.a.s.c.TransientSolrCoreCacheDefault Allocating transient cache for 2147483647 transient cores
   [junit4]   2> 1380442 INFO  (jetty-launcher-4240-thread-3) [n:127.0.0.1:45489_solr    ] o.a.s.c.ZkController Register node as live in ZooKeeper:/live_nodes/127.0.0.1:45489_solr
   [junit4]   2> 1380442 DEBUG (SyncThread:0) [    ] o.a.s.c.ZkTestServer Watch fired: children: /solr/live_nodes
   [junit4]   2> 1380442 DEBUG (SyncThread:0) [    ] o.a.s.c.ZkTestServer Watch fired: children: /solr/live_nodes
   [junit4]   2> 1380443 DEBUG (OverseerAutoScalingTriggerThread-72275546143129608-127.0.0.1:33683_solr-n_0000000000) [    ] o.a.s.c.a.OverseerTriggerThread Adding .auto_add_replicas and .scheduled_maintenance triggers
   [junit4]   2> 1380444 DEBUG (SyncThread:0) [    ] o.a.s.c.ZkTestServer Watch added: children: /solr/overseer/queue
   [junit4]   2> 1380444 DEBUG (SyncThread:0) [    ] o.a.s.c.ZkTestServer Watch added: children: /solr/live_nodes
   [junit4]   2> 1380444 INFO  (zkCallback-4277-thread-1) [    ] o.a.s.c.c.ZkStateReader Updated live nodes from ZooKeeper... (0) -> (2)
   [junit4]   2> 1380444 DEBUG (OverseerStateUpdate-72275546143129608-127.0.0.1:33683_solr-n_0000000000) [n:127.0.0.1:33683_solr    ] o.a.s.c.Overseer processMessage: queueSize: 1, message = {
   [junit4]   2>   "operation":"downnode",
   [junit4]   2>   "node_name":"127.0.0.1:45489_solr"} current state version: 0
   [junit4]   2> 1380445 DEBUG (SyncThread:0) [    ] o.a.s.c.ZkTestServer Watch added: data: /solr/autoscaling.json
   [junit4]   2> 1380445 DEBUG (OverseerAutoScalingTriggerThread-72275546143129608-127.0.0.1:33683_solr-n_0000000000) [    ] o.a.s.c.a.OverseerTriggerThread Refreshing /autoscaling.json with znode version 1
   [junit4]   2> 1380447 DEBUG (OverseerAutoScalingTriggerThread-72275546143129608-127.0.0.1:33683_solr-n_0000000000) [    ] o.a.s.c.a.OverseerTriggerThread Current znodeVersion 1, lastZnodeVersion -1
   [junit4]   2> 1380448 DEBUG (SyncThread:0) [    ] o.a.s.c.ZkTestServer Watch added: children: /solr/live_nodes
   [junit4]   2> 1380448 DEBUG (OverseerAutoScalingTriggerThread-72275546143129608-127.0.0.1:33683_solr-n_0000000000) [    ] o.a.s.c.a.OverseerTriggerThread Processed trigger updates upto znodeVersion 1
   [junit4]   2> 1380448 DEBUG (SyncThread:0) [    ] o.a.s.c.ZkTestServer Watch added: create/delete: /solr/clusterprops.json
   [junit4]   2> 1380449 DEBUG (SyncThread:0) [    ] o.a.s.c.ZkTestServer Watch added: children: /solr/live_nodes
   [junit4]   2> 1380449 INFO  (jetty-launcher-4240-thread-1) [n:127.0.0.1:38657_solr    ] o.a.s.c.c.ZkStateReader Updated live nodes from ZooKeeper... (0) -> (2)
   [junit4]   2> 1380449 DEBUG (SyncThread:0) [    ] o.a.s.c.ZkTestServer Watch added: data: /solr/clusterstate.json
   [junit4]   2> 1380449 DEBUG (SyncThread:0) [    ] o.a.s.c.ZkTestServer Watch added: children: /solr/collections
   [junit4]   2> 1380449 DEBUG (SyncThread:0) [    ] o.a.s.c.ZkTestServer Watch added: create/delete: /solr/aliases.json
   [junit4]   2> 1380450 DEBUG (SyncThread:0) [    ] o.a.s.c.ZkTestServer Watch added: create/delete: /solr/security.json
   [junit4]   2> 1380451 DEBUG (jetty-launcher-4240-thread-1) [n:127.0.0.1:38657_solr    ] o.a.s.c.LeaderElector Joined leadership election with path: /overseer_elect/election/72275546143129606-127.0.0.1:38657_solr-n_0000000002
   [junit4]   2> 1380451 DEBUG (SyncThread:0) [    ] o.a.s.c.ZkTestServer Watch added: data: /solr/overseer_elect/election/72275546143129611-127.0.0.1:45489_solr-n_0000000001
   [junit4]   2> 1380452 DEBUG (jetty-launcher-4240-thread-1) [n:127.0.0.1:38657_solr    ] o.a.s.c.LeaderElector Watching path /overseer_elect/election/72275546143129611-127.0.0.1:45489_solr-n_0000000001 to know if I could be the leader
   [junit4]   2> 1380452 INFO  (zkCallback-4266-thread-2) [    ] o.a.s.c.c.ZkStateReader Updated live nodes from ZooKeeper... (1) -> (2)
   [junit4]   2> 1380452 DEBUG (jetty-launcher-4240-thread-1) [n:127.0.0.1:38657_solr    ] o.a.s.c.ZkController Publish node=127.0.0.1:38657_solr as DOWN
   [junit4]   2> 1380452 DEBUG (SyncThread:0) [    ] o.a.s.c.ZkTestServer Watch added: children: /solr/live_nodes
   [junit4]   2> 1380452 DEBUG (SyncThread:0) [    ] o.a.s.c.ZkTestServer Watch fired: children: /solr/overseer/queue
   [junit4]   2> 1380452 INFO  (zkCallback-4273-thread-1) [    ] o.a.s.c.c.ZkStateReader Updated live nodes from ZooKeeper... (1) -> (2)
   [junit4]   2> 1380453 INFO  (jetty-launcher-4240-thread-1) [n:127.0.0.1:38657_solr    ] o.a.s.c.TransientSolrCoreCacheDefault Allocating transient cache for 2147483647 transient cores
   [junit4]   2> 1380453 INFO  (jetty-launcher-4240-thread-1) [n:127.0.0.1:38657_solr    ] o.a.s.c.ZkController Register node as live in ZooKeeper:/live_nodes/127.0.0.1:38657_solr
   [junit4]   2> 1380453 DEBUG (SyncThread:0) [    ] o.a.s.c.ZkTestServer Watch fired: children: /solr/live_nodes
   [junit4]   2> 1380453 DEBUG (SyncThread:0) [    ] o.a.s.c.ZkTestServer Watch fired: children: /solr/live_nodes
   [junit4]   2> 1380453 DEBUG (SyncThread:0) [    ] o.a.s.c.ZkTestServer Watch fired: children: /solr/live_nodes
   [junit4]   2> 1380453 DEBUG (SyncThread:0) [    ] o.a.s.c.ZkTestServer Watch fired: children: /solr/live_nodes
   [junit4]   2> 1380464 DEBUG (SyncThread:0) [    ] o.a.s.c.ZkTestServer Watch added: children: /solr/live_nodes
   [junit4]   2> 1380464 DEBUG (SyncThread:0) [    ] o.a.s.c.ZkTestServer Watch added: children: /solr/live_nodes
   [junit4]   2> 1380465 INFO  (jetty-launcher-4240-thread-2) [n:127.0.0.1:33683_solr    ] o.a.s.h.a.MetricsHistoryHandler No .system collection, keeping metrics history in memory.
   [junit4]   2> 1380465 DEBUG (SyncThread:0) [    ] o.a.s.c.ZkTestServer Watch added: children: /solr/overseer/queue
   [junit4]   2> 1380465 DEBUG (SyncThread:0) [    ] o.a.s.c.ZkTestServer Watch added: children: /solr/live_nodes
   [junit4]   2> 1380465 DEBUG (SyncThread:0) [    ] o.a.s.c.ZkTestServer Watch added: children: /solr/live_nodes
   [junit4]   2> 1380465 INFO  (zkCallback-4277-thread-1) [    ] o.a.s.c.c.ZkStateReader Updated live nodes from ZooKeeper... (2) -> (3)
   [junit4]   2> 1380465 INFO  (zkCallback-4266-thread-1) [    ] o.a.s.c.c.ZkStateReader Updated live nodes from ZooKeeper... (2) -> (3)
   [junit4]   2> 1380465 INFO  (zkCallback-4256-thread-1) [    ] o.a.s.c.c.ZkStateReader Updated live nodes from ZooKeeper... (2) -> (3)
   [junit4]   2> 1380468 INFO  (zkCallback-4273-thread-1) [    ] o.a.s.c.c.ZkStateReader Updated live nodes from ZooKeeper... (2) -> (3)
   [junit4]   2> 1380470 DEBUG (SyncThread:0) [    ] o.a.s.c.ZkTestServer Watch added: children: /solr/autoscaling/events/.scheduled_maintenance
   [junit4]   2> 1380470 DEBUG (OverseerStateUpdate-72275546143129608-127.0.0.1:33683_solr-n_0000000000) [n:127.0.0.1:33683_solr    ] o.a.s.c.Overseer processMessage: queueSize: 2, message = {
   [junit4]   2>   "operation":"downnode",
   [junit4]   2>   "node_name":"127.0.0.1:38657_solr"} current state version: 0
   [junit4]   2> 1380476 DEBUG (OverseerAutoScalingTriggerThread-72275546143129608-127.0.0.1:33683_solr-n_0000000000) [    ] o.a.s.c.a.NodeLostTrigger NodeLostTrigger .auto_add_replicas - Initial livenodes: [127.0.0.1:33683_solr, 127.0.0.1:45489_solr, 127.0.0.1:38657_solr]
   [junit4]   2> 1380479 DEBUG (SyncThread:0) [    ] o.a.s.c.ZkTestServer Watch added: children: /solr/autoscaling/events/.auto_add_replicas
   [junit4]   2> 1380480 DEBUG (ScheduledTrigger-6489-thread-1) [    ] o.a.s.c.a.NodeLostTrigger Running NodeLostTrigger: .auto_add_replicas with currently live nodes: 3
   [junit4]   2> 1380480 DEBUG (OverseerAutoScalingTriggerThread-72275546143129608-127.0.0.1:33683_solr-n_0000000000) [    ] o.a.s.c.a.OverseerTriggerThread -- clean old nodeAdded markers
   [junit4]   2> 1380480 DEBUG (OverseerAutoScalingTriggerThread-72275546143129608-127.0.0.1:33683_solr-n_0000000000) [    ] o.a.s.c.a.OverseerTriggerThread Current znodeVersion 1, lastZnodeVersion 1
   [junit4]   2> 1380481 INFO  (zkConnectionManagerCallback-4286-thread-1) [    ] o.a.s.c.c.ConnectionManager zkClient has connected
   [junit4]   2> 1380481 INFO  (zkConnectionManagerCallback-4291-thread-1) [    ] o.a.s.c.c.ConnectionManager zkClient has connected
   [junit4]   2> 1380481 DEBUG (SyncThread:0) [    ] o.a.s.c.ZkTestServer Watch added: create/delete: /solr/clusterprops.json
   [junit4]   2> 1380481 DEBUG (SyncThread:0) [    ] o.a.s.c.ZkTestServer Watch added: create/delete: /solr/clusterprops.json
   [junit4]   2> 1380482 DEBUG (SyncThread:0) [    ] o.a.s.c.ZkTestServer Watch added: children: /solr/live_nodes
   [junit4]   2> 1380482 DEBUG (SyncThread:0) [    ] o.a.s.c.ZkTestServer Watch added: children: /solr/live_nodes
   [junit4]   2> 1380482 INFO  (jetty-launcher-4240-thread-3) [n:127.0.0.1:45489_solr    ] o.a.s.c.c.ZkStateReader Updated live nodes from ZooKeeper... (0) -> (3)
   [junit4]   2> 1380482 INFO  (jetty-launcher-4240-thread-1) [n:127.0.0.1:38657_solr    ] o.a.s.c.c.ZkStateReader Updated live nodes from ZooKeeper... (0) -> (3)
   [junit4]   2> 1380482 DEBUG (SyncThread:0) [    ] o.a.s.c.ZkTestServer Watch added: data: /solr/clusterstate.json
   [junit4]   2> 1380482 DEBUG (SyncThread:0) [    ] o.a.s.c.ZkTestServer Watch added: data: /solr/clusterstate.json
   [junit4]   2> 1380482 DEBUG (SyncThread:0) [    ] o.a.s.c.ZkTestServer Watch added: children: /solr/collections
   [junit4]   2> 1380482 DEBUG (SyncThread:0) [    ] o.a.s.c.ZkTestServer Watch added: children: /solr/collections
   [junit4]   2> 1380482 DEBUG (SyncThread:0) [    ] o.a.s.c.ZkTestServer Watch added: create/delete: /solr/aliases.json
   [junit4]   2> 1380482 DEBUG (SyncThread:0) [    ] o.a.s.c.ZkTestServer Watch added: create/delete: /solr/aliases.json
   [junit4]   2> 1380482 INFO  (jetty-launcher-4240-thread-3) [n:127.0.0.1:45489_solr    ] o.a.s.c.s.i.ZkClientClusterStateProvider Cluster at 127.0.0.1:37908/solr ready
   [junit4]   2> 1380483 INFO  (jetty-launcher-4240-thread-1) [n:127.0.0.1:38657_solr    ] o.a.s.c.s.i.ZkClientClusterStateProvider Cluster at 127.0.0.1:37908/solr ready
   [junit4]   2> 1380483 INFO  (jetty-launcher-4240-thread-3) [n:127.0.0.1:45489_solr    ] o.a.s.h.a.MetricsHistoryHandler No .system collection, keeping metrics history in memory.
   [junit4]   2> 1380487 INFO  (jetty-launcher-4240-thread-1) [n:127.0.0.1:38657_solr    ] o.a.s.h.a.MetricsHistoryHandler No .system collection, keeping metrics history in memory.
   [junit4]   2> 1380515 INFO  (jetty-launcher-4240-thread-3) [n:127.0.0.1:45489_solr    ] o.a.s.m.r.SolrJmxReporter JMX monitoring for 'solr_45489.solr.node' (registry 'solr.node') enabled at server: com.sun.jmx.mbeanserver.JmxMBeanServer@56caf261
   [junit4]   2> 1380520 INFO  (jetty-launcher-4240-thread-2) [n:127.0.0.1:33683_solr    ] o.a.s.m.r.SolrJmxReporter JMX monitoring for 'solr_33683.solr.node' (registry 'solr.node') enabled at server: com.sun.jmx.mbeanserver.JmxMBeanServer@56caf261
   [junit4]   2> 1380537 INFO  (jetty-launcher-4240-thread-3) [n:127.0.0.1:45489_solr    ] o.a.s.m.r.SolrJmxReporter JMX monitoring for 'solr_45489.solr.jvm' (registry 'solr.jvm') enabled at server: com.sun.jmx.mbeanserver.JmxMBeanServer@56caf261
   [junit4]   2> 1380537 INFO  (jetty-launcher-4240-thread-3) [n:127.0.0.1:45489_solr    ] o.a.s.m.r.SolrJmxReporter JMX monitoring for 'solr_45489.solr.jetty' (registry 'solr.jetty') enabled at server: com.sun.jmx.mbeanserver.JmxMBeanServer@56caf261
   [junit4]   2> 1380539 INFO  (jetty-launcher-4240-thread-3) [n:127.0.0.1:45489_solr    ] o.a.s.c.CorePropertiesLocator Found 0 core definitions underneath /x1/jenkins/jenkins-slave/workspace/Lucene-Solr-Tests-master/solr/build/solr-core/test/J0/temp/solr.cloud.MoveReplicaHDFSTest_252E3C66407D4211-001/tempDir-001/node2/.
   [junit4]   2> 1380540 INFO  (jetty-launcher-4240-thread-1) [n:127.0.0.1:38657_solr    ] o.a.s.m.r.SolrJmxReporter JMX monitoring for 'solr_38657.solr.node' (registry 'solr.node') enabled at server: com.sun.jmx.mbeanserver.JmxMBeanServer@56caf261
   [junit4]   2> 1380549 INFO  (jetty-launcher-4240-thread-2) [n:127.0.0.1:33683_solr    ] o.a.s.m.r.SolrJmxReporter JMX monitoring for 'solr_33683.solr.jvm' (registry 'solr.jvm') enabled at server: com.sun.jmx.mbeanserver.JmxMBeanServer@56caf261
   [junit4]   2> 1380549 INFO  (jetty-launcher-4240-thread-2) [n:127.0.0.1:33683_solr    ] o.a.s.m.r.SolrJmxReporter JMX monitoring for 'solr_33683.solr.jetty' (registry 'solr.jetty') enabled at server: com.sun.jmx.mbeanserver.JmxMBeanServer@56caf261
   [junit4]   2> 1380551 INFO  (jetty-launcher-4240-thread-2) [n:127.0.0.1:33683_solr    ] o.a.s.c.CorePropertiesLocator Found 0 core definitions underneath /x1/jenkins/jenkins-slave/workspace/Lucene-Solr-Tests-master/solr/build/solr-core/test/J0/temp/solr.cloud.MoveReplicaHDFSTest_252E3C66407D4211-001/tempDir-001/node4/.
   [junit4]   2> 1380554 INFO  (jetty-launcher-4240-thread-1) [n:127.0.0.1:38657_solr    ] o.a.s.m.r.SolrJmxReporter JMX monitoring for 'solr_38657.solr.jvm' (registry 'solr.jvm') enabled at server: com.sun.jmx.mbeanserver.JmxMBeanServer@56caf261
   [junit4]   2> 1380554 INFO  (jetty-launcher-4240-thread-1) [n:127.0.0.1:38657_solr    ] o.a.s.m.r.SolrJmxReporter JMX monitoring for 'solr_38657.solr.jetty' (registry 'solr.jetty') enabled at server: com.sun.jmx.mbeanserver.JmxMBeanServer@56caf261
   [junit4]   2> 1380555 INFO  (jetty-launcher-4240-thread-1) [n:127.0.0.1:38657_solr    ] o.a.s.c.CorePropertiesLocator Found 0 core definitions underneath /x1/jenkins/jenkins-slave/workspace/Lucene-Solr-Tests-master/solr/build/solr-core/test/J0/temp/solr.cloud.MoveReplicaHDFSTest_252E3C66407D4211-001/tempDir-001/node1/.
   [junit4]   2> 1380569 INFO  (jetty-launcher-4240-thread-4) [    ] o.a.s.c.ZkContainer Zookeeper client=127.0.0.1:37908/solr
   [junit4]   2> 1380570 DEBUG (SyncThread:0) [    ] o.a.s.c.ZkTestServer Watch fired: children: /solr/overseer/queue
   [junit4]   2> 1380571 DEBUG (SyncThread:0) [    ] o.a.s.c.ZkTestServer Watch added: children: /solr/overseer/queue
   [junit4]   2> 1380571 INFO  (zkConnectionManagerCallback-4297-thread-1) [    ] o.a.s.c.c.ConnectionManager zkClient has connected
   [junit4]   2> 1380572 DEBUG (jetty-launcher-4240-thread-4) [n:127.0.0.1:35761_solr    ] o.a.s.c.ZkController Added new OnReconnect listener org.apache.solr.cloud.ZkController$$Lambda$132/757785742@2ee490ce
   [junit4]   2> 1380573 INFO  (zkConnectionManagerCallback-4299-thread-1) [    ] o.a.s.c.c.ConnectionManager zkClient has connected
   [junit4]   2> 1380578 DEBUG (SyncThread:0) [    ] o.a.s.c.ZkTestServer Watch added: create/delete: /solr/clusterprops.json
   [junit4]   2> 1380578 DEBUG (SyncThread:0) [    ] o.a.s.c.ZkTestServer Watch added: children: /solr/live_nodes
   [junit4]   2> 1380578 INFO  (jetty-launcher-4240-thread-4) [n:127.0.0.1:35761_solr    ] o.a.s.c.c.ZkStateReader Updated live nodes from ZooKeeper... (0) -> (3)
   [junit4]   2> 1380578 DEBUG (SyncThread:0) [    ] o.a.s.c.ZkTestServer Watch added: data: /solr/clusterstate.json
   [junit4]   2> 1380579 DEBUG (SyncThread:0) [    ] o.a.s.c.ZkTestServer Watch added: children: /solr/collections
   [junit4]   2> 1380579 DEBUG (SyncThread:0) [    ] o.a.s.c.ZkTestServer Watch added: create/delete: /solr/aliases.json
   [junit4]   2> 1380579 DEBUG (SyncThread:0) [    ] o.a.s.c.ZkTestServer Watch added: create/delete: /solr/security.json
   [junit4]   2> 1380580 DEBUG (jetty-launcher-4240-thread-4) [n:127.0.0.1:35761_solr    ] o.a.s.c.LeaderElector Joined leadership election with path: /overseer_elect/election/72275546143129615-127.0.0.1:35761_solr-n_0000000003
   [junit4]   2> 1380581 DEBUG (SyncThread:0) [    ] o.a.s.c.ZkTestServer Watch added: data: /solr/overseer_elect/election/72275546143129606-127.0.0.1:38657_solr-n_0000000002
   [junit4]   2> 1380581 DEBUG (jetty-launcher-4240-thread-4) [n:127.0.0.1:35761_solr    ] o.a.s.c.LeaderElector Watching path /overseer_elect/election/72275546143129606-127.0.0.1:38657_solr-n_0000000002 to know if I could be the leader
   [junit4]   2> 1380581 DEBUG (jetty-launcher-4240-thread-4) [n:127.0.0.1:35761_solr    ] o.a.s.c.ZkController Publish node=127.0.0.1:35761_solr as DOWN
   [junit4]   2> 1380582 DEBUG (SyncThread:0) [    ] o.a.s.c.ZkTestServer Watch fired: children: /solr/overseer/queue
   [junit4]   2> 1380582 INFO  (jetty-launcher-4240-thread-4) [n:127.0.0.1:35761_solr    ] o.a.s.c.TransientSolrCoreCacheDefault Allocating transient cache for 2147483647 transient cores
   [junit4]   2> 1380582 INFO  (jetty-launcher-4240-thread-4) [n:127.0.0.1:35761_solr    ] o.a.s.c.ZkController Register node as live in ZooKeeper:/live_nodes/127.0.0.1:35761_solr
   [junit4]   2> 1380582 DEBUG (SyncThread:0) [    ] o.a.s.c.ZkTestServer Watch added: children: /solr/overseer/queue
   [junit4]   2> 1380582 DEBUG (OverseerStateUpdate-72275546143129608-127.0.0.1:33683_solr-n_0000000000) [n:127.0.0.1:33683_solr    ] o.a.s.c.Overseer processMessage: queueSize: 1, message = {
   [junit4]   2>   "operation":"downnode",
   [junit4]   2>   "node_name":"127.0.0.1:35761_solr"} current state version: 0
   [junit4]   2> 1380582 DEBUG (SyncThread:0) [    ] o.a.s.c.ZkTestServer Watch fired: children: /solr/live_nodes
   [junit4]   2> 1380582 DEBUG (SyncThread:0) [    ] o.a.s.c.ZkTestServer Watch fired: children: /solr/live_nodes
   [junit4]   2> 1380582 DEBUG (SyncThread:0) [    ] o.a.s.c.ZkTestServer Watch fired: children: /solr/live_nodes
   [junit4]   2> 1380583 DEBUG (SyncThread:0) [    ] o.a.s.c.ZkTestServer Watch fired: children: /solr/live_nodes
   [junit4]   2> 1380583 DEBUG (SyncThread:0) [    ] o.a.s.c.ZkTestServer Watch fired: children: /solr/live_nodes
   [junit4]   2> 1380583 DEBUG (SyncThread:0) [    ] o.a.s.c.ZkTestServer Watch fired: children: /solr/live_nodes
   [junit4]   2> 1380583 DEBUG (SyncThread:0) [    ] o.a.s.c.ZkTestServer Watch fired: children: /solr/live_nodes
   [junit4]   2> 1380585 DEBUG (SyncThread:0) [    ] o.a.s.c.ZkTestServer Watch added: children: /solr/live_nodes
   [junit4]   2> 1380585 DEBUG (SyncThread:0) [    ] o.a.s.c.ZkTestServer Watch added: children: /solr/live_nodes
   [junit4]   2> 1380585 INFO  (zkCallback-4273-thread-1) [    ] o.a.s.c.c.ZkStateReader Updated live nodes from ZooKeeper... (3) -> (4)
   [junit4]   2> 1380585 INFO  (zkCallback-4277-thread-1) [    ] o.a.s.c.c.ZkStateReader Updated live nodes from ZooKeeper... (3) -> (4)
   [junit4]   2> 1380585 DEBUG (SyncThread:0) [    ] o.a.s.c.ZkTestServer Watch added: children: /solr/live_nodes
   [junit4]   2> 1380586 INFO  (zkCallback-4266-thread-1) [    ] o.a.s.c.c.ZkStateReader Updated live nodes from ZooKeeper... (3) -> (4)
   [junit4]   2> 1380590 DEBUG (SyncThread:0) [    ] o.a.s.c.ZkTestServer Watch added: children: /solr/live_nodes
   [junit4]   2> 1380590 INFO  (zkCallback-4256-thread-1) [    ] o.a.s.c.c.ZkStateReader Updated live nodes from ZooKeeper... (3) -> (4)
   [junit4]   2> 1380590 DEBUG (SyncThread:0) [    ] o.a.s.c.ZkTestServer Watch added: children: /solr/live_nodes
   [junit4]   2> 1380590 INFO  (zkCallback-4285-thread-1) [    ] o.a.s.c.c.ZkStateReader Updated live nodes from ZooKeeper... (3) -> (4)
   [junit4]   2> 1380590 DEBUG (SyncThread:0) [    ] o.a.s.c.ZkTestServer Watch added: children: /solr/live_nodes
   [junit4]   2> 1380590 INFO  (zkCallback-4290-thread-1) [    ] o.a.s.c.c.ZkStateReader Updated live nodes from ZooKeeper... (3) -> (4)
   [junit4]   2> 1380590 DEBUG (SyncThread:0) [    ] o.a.s.c.ZkTestServer Watch added: children: /solr/live_nodes
   [junit4]   2> 1380591 INFO  (zkCallback-4298-thread-1) [    ] o.a.s.c.c.ZkStateReader Updated live nodes from ZooKeeper... (3) -> (4)
   [junit4]   2> 1380602 INFO  (zkConnectionManagerCallback-4306-thread-1) [    ] o.a.s.c.c.ConnectionManager zkClient has connected
   [junit4]   2> 1380603 DEBUG (SyncThread:0) [    ] o.a.s.c.ZkTestServer Watch added: create/delete: /solr/clusterprops.json
   [junit4]   2> 1380603 DEBUG (SyncThread:0) [    ] o.a.s.c.ZkTestServer Watch added: children: /solr/live_nodes
   [junit4]   2> 1380603 INFO  (jetty-launcher-4240-thread-4) [n:127.0.0.1:35761_solr    ] o.a.s.c.c.ZkStateReader Updated live nodes from ZooKeeper... (0) -> (4)
   [junit4]   2> 1380603 DEBUG (SyncThread:0) [    ] o.a.s.c.ZkTestServer Watch added: data: /solr/clusterstate.json
   [junit4]   2> 1380604 DEBUG (SyncThread:0) [    ] o.a.s.c.ZkTestServer Watch added: children: /solr/collections
   [junit4]   2> 1380604 DEBUG (SyncThread:0) [    ] o.a.s.c.ZkTestServer Watch added: create/delete: /solr/aliases.json
   [junit4]   2> 1380605 INFO  (jetty-launcher-4240-thread-4) [n:127.0.0.1:35761_solr    ] o.a.s.c.s.i.ZkClientClusterStateProvider Cluster at 127.0.0.1:37908/solr ready
   [junit4]   2> 1380605 INFO  (jetty-launcher-4240-thread-4) [n:127.0.0.1:35761_solr    ] o.a.s.h.a.MetricsHistoryHandler No .system collection, keeping metrics history in memory.
   [junit4]   2> 1380621 INFO  (jetty-launcher-4240-thread-4) [n:127.0.0.1:35761_solr    ] o.a.s.m.r.SolrJmxReporter JMX monitoring for 'solr_35761.solr.node' (registry 'solr.node') enabled at server: com.sun.jmx.mbeanserver.JmxMBeanServer@56caf261
   [junit4]   2> 1380628 INFO  (jetty-launcher-4240-thread-4) [n:127.0.0.1:35761_solr    ] o.a.s.m.r.SolrJmxReporter JMX monitoring for 'solr_35761.solr.jvm' (registry 'solr.jvm') enabled at server: com.sun.jmx.mbeanserver.JmxMBeanServer@56caf261
   [junit4]   2> 1380628 INFO  (jetty-launcher-4240-thread-4) [n:127.0.0.1:35761_solr    ] o.a.s.m.r.SolrJmxReporter JMX monitoring for 'solr_35761.solr.jetty' (registry 'solr.jetty') enabled at server: com.sun.jmx.mbeanserver.JmxMBeanServer@56caf261
   [junit4]   2> 1380629 INFO  (jetty-launcher-4240-thread-4) [n:127.0.0.1:35761_solr    ] o.a.s.c.CorePropertiesLocator Found 0 core definitions underneath /x1/jenkins/jenkins-slave/workspace/Lucene-Solr-Tests-master/solr/build/solr-core/test/J0/temp/solr.cloud.MoveReplicaHDFSTest_252E3C66407D4211-001/tempDir-001/node3/.
   [junit4]   2> 1380662 INFO  (zkConnectionManagerCallback-4309-thread-1) [    ] o.a.s.c.c.ConnectionManager zkClient has connected
   [junit4]   2> 1380666 INFO  (zkConnectionManagerCallback-4314-thread-1) [    ] o.a.s.c.c.ConnectionManager zkClient has connected
   [junit4]   2> 1380666 DEBUG (SyncThread:0) [    ] o.a.s.c.ZkTestServer Watch added: create/delete: /solr/clusterprops.json
   [junit4]   2> 1380666 DEBUG (SyncThread:0) [    ] o.a.s.c.ZkTestServer Watch added: children: /solr/live_nodes
   [junit4]   2> 1380667 INFO  (SUITE-MoveReplicaHDFSTest-seed#[252E3C66407D4211]-worker) [    ] o.a.s.c.c.ZkStateReader Updated live nodes from ZooKeeper... (0) -> (4)
   [junit4]   2> 1380667 DEBUG (SyncThread:0) [    ] o.a.s.c.ZkTestServer Watch added: data: /solr/clusterstate.json
   [junit4]   2> 1380667 DEBUG (SyncThread:0) [    ] o.a.s.c.ZkTestServer Watch added: children: /solr/collections
   [junit4]   2> 1380667 DEBUG (SyncThread:0) [    ] o.a.s.c.ZkTestServer Watch added: create/delete: /solr/aliases.json
   [junit4]   2> 1380667 INFO  (SUITE-MoveReplicaHDFSTest-seed#[252E3C66407D4211]-worker) [    ] o.a.s.c.s.i.ZkClientClusterStateProvider Cluster at 127.0.0.1:37908/solr ready
   [junit4]   2> 1380672 INFO  (qtp216212786-15725) [n:127.0.0.1:33683_solr    ] o.a.s.h.a.CollectionsHandler Invoked Collection Action :overseerstatus with params action=OVERSEERSTATUS&wt=javabin&version=2 and sendToOCPQueue=true
   [junit4]   2> 1380672 DEBUG (SyncThread:0) [    ] o.a.s.c.ZkTestServer Watch fired: children: /solr/overseer/collection-queue-work
   [junit4]   2> 1380672 DEBUG (SyncThread:0) [    ] o.a.s.c.ZkTestServer Watch added: create/delete: /solr/overseer/collection-queue-work/qnr-0000000000
   [junit4]   2> 1380672 DEBUG (SyncThread:0) [    ] o.a.s.c.ZkTestServer Watch added: children: /solr/overseer/collection-queue-work
   [junit4]   2> 1380672 DEBUG (OverseerCollectionConfigSetProcessor-72275546143129608-127.0.0.1:33683_solr-n_0000000000) [n:127.0.0.1:33683_solr    ] o.a.s.c.ZkDistributedQueue Found child node with improper name: qnr-0000000000
   [junit4]   2> 1380673 DEBUG (SyncThread:0) [    ] o.a.s.c.ZkTestServer Watch fired: children: /solr/overseer/collection-queue-work
   [junit4]   2> 1380676 DEBUG (SyncThread:0) [    ] o.a.s.c.ZkTestServer Watch added: children: /solr/overseer/collection-queue-work
   [junit4]   2> 1380676 DEBUG (OverseerCollectionConfigSetProcessor-72275546143129608-127.0.0.1:33683_solr-n_0000000000) [n:127.0.0.1:33683_solr    ] o.a.s.c.ZkDistributedQueue Found child node with improper name: qnr-0000000000
   [junit4]   2> 1380676 DEBUG (OverseerCollectionConfigSetProcessor-72275546143129608-127.0.0.1:33683_solr-n_0000000000) [n:127.0.0.1:33683_solr    ] o.a.s.c.OverseerTaskQueue Returning topN elements: [/overseer/collection-queue-work/qn-0000000000, ]
   [junit4]   2> 1380676 DEBUG (OverseerCollectionConfigSetProcessor-72275546143129608-127.0.0.1:33683_solr-n_0000000000) [n:127.0.0.1:33683_solr    ] o.a.s.c.OverseerTaskProcessor Got 1 tasks from work-queue : [[org.apache.solr.cloud.OverseerTaskQueue$QueueEvent@2e684ecf]]
   [junit4]   2> 1380676 DEBUG (OverseerCollectionConfigSetProcessor-72275546143129608-127.0.0.1:33683_solr-n_0000000000) [n:127.0.0.1:33683_solr    ] o.a.s.c.OverseerTaskProcessor Marked task [/overseer/collection-queue-work/qn-0000000000] as running
   [junit4]   2> 1380676 DEBUG (OverseerCollectionConfigSetProcessor-72275546143129608-127.0.0.1:33683_solr-n_0000000000) [n:127.0.0.1:33683_solr    ] o.a.s.c.OverseerTaskProcessor Overseer Collection Message Handler: Get the message id:/overseer/collection-queue-work/qn-0000000000 message:{"operation":"overseerstatus"}
   [junit4]   2> 1380676 DEBUG (OverseerCollectionConfigSetProcessor-72275546143129608-127.0.0.1:33683_solr-n_0000000000) [n:127.0.0.1:33683_solr    ] o.a.s.c.OverseerTaskProcessor Cleaning up work-queue. #Running tasks: 1
   [junit4]   2> 1380676 DEBUG (OverseerThreadFactory-6491-thread-1-processing-n:127.0.0.1:33683_solr) [n:127.0.0.1:33683_solr    ] o.a.s.c.OverseerTaskProcessor Runner processing /overseer/collection-queue-work/qn-0000000000
   [junit4]   2> 1380676 DEBUG (OverseerCollectionConfigSetProcessor-72275546143129608-127.0.0.1:33683_solr-n_0000000000) [n:127.0.0.1:33683_solr    ] o.a.s.c.OverseerTaskProcessor RunningTasks: [/overseer/collection-queue-work/qn-0000000000]
   [junit4]   2> 1380676 DEBUG (OverseerCollectionConfigSetProcessor-72275546143129608-127.0.0.1:33683_solr-n_0000000000) [n:127.0.0.1:33683_solr    ] o.a.s.c.OverseerTaskProcessor BlockedTasks: []
   [junit4]   2> 1380676 DEBUG (OverseerCollectionConfigSetProcessor-72275546143129608-127.0.0.1:33683_solr-n_0000000000) [n:127.0.0.1:33683_solr    ] o.a.s.c.OverseerTaskProcessor CompletedTasks: []
   [junit4]   2> 1380676 DEBUG (OverseerCollectionConfigSetProcessor-72275546143129608-127.0.0.1:33683_solr-n_0000000000) [n:127.0.0.1:33683_solr    ] o.a.s.c.OverseerTaskProcessor RunningZKTasks: [/overseer/collection-queue-work/qn-0000000000]
   [junit4]   2> 1380676 DEBUG (OverseerThreadFactory-6491-thread-1-processing-n:127.0.0.1:33683_solr) [n:127.0.0.1:33683_solr    ] o.a.s.c.a.c.OverseerCollectionMessageHandler OverseerCollectionMessageHandler.processMessage : overseerstatus , {"operation":"overseerstatus"}
   [junit4]   2> 1380676 DEBUG (OverseerCollectionConfigSetProcessor-72275546143129608-127.0.0.1:33683_solr-n_0000000000) [n:127.0.0.1:33683_solr    ] o.a.s.c.OverseerTaskQueue Peeking for top 99 elements. ExcludeSet: [/overseer/collection-queue-work/qn-0000000000],[]
   [junit4]   2> 1380679 DEBUG (OverseerThreadFactory-6491-thread-1-processing-n:127.0.0.1:33683_solr) [n:127.0.0.1:33683_solr    ] o.a.s.c.OverseerTaskProcessor Completed task:[/overseer/collection-queue-work/qn-0000000000]
   [junit4]   2> 1380679 DEBUG (SyncThread:0) [    ] o.a.s.c.ZkTestServer Watch fired: data: /solr/overseer/collection-queue-work/qnr-0000000000
   [junit4]   2> 1380679 DEBUG (zkCallback-4266-thread-1) [    ] o.a.s.c.OverseerTaskQueue NodeDataChanged fired on path /overseer/collection-queue-work/qnr-0000000000 state SyncConnected latchEventType null
   [junit4]   2> 1380679 DEBUG (SyncThread:0) [    ] o.a.s.c.ZkTestServer Watch fired: children: /solr/overseer/collection-queue-work
   [junit4]   2> 1380684 DEBUG (SyncThread:0) [    ] o.a.s.c.ZkTestServer Watch fired: children: /solr/overseer/queue
   [junit4]   2> 1380684 DEBUG (SyncThread:0) [    ] o.a.s.c.ZkTestServer Watch added: children: /solr/overseer/collection-queue-work
   [junit4]   2> 1380684 DEBUG (OverseerThreadFactory-6491-thread-1-processing-n:127.0.0.1:33683_solr) [n:127.0.0.1:33683_solr    ] o.a.s.c.OverseerTaskProcessor Marked task [/overseer/collection-queue-work/qn-0000000000] as completed.
   [junit4]   2> 1380684 DEBUG (OverseerCollectionConfigSetProcessor-72275546143129608-127.0.0.1:33683_solr-n_0000000000) [n:127.0.0.1:33683_solr    ] o.a.s.c.ZkDistributedQueue Found child node with improper name: qnr-0000000000
   [junit4]   2> 1380684 DEBUG (OverseerThreadFactory-6491-thread-1-processing-n:127.0.0.1:33683_solr) [n:127.0.0.1:33683_solr    ] o.a.s.c.OverseerTaskProcessor RunningTasks: []
   [junit4]   2> 1380684 DEBUG (OverseerThreadFactory-6491-thread-1-processing-n:127.0.0.1:33683_solr) [n:127.0.0.1:33683_solr    ] o.a.s.c.OverseerTaskProcessor BlockedTasks: []
   [junit4]   2> 1380684 DEBUG (OverseerThreadFactory-6491-thread-1-processing-n:127.0.0.1:33683_solr) [n:127.0.0.1:33683_solr    ] o.a.s.c.OverseerTaskProcessor CompletedTasks: [/overseer/collection-queue-work/qn-0000000000]
   [junit4]   2> 1380684 DEBUG (OverseerThreadFactory-6491-thread-1-processing-n:127.0.0.1:33683_solr) [n:127.0.0.1:33683_solr    ] o.a.s.c.OverseerTaskProcessor RunningZKTasks: [/overseer/collection-queue-work/qn-0000000000]
   [junit4]   2> 1380684 DEBUG (SyncThread:0) [    ] o.a.s.c.ZkTestServer Watch fired: children: /solr/overseer/collection-queue-work
   [junit4]   2> 1380684 DEBUG (OverseerThreadFactory-6491-thread-1-processing-n:127.0.0.1:33683_solr) [n:127.0.0.1:33683_solr    ] o.a.s.c.OverseerTaskProcessor Overseer Collection Message Handler: Message id:/overseer/collection-queue-work/qn-0000000000 complete, response:{leader=127.0.0.1:33683_solr,overseer_queue_size=1,overseer_work_queue_size=0,overseer_collection_queue_size=2,overseer_operations={am_i_leader={requests=3,errors=0,avgRequestsPerSecond=12.002451476709215,5minRateRequestsPerSecond=0.0,15minRateRequestsPerSecond=0.0,avgTimePerRequest=0.34452466666666665,medianRequestTime=0.245003,75thPcRequestTime=0.613753,95thPcRequestTime=0.613753,99thPcRequestTime=0.613753,999thPcRequestTime=0.613753},downnode={requests=3,errors=0,avgRequestsPerSecond=12.848138129407962,5minRateRequestsPerSecond=0.0,15minRateRequestsPerSecond=0.0,avgTimePerRequest=0.009140666666666667,medianRequestTime=0.00922,75thPcRequestTime=0.009347,95thPcRequestTime=0.009347,99thPcRequestTime=0.009347,999thPcRequestTime=0.009347}},collection_operations={am_i_leader={requests=3,errors=0,avgRequestsPerSecond=12.056093724844207,5minRateRequestsPerSecond=0.0,15minRateRequestsPerSecond=0.0,avgTimePerRequest=0.24826999999999996,medianRequestTime=0.23618,75thPcRequestTime=0.366281,95thPcRequestTime=0.366281,99thPcRequestTime=0.366281,999thPcRequestTime=0.366281},overseerstatus={requests=0,errors=0,avgRequestsPerSecond=0.0,5minRateRequestsPerSecond=0.0,15minRateRequestsPerSecond=0.0,avgTimePerRequest=0.0,medianRequestTime=0.0,75thPcRequestTime=0.0,95thPcRequestTime=0.0,99thPcRequestTime=0.0,999thPcRequestTime=0.0}},overseer_queue={},overseer_internal_queue={peek={avgRequestsPerSecond=4.029471327639964,5minRateRequestsPerSecond=0.0,15minRateRequestsPerSecond=0.0,avgTimePerRequest=0.386591,medianRequestTime=0.386591,75thPcRequestTime=0.386591,95thPcRequestTime=0.386591,99thPcRequestTime=0.386591,999thPcRequestTime=0.386591}},collection_queue={peektopn_wait2000={avgRequestsPerSecond=4.146838420530951,5minRateRequestsPerSecond=0.0,15minRateRequestsPerSecond=0.0,avgTimePerRequest=239.583634,medianRequestTime=239.583634,75thPcRequestTime=239.583634,95thPcRequestTime=239.583634,99thPcRequestTime=239.583634,999thPcRequestTime=239.583634}}}
   [junit4]   2> 1380684 DEBUG (SyncThread:0) [    ] o.a.s.c.ZkTestServer Watch added: children: /solr/overseer/queue
   [junit4]   2> 1380684 DEBUG (SyncThread:0) [    ] o.a.s.c.ZkTestServer Watch added: children: /solr/overseer/collection-queue-work
   [junit4]   2> 1380685 INFO  (qtp216212786-15725) [n:127.0.0.1:33683_solr    ] o.a.s.s.HttpSolrCall [admin] webapp=null path=/admin/collections params={action=OVERSEERSTATUS&wt=javabin&version=2} status=0 QTime=13
   [junit4]   1> Formatting using clusterid: testClusterID
   [junit4]   2> 1380726 WARN  (SUITE-MoveReplicaHDFSTest-seed#[252E3C66407D4211]-worker) [    ] o.a.h.m.i.MetricsConfig Cannot locate configuration: tried hadoop-metrics2-namenode.properties,hadoop-metrics2.properties
   [junit4]   2> 1380744 WARN  (SUITE-MoveReplicaHDFSTest-seed#[252E3C66407D4211]-worker) [    ] o.a.h.h.HttpRequestLog Jetty request log can only be enabled using Log4j
   [junit4]   2> 1380746 INFO  (SUITE-MoveReplicaHDFSTest-seed#[252E3C66407D4211]-worker) [    ] o.m.log jetty-6.1.26
   [junit4]   2> 1380760 INFO  (SUITE-MoveReplicaHDFSTest-seed#[252E3C66407D4211]-worker) [    ] o.m.log Extract jar:file:/x1/jenkins/.ivy2/cache/org.apache.hadoop/hadoop-hdfs/tests/hadoop-hdfs-2.7.4-tests.jar!/webapps/hdfs to ./temp/Jetty_localhost_35860_hdfs____fxdo8q/webapp
   [junit4]   2> 1381113 INFO  (SUITE-MoveReplicaHDFSTest-seed#[252E3C66407D4211]-worker) [    ] o.m.log Started HttpServer2$SelectChannelConnectorWithSafeStartup@localhost:35860
   [junit4]   2> 1381227 WARN  (SUITE-MoveReplicaHDFSTest-seed#[252E3C66407D4211]-worker) [    ] o.a.h.h.HttpRequestLog Jetty request log can only be enabled using Log4j
   [junit4]   2> 1381229 INFO  (SUITE-MoveReplicaHDFSTest-seed#[252E3C66407D4211]-worker) [    ] o.m.log jetty-6.1.26
   [junit4]   2> 1381244 INFO  (SUITE-MoveReplicaHDFSTest-seed#[252E3C66407D4211]-worker) [    ] o.m.log Extract jar:file:/x1/jenkins/.ivy2/cache/org.apache.hadoop/hadoop-hdfs/tests/hadoop-hdfs-2.7.4-tests.jar!/webapps/datanode to ./temp/Jetty_localhost_42082_datanode____.9b4bot/webapp
   [junit4]   2> 1381484 DEBUG (ScheduledTrigger-6489-thread-3) [    ] o.a.s.c.a.NodeLostTrigger Running NodeLostTrigger: .auto_add_replicas with currently live nodes: 4
   [junit4]   2> 1381630 INFO  (SUITE-MoveReplicaHDFSTest-seed#[252E3C66407D4211]-worker) [    ] o.m.log Started HttpServer2$SelectChannelConnectorWithSafeStartup@localhost:42082
   [junit4]   2> 1381753 WARN  (SUITE-MoveReplicaHDFSTest-seed#[252E3C66407D4211]-worker) [    ] o.a.h.h.HttpRequestLog Jetty request log can only be enabled using Log4j
   [junit4]   2> 1381754 INFO  (SUITE-MoveReplicaHDFSTest-seed#[252E3C66407D4211]-worker) [    ] o.m.log jetty-6.1.26
   [junit4]   2> 1381785 INFO  (SUITE-MoveReplicaHDFSTest-seed#[252E3C66407D4211]-worker) [    ] o.m.log Extract jar:file:/x1/jenkins/.ivy2/cache/org.apache.hadoop/hadoop-hdfs/tests/hadoop-hdfs-2.7.4-tests.jar!/webapps/datanode to ./temp/Jetty_localhost_37355_datanode____beyumu/webapp
   [junit4]   2> 1381803 ERROR (DataNode: [[[DISK]file:/x1/jenkins/jenkins-slave/workspace/Lucene-Solr-Tests-master/solr/build/solr-core/test/J0/temp/solr.cloud.MoveReplicaHDFSTest_252E3C66407D4211-001/tempDir-002/hdfsBaseDir/data/data1/, [DISK]file:/x1/jenkins/jenkins-slave/workspace/Lucene-Solr-Tests-master/solr/build/solr-core/test/J0/temp/solr.cloud.MoveReplicaHDFSTest_252E3C66407D4211-001/tempDir-002/hdfsBaseDir/data/data2/]]  heartbeating to localhost/127.0.0.1:37728) [    ] o.a.h.h.s.d.DirectoryScanner dfs.datanode.directoryscan.throttle.limit.ms.per.sec set to value below 1 ms/sec. Assuming default value of 1000
   [junit4]   2> 1381823 INFO  (Block report processor) [    ] BlockStateChange BLOCK* processReport 0xbd0b1d1c473a3: from storage DS-66d9a77c-d817-4099-be90-f692b046e10f node DatanodeRegistration(127.0.0.1:46598, datanodeUuid=738ba5dc-dc1a-4d09-92e8-52d01245e405, infoPort=38279, infoSecurePort=0, ipcPort=46252, storageInfo=lv=-56;cid=testClusterID;nsid=1374446941;c=0), blocks: 0, hasStaleStorage: true, processing time: 0 msecs
   [junit4]   2> 1381823 INFO  (Block report processor) [    ] BlockStateChange BLOCK* processReport 0xbd0b1d1c473a3: from storage DS-2eace68a-e591-44bc-a529-378a270fe1bb node DatanodeRegistration(127.0.0.1:46598, datanodeUuid=738ba5dc-dc1a-4d09-92e8-52d01245e405, infoPort=38279, infoSecurePort=0, ipcPort=46252, storageInfo=lv=-56;cid=testClusterID;nsid=1374446941;c=0), blocks: 0, hasStaleStorage: false, processing time: 0 msecs
   [junit4]   2> 1382188 INFO  (SUITE-MoveReplicaHDFSTest-seed#[252E3C66407D4211]-worker) [    ] o.m.log Started HttpServer2$SelectChannelConnectorWithSafeStartup@localhost:37355
   [junit4]   2> 1382367 ERROR (DataNode: [[[DISK]file:/x1/jenkins/jenkins-slave/workspace/Lucene-Solr-Tests-master/solr/build/solr-core/test/J0/temp/solr.cloud.MoveReplicaHDFSTest_252E3C66407D4211-001/tempDir-002/hdfsBaseDir/data/data3/, [DISK]file:/x1/jenkins/jenkins-slave/workspace/Lucene-Solr-Tests-master/solr/build/solr-core/test/J0/temp/solr.cloud.MoveReplicaHDFSTest_252E3C66407D4211-001/tempDir-002/hdfsBaseDir/data/data4/]]  heartbeating to localhost/127.0.0.1:37728) [    ] o.a.h.h.s.d.DirectoryScanner dfs.datanode.directoryscan.throttle.limit.ms.per.sec set to value below 1 ms/sec. Assuming default value of 1000
   [junit4]   2> 1382403 INFO  (Block report processor) [    ] BlockStateChange BLOCK* processReport 0xbd0b1f451bff9: from storage DS-c3c4f596-abca-4927-827b-152bd18951f7 node DatanodeRegistration(127.0.0.1:33233, datanodeUuid=18dd440d-b921-444e-a1b7-1562c2780340, infoPort=32902, infoSecurePort=0, ipcPort=40688, storageInfo=lv=-56;cid=testClusterID;nsid=1374446941;c=0), blocks: 0, hasStaleStorage: true, processing time: 0 msecs
   [junit4]   2> 1382403 INFO  (Block report processor) [    ] BlockStateChange BLOCK* processReport 0xbd0b1f451bff9: from storage DS-059305e4-382e-46a0-9e48-569fd2fe6491 node DatanodeRegistration(127.0.0.1:33233, datanodeUuid=18dd440d-b921-444e-a1b7-1562c2780340, infoPort=32902, infoSecurePort=0, ipcPort=40688, storageInfo=lv=-56;cid=testClusterID;nsid=1374446941;c=0), blocks: 0, hasStaleStorage: false, processing time: 0 msecs
   [junit4]   2> 1382485 DEBUG (ScheduledTrigger-6489-thread-4) [    ] o.a.s.c.a.NodeLostTrigger Running NodeLostTrigger: .auto_add_replicas with currently live nodes: 4
   [junit4]   2> 1382680 DEBUG (OverseerCollectionConfigSetProcessor-72275546143129608-127.0.0.1:33683_solr-n_0000000000) [n:127.0.0.1:33683_solr    ] o.a.s.c.OverseerTaskProcessor Got 0 tasks from work-queue : [[]]
   [junit4]   2> 1382686 DEBUG (OverseerCollectionConfigSetProcessor-72275546143129608-127.0.0.1:33683_solr-n_0000000000) [n:127.0.0.1:33683_solr    ] o.a.s.c.OverseerTaskProcessor Cleaning up work-queue. #Running tasks: 0
   [junit4]   2> 1382691 INFO  (OverseerCollectionConfigSetProcessor-72275546143129608-127.0.0.1:33683_solr-n_0000000000) [n:127.0.0.1:33683_solr    ] o.a.s.c.OverseerTaskQueue Response ZK path: /overseer/collection-queue-work/qnr-0000000000 doesn't exist.  Requestor may have disconnected from ZooKeeper
   [junit4]   2> 1382702 DEBUG (OverseerCollectionConfigSetProcessor-72275546143129608-127.0.0.1:33683_solr-n_0000000000) [n:127.0.0.1:33683_solr    ] o.a.s.c.OverseerTaskProcessor RunningTasks: []
   [junit4]   2> 1382702 DEBUG (OverseerCollectionConfigSetProcessor-72275546143129608-127.0.0.1:33683_solr-n_0000000000) [n:127.0.0.1:33683_solr    ] o.a.s.c.OverseerTaskProcessor BlockedTasks: []
   [junit4]   2> 1382702 DEBUG (OverseerCollectionConfigSetProcessor-72275546143129608-127.0.0.1:33683_solr-n_0000000000) [n:127.0.0.1:33683_solr    ] o.a.s.c.OverseerTaskProcessor CompletedTasks: []
   [junit4]   2> 1382702 DEBUG (OverseerCollectionConfigSetProcessor-72275546143129608-127.0.0.1:33683_solr-n_0000000000) [n:127.0.0.1:33683_solr    ] o.a.s.c.OverseerTaskProcessor RunningZKTasks: []
   [junit4]   2> 1382704 DEBUG (OverseerCollectionConfigSetProcessor-72275546143129608-127.0.0.1:33683_solr-n_0000000000) [n:127.0.0.1:33683_solr    ] o.a.s.c.OverseerTaskQueue Peeking for top 100 elements. ExcludeSet: []
   [junit4]   2> 1382989 INFO  (TEST-MoveReplicaHDFSTest.testNormalMove-seed#[252E3C66407D4211]) [    ] o.a.s.SolrTestCaseJ4 ###Starting testNormalMove
   [junit4]   2> 1382989 DEBUG (SyncThread:0) [    ] o.a.s.c.ZkTestServer Watch added: create/delete: /solr/clusterprops.json
   [junit4]   2> 1382990 DEBUG (SyncThread:0) [    ] o.a.s.c.ZkTestServer Watch added: children: /solr/live_nodes
   [junit4]   2> 1382990 INFO  (TEST-MoveReplicaHDFSTest.testNormalMove-seed#[252E3C66407D4211]) [    ] o.a.s.c.c.ZkStateReader Updated live nodes from ZooKeeper... (0) -> (4)
   [junit4]   2> 1382990 DEBUG (SyncThread:0) [    ] o.a.s.c.ZkTestServer Watch added: data: /solr/clusterstate.json
   [junit4]   2> 1382996 DEBUG (SyncThread:0) [    ] o.a.s.c.ZkTestServer Watch added: children: /solr/collections
   [junit4]   2> 1382996 DEBUG (SyncThread:0) [    ] o.a.s.c.ZkTestServer Watch added: create/delete: /solr/aliases.json
   [junit4]   2> 1382997 DEBUG (SyncThread:0) [    ] o.a.s.c.ZkTestServer Watch fired: data: /solr/aliases.json
   [junit4]   2> 1382997 DEBUG (SyncThread:0) [    ] o.a.s.c.ZkTestServer Watch fired: data: /solr/aliases.json
   [junit4]   2> 1382997 DEBUG (SyncThread:0) [    ] o.a.s.c.ZkTestServer Watch fired: data: /solr/aliases.json
   [junit4]   2> 1382997 DEBUG (SyncThread:0) [    ] o.a.s.c.ZkTestServer Watch fired: data: /solr/aliases.json
   [junit4]   2> 1382997 DEBUG (SyncThread:0) [    ] o.a.s.c.ZkTestServer Watch fired: data: /solr/aliases.json
   [junit4]   2> 1382997 DEBUG (SyncThread:0) [    ] o.a.s.c.ZkTestServer Watch fired: data: /solr/aliases.json
   [junit4]   2> 1382997 DEBUG (SyncThread:0) [    ] o.a.s.c.ZkTestServer Watch fired: data: /solr/aliases.json
   [junit4]   2> 1382997 DEBUG (SyncThread:0) [    ] o.a.s.c.ZkTestServer Watch fired: data: /solr/aliases.json
   [junit4]   2> 1382997 DEBUG (SyncThread:0) [    ] o.a.s.c.ZkTestServer Watch fired: data: /solr/aliases.json
   [junit4]   2> 1382998 DEBUG (SyncThread:0) [    ] o.a.s.c.ZkTestServer Watch added: data: /solr/aliases.json
   [junit4]   2> 1382998 DEBUG (SyncThread:0) [    ] o.a.s.c.ZkTestServer Watch added: data: /solr/aliases.json
   [junit4]   2> 1382998 DEBUG (SyncThread:0) [    ] o.a.s.c.ZkTestServer Watch added: data: /solr/aliases.json
   [junit4]   2> 1382998 DEBUG (SyncThread:0) [    ] o.a.s.c.ZkTestServer Watch added: data: /solr/aliases.json
   [junit4]   2> 1382998 DEBUG (SyncThread:0) [    ] o.a.s.c.ZkTestServer Watch added: data: /solr/aliases.json
   [junit4]   2> 1382999 INFO  (TEST-MoveReplicaHDFSTest.testNormalMove-seed#[252E3C66407D4211]) [    ] o.e.j.s.Server jetty-9.4.11.v20180605; built: 2018-06-05T18:24:03.829Z; git: d5fc0523cfa96bfebfbda19606cad384d772f04c; jvm 1.8.0_172-b11
   [junit4]   2> 1383000 DEBUG (SyncThread:0) [    ] o.a.s.c.ZkTestServer Watch added: data: /solr/aliases.json
   [junit4]   2> 1383000 DEBUG (SyncThread:0) [    ] o.a.s.c.ZkTestServer Watch added: data: /solr/aliases.json
   [junit4]   2> 1383000 DEBUG (SyncThread:0) [    ] o.a.s.c.ZkTestServer Watch added: data: /solr/aliases.json
   [junit4]   2> 1383000 DEBUG (SyncThread:0) [    ] o.a.s.c.ZkTestServer Watch added: data: /solr/aliases.json
   [junit4]   2> 1383000 DEBUG (SyncThread:0) [    ] o.a.s.c.ZkTestServer Watch added: data: /solr/aliases.json
   [junit4]   2> 1383001 INFO  (TEST-MoveReplicaHDFSTest.testNormalMove-seed#[252E3C66407D4211]) [    ] o.e.j.s.session DefaultSessionIdManager workerName=node0
   [junit4]   2> 1383001 INFO  (TEST-MoveReplicaHDFSTest.testNormalMove-seed#[252E3C66407D4211]) [    ] o.e.j.s.session No SessionScavenger set, using defaults
   [junit4]   2> 1383001 INFO  (TEST-MoveReplicaHDFSTest.testNormalMove-seed#[252E3C66407D4211]) [    ] o.e.j.s.session node0 Scavenging every 600000ms
   [junit4]   2> 1383001 INFO  (TEST-MoveReplicaHDFSTest.testNormalMove-seed#[252E3C66407D4211]) [    ] o.e.j.s.h.ContextHandler Started o.e.j.s.ServletContextHandler@6b4045ff{/solr,null,AVAILABLE}
   [junit4]   2> 1383002 INFO  (TEST-MoveReplicaHDFSTest.testNormalMove-seed#[252E3C66407D4211]) [    ] o.e.j.s.AbstractConnector Started ServerConnector@6884936d{HTTP/1.1,[http/1.1]}{127.0.0.1:35359}
   [junit4]   2> 1383002 INFO  (TEST-MoveReplicaHDFSTest.testNormalMove-seed#[252E3C66407D4211]) [    ] o.e.j.s.Server Started @1383047ms
   [junit4]   2> 1383002 INFO  (TEST-MoveReplicaHDFSTest.testNormalMove-seed#[252E3C66407D4211]) [    ] o.a.s.c.s.e.JettySolrRunner Jetty properties: {hostContext=/solr, hostPort=35359}
   [junit4]   2> 1383002 ERROR (TEST-MoveReplicaHDFSTest.testNormalMove-seed#[252E3C66407D4211]) [    ] o.a.s.u.StartupLoggingUtils Missing Java Option solr.log.dir. Logging may be missing or incomplete.
   [junit4]   2> 1383002 INFO  (TEST-MoveReplicaHDFSTest.testNormalMove-seed#[252E3C66407D4211]) [    ] o.a.s.s.SolrDispatchFilter Using logger factory org.apache.logging.slf4j.Log4jLoggerFactory
   [junit4]   2> 1383002 INFO  (TEST-MoveReplicaHDFSTest.testNormalMove-seed#[252E3C66407D4211]) [    ] o.a.s.s.SolrDispatchFilter  ___      _       Welcome to Apache Solr™ version 8.0.0
   [junit4]   2> 1383002 INFO  (TEST-MoveReplicaHDFSTest.testNormalMove-seed#[252E3C66407D4211]) [    ] o.a.s.s.SolrDispatchFilter / __| ___| |_ _   Starting in cloud mode on port null
   [junit4]   2> 1383002 INFO  (TEST-MoveReplicaHDFSTest.testNormalMove-seed#[252E3C66407D4211]) [    ] o.a.s.s.SolrDispatchFilter \__ \/ _ \ | '_|  Install dir: null
   [junit4]   2> 1383002 INFO  (TEST-MoveReplicaHDFSTest.testNormalMove-seed#[252E3C66407D4211]) [    ] o.a.s.s.SolrDispatchFilter |___/\___/_|_|    Start time: 2018-09-04T04:55:29.998Z
   [junit4]   2> 1383006 INFO  (zkConnectionManagerCallback-4318-thread-1) [    ] o.a.s.c.c.ConnectionManager zkClient has connected
   [junit4]   2> 1383006 INFO  (TEST-MoveReplicaHDFSTest.testNormalMove-seed#[252E3C66407D4211]) [    ] o.a.s.s.SolrDispatchFilter solr.xml found in ZooKeeper. Loading...
   [junit4]   2> 1383202 INFO  (TEST-MoveReplicaHDFSTest.testNormalMove-seed#[252E3C66407D4211]) [    ] o.a.s.c.ZkContainer Zookeeper client=127.0.0.1:37908/solr
   [junit4]   2> 1383204 INFO  (zkConnectionManagerCallback-4322-thread-1) [    ] o.a.s.c.c.ConnectionManager zkClient has connected
   [junit4]   2> 1383204 DEBUG (TEST-MoveReplicaHDFSTest.testNormalMove-seed#[252E3C66407D4211]) [n:127.0.0.1:35359_solr    ] o.a.s.c.ZkController Added new OnReconnect listener org.apache.solr.cloud.ZkController$$Lambda$132/757785742@558be0f2
   [junit4]   2> 1383205 INFO  (zkConnectionManagerCallback-4324-thread-1) [    ] o.a.s.c.c.ConnectionManager zkClient has connected
   [junit4]   2> 1383210 DEBUG (SyncThread:0) [    ] o.a.s.c.ZkTestServer Watch added: create/delete: /solr/clusterprops.json
   [junit4]   2> 1383210 DEBUG (SyncThread:0) [    ] o.a.s.c.ZkTestServer Watch added: children: /solr/live_nodes
   [junit4]   2> 1383210 INFO  (TEST-MoveReplicaHDFSTest.testNormalMove-seed#[252E3C66407D4211]) [n:127.0.0.1:35359_solr    ] o.a.s.c.c.ZkStateReader Updated live nodes from ZooKeeper... (0) -> (4)
   [junit4]   2> 1383210 DEBUG (SyncThread:0) [    ] o.a.s.c.ZkTestServer Watch added: data: /solr/clusterstate.json
   [junit4]   2> 1383210 DEBUG (SyncThread:0) [    ] o.a.s.c.ZkTestServer Watch added: children: /solr/collections
   [junit4]   2> 1383211 DEBUG (SyncThread:0) [    ] o.a.s.c.ZkTestServer Watch added: create/delete: /solr/aliases.json
   [junit4]   2> 1383211 DEBUG (SyncThread:0) [    ] o.a.s.c.ZkTestServer Watch added: create/delete: /solr/security.json
   [junit4]   2> 1383212 DEBUG (TEST-MoveReplicaHDFSTest.testNormalMove-seed#[252E3C66407D4211]) [n:127.0.0.1:35359_solr    ] o.a.s.c.LeaderElector Joined leadership election with path: /overseer_elect/election/72275546143129621-127.0.0.1:35359_solr-n_0000000004
   [junit4]   2> 1383212 DEBUG (SyncThread:0) [    ] o.a.s.c.ZkTestServer Watch added: data: /solr/overseer_elect/election/72275546143129615-127.0.0.1:35761_solr-n_0000000003
   [junit4]   2> 1383212 DEBUG (TEST-MoveReplicaHDFSTest.testNormalMove-seed#[252E3C66407D4211]) [n:127.0.0.1:35359_solr    ] o.a.s.c.LeaderElector Watching path /overseer_elect/election/72275546143129615-127.0.0.1:35761_solr-n_0000000003 to know if I could be the leader
   [junit4]   2> 1383212 DEBUG (TEST-MoveReplicaHDFSTest.testNormalMove-seed#[252E3C66407D4211]) [n:127.0.0.1:35359_solr    ] o.a.s.c.ZkController Publish node=127.0.0.1:35359_solr as DOWN
   [junit4]   2> 1383213 DEBUG (SyncThread:0) [    ] o.a.s.c.ZkTestServer Watch fired: children: /solr/overseer/queue
   [junit4]   2> 1383213 INFO  (TEST-MoveReplicaHDFSTest.testNormalMove-seed#[252E3C66407D4211]) [n:127.0.0.1:35359_solr    ] o.a.s.c.TransientSolrCoreCacheDefault Allocating transient cache for 2147483647 transient cores
   [junit4]   2> 1383213 INFO  (TEST-MoveReplicaHDFSTest.testNormalMove-seed#[252E3C66407D4211]) [n:127.0.0.1:35359_solr    ] o.a.s.c.ZkController Register node as live in ZooKeeper:/live_nodes/127.0.0.1:35359_solr
   [junit4]   2> 1383213 DEBUG (SyncThread:0) [    ] o.a.s.c.ZkTestServer Watch added: children: /solr/overseer/queue
   [junit4]   2> 1383213 DEBUG (SyncThread:0) [    ] o.a.s.c.ZkTestServer Watch fired: children: /solr/live_nodes
   [junit4]   2> 1383214 DEBUG (SyncThread:0) [    ] o.a.s.c.ZkTestServer Watch fired: children: /solr/live_nodes
   [junit4]   2> 1383214 DEBUG (SyncThread:0) [    ] o.a.s.c.ZkTestServer Watch fired: children: /solr/live_nodes
   [junit4]   2> 1383214 DEBUG (SyncThread:0) [    ] o.a.s.c.ZkTestServer Watch fired: children: /solr/live_nodes
   [junit4]   2> 1383214 DEBUG (SyncThread:0) [    ] o.a.s.c.ZkTestServer Watch fired: children: /solr/live_nodes
   [junit4]   2> 1383214 DEBUG (SyncThread:0) [    ] o.a.s.c.ZkTestServer Watch fired: children: /solr/live_nodes
   [junit4]   2> 1383214 DEBUG (SyncThread:0) [    ] o.a.s.c.ZkTestServer Watch fired: children: /solr/live_nodes
   [junit4]   2> 1383214 DEBUG (SyncThread:0) [    ] o.a.s.c.ZkTestServer Watch fired: children: /solr/live_nodes
   [junit4]   2> 1383214 DEBUG (SyncThread:0) [    ] o.a.s.c.ZkTestServer Watch fired: children: /solr/live_nodes
   [junit4]   2> 1383214 DEBUG (SyncThread:0) [    ] o.a.s.c.ZkTestServer Watch fired: children: /solr/live_nodes
   [junit4]   2> 1383214 DEBUG (SyncThread:0) [    ] o.a.s.c.ZkTestServer Watch added: children: /solr/live_nodes
   [junit4]   2> 1383214 DEBUG (SyncThread:0) [    ] o.a.s.c.ZkTestServer Watch added: children: /solr/live_nodes
   [junit4]   2> 1383214 DEBUG (SyncThread:0) [    ] o.a.s.c.ZkTestServer Watch added: children: /solr/live_nodes
   [junit4]   2> 1383214 DEBUG (SyncThread:0) [    ] o.a.s.c.ZkTestServer Watch added: children: /solr/live_nodes
   [junit4]   2> 1383214 INFO  (zkCallback-4256-thread-1) [    ] o.a.s.c.c.ZkStateReader Updated live nodes from ZooKeeper... (4) -> (5)
   [junit4]   2> 1383214 INFO  (zkCallback-4277-thread-1) [    ] o.a.s.c.c.ZkStateReader Updated live nodes from ZooKeeper... (4) -> (5)
   [junit4]   2> 1383214 INFO  (zkCallback-4305-thread-1) [    ] o.a.s.c.c.ZkStateReader Updated live nodes from ZooKeeper... (4) -> (5)
   [junit4]   2> 1383219 INFO  (zkCallback-4298-thread-1) [    ] o.a.s.c.c.ZkStateReader Updated live nodes from ZooKeeper... (4) -> (5)
   [junit4]   2> 1383219 DEBUG (SyncThread:0) [    ] o.a.s.c.ZkTestServer Watch added: children: /solr/live_nodes
   [junit4]   2> 1383219 DEBUG (SyncThread:0) [    ] o.a.s.c.ZkTestServer Watch added: children: /solr/live_nodes
   [junit4]   2> 1383219 DEBUG (SyncThread:0) [    ] o.a.s.c.ZkTestServer Watch added: children: /solr/live_nodes
   [junit4]   2> 1383219 DEBUG (SyncThread:0) [    ] o.a.s.c.ZkTestServer Watch added: children: /solr/live_nodes
   [junit4]   2> 1383219 INFO  (zkCallback-4290-thread-1) [    ] o.a.s.c.c.ZkStateReader Updated live nodes from ZooKeeper... (4) -> (5)
   [junit4]   2> 1383219 DEBUG (SyncThread:0) [    ] o.a.s.c.ZkTestServer Watch added: children: /solr/live_nodes
   [junit4]   2> 1383219 INFO  (zkCallback-4323-thread-1) [    ] o.a.s.c.c.ZkStateReader Updated live nodes from ZooKeeper... (4) -> (5)
   [junit4]   2> 1383219 DEBUG (SyncThread:0) [    ] o.a.s.c.ZkTestServer Watch added: children: /solr/live_nodes
   [junit4]   2> 1383219 DEBUG (SyncThread:0) [    ] o.a.s.c.ZkTestServer Watch added: children: /solr/live_nodes
   [junit4]   2> 1383219 INFO  (zkCallback-4285-thread-1) [    ] o.a.s.c.c.ZkStateReader Updated live nodes from ZooKeeper... (4) -> (5)
   [junit4]   2> 1383219 INFO  (zkCallback-4313-thread-2) [    ] o.a.s.c.c.ZkStateReader Updated live nodes from ZooKeeper... (4) -> (5)
   [junit4]   2> 1383219 INFO  (zkCallback-4313-thread-1) [    ] o.a.s.c.c.ZkStateReader Updated live nodes from ZooKeeper... (4) -> (5)
   [junit4]   2> 1383219 DEBUG (OverseerStateUpdate-72275546143129608-127.0.0.1:33683_solr-n_0000000000) [n:127.0.0.1:33683_solr    ] o.a.s.c.Overseer processMessage: queueSize: 1, message = {
   [junit4]   2>   "operation":"downnode",
   [junit4]   2>   "node_name":"127.0.0.1:35359_solr"} current state version: 0
   [junit4]   2> 1383219 INFO  (zkCallback-4273-thread-1) [    ] o.a.s.c.c.ZkStateReader Updated live nodes from ZooKeeper... (4) -> (5)
   [junit4]   2> 1383219 INFO  (zkCallback-4266-thread-1) [    ] o.a.s.c.c.ZkStateReader Updated live nodes from ZooKeeper... (4) -> (5)
   [junit4]   2> 1383233 INFO  (zkConnectionManagerCallback-4331-thread-1) [    ] o.a.s.c.c.ConnectionManager zkClient has connected
   [junit4]   2> 1383234 DEBUG (SyncThread:0) [    ] o.a.s.c.ZkTestServer Watch added: create/delete: /solr/clusterprops.json
   [junit4]   2> 1383234 DEBUG (SyncThread:0) [    ] o.a.s.c.ZkTestServer Watch added: children: /solr/live_nodes
   [junit4]   2> 1383234 INFO  (TEST-MoveReplicaHDFSTest.testNormalMove-seed#[252E3C66407D4211]) [n:127.0.0.1:35359_solr    ] o.a.s.c.c.ZkStateReader Updated live nodes from ZooKeeper... (0) -> (5)
   [junit4]   2> 1383234 DEBUG (SyncThread:0) [    ] o.a.s.c.ZkTestServer Watch added: data: /solr/clusterstate.json
   [junit4]   2> 1383234 DEBUG (SyncThread:0) [    ] o.a.s.c.ZkTestServer Watch added: children: /solr/collections
   [junit4]   2> 1383234 DEBUG (SyncThread:0) [    ] o.a.s.c.ZkTestServer Watch added: create/delete: /solr/aliases.json
   [junit4]   2> 1383235 INFO  (TEST-MoveReplicaHDFSTest.testNormalMove-seed#[252E3C66407D4211]) [n:127.0.0.1:35359_solr    ] o.a.s.c.s.i.ZkClientClusterStateProvider Cluster at 127.0.0.1:37908/solr ready
   [junit4]   2> 1383235 INFO  (TEST-MoveReplicaHDFSTest.testNormalMove-seed#[252E3C66407D4211]) [n:127.0.0.1:35359_solr    ] o.a.s.h.a.MetricsHistoryHandler No .system collection, keeping metrics history in memory.
   [junit4]   2> 1383252 INFO  (TEST-MoveReplicaHDFSTest.testNormalMove-seed#[252E3C66407D4211]) [n:127.0.0.1:35359_solr    ] o.a.s.m.r.SolrJmxReporter JMX monitoring for 'solr_35359.solr.node' (registry 'solr.node') enabled at server: com.sun.jmx.mbeanserver.JmxMBeanServer@56caf261
   [junit4]   2> 1383260 INFO  (TEST-MoveReplicaHDFSTest.testNormalMove-seed#[252E3C66407D4211]) [n:127.0.0.1:35359_solr    ] o.a.s.m.r.SolrJmxReporter JMX monitoring for 'solr_35359.solr.jvm' (registry 'solr.jvm') enabled at server: com.sun.jmx.mbeanserver.JmxMBeanServer@56caf261
   [junit4]   2> 1383261 INFO  (TEST-MoveReplicaHDFSTest.testNormalMove-seed#[252E3C66407D4211]) [n:127.0.0.1:35359_solr    ] o.a.s.m.r.SolrJmxReporter JMX monitoring for 'solr_35359.solr.jetty' (registry 'solr.jetty') enabled at server: com.sun.jmx.mbeanserver.JmxMBeanServer@56caf261
   [junit4]   2> 1383262 INFO  (TEST-MoveReplicaHDFSTest.testNormalMove-seed#[252E3C66407D4211]) [n:127.0.0.1:35359_solr    ] o.a.s.c.CorePropertiesLocator Found 0 core definitions underneath /x1/jenkins/jenkins-slave/workspace/Lucene-Solr-Tests-master/solr/build/solr-core/test/J0/temp/solr.cloud.MoveReplicaHDFSTest_252E3C66407D4211-001/tempDir-001/node5/.
   [junit4]   2> 1383315 INFO  (zkConnectionManagerCallback-4334-thread-1) [    ] o.a.s.c.c.ConnectionManager zkClient has connected
   [junit4]   2> 1383317 INFO  (TEST-MoveReplicaHDFSTest.testNormalMove-seed#[252E3C66407D4211]) [    ] o.a.s.c.MoveReplicaTest total_jettys: 5
   [junit4]   2> 1383317 INFO  (qtp216212786-15699) [n:127.0.0.1:33683_solr    ] o.a.s.h.a.CollectionsHandler Invoked Collection Action :create with params collection.configName=conf1&maxShardsPerNode=2&autoAddReplicas=false&name=MoveReplicaHDFSTest_coll_false&nrtReplicas=2&action=CREATE&numShards=2&wt=javabin&version=2 and sendToOCPQueue=true
   [junit4]   2> 1383318 DEBUG (SyncThread:0) [    ] o.a.s.c.ZkTestServer Watch fired: children: /solr/overseer/collection-queue-work
   [junit4]   2> 1383320 DEBUG (SyncThread:0) [    ] o.a.s.c.ZkTestServer Watch added: create/delete: /solr/overseer/collection-queue-work/qnr-0000000002
   [junit4]   2> 1383320 DEBUG (SyncThread:0) [    ] o.a.s.c.ZkTestServer Watch added: children: /solr/overseer/collection-queue-work
   [junit4]   2> 1383320 DEBUG (SyncThread:0) [    ] o.a.s.c.ZkTestServer Watch fired: children: /solr/overseer/queue
   [junit4]   2> 1383321 DEBUG (OverseerCollectionConfigSetProcessor-72275546143129608-127.0.0.1:33683_solr-n_0000000000) [n:127.0.0.1:33683_solr    ] o.a.s.c.ZkDistributedQueue Found child node with improper name: qnr-0000000002
   [junit4]   2> 1383321 DEBUG (SyncThread:0) [    ] o.a.s.c.ZkTestServer Watch fired: children: /solr/overseer/collection-queue-work
   [junit4]   2> 1383321 DEBUG (SyncThread:0) [    ] o.a.s.c.ZkTestServer Watch added: children: /solr/overseer/collection-queue-work
   [junit4]   2> 1383321 DEBUG (OverseerCollectionConfigSetProcessor-72275546143129608-127.0.0.1:33683_solr-n_0000000000) [n:127.0.0.1:33683_solr    ] o.a.s.c.ZkDistributedQueue Found child node with improper name: qnr-0000000002
   [junit4]   2> 1383321 DEBUG (SyncThread:0) [    ] o.a.s.c.ZkTestServer Watch added: children: /solr/overseer/queue
   [junit4]   2> 1383321 DEBUG (OverseerCollectionConfigSetProcessor-72275546143129608-127.0.0.1:33683_solr-n_0000000000) [n:127.0.0.1:33683_solr    ] o.a.s.c.OverseerTaskQueue Returning topN elements: [/overseer/collection-queue-work/qn-0000000002, ]
   [junit4]   2> 1383321 DEBUG (OverseerCollectionConfigSetProcessor-72275546143129608-127.0.0.1:33683_solr-n_0000000000) [n:127.0.0.1:33683_solr    ] o.a.s.c.OverseerTaskProcessor Got 1 tasks from work-queue : [[org.apache.solr.cloud.OverseerTaskQueue$QueueEvent@2e684ed1]]
   [junit4]   2> 1383321 DEBUG (OverseerCollectionConfigSetProcessor-72275546143129608-127.0.0.1:33683_solr-n_0000000000) [n:127.0.0.1:33683_solr    ] o.a.s.c.OverseerTaskProcessor Marked task [/overseer/collection-queue-work/qn-0000000002] as running
   [junit4]   2> 1383321 DEBUG (OverseerCollectionConfigSetProcessor-72275546143129608-127.0.0.1:33683_solr-n_0000000000) [n:127.0.0.1:33683_solr    ] o.a.s.c.OverseerTaskProcessor Overseer Collection Message Handler: Get the message id:/overseer/collection-queue-work/qn-0000000002 message:{
   [junit4]   2>   "name":"MoveReplicaHDFSTest_coll_false",
   [junit4]   2>   "fromApi":"true",
   [junit4]   2>   "collection.configName":"conf1",
   [junit4]   2>   "numShards":"2",
   [junit4]   2>   "maxShardsPerNode":"2",
   [junit4]   2>   "autoAddReplicas":"false",
   [junit4]   2>   "nrtReplicas":"2",
   [junit4]   2>   "stateFormat":"2",
   [junit4]   2>   "replicationFactor":"2",
   [junit4]   2>   "operation":"create"}
   [junit4]   2> 1383322 DEBUG (OverseerThreadFactory-6491-thread-2-processing-n:127.0.0.1:33683_solr) [n:127.0.0.1:33683_solr    ] o.a.s.c.OverseerTaskProcessor Runner processing /overseer/collection-queue-work/qn-0000000002
   [junit4]   2> 1383322 DEBUG (OverseerThreadFactory-6491-thread-2-processing-n:127.0.0.1:33683_solr) [n:127.0.0.1:33683_solr    ] o.a.s.c.a.c.OverseerCollectionMessageHandler OverseerCollectionMessageHandler.processMessage : create , {
   [junit4]   2>   "name":"MoveReplicaHDFSTest_coll_false",
   [junit4]   2>   "fromApi":"true",
   [junit4]   2>   "collection.configName":"conf1",
   [junit4]   2>   "numShards":"2",
   [junit4]   2>   "maxShardsPerNode":"2",
   [junit4]   2>   "autoAddReplicas":"false",
   [junit4]   2>   "nrtReplicas":"2",
   [junit4]   2>   "stateFormat":"2",
   [junit4]   2>   "replicationFactor":"2",
   [junit4]   2>   "operation":"create"}
   [junit4]   2> 1383322 INFO  (OverseerThreadFactory-6491-thread-2-processing-n:127.0.0.1:33683_solr) [n:127.0.0.1:33683_solr    ] o.a.s.c.a.c.CreateCollectionCmd Create collection MoveReplicaHDFSTest_coll_false
   [junit4]   2> 1383322 DEBUG (OverseerCollectionConfigSetProcessor-72275546143129608-127.0.0.1:33683_solr-n_0000000000) [n:127.0.0.1:33683_solr    ] o.a.s.c.OverseerTaskProcessor Cleaning up work-queue. #Running tasks: 1
   [junit4]   2> 1383322 DEBUG (OverseerCollectionConfigSetProcessor-72275546143129608-127.0.0.1:33683_solr-n_0000000000) [n:127.0.0.1:33683_solr    ] o.a.s.c.OverseerTaskProcessor RunningTasks: [/overseer/collection-queue-work/qn-0000000002]
   [junit4]   2> 1383322 DEBUG (OverseerCollectionConfigSetProcessor-72275546143129608-127.0.0.1:33683_solr-n_0000000000) [n:127.0.0.1:33683_solr    ] o.a.s.c.OverseerTaskProcessor BlockedTasks: []
   [junit4]   2> 1383322 DEBUG (OverseerCollectionConfigSetProcessor-72275546143129608-127.0.0.1:33683_solr-n_0000000000) [n:127.0.0.1:33683_solr    ] o.a.s.c.OverseerTaskProcessor CompletedTasks: []
   [junit4]   2> 1383322 DEBUG (OverseerCollectionConfigSetProcessor-72275546143129608-127.0.0.1:33683_solr-n_0000000000) [n:127.0.0.1:33683_solr    ] o.a.s.c.OverseerTaskProcessor RunningZKTasks: [/overseer/collection-queue-work/qn-0000000002]
   [junit4]   2> 1383322 DEBUG (OverseerCollectionConfigSetProcessor-72275546143129608-127.0.0.1:33683_solr-n_0000000000) [n:127.0.0.1:33683_solr    ] o.a.s.c.OverseerTaskQueue Peeking for top 99 elements. ExcludeSet: [/overseer/collection-queue-work/qn-0000000002],[]
   [junit4]   2> 1383322 DEBUG (OverseerThreadFactory-6491-thread-2-processing-n:127.0.0.1:33683_solr) [n:127.0.0.1:33683_solr    ] o.a.s.c.a.c.OverseerCollectionMessageHandler creating collections conf node /collections/MoveReplicaHDFSTest_coll_false 
   [junit4]   2> 1383323 DEBUG (SyncThread:0) [    ] o.a.s.c.ZkTestServer Watch fired: children: /solr/collections
   [junit4]   2> 1383323 DEBUG (SyncThread:0) [    ] o.a.s.c.ZkTestServer Watch fired: children: /solr/collections
   [junit4]   2> 1383323 DEBUG (SyncThread:0) [    ] o.a.s.c.ZkTestServer Watch fired: children: /solr/collections
   [junit4]   2> 1383323 DEBUG (SyncThread:0) [    ] o.a.s.c.ZkTestServer Watch fired: children: /solr/collections
   [junit4]   2> 1383323 DEBUG (SyncThread:0) [    ] o.a.s.c.ZkTestServer Watch fired: children: /solr/collections
   [junit4]   2> 1383323 DEBUG (SyncThread:0) [    ] o.a.s.c.ZkTestServer Watch fired: children: /solr/collections
   [junit4]   2> 1383323 DEBUG (SyncThread:0) [    ] o.a.s.c.ZkTestServer Watch fired: children: /solr/collections
   [junit4]   2> 1383323 DEBUG (SyncThread:0) [    ] o.a.s.c.ZkTestServer Watch fired: children: /solr/collections
   [junit4]   2> 1383323 DEBUG (SyncThread:0) [    ] o.a.s.c.ZkTestServer Watch fired: children: /solr/collections
   [junit4]   2> 1383323 DEBUG (SyncThread:0) [    ] o.a.s.c.ZkTestServer Watch fired: children: /solr/collections
   [junit4]   2> 1383323 DEBUG (SyncThread:0) [    ] o.a.s.c.ZkTestServer Watch fired: children: /solr/collections
   [junit4]   2> 1383323 DEBUG (SyncThread:0) [    ] o.a.s.c.ZkTestServer Watch added: children: /solr/collections
   [junit4]   2> 138

[...truncated too long message...]

ivy.jars.list as its length is 0.

-ivy-fail-disallowed-ivy-version:

ivy-fail:

ivy-fail:

ivy-configure:
[ivy:configure] :: loading settings :: file = /x1/jenkins/jenkins-slave/workspace/Lucene-Solr-Tests-master/lucene/top-level-ivy-settings.xml

resolve:

ivy-availability-check:
[loadresource] Do not set property disallowed.ivy.jars.list as its length is 0.

-ivy-fail-disallowed-ivy-version:

ivy-fail:

ivy-configure:
[ivy:configure] :: loading settings :: file = /x1/jenkins/jenkins-slave/workspace/Lucene-Solr-Tests-master/lucene/top-level-ivy-settings.xml

resolve:

ivy-availability-check:
[loadresource] Do not set property disallowed.ivy.jars.list as its length is 0.

-ivy-fail-disallowed-ivy-version:

ivy-fail:

ivy-fail:

ivy-configure:
[ivy:configure] :: loading settings :: file = /x1/jenkins/jenkins-slave/workspace/Lucene-Solr-Tests-master/lucene/top-level-ivy-settings.xml

resolve:

ivy-availability-check:
[loadresource] Do not set property disallowed.ivy.jars.list as its length is 0.

-ivy-fail-disallowed-ivy-version:

ivy-fail:

ivy-configure:
[ivy:configure] :: loading settings :: file = /x1/jenkins/jenkins-slave/workspace/Lucene-Solr-Tests-master/lucene/top-level-ivy-settings.xml

resolve:

ivy-availability-check:
[loadresource] Do not set property disallowed.ivy.jars.list as its length is 0.

-ivy-fail-disallowed-ivy-version:

ivy-fail:

ivy-fail:

ivy-configure:
[ivy:configure] :: loading settings :: file = /x1/jenkins/jenkins-slave/workspace/Lucene-Solr-Tests-master/lucene/top-level-ivy-settings.xml

resolve:

ivy-availability-check:
[loadresource] Do not set property disallowed.ivy.jars.list as its length is 0.

-ivy-fail-disallowed-ivy-version:

ivy-fail:

ivy-fail:

ivy-configure:
[ivy:configure] :: loading settings :: file = /x1/jenkins/jenkins-slave/workspace/Lucene-Solr-Tests-master/lucene/top-level-ivy-settings.xml

resolve:

ivy-availability-check:
[loadresource] Do not set property disallowed.ivy.jars.list as its length is 0.

-ivy-fail-disallowed-ivy-version:

ivy-fail:

ivy-fail:

ivy-configure:
[ivy:configure] :: loading settings :: file = /x1/jenkins/jenkins-slave/workspace/Lucene-Solr-Tests-master/lucene/top-level-ivy-settings.xml

resolve:

ivy-availability-check:
[loadresource] Do not set property disallowed.ivy.jars.list as its length is 0.

-ivy-fail-disallowed-ivy-version:

ivy-fail:

ivy-fail:

ivy-configure:
[ivy:configure] :: loading settings :: file = /x1/jenkins/jenkins-slave/workspace/Lucene-Solr-Tests-master/lucene/top-level-ivy-settings.xml

resolve:

ivy-availability-check:
[loadresource] Do not set property disallowed.ivy.jars.list as its length is 0.

-ivy-fail-disallowed-ivy-version:

ivy-fail:

ivy-fail:

ivy-configure:
[ivy:configure] :: loading settings :: file = /x1/jenkins/jenkins-slave/workspace/Lucene-Solr-Tests-master/lucene/top-level-ivy-settings.xml

resolve:

ivy-availability-check:
[loadresource] Do not set property disallowed.ivy.jars.list as its length is 0.

-ivy-fail-disallowed-ivy-version:

ivy-fail:

ivy-fail:

ivy-configure:
[ivy:configure] :: loading settings :: file = /x1/jenkins/jenkins-slave/workspace/Lucene-Solr-Tests-master/lucene/top-level-ivy-settings.xml

resolve:

ivy-availability-check:
[loadresource] Do not set property disallowed.ivy.jars.list as its length is 0.

-ivy-fail-disallowed-ivy-version:

ivy-fail:

ivy-fail:

ivy-configure:
[ivy:configure] :: loading settings :: file = /x1/jenkins/jenkins-slave/workspace/Lucene-Solr-Tests-master/lucene/top-level-ivy-settings.xml

resolve:

ivy-availability-check:
[loadresource] Do not set property disallowed.ivy.jars.list as its length is 0.

-ivy-fail-disallowed-ivy-version:

ivy-fail:

ivy-fail:

ivy-configure:
[ivy:configure] :: loading settings :: file = /x1/jenkins/jenkins-slave/workspace/Lucene-Solr-Tests-master/lucene/top-level-ivy-settings.xml

resolve:

ivy-availability-check:
[loadresource] Do not set property disallowed.ivy.jars.list as its length is 0.

-ivy-fail-disallowed-ivy-version:

ivy-fail:

ivy-fail:

ivy-configure:
[ivy:configure] :: loading settings :: file = /x1/jenkins/jenkins-slave/workspace/Lucene-Solr-Tests-master/lucene/top-level-ivy-settings.xml

resolve:

ivy-availability-check:
[loadresource] Do not set property disallowed.ivy.jars.list as its length is 0.

-ivy-fail-disallowed-ivy-version:

ivy-fail:

ivy-fail:

ivy-configure:
[ivy:configure] :: loading settings :: file = /x1/jenkins/jenkins-slave/workspace/Lucene-Solr-Tests-master/lucene/top-level-ivy-settings.xml

resolve:

jar-checksums:
    [mkdir] Created dir: /x1/jenkins/jenkins-slave/workspace/Lucene-Solr-Tests-master/solr/null2020772171
     [copy] Copying 238 files to /x1/jenkins/jenkins-slave/workspace/Lucene-Solr-Tests-master/solr/null2020772171
   [delete] Deleting directory /x1/jenkins/jenkins-slave/workspace/Lucene-Solr-Tests-master/solr/null2020772171

check-working-copy:
[ivy:cachepath] :: resolving dependencies :: org.eclipse.jgit#org.eclipse.jgit-caller;working
[ivy:cachepath] 	confs: [default]
[ivy:cachepath] 	found org.eclipse.jgit#org.eclipse.jgit;4.6.0.201612231935-r in public
[ivy:cachepath] 	found com.jcraft#jsch;0.1.53 in public
[ivy:cachepath] 	found com.googlecode.javaewah#JavaEWAH;1.1.6 in public
[ivy:cachepath] 	found org.apache.httpcomponents#httpclient;4.3.6 in public
[ivy:cachepath] 	found org.apache.httpcomponents#httpcore;4.3.3 in public
[ivy:cachepath] 	found commons-logging#commons-logging;1.1.3 in public
[ivy:cachepath] 	found commons-codec#commons-codec;1.6 in public
[ivy:cachepath] 	found org.slf4j#slf4j-api;1.7.2 in public
[ivy:cachepath] :: resolution report :: resolve 22ms :: artifacts dl 1ms
	---------------------------------------------------------------------
	|                  |            modules            ||   artifacts   |
	|       conf       | number| search|dwnlded|evicted|| number|dwnlded|
	---------------------------------------------------------------------
	|      default     |   8   |   0   |   0   |   0   ||   8   |   0   |
	---------------------------------------------------------------------
[wc-checker] Initializing working copy...
[wc-checker] SLF4J: Failed to load class "org.slf4j.impl.StaticLoggerBinder".
[wc-checker] SLF4J: Defaulting to no-operation (NOP) logger implementation
[wc-checker] SLF4J: See http://www.slf4j.org/codes.html#StaticLoggerBinder for further details.
[wc-checker] Checking working copy status...

-jenkins-base:

BUILD SUCCESSFUL
Total time: 96 minutes 38 seconds
Archiving artifacts
java.lang.InterruptedException: no matches found within 10000
	at hudson.FilePath$34.hasMatch(FilePath.java:2678)
	at hudson.FilePath$34.invoke(FilePath.java:2557)
	at hudson.FilePath$34.invoke(FilePath.java:2547)
	at hudson.FilePath$FileCallableWrapper.call(FilePath.java:2918)
Also:   hudson.remoting.Channel$CallSiteStackTrace: Remote call to lucene
		at hudson.remoting.Channel.attachCallSiteStackTrace(Channel.java:1741)
		at hudson.remoting.UserRequest$ExceptionResponse.retrieve(UserRequest.java:357)
		at hudson.remoting.Channel.call(Channel.java:955)
		at hudson.FilePath.act(FilePath.java:1036)
		at hudson.FilePath.act(FilePath.java:1025)
		at hudson.FilePath.validateAntFileMask(FilePath.java:2547)
		at hudson.tasks.ArtifactArchiver.perform(ArtifactArchiver.java:243)
		at hudson.tasks.BuildStepCompatibilityLayer.perform(BuildStepCompatibilityLayer.java:81)
		at hudson.tasks.BuildStepMonitor$1.perform(BuildStepMonitor.java:20)
		at hudson.model.AbstractBuild$AbstractBuildExecution.perform(AbstractBuild.java:744)
		at hudson.model.AbstractBuild$AbstractBuildExecution.performAllBuildSteps(AbstractBuild.java:690)
		at hudson.model.Build$BuildExecution.post2(Build.java:186)
		at hudson.model.AbstractBuild$AbstractBuildExecution.post(AbstractBuild.java:635)
		at hudson.model.Run.execute(Run.java:1819)
		at hudson.model.FreeStyleBuild.run(FreeStyleBuild.java:43)
		at hudson.model.ResourceController.execute(ResourceController.java:97)
		at hudson.model.Executor.run(Executor.java:429)
Caused: hudson.FilePath$TunneledInterruptedException
	at hudson.FilePath$FileCallableWrapper.call(FilePath.java:2920)
	at hudson.remoting.UserRequest.perform(UserRequest.java:212)
	at hudson.remoting.UserRequest.perform(UserRequest.java:54)
	at hudson.remoting.Request$2.run(Request.java:369)
	at hudson.remoting.InterceptingExecutorService$1.call(InterceptingExecutorService.java:72)
	at java.util.concurrent.FutureTask.run(FutureTask.java:266)
	at java.util.concurrent.ThreadPoolExecutor.runWorker(ThreadPoolExecutor.java:1142)
	at java.util.concurrent.ThreadPoolExecutor$Worker.run(ThreadPoolExecutor.java:617)
	at java.lang.Thread.run(Thread.java:748)
Caused: java.lang.InterruptedException: java.lang.InterruptedException: no matches found within 10000
	at hudson.FilePath.act(FilePath.java:1038)
	at hudson.FilePath.act(FilePath.java:1025)
	at hudson.FilePath.validateAntFileMask(FilePath.java:2547)
	at hudson.tasks.ArtifactArchiver.perform(ArtifactArchiver.java:243)
	at hudson.tasks.BuildStepCompatibilityLayer.perform(BuildStepCompatibilityLayer.java:81)
	at hudson.tasks.BuildStepMonitor$1.perform(BuildStepMonitor.java:20)
	at hudson.model.AbstractBuild$AbstractBuildExecution.perform(AbstractBuild.java:744)
	at hudson.model.AbstractBuild$AbstractBuildExecution.performAllBuildSteps(AbstractBuild.java:690)
	at hudson.model.Build$BuildExecution.post2(Build.java:186)
	at hudson.model.AbstractBuild$AbstractBuildExecution.post(AbstractBuild.java:635)
	at hudson.model.Run.execute(Run.java:1819)
	at hudson.model.FreeStyleBuild.run(FreeStyleBuild.java:43)
	at hudson.model.ResourceController.execute(ResourceController.java:97)
	at hudson.model.Executor.run(Executor.java:429)
No artifacts found that match the file pattern "**/*.events,heapdumps/**,**/hs_err_pid*". Configuration error?
Recording test results
Build step 'Publish JUnit test result report' changed build result to UNSTABLE
Email was triggered for: Unstable (Test Failures)
Sending email for trigger: Unstable (Test Failures)

Mime
View raw message