lucene-dev mailing list archives

Site index · List index
Message view « Date » · « Thread »
Top « Date » · « Thread »
From Apache Jenkins Server <jenk...@builds.apache.org>
Subject [JENKINS] Lucene-Solr-NightlyTests-7.x - Build # 329 - Failure
Date Thu, 27 Sep 2018 07:40:34 GMT
Build: https://builds.apache.org/job/Lucene-Solr-NightlyTests-7.x/329/

2 tests failed.
FAILED:  org.apache.solr.cloud.FullSolrCloudDistribCmdsTest.test

Error Message:
No live SolrServers available to handle this request:[http://127.0.0.1:38828/collection2, http://127.0.0.1:41411/collection2, http://127.0.0.1:41270/collection2, http://127.0.0.1:34380/collection2, http://127.0.0.1:39633/collection2]

Stack Trace:
org.apache.solr.client.solrj.SolrServerException: No live SolrServers available to handle this request:[http://127.0.0.1:38828/collection2, http://127.0.0.1:41411/collection2, http://127.0.0.1:41270/collection2, http://127.0.0.1:34380/collection2, http://127.0.0.1:39633/collection2]
	at __randomizedtesting.SeedInfo.seed([1485DDF7CA87529D:9CD1E22D647B3F65]:0)
	at org.apache.solr.client.solrj.impl.LBHttpSolrClient.request(LBHttpSolrClient.java:462)
	at org.apache.solr.client.solrj.impl.CloudSolrClient.sendRequest(CloudSolrClient.java:1107)
	at org.apache.solr.client.solrj.impl.CloudSolrClient.requestWithRetryOnStaleState(CloudSolrClient.java:884)
	at org.apache.solr.client.solrj.impl.CloudSolrClient.request(CloudSolrClient.java:817)
	at org.apache.solr.client.solrj.SolrRequest.process(SolrRequest.java:194)
	at org.apache.solr.client.solrj.SolrClient.query(SolrClient.java:942)
	at org.apache.solr.client.solrj.SolrClient.query(SolrClient.java:957)
	at org.apache.solr.cloud.CloudInspectUtil.compareResults(CloudInspectUtil.java:193)
	at org.apache.solr.cloud.CloudInspectUtil.compareResults(CloudInspectUtil.java:167)
	at org.apache.solr.cloud.FullSolrCloudDistribCmdsTest.testIndexingBatchPerRequestWithHttpSolrClient(FullSolrCloudDistribCmdsTest.java:669)
	at org.apache.solr.cloud.FullSolrCloudDistribCmdsTest.test(FullSolrCloudDistribCmdsTest.java:153)
	at sun.reflect.NativeMethodAccessorImpl.invoke0(Native Method)
	at sun.reflect.NativeMethodAccessorImpl.invoke(NativeMethodAccessorImpl.java:62)
	at sun.reflect.DelegatingMethodAccessorImpl.invoke(DelegatingMethodAccessorImpl.java:43)
	at java.lang.reflect.Method.invoke(Method.java:498)
	at com.carrotsearch.randomizedtesting.RandomizedRunner.invoke(RandomizedRunner.java:1742)
	at com.carrotsearch.randomizedtesting.RandomizedRunner$8.evaluate(RandomizedRunner.java:935)
	at com.carrotsearch.randomizedtesting.RandomizedRunner$9.evaluate(RandomizedRunner.java:971)
	at com.carrotsearch.randomizedtesting.RandomizedRunner$10.evaluate(RandomizedRunner.java:985)
	at org.apache.solr.BaseDistributedSearchTestCase$ShardsRepeatRule$ShardsFixedStatement.callStatement(BaseDistributedSearchTestCase.java:1008)
	at org.apache.solr.BaseDistributedSearchTestCase$ShardsRepeatRule$ShardsStatement.evaluate(BaseDistributedSearchTestCase.java:983)
	at com.carrotsearch.randomizedtesting.rules.SystemPropertiesRestoreRule$1.evaluate(SystemPropertiesRestoreRule.java:57)
	at org.apache.lucene.util.TestRuleSetupTeardownChained$1.evaluate(TestRuleSetupTeardownChained.java:49)
	at org.apache.lucene.util.AbstractBeforeAfterRule$1.evaluate(AbstractBeforeAfterRule.java:45)
	at org.apache.lucene.util.TestRuleThreadAndTestName$1.evaluate(TestRuleThreadAndTestName.java:48)
	at org.apache.lucene.util.TestRuleIgnoreAfterMaxFailures$1.evaluate(TestRuleIgnoreAfterMaxFailures.java:64)
	at org.apache.lucene.util.TestRuleMarkFailure$1.evaluate(TestRuleMarkFailure.java:47)
	at com.carrotsearch.randomizedtesting.rules.StatementAdapter.evaluate(StatementAdapter.java:36)
	at com.carrotsearch.randomizedtesting.ThreadLeakControl$StatementRunner.run(ThreadLeakControl.java:368)
	at com.carrotsearch.randomizedtesting.ThreadLeakControl.forkTimeoutingTask(ThreadLeakControl.java:817)
	at com.carrotsearch.randomizedtesting.ThreadLeakControl$3.evaluate(ThreadLeakControl.java:468)
	at com.carrotsearch.randomizedtesting.RandomizedRunner.runSingleTest(RandomizedRunner.java:944)
	at com.carrotsearch.randomizedtesting.RandomizedRunner$5.evaluate(RandomizedRunner.java:830)
	at com.carrotsearch.randomizedtesting.RandomizedRunner$6.evaluate(RandomizedRunner.java:880)
	at com.carrotsearch.randomizedtesting.RandomizedRunner$7.evaluate(RandomizedRunner.java:891)
	at com.carrotsearch.randomizedtesting.rules.StatementAdapter.evaluate(StatementAdapter.java:36)
	at com.carrotsearch.randomizedtesting.rules.SystemPropertiesRestoreRule$1.evaluate(SystemPropertiesRestoreRule.java:57)
	at org.apache.lucene.util.AbstractBeforeAfterRule$1.evaluate(AbstractBeforeAfterRule.java:45)
	at com.carrotsearch.randomizedtesting.rules.StatementAdapter.evaluate(StatementAdapter.java:36)
	at org.apache.lucene.util.TestRuleStoreClassName$1.evaluate(TestRuleStoreClassName.java:41)
	at com.carrotsearch.randomizedtesting.rules.NoShadowingOrOverridesOnMethodsRule$1.evaluate(NoShadowingOrOverridesOnMethodsRule.java:40)
	at com.carrotsearch.randomizedtesting.rules.NoShadowingOrOverridesOnMethodsRule$1.evaluate(NoShadowingOrOverridesOnMethodsRule.java:40)
	at com.carrotsearch.randomizedtesting.rules.StatementAdapter.evaluate(StatementAdapter.java:36)
	at com.carrotsearch.randomizedtesting.rules.StatementAdapter.evaluate(StatementAdapter.java:36)
	at com.carrotsearch.randomizedtesting.rules.StatementAdapter.evaluate(StatementAdapter.java:36)
	at org.apache.lucene.util.TestRuleAssertionsRequired$1.evaluate(TestRuleAssertionsRequired.java:53)
	at org.apache.lucene.util.TestRuleMarkFailure$1.evaluate(TestRuleMarkFailure.java:47)
	at org.apache.lucene.util.TestRuleIgnoreAfterMaxFailures$1.evaluate(TestRuleIgnoreAfterMaxFailures.java:64)
	at org.apache.lucene.util.TestRuleIgnoreTestSuites$1.evaluate(TestRuleIgnoreTestSuites.java:54)
	at com.carrotsearch.randomizedtesting.rules.StatementAdapter.evaluate(StatementAdapter.java:36)
	at com.carrotsearch.randomizedtesting.ThreadLeakControl$StatementRunner.run(ThreadLeakControl.java:368)
	at java.lang.Thread.run(Thread.java:748)
Caused by: org.apache.solr.client.solrj.impl.HttpSolrClient$RemoteSolrException: Error from server at http://127.0.0.1:39633/collection2: Impossible Exception
	at org.apache.solr.client.solrj.impl.HttpSolrClient.executeMethod(HttpSolrClient.java:643)
	at org.apache.solr.client.solrj.impl.HttpSolrClient.request(HttpSolrClient.java:255)
	at org.apache.solr.client.solrj.impl.HttpSolrClient.request(HttpSolrClient.java:244)
	at org.apache.solr.client.solrj.impl.LBHttpSolrClient.doRequest(LBHttpSolrClient.java:483)
	at org.apache.solr.client.solrj.impl.LBHttpSolrClient.request(LBHttpSolrClient.java:413)
	... 51 more


FAILED:  org.apache.solr.uninverting.TestDocTermOrdsUninvertLimit.testTriggerUnInvertLimit

Error Message:
GC overhead limit exceeded

Stack Trace:
java.lang.OutOfMemoryError: GC overhead limit exceeded
	at __randomizedtesting.SeedInfo.seed([1485DDF7CA87529D:2737F533C730882A]:0)
	at org.apache.lucene.codecs.memory.DirectPostingsFormat$DirectField.<init>(DirectPostingsFormat.java:458)
	at org.apache.lucene.codecs.memory.DirectPostingsFormat$DirectFields.<init>(DirectPostingsFormat.java:129)
	at org.apache.lucene.codecs.memory.DirectPostingsFormat.fieldsProducer(DirectPostingsFormat.java:113)
	at org.apache.lucene.codecs.perfield.PerFieldPostingsFormat$FieldsReader.<init>(PerFieldPostingsFormat.java:292)
	at org.apache.lucene.codecs.perfield.PerFieldPostingsFormat.fieldsProducer(PerFieldPostingsFormat.java:372)
	at org.apache.lucene.index.SegmentCoreReaders.<init>(SegmentCoreReaders.java:113)
	at org.apache.lucene.index.SegmentReader.<init>(SegmentReader.java:83)
	at org.apache.lucene.index.ReadersAndUpdates.getReader(ReadersAndUpdates.java:172)
	at org.apache.lucene.index.IndexWriter.mergeMiddle(IndexWriter.java:4591)
	at org.apache.lucene.index.IndexWriter.merge(IndexWriter.java:4068)
	at org.apache.lucene.index.SerialMergeScheduler.merge(SerialMergeScheduler.java:40)
	at org.apache.lucene.index.IndexWriter.maybeMerge(IndexWriter.java:2170)
	at org.apache.lucene.index.IndexWriter.processEvents(IndexWriter.java:5103)
	at org.apache.lucene.index.IndexWriter.updateDocument(IndexWriter.java:1612)
	at org.apache.lucene.index.IndexWriter.addDocument(IndexWriter.java:1228)
	at org.apache.lucene.index.RandomIndexWriter.addDocument(RandomIndexWriter.java:189)
	at org.apache.solr.uninverting.TestDocTermOrdsUninvertLimit.testTriggerUnInvertLimit(TestDocTermOrdsUninvertLimit.java:65)
	at sun.reflect.NativeMethodAccessorImpl.invoke0(Native Method)
	at sun.reflect.NativeMethodAccessorImpl.invoke(NativeMethodAccessorImpl.java:62)
	at sun.reflect.DelegatingMethodAccessorImpl.invoke(DelegatingMethodAccessorImpl.java:43)
	at java.lang.reflect.Method.invoke(Method.java:498)
	at com.carrotsearch.randomizedtesting.RandomizedRunner.invoke(RandomizedRunner.java:1742)
	at com.carrotsearch.randomizedtesting.RandomizedRunner$8.evaluate(RandomizedRunner.java:935)
	at com.carrotsearch.randomizedtesting.RandomizedRunner$9.evaluate(RandomizedRunner.java:971)
	at com.carrotsearch.randomizedtesting.RandomizedRunner$10.evaluate(RandomizedRunner.java:985)
	at org.apache.lucene.util.TestRuleSetupTeardownChained$1.evaluate(TestRuleSetupTeardownChained.java:49)
	at org.apache.lucene.util.AbstractBeforeAfterRule$1.evaluate(AbstractBeforeAfterRule.java:45)
	at org.apache.lucene.util.TestRuleThreadAndTestName$1.evaluate(TestRuleThreadAndTestName.java:48)
	at org.apache.lucene.util.TestRuleIgnoreAfterMaxFailures$1.evaluate(TestRuleIgnoreAfterMaxFailures.java:64)
	at org.apache.lucene.util.TestRuleMarkFailure$1.evaluate(TestRuleMarkFailure.java:47)
	at com.carrotsearch.randomizedtesting.rules.StatementAdapter.evaluate(StatementAdapter.java:36)
	at com.carrotsearch.randomizedtesting.ThreadLeakControl$StatementRunner.run(ThreadLeakControl.java:368)




Build Log:
[...truncated 13747 lines...]
   [junit4] Suite: org.apache.solr.uninverting.TestDocTermOrdsUninvertLimit
   [junit4]   2> NOTE: download the large Jenkins line-docs file by running 'ant get-jenkins-line-docs' in the lucene directory.
   [junit4]   2> NOTE: reproduce with: ant test  -Dtestcase=TestDocTermOrdsUninvertLimit -Dtests.method=testTriggerUnInvertLimit -Dtests.seed=1485DDF7CA87529D -Dtests.multiplier=2 -Dtests.nightly=true -Dtests.slow=true -Dtests.linedocsfile=/home/jenkins/jenkins-slave/workspace/Lucene-Solr-NightlyTests-7.x/test-data/enwiki.random.lines.txt -Dtests.locale=th -Dtests.timezone=Asia/Istanbul -Dtests.asserts=true -Dtests.file.encoding=US-ASCII
   [junit4] ERROR    146s J2 | TestDocTermOrdsUninvertLimit.testTriggerUnInvertLimit <<<
   [junit4]    > Throwable #1: java.lang.OutOfMemoryError: GC overhead limit exceeded
   [junit4]    > 	at __randomizedtesting.SeedInfo.seed([1485DDF7CA87529D:2737F533C730882A]:0)
   [junit4]    > 	at org.apache.lucene.codecs.memory.DirectPostingsFormat$DirectField.<init>(DirectPostingsFormat.java:458)
   [junit4]    > 	at org.apache.lucene.codecs.memory.DirectPostingsFormat$DirectFields.<init>(DirectPostingsFormat.java:129)
   [junit4]    > 	at org.apache.lucene.codecs.memory.DirectPostingsFormat.fieldsProducer(DirectPostingsFormat.java:113)
   [junit4]    > 	at org.apache.lucene.codecs.perfield.PerFieldPostingsFormat$FieldsReader.<init>(PerFieldPostingsFormat.java:292)
   [junit4]    > 	at org.apache.lucene.codecs.perfield.PerFieldPostingsFormat.fieldsProducer(PerFieldPostingsFormat.java:372)
   [junit4]    > 	at org.apache.lucene.index.SegmentCoreReaders.<init>(SegmentCoreReaders.java:113)
   [junit4]    > 	at org.apache.lucene.index.SegmentReader.<init>(SegmentReader.java:83)
   [junit4]    > 	at org.apache.lucene.index.ReadersAndUpdates.getReader(ReadersAndUpdates.java:172)
   [junit4]    > 	at org.apache.lucene.index.IndexWriter.mergeMiddle(IndexWriter.java:4591)
   [junit4]    > 	at org.apache.lucene.index.IndexWriter.merge(IndexWriter.java:4068)
   [junit4]    > 	at org.apache.lucene.index.SerialMergeScheduler.merge(SerialMergeScheduler.java:40)
   [junit4]    > 	at org.apache.lucene.index.IndexWriter.maybeMerge(IndexWriter.java:2170)
   [junit4]    > 	at org.apache.lucene.index.IndexWriter.processEvents(IndexWriter.java:5103)
   [junit4]    > 	at org.apache.lucene.index.IndexWriter.updateDocument(IndexWriter.java:1612)
   [junit4]    > 	at org.apache.lucene.index.IndexWriter.addDocument(IndexWriter.java:1228)
   [junit4]    > 	at org.apache.lucene.index.RandomIndexWriter.addDocument(RandomIndexWriter.java:189)
   [junit4]    > 	at org.apache.solr.uninverting.TestDocTermOrdsUninvertLimit.testTriggerUnInvertLimit(TestDocTermOrdsUninvertLimit.java:65)
   [junit4]   2> NOTE: test params are: codec=Asserting(Lucene70): {field=PostingsFormat(name=Direct)}, docValues:{}, maxPointsInLeafNode=434, maxMBSortInHeap=5.939053175699654, sim=RandomSimilarity(queryNorm=true): {field=DFR GLZ(0.3)}, locale=th, timezone=Asia/Istanbul
   [junit4]   2> NOTE: Linux 4.4.0-130-generic amd64/Oracle Corporation 1.8.0_172 (64-bit)/cpus=4,threads=1,free=252404304,total=477626368
   [junit4]   2> NOTE: All tests run in this JVM: [SolrIndexSplitterTest, TestJsonFacetRefinement, TestDeleteCollectionOnDownNodes, TestSerializedLuceneMatchVersion, LeaderElectionContextKeyTest, OverseerRolesTest, TestSQLHandler, CoreAdminHandlerTest, TestNRTOpen, ClassificationUpdateProcessorIntegrationTest, TriggerIntegrationTest, Tagger2Test, ConnectionManagerTest, TestFuzzyAnalyzedSuggestions, JvmMetricsTest, TestTestInjection, TestNumericTerms64, TestRealTimeGet, SolrCmdDistributorTest, PeerSyncTest, TestAddFieldRealTimeGet, SimpleMLTQParserTest, CSVRequestHandlerTest, LukeRequestHandlerTest, ClusterStateUpdateTest, ResponseHeaderTest, SignificantTermsQParserPluginTest, SolrMetricManagerTest, TestTlogReplica, DistribCursorPagingTest, SchemaApiFailureTest, DirectSolrConnectionTest, DateMathParserTest, TestDFISimilarityFactory, TestQueryUtils, SuggesterWFSTTest, DeleteReplicaTest, SpellCheckCollatorTest, HLLUtilTest, TestCloudSearcherWarming, OpenCloseCoreStressTest, BadIndexSchemaTest, TestSubQueryTransformer, CoreMergeIndexesAdminHandlerTest, QueryParsingTest, TestPerFieldSimilarity, MultiTermTest, TestMacroExpander, DistanceFunctionTest, TestLMDirichletSimilarityFactory, TestPolicyCloud, ScheduledMaintenanceTriggerTest, LeaderFailoverAfterPartitionTest, TestReload, TestJettySolrRunner, TestPartialUpdateDeduplication, TestUseDocValuesAsStored2, DirectSolrSpellCheckerTest, UtilsToolTest, VMParamsZkACLAndCredentialsProvidersTest, SimpleFacetsTest, SegmentsInfoRequestHandlerTest, SearchRateTriggerIntegrationTest, BlockCacheTest, SearchHandlerTest, ForceLeaderTest, TestJmxIntegration, TestExactSharedStatsCache, UpdateRequestProcessorFactoryTest, TestSearcherReuse, TestHashQParserPlugin, TestSolrQueryResponse, SolrTestCaseJ4Test, TestImplicitCoreProperties, TestSolrCloudSnapshots, BadComponentTest, OpenExchangeRatesOrgProviderTest, TestShortCircuitedRequests, TestCoreDiscovery, StatelessScriptUpdateProcessorFactoryTest, TestRequestForwarding, UpdateParamsTest, DistributedIntervalFacetingTest, BlockJoinFacetRandomTest, TestFaceting, TestConfigsApi, SolrXmlInZkTest, TestNoOpRegenerator, BasicZkTest, TestDocTermOrdsUninvertLimit]
   [junit4] Completed [246/833 (1!)] on J2 in 146.03s, 1 test, 1 error <<< FAILURES!

[...truncated 717 lines...]
   [junit4] Suite: org.apache.solr.cloud.FullSolrCloudDistribCmdsTest
   [junit4]   2> Creating dataDir: /x1/jenkins/jenkins-slave/workspace/Lucene-Solr-NightlyTests-7.x/checkout/solr/build/solr-core/test/J2/temp/solr.cloud.FullSolrCloudDistribCmdsTest_1485DDF7CA87529D-001/init-core-data-001
   [junit4]   2> 2595214 WARN  (SUITE-FullSolrCloudDistribCmdsTest-seed#[1485DDF7CA87529D]-worker) [    ] o.a.s.SolrTestCaseJ4 startTrackingSearchers: numOpens=4 numCloses=4
   [junit4]   2> 2595214 INFO  (SUITE-FullSolrCloudDistribCmdsTest-seed#[1485DDF7CA87529D]-worker) [    ] o.a.s.SolrTestCaseJ4 Using PointFields (NUMERIC_POINTS_SYSPROP=true) w/NUMERIC_DOCVALUES_SYSPROP=true
   [junit4]   2> 2595216 INFO  (SUITE-FullSolrCloudDistribCmdsTest-seed#[1485DDF7CA87529D]-worker) [    ] o.a.s.SolrTestCaseJ4 Randomized ssl (false) and clientAuth (false) via: @org.apache.solr.SolrTestCaseJ4$SuppressSSL(bugUrl=https://issues.apache.org/jira/browse/SOLR-5776)
   [junit4]   2> 2595216 INFO  (SUITE-FullSolrCloudDistribCmdsTest-seed#[1485DDF7CA87529D]-worker) [    ] o.a.s.SolrTestCaseJ4 SecureRandom sanity checks: test.solr.allowed.securerandom=null & java.security.egd=file:/dev/./urandom
   [junit4]   2> 2595216 INFO  (SUITE-FullSolrCloudDistribCmdsTest-seed#[1485DDF7CA87529D]-worker) [    ] o.a.s.BaseDistributedSearchTestCase Setting hostContext system property: /
   [junit4]   2> 2595218 INFO  (TEST-FullSolrCloudDistribCmdsTest.test-seed#[1485DDF7CA87529D]) [    ] o.a.s.c.ZkTestServer STARTING ZK TEST SERVER
   [junit4]   2> 2595218 INFO  (Thread-10950) [    ] o.a.s.c.ZkTestServer client port:0.0.0.0/0.0.0.0:0
   [junit4]   2> 2595218 INFO  (Thread-10950) [    ] o.a.s.c.ZkTestServer Starting server
   [junit4]   2> 2595220 ERROR (Thread-10950) [    ] o.a.z.s.ZooKeeperServer ZKShutdownHandler is not registered, so ZooKeeper server won't take any action on ERROR or SHUTDOWN server state changes
   [junit4]   2> 2595318 INFO  (TEST-FullSolrCloudDistribCmdsTest.test-seed#[1485DDF7CA87529D]) [    ] o.a.s.c.ZkTestServer start zk server on port:43811
   [junit4]   2> 2595321 INFO  (zkConnectionManagerCallback-4902-thread-1) [    ] o.a.s.c.c.ConnectionManager zkClient has connected
   [junit4]   2> 2595325 INFO  (zkConnectionManagerCallback-4904-thread-1) [    ] o.a.s.c.c.ConnectionManager zkClient has connected
   [junit4]   2> 2595329 INFO  (TEST-FullSolrCloudDistribCmdsTest.test-seed#[1485DDF7CA87529D]) [    ] o.a.s.c.AbstractZkTestCase put /x1/jenkins/jenkins-slave/workspace/Lucene-Solr-NightlyTests-7.x/checkout/solr/core/src/test-files/solr/collection1/conf/solrconfig-tlog.xml to /configs/conf1/solrconfig.xml
   [junit4]   2> 2595331 INFO  (TEST-FullSolrCloudDistribCmdsTest.test-seed#[1485DDF7CA87529D]) [    ] o.a.s.c.AbstractZkTestCase put /x1/jenkins/jenkins-slave/workspace/Lucene-Solr-NightlyTests-7.x/checkout/solr/core/src/test-files/solr/collection1/conf/schema15.xml to /configs/conf1/schema.xml
   [junit4]   2> 2595333 INFO  (TEST-FullSolrCloudDistribCmdsTest.test-seed#[1485DDF7CA87529D]) [    ] o.a.s.c.AbstractZkTestCase put /x1/jenkins/jenkins-slave/workspace/Lucene-Solr-NightlyTests-7.x/checkout/solr/core/src/test-files/solr/collection1/conf/solrconfig.snippet.randomindexconfig.xml to /configs/conf1/solrconfig.snippet.randomindexconfig.xml
   [junit4]   2> 2595334 INFO  (TEST-FullSolrCloudDistribCmdsTest.test-seed#[1485DDF7CA87529D]) [    ] o.a.s.c.AbstractZkTestCase put /x1/jenkins/jenkins-slave/workspace/Lucene-Solr-NightlyTests-7.x/checkout/solr/core/src/test-files/solr/collection1/conf/stopwords.txt to /configs/conf1/stopwords.txt
   [junit4]   2> 2595335 INFO  (TEST-FullSolrCloudDistribCmdsTest.test-seed#[1485DDF7CA87529D]) [    ] o.a.s.c.AbstractZkTestCase put /x1/jenkins/jenkins-slave/workspace/Lucene-Solr-NightlyTests-7.x/checkout/solr/core/src/test-files/solr/collection1/conf/protwords.txt to /configs/conf1/protwords.txt
   [junit4]   2> 2595337 INFO  (TEST-FullSolrCloudDistribCmdsTest.test-seed#[1485DDF7CA87529D]) [    ] o.a.s.c.AbstractZkTestCase put /x1/jenkins/jenkins-slave/workspace/Lucene-Solr-NightlyTests-7.x/checkout/solr/core/src/test-files/solr/collection1/conf/currency.xml to /configs/conf1/currency.xml
   [junit4]   2> 2595338 INFO  (TEST-FullSolrCloudDistribCmdsTest.test-seed#[1485DDF7CA87529D]) [    ] o.a.s.c.AbstractZkTestCase put /x1/jenkins/jenkins-slave/workspace/Lucene-Solr-NightlyTests-7.x/checkout/solr/core/src/test-files/solr/collection1/conf/enumsConfig.xml to /configs/conf1/enumsConfig.xml
   [junit4]   2> 2595339 INFO  (TEST-FullSolrCloudDistribCmdsTest.test-seed#[1485DDF7CA87529D]) [    ] o.a.s.c.AbstractZkTestCase put /x1/jenkins/jenkins-slave/workspace/Lucene-Solr-NightlyTests-7.x/checkout/solr/core/src/test-files/solr/collection1/conf/open-exchange-rates.json to /configs/conf1/open-exchange-rates.json
   [junit4]   2> 2595340 INFO  (TEST-FullSolrCloudDistribCmdsTest.test-seed#[1485DDF7CA87529D]) [    ] o.a.s.c.AbstractZkTestCase put /x1/jenkins/jenkins-slave/workspace/Lucene-Solr-NightlyTests-7.x/checkout/solr/core/src/test-files/solr/collection1/conf/mapping-ISOLatin1Accent.txt to /configs/conf1/mapping-ISOLatin1Accent.txt
   [junit4]   2> 2595341 INFO  (TEST-FullSolrCloudDistribCmdsTest.test-seed#[1485DDF7CA87529D]) [    ] o.a.s.c.AbstractZkTestCase put /x1/jenkins/jenkins-slave/workspace/Lucene-Solr-NightlyTests-7.x/checkout/solr/core/src/test-files/solr/collection1/conf/old_synonyms.txt to /configs/conf1/old_synonyms.txt
   [junit4]   2> 2595342 INFO  (TEST-FullSolrCloudDistribCmdsTest.test-seed#[1485DDF7CA87529D]) [    ] o.a.s.c.AbstractZkTestCase put /x1/jenkins/jenkins-slave/workspace/Lucene-Solr-NightlyTests-7.x/checkout/solr/core/src/test-files/solr/collection1/conf/synonyms.txt to /configs/conf1/synonyms.txt
   [junit4]   2> 2595344 INFO  (TEST-FullSolrCloudDistribCmdsTest.test-seed#[1485DDF7CA87529D]) [    ] o.a.s.c.AbstractFullDistribZkTestBase Will use NRT replicas unless explicitly asked otherwise
   [junit4]   2> 2595476 INFO  (TEST-FullSolrCloudDistribCmdsTest.test-seed#[1485DDF7CA87529D]) [    ] o.e.j.s.Server jetty-9.4.11.v20180605; built: 2018-06-05T18:24:03.829Z; git: d5fc0523cfa96bfebfbda19606cad384d772f04c; jvm 1.8.0_172-b11
   [junit4]   2> 2595477 INFO  (TEST-FullSolrCloudDistribCmdsTest.test-seed#[1485DDF7CA87529D]) [    ] o.e.j.s.session DefaultSessionIdManager workerName=node0
   [junit4]   2> 2595477 INFO  (TEST-FullSolrCloudDistribCmdsTest.test-seed#[1485DDF7CA87529D]) [    ] o.e.j.s.session No SessionScavenger set, using defaults
   [junit4]   2> 2595477 INFO  (TEST-FullSolrCloudDistribCmdsTest.test-seed#[1485DDF7CA87529D]) [    ] o.e.j.s.session node0 Scavenging every 600000ms
   [junit4]   2> 2595478 INFO  (TEST-FullSolrCloudDistribCmdsTest.test-seed#[1485DDF7CA87529D]) [    ] o.e.j.s.h.ContextHandler Started o.e.j.s.ServletContextHandler@23d8d1ed{/,null,AVAILABLE}
   [junit4]   2> 2595478 INFO  (TEST-FullSolrCloudDistribCmdsTest.test-seed#[1485DDF7CA87529D]) [    ] o.e.j.s.AbstractConnector Started ServerConnector@674078ab{HTTP/1.1,[http/1.1]}{127.0.0.1:39633}
   [junit4]   2> 2595478 INFO  (TEST-FullSolrCloudDistribCmdsTest.test-seed#[1485DDF7CA87529D]) [    ] o.e.j.s.Server Started @2595536ms
   [junit4]   2> 2595478 INFO  (TEST-FullSolrCloudDistribCmdsTest.test-seed#[1485DDF7CA87529D]) [    ] o.a.s.c.s.e.JettySolrRunner Jetty properties: {solr.data.dir=/x1/jenkins/jenkins-slave/workspace/Lucene-Solr-NightlyTests-7.x/checkout/solr/build/solr-core/test/J2/temp/solr.cloud.FullSolrCloudDistribCmdsTest_1485DDF7CA87529D-001/tempDir-001/control/data, hostContext=/, hostPort=39633, coreRootDirectory=/x1/jenkins/jenkins-slave/workspace/Lucene-Solr-NightlyTests-7.x/checkout/solr/build/solr-core/test/J2/../../../../../../../../../../../x1/jenkins/jenkins-slave/workspace/Lucene-Solr-NightlyTests-7.x/checkout/solr/build/solr-core/test/J2/temp/solr.cloud.FullSolrCloudDistribCmdsTest_1485DDF7CA87529D-001/control-001/cores}
   [junit4]   2> 2595478 ERROR (TEST-FullSolrCloudDistribCmdsTest.test-seed#[1485DDF7CA87529D]) [    ] o.a.s.u.StartupLoggingUtils Missing Java Option solr.log.dir. Logging may be missing or incomplete.
   [junit4]   2> 2595478 INFO  (TEST-FullSolrCloudDistribCmdsTest.test-seed#[1485DDF7CA87529D]) [    ] o.a.s.s.SolrDispatchFilter Using logger factory org.apache.logging.slf4j.Log4jLoggerFactory
   [junit4]   2> 2595478 INFO  (TEST-FullSolrCloudDistribCmdsTest.test-seed#[1485DDF7CA87529D]) [    ] o.a.s.s.SolrDispatchFilter  ___      _       Welcome to Apache Solr? version 7.6.0
   [junit4]   2> 2595479 INFO  (TEST-FullSolrCloudDistribCmdsTest.test-seed#[1485DDF7CA87529D]) [    ] o.a.s.s.SolrDispatchFilter / __| ___| |_ _   Starting in cloud mode on port null
   [junit4]   2> 2595479 INFO  (TEST-FullSolrCloudDistribCmdsTest.test-seed#[1485DDF7CA87529D]) [    ] o.a.s.s.SolrDispatchFilter \__ \/ _ \ | '_|  Install dir: null
   [junit4]   2> 2595479 INFO  (TEST-FullSolrCloudDistribCmdsTest.test-seed#[1485DDF7CA87529D]) [    ] o.a.s.s.SolrDispatchFilter |___/\___/_|_|    Start time: 2018-09-27T06:49:45.781Z
   [junit4]   2> 2595480 INFO  (zkConnectionManagerCallback-4906-thread-1) [    ] o.a.s.c.c.ConnectionManager zkClient has connected
   [junit4]   2> 2595481 INFO  (TEST-FullSolrCloudDistribCmdsTest.test-seed#[1485DDF7CA87529D]) [    ] o.a.s.s.SolrDispatchFilter Loading solr.xml from SolrHome (not found in ZooKeeper)
   [junit4]   2> 2595481 INFO  (TEST-FullSolrCloudDistribCmdsTest.test-seed#[1485DDF7CA87529D]) [    ] o.a.s.c.SolrXmlConfig Loading container configuration from /x1/jenkins/jenkins-slave/workspace/Lucene-Solr-NightlyTests-7.x/checkout/solr/build/solr-core/test/J2/temp/solr.cloud.FullSolrCloudDistribCmdsTest_1485DDF7CA87529D-001/control-001/solr.xml
   [junit4]   2> 2595485 INFO  (TEST-FullSolrCloudDistribCmdsTest.test-seed#[1485DDF7CA87529D]) [    ] o.a.s.c.SolrXmlConfig Configuration parameter autoReplicaFailoverWorkLoopDelay is ignored
   [junit4]   2> 2595485 INFO  (TEST-FullSolrCloudDistribCmdsTest.test-seed#[1485DDF7CA87529D]) [    ] o.a.s.c.SolrXmlConfig Configuration parameter autoReplicaFailoverBadNodeExpiration is ignored
   [junit4]   2> 2595526 INFO  (TEST-FullSolrCloudDistribCmdsTest.test-seed#[1485DDF7CA87529D]) [    ] o.a.s.c.SolrXmlConfig MBean server found: com.sun.jmx.mbeanserver.JmxMBeanServer@3e0423d1, but no JMX reporters were configured - adding default JMX reporter.
   [junit4]   2> 2595873 INFO  (TEST-FullSolrCloudDistribCmdsTest.test-seed#[1485DDF7CA87529D]) [    ] o.a.s.c.ZkContainer Zookeeper client=127.0.0.1:43811/solr
   [junit4]   2> 2595874 INFO  (zkConnectionManagerCallback-4910-thread-1) [    ] o.a.s.c.c.ConnectionManager zkClient has connected
   [junit4]   2> 2595876 INFO  (zkConnectionManagerCallback-4912-thread-1) [    ] o.a.s.c.c.ConnectionManager zkClient has connected
   [junit4]   2> 2595955 INFO  (TEST-FullSolrCloudDistribCmdsTest.test-seed#[1485DDF7CA87529D]) [n:127.0.0.1:39633_    ] o.a.s.c.OverseerElectionContext I am going to be the leader 127.0.0.1:39633_
   [junit4]   2> 2595956 INFO  (TEST-FullSolrCloudDistribCmdsTest.test-seed#[1485DDF7CA87529D]) [n:127.0.0.1:39633_    ] o.a.s.c.Overseer Overseer (id=72406226241323012-127.0.0.1:39633_-n_0000000000) starting
   [junit4]   2> 2595962 INFO  (zkConnectionManagerCallback-4919-thread-1) [    ] o.a.s.c.c.ConnectionManager zkClient has connected
   [junit4]   2> 2595964 INFO  (TEST-FullSolrCloudDistribCmdsTest.test-seed#[1485DDF7CA87529D]) [n:127.0.0.1:39633_    ] o.a.s.c.s.i.ZkClientClusterStateProvider Cluster at 127.0.0.1:43811/solr ready
   [junit4]   2> 2595965 INFO  (OverseerStateUpdate-72406226241323012-127.0.0.1:39633_-n_0000000000) [n:127.0.0.1:39633_    ] o.a.s.c.Overseer Starting to work on the main queue : 127.0.0.1:39633_
   [junit4]   2> 2595965 INFO  (TEST-FullSolrCloudDistribCmdsTest.test-seed#[1485DDF7CA87529D]) [n:127.0.0.1:39633_    ] o.a.s.c.ZkController Register node as live in ZooKeeper:/live_nodes/127.0.0.1:39633_
   [junit4]   2> 2595971 INFO  (OverseerStateUpdate-72406226241323012-127.0.0.1:39633_-n_0000000000) [n:127.0.0.1:39633_    ] o.a.s.c.c.ZkStateReader Updated live nodes from ZooKeeper... (0) -> (1)
   [junit4]   2> 2595979 INFO  (zkCallback-4918-thread-1) [    ] o.a.s.c.c.ZkStateReader Updated live nodes from ZooKeeper... (0) -> (1)
   [junit4]   2> 2595990 INFO  (TEST-FullSolrCloudDistribCmdsTest.test-seed#[1485DDF7CA87529D]) [n:127.0.0.1:39633_    ] o.a.s.h.a.MetricsHistoryHandler No .system collection, keeping metrics history in memory.
   [junit4]   2> 2596007 INFO  (TEST-FullSolrCloudDistribCmdsTest.test-seed#[1485DDF7CA87529D]) [n:127.0.0.1:39633_    ] o.a.s.m.r.SolrJmxReporter JMX monitoring for 'solr.node' (registry 'solr.node') enabled at server: com.sun.jmx.mbeanserver.JmxMBeanServer@3e0423d1
   [junit4]   2> 2596016 INFO  (TEST-FullSolrCloudDistribCmdsTest.test-seed#[1485DDF7CA87529D]) [n:127.0.0.1:39633_    ] o.a.s.m.r.SolrJmxReporter JMX monitoring for 'solr.jvm' (registry 'solr.jvm') enabled at server: com.sun.jmx.mbeanserver.JmxMBeanServer@3e0423d1
   [junit4]   2> 2596017 INFO  (TEST-FullSolrCloudDistribCmdsTest.test-seed#[1485DDF7CA87529D]) [n:127.0.0.1:39633_    ] o.a.s.m.r.SolrJmxReporter JMX monitoring for 'solr.jetty' (registry 'solr.jetty') enabled at server: com.sun.jmx.mbeanserver.JmxMBeanServer@3e0423d1
   [junit4]   2> 2596018 INFO  (TEST-FullSolrCloudDistribCmdsTest.test-seed#[1485DDF7CA87529D]) [n:127.0.0.1:39633_    ] o.a.s.c.CorePropertiesLocator Found 0 core definitions underneath /x1/jenkins/jenkins-slave/workspace/Lucene-Solr-NightlyTests-7.x/checkout/solr/build/solr-core/test/J2/../../../../../../../../../../../x1/jenkins/jenkins-slave/workspace/Lucene-Solr-NightlyTests-7.x/checkout/solr/build/solr-core/test/J2/temp/solr.cloud.FullSolrCloudDistribCmdsTest_1485DDF7CA87529D-001/control-001/cores
   [junit4]   2> 2596040 INFO  (zkConnectionManagerCallback-4925-thread-1) [    ] o.a.s.c.c.ConnectionManager zkClient has connected
   [junit4]   2> 2596041 INFO  (TEST-FullSolrCloudDistribCmdsTest.test-seed#[1485DDF7CA87529D]) [    ] o.a.s.c.c.ZkStateReader Updated live nodes from ZooKeeper... (0) -> (1)
   [junit4]   2> 2596042 INFO  (TEST-FullSolrCloudDistribCmdsTest.test-seed#[1485DDF7CA87529D]) [    ] o.a.s.c.s.i.ZkClientClusterStateProvider Cluster at 127.0.0.1:43811/solr ready
   [junit4]   2> 2596043 INFO  (qtp1665255401-26253) [n:127.0.0.1:39633_    ] o.a.s.h.a.CollectionsHandler Invoked Collection Action :create with params collection.configName=conf1&name=control_collection&nrtReplicas=1&action=CREATE&numShards=1&createNodeSet=127.0.0.1:39633_&wt=javabin&version=2 and sendToOCPQueue=true
   [junit4]   2> 2596046 INFO  (OverseerThreadFactory-8636-thread-1-processing-n:127.0.0.1:39633_) [n:127.0.0.1:39633_    ] o.a.s.c.a.c.CreateCollectionCmd Create collection control_collection
   [junit4]   2> 2596154 INFO  (qtp1665255401-26248) [n:127.0.0.1:39633_    x:control_collection_shard1_replica_n1] o.a.s.h.a.CoreAdminOperation core create command qt=/admin/cores&collection.configName=conf1&newCollection=true&name=control_collection_shard1_replica_n1&action=CREATE&numShards=1&collection=control_collection&shard=shard1&wt=javabin&version=2&replicaType=NRT
   [junit4]   2> 2596155 INFO  (qtp1665255401-26248) [n:127.0.0.1:39633_    x:control_collection_shard1_replica_n1] o.a.s.c.TransientSolrCoreCacheDefault Allocating transient cache for 4 transient cores
   [junit4]   2> 2597172 INFO  (qtp1665255401-26248) [n:127.0.0.1:39633_ c:control_collection s:shard1  x:control_collection_shard1_replica_n1] o.a.s.c.SolrConfig Using Lucene MatchVersion: 7.6.0
   [junit4]   2> 2597184 INFO  (qtp1665255401-26248) [n:127.0.0.1:39633_ c:control_collection s:shard1  x:control_collection_shard1_replica_n1] o.a.s.s.IndexSchema [control_collection_shard1_replica_n1] Schema name=test
   [junit4]   2> 2597267 INFO  (qtp1665255401-26248) [n:127.0.0.1:39633_ c:control_collection s:shard1  x:control_collection_shard1_replica_n1] o.a.s.s.IndexSchema Loaded schema test/1.6 with uniqueid field id
   [junit4]   2> 2597287 INFO  (qtp1665255401-26248) [n:127.0.0.1:39633_ c:control_collection s:shard1  x:control_collection_shard1_replica_n1] o.a.s.c.CoreContainer Creating SolrCore 'control_collection_shard1_replica_n1' using configuration from collection control_collection, trusted=true
   [junit4]   2> 2597287 INFO  (qtp1665255401-26248) [n:127.0.0.1:39633_ c:control_collection s:shard1  x:control_collection_shard1_replica_n1] o.a.s.m.r.SolrJmxReporter JMX monitoring for 'solr.core.control_collection.shard1.replica_n1' (registry 'solr.core.control_collection.shard1.replica_n1') enabled at server: com.sun.jmx.mbeanserver.JmxMBeanServer@3e0423d1
   [junit4]   2> 2597288 INFO  (qtp1665255401-26248) [n:127.0.0.1:39633_ c:control_collection s:shard1  x:control_collection_shard1_replica_n1] o.a.s.c.SolrCore [[control_collection_shard1_replica_n1] ] Opening new SolrCore at [/x1/jenkins/jenkins-slave/workspace/Lucene-Solr-NightlyTests-7.x/checkout/solr/build/solr-core/test/J2/temp/solr.cloud.FullSolrCloudDistribCmdsTest_1485DDF7CA87529D-001/control-001/cores/control_collection_shard1_replica_n1], dataDir=[/x1/jenkins/jenkins-slave/workspace/Lucene-Solr-NightlyTests-7.x/checkout/solr/build/solr-core/test/J2/../../../../../../../../../../../x1/jenkins/jenkins-slave/workspace/Lucene-Solr-NightlyTests-7.x/checkout/solr/build/solr-core/test/J2/temp/solr.cloud.FullSolrCloudDistribCmdsTest_1485DDF7CA87529D-001/control-001/cores/control_collection_shard1_replica_n1/data/]
   [junit4]   2> 2597291 INFO  (qtp1665255401-26248) [n:127.0.0.1:39633_ c:control_collection s:shard1  x:control_collection_shard1_replica_n1] o.a.s.u.RandomMergePolicy RandomMergePolicy wrapping class org.apache.lucene.index.MockRandomMergePolicy: org.apache.lucene.index.MockRandomMergePolicy@3172b7a8
   [junit4]   2> 2597293 WARN  (qtp1665255401-26248) [n:127.0.0.1:39633_ c:control_collection s:shard1  x:control_collection_shard1_replica_n1] o.a.s.c.RequestHandlers INVALID paramSet a in requestHandler {type = requestHandler,name = /dump,class = DumpRequestHandler,attributes = {initParams=a, name=/dump, class=DumpRequestHandler},args = {defaults={a=A,b=B}}}
   [junit4]   2> 2597339 INFO  (qtp1665255401-26248) [n:127.0.0.1:39633_ c:control_collection s:shard1  x:control_collection_shard1_replica_n1] o.a.s.u.UpdateHandler Using UpdateLog implementation: org.apache.solr.update.UpdateLog
   [junit4]   2> 2597339 INFO  (qtp1665255401-26248) [n:127.0.0.1:39633_ c:control_collection s:shard1  x:control_collection_shard1_replica_n1] o.a.s.u.UpdateLog Initializing UpdateLog: dataDir= defaultSyncLevel=FLUSH numRecordsToKeep=100 maxNumLogsToKeep=10 numVersionBuckets=65536
   [junit4]   2> 2597340 INFO  (qtp1665255401-26248) [n:127.0.0.1:39633_ c:control_collection s:shard1  x:control_collection_shard1_replica_n1] o.a.s.u.CommitTracker Hard AutoCommit: disabled
   [junit4]   2> 2597340 INFO  (qtp1665255401-26248) [n:127.0.0.1:39633_ c:control_collection s:shard1  x:control_collection_shard1_replica_n1] o.a.s.u.CommitTracker Soft AutoCommit: disabled
   [junit4]   2> 2597341 INFO  (qtp1665255401-26248) [n:127.0.0.1:39633_ c:control_collection s:shard1  x:control_collection_shard1_replica_n1] o.a.s.u.RandomMergePolicy RandomMergePolicy wrapping class org.apache.lucene.index.TieredMergePolicy: [TieredMergePolicy: maxMergeAtOnce=27, maxMergeAtOnceExplicit=16, maxMergedSegmentMB=1.7158203125, floorSegmentMB=1.88671875, forceMergeDeletesPctAllowed=25.29713956040677, segmentsPerTier=43.0, maxCFSSegmentSizeMB=8.796093022207999E12, noCFSRatio=1.0, deletesPctAllowed=25.53993293286383
   [junit4]   2> 2597342 INFO  (qtp1665255401-26248) [n:127.0.0.1:39633_ c:control_collection s:shard1  x:control_collection_shard1_replica_n1] o.a.s.s.SolrIndexSearcher Opening [Searcher@12ce3a3d[control_collection_shard1_replica_n1] main]
   [junit4]   2> 2597343 INFO  (qtp1665255401-26248) [n:127.0.0.1:39633_ c:control_collection s:shard1  x:control_collection_shard1_replica_n1] o.a.s.r.ManagedResourceStorage Configured ZooKeeperStorageIO with znodeBase: /configs/conf1
   [junit4]   2> 2597343 INFO  (qtp1665255401-26248) [n:127.0.0.1:39633_ c:control_collection s:shard1  x:control_collection_shard1_replica_n1] o.a.s.r.ManagedResourceStorage Loaded null at path _rest_managed.json using ZooKeeperStorageIO:path=/configs/conf1
   [junit4]   2> 2597344 INFO  (qtp1665255401-26248) [n:127.0.0.1:39633_ c:control_collection s:shard1  x:control_collection_shard1_replica_n1] o.a.s.h.ReplicationHandler Commits will be reserved for 10000ms.
   [junit4]   2> 2597345 INFO  (searcherExecutor-8641-thread-1-processing-n:127.0.0.1:39633_ x:control_collection_shard1_replica_n1 c:control_collection s:shard1) [n:127.0.0.1:39633_ c:control_collection s:shard1  x:control_collection_shard1_replica_n1] o.a.s.c.SolrCore [control_collection_shard1_replica_n1] Registered new searcher Searcher@12ce3a3d[control_collection_shard1_replica_n1] main{ExitableDirectoryReader(UninvertingDirectoryReader())}
   [junit4]   2> 2597345 INFO  (qtp1665255401-26248) [n:127.0.0.1:39633_ c:control_collection s:shard1  x:control_collection_shard1_replica_n1] o.a.s.u.UpdateLog Could not find max version in index or recent updates, using new clock 1612742380902940672
   [junit4]   2> 2597351 INFO  (qtp1665255401-26248) [n:127.0.0.1:39633_ c:control_collection s:shard1  x:control_collection_shard1_replica_n1] o.a.s.c.ZkShardTerms Successful update of terms at /collections/control_collection/terms/shard1 to Terms{values={core_node2=0}, version=0}
   [junit4]   2> 2597354 INFO  (qtp1665255401-26248) [n:127.0.0.1:39633_ c:control_collection s:shard1  x:control_collection_shard1_replica_n1] o.a.s.c.ShardLeaderElectionContext Enough replicas found to continue.
   [junit4]   2> 2597354 INFO  (qtp1665255401-26248) [n:127.0.0.1:39633_ c:control_collection s:shard1  x:control_collection_shard1_replica_n1] o.a.s.c.ShardLeaderElectionContext I may be the new leader - try and sync
   [junit4]   2> 2597354 INFO  (qtp1665255401-26248) [n:127.0.0.1:39633_ c:control_collection s:shard1  x:control_collection_shard1_replica_n1] o.a.s.c.SyncStrategy Sync replicas to http://127.0.0.1:39633/control_collection_shard1_replica_n1/
   [junit4]   2> 2597354 INFO  (qtp1665255401-26248) [n:127.0.0.1:39633_ c:control_collection s:shard1  x:control_collection_shard1_replica_n1] o.a.s.c.SyncStrategy Sync Success - now sync replicas to me
   [junit4]   2> 2597354 INFO  (qtp1665255401-26248) [n:127.0.0.1:39633_ c:control_collection s:shard1  x:control_collection_shard1_replica_n1] o.a.s.c.SyncStrategy http://127.0.0.1:39633/control_collection_shard1_replica_n1/ has no replicas
   [junit4]   2> 2597354 INFO  (qtp1665255401-26248) [n:127.0.0.1:39633_ c:control_collection s:shard1  x:control_collection_shard1_replica_n1] o.a.s.c.ShardLeaderElectionContext Found all replicas participating in election, clear LIR
   [junit4]   2> 2597358 INFO  (qtp1665255401-26248) [n:127.0.0.1:39633_ c:control_collection s:shard1  x:control_collection_shard1_replica_n1] o.a.s.c.ShardLeaderElectionContext I am the new leader: http://127.0.0.1:39633/control_collection_shard1_replica_n1/ shard1
   [junit4]   2> 2597461 INFO  (qtp1665255401-26248) [n:127.0.0.1:39633_ c:control_collection s:shard1  x:control_collection_shard1_replica_n1] o.a.s.c.ZkController I am the leader, no recovery necessary
   [junit4]   2> 2597463 INFO  (qtp1665255401-26248) [n:127.0.0.1:39633_ c:control_collection s:shard1  x:control_collection_shard1_replica_n1] o.a.s.s.HttpSolrCall [admin] webapp=null path=/admin/cores params={qt=/admin/cores&collection.configName=conf1&newCollection=true&name=control_collection_shard1_replica_n1&action=CREATE&numShards=1&collection=control_collection&shard=shard1&wt=javabin&version=2&replicaType=NRT} status=0 QTime=1308
   [junit4]   2> 2597465 INFO  (qtp1665255401-26253) [n:127.0.0.1:39633_    ] o.a.s.h.a.CollectionsHandler Wait for new collection to be active for at most 30 seconds. Check all shard replicas
   [junit4]   2> 2597563 INFO  (zkCallback-4911-thread-1) [    ] o.a.s.c.c.ZkStateReader A cluster state change: [WatchedEvent state:SyncConnected type:NodeDataChanged path:/collections/control_collection/state.json] for collection [control_collection] has occurred - updating... (live nodes size: [1])
   [junit4]   2> 2598048 INFO  (OverseerCollectionConfigSetProcessor-72406226241323012-127.0.0.1:39633_-n_0000000000) [n:127.0.0.1:39633_    ] o.a.s.c.OverseerTaskQueue Response ZK path: /overseer/collection-queue-work/qnr-0000000000 doesn't exist.  Requestor may have disconnected from ZooKeeper
   [junit4]   2> 2598465 INFO  (qtp1665255401-26253) [n:127.0.0.1:39633_    ] o.a.s.s.HttpSolrCall [admin] webapp=null path=/admin/collections params={collection.configName=conf1&name=control_collection&nrtReplicas=1&action=CREATE&numShards=1&createNodeSet=127.0.0.1:39633_&wt=javabin&version=2} status=0 QTime=2422
   [junit4]   2> 2598472 INFO  (zkConnectionManagerCallback-4930-thread-1) [    ] o.a.s.c.c.ConnectionManager zkClient has connected
   [junit4]   2> 2598473 INFO  (TEST-FullSolrCloudDistribCmdsTest.test-seed#[1485DDF7CA87529D]) [    ] o.a.s.c.c.ZkStateReader Updated live nodes from ZooKeeper... (0) -> (1)
   [junit4]   2> 2598474 INFO  (TEST-FullSolrCloudDistribCmdsTest.test-seed#[1485DDF7CA87529D]) [    ] o.a.s.c.s.i.ZkClientClusterStateProvider Cluster at 127.0.0.1:43811/solr ready
   [junit4]   2> 2598474 INFO  (TEST-FullSolrCloudDistribCmdsTest.test-seed#[1485DDF7CA87529D]) [    ] o.a.s.c.ChaosMonkey monkey: init - expire sessions:false cause connection loss:false
   [junit4]   2> 2598475 INFO  (qtp1665255401-26250) [n:127.0.0.1:39633_    ] o.a.s.h.a.CollectionsHandler Invoked Collection Action :create with params collection.configName=conf1&name=collection1&nrtReplicas=1&action=CREATE&numShards=3&createNodeSet=&stateFormat=2&wt=javabin&version=2 and sendToOCPQueue=true
   [junit4]   2> 2598478 INFO  (OverseerThreadFactory-8636-thread-2-processing-n:127.0.0.1:39633_) [n:127.0.0.1:39633_    ] o.a.s.c.a.c.CreateCollectionCmd Create collection collection1
   [junit4]   2> 2598683 WARN  (OverseerThreadFactory-8636-thread-2-processing-n:127.0.0.1:39633_) [n:127.0.0.1:39633_    ] o.a.s.c.a.c.CreateCollectionCmd It is unusual to create a collection (collection1) without cores.
   [junit4]   2> 2598685 INFO  (qtp1665255401-26250) [n:127.0.0.1:39633_    ] o.a.s.h.a.CollectionsHandler Wait for new collection to be active for at most 30 seconds. Check all shard replicas
   [junit4]   2> 2598685 INFO  (qtp1665255401-26250) [n:127.0.0.1:39633_    ] o.a.s.s.HttpSolrCall [admin] webapp=null path=/admin/collections params={collection.configName=conf1&name=collection1&nrtReplicas=1&action=CREATE&numShards=3&createNodeSet=&stateFormat=2&wt=javabin&version=2} status=0 QTime=210
   [junit4]   2> 2598807 INFO  (TEST-FullSolrCloudDistribCmdsTest.test-seed#[1485DDF7CA87529D]) [    ] o.a.s.c.AbstractFullDistribZkTestBase create jetty 1 in directory /x1/jenkins/jenkins-slave/workspace/Lucene-Solr-NightlyTests-7.x/checkout/solr/build/solr-core/test/J2/temp/solr.cloud.FullSolrCloudDistribCmdsTest_1485DDF7CA87529D-001/shard-1-001 of type NRT
   [junit4]   2> 2598808 INFO  (TEST-FullSolrCloudDistribCmdsTest.test-seed#[1485DDF7CA87529D]) [    ] o.e.j.s.Server jetty-9.4.11.v20180605; built: 2018-06-05T18:24:03.829Z; git: d5fc0523cfa96bfebfbda19606cad384d772f04c; jvm 1.8.0_172-b11
   [junit4]   2> 2598809 INFO  (TEST-FullSolrCloudDistribCmdsTest.test-seed#[1485DDF7CA87529D]) [    ] o.e.j.s.session DefaultSessionIdManager workerName=node0
   [junit4]   2> 2598809 INFO  (TEST-FullSolrCloudDistribCmdsTest.test-seed#[1485DDF7CA87529D]) [    ] o.e.j.s.session No SessionScavenger set, using defaults
   [junit4]   2> 2598809 INFO  (TEST-FullSolrCloudDistribCmdsTest.test-seed#[1485DDF7CA87529D]) [    ] o.e.j.s.session node0 Scavenging every 600000ms
   [junit4]   2> 2598809 INFO  (TEST-FullSolrCloudDistribCmdsTest.test-seed#[1485DDF7CA87529D]) [    ] o.e.j.s.h.ContextHandler Started o.e.j.s.ServletContextHandler@19a08bc8{/,null,AVAILABLE}
   [junit4]   2> 2598810 INFO  (TEST-FullSolrCloudDistribCmdsTest.test-seed#[1485DDF7CA87529D]) [    ] o.e.j.s.AbstractConnector Started ServerConnector@5f3ae83e{HTTP/1.1,[http/1.1]}{127.0.0.1:41411}
   [junit4]   2> 2598810 INFO  (TEST-FullSolrCloudDistribCmdsTest.test-seed#[1485DDF7CA87529D]) [    ] o.e.j.s.Server Started @2598867ms
   [junit4]   2> 2598810 INFO  (TEST-FullSolrCloudDistribCmdsTest.test-seed#[1485DDF7CA87529D]) [    ] o.a.s.c.s.e.JettySolrRunner Jetty properties: {solr.data.dir=/x1/jenkins/jenkins-slave/workspace/Lucene-Solr-NightlyTests-7.x/checkout/solr/build/solr-core/test/J2/temp/solr.cloud.FullSolrCloudDistribCmdsTest_1485DDF7CA87529D-001/tempDir-001/jetty1, solrconfig=solrconfig.xml, hostContext=/, hostPort=41411, coreRootDirectory=/x1/jenkins/jenkins-slave/workspace/Lucene-Solr-NightlyTests-7.x/checkout/solr/build/solr-core/test/J2/../../../../../../../../../../../x1/jenkins/jenkins-slave/workspace/Lucene-Solr-NightlyTests-7.x/checkout/solr/build/solr-core/test/J2/temp/solr.cloud.FullSolrCloudDistribCmdsTest_1485DDF7CA87529D-001/shard-1-001/cores}
   [junit4]   2> 2598810 ERROR (TEST-FullSolrCloudDistribCmdsTest.test-seed#[1485DDF7CA87529D]) [    ] o.a.s.u.StartupLoggingUtils Missing Java Option solr.log.dir. Logging may be missing or incomplete.
   [junit4]   2> 2598810 INFO  (TEST-FullSolrCloudDistribCmdsTest.test-seed#[1485DDF7CA87529D]) [    ] o.a.s.s.SolrDispatchFilter Using logger factory org.apache.logging.slf4j.Log4jLoggerFactory
   [junit4]   2> 2598810 INFO  (TEST-FullSolrCloudDistribCmdsTest.test-seed#[1485DDF7CA87529D]) [    ] o.a.s.s.SolrDispatchFilter  ___      _       Welcome to Apache Solr? version 7.6.0
   [junit4]   2> 2598810 INFO  (TEST-FullSolrCloudDistribCmdsTest.test-seed#[1485DDF7CA87529D]) [    ] o.a.s.s.SolrDispatchFilter / __| ___| |_ _   Starting in cloud mode on port null
   [junit4]   2> 2598810 INFO  (TEST-FullSolrCloudDistribCmdsTest.test-seed#[1485DDF7CA87529D]) [    ] o.a.s.s.SolrDispatchFilter \__ \/ _ \ | '_|  Install dir: null
   [junit4]   2> 2598810 INFO  (TEST-FullSolrCloudDistribCmdsTest.test-seed#[1485DDF7CA87529D]) [    ] o.a.s.s.SolrDispatchFilter |___/\___/_|_|    Start time: 2018-09-27T06:49:49.112Z
   [junit4]   2> 2598812 INFO  (zkConnectionManagerCallback-4932-thread-1) [    ] o.a.s.c.c.ConnectionManager zkClient has connected
   [junit4]   2> 2598813 INFO  (TEST-FullSolrCloudDistribCmdsTest.test-seed#[1485DDF7CA87529D]) [    ] o.a.s.s.SolrDispatchFilter Loading solr.xml from SolrHome (not found in ZooKeeper)
   [junit4]   2> 2598813 INFO  (TEST-FullSolrCloudDistribCmdsTest.test-seed#[1485DDF7CA87529D]) [    ] o.a.s.c.SolrXmlConfig Loading container configuration from /x1/jenkins/jenkins-slave/workspace/Lucene-Solr-NightlyTests-7.x/checkout/solr/build/solr-core/test/J2/temp/solr.cloud.FullSolrCloudDistribCmdsTest_1485DDF7CA87529D-001/shard-1-001/solr.xml
   [junit4]   2> 2598816 INFO  (TEST-FullSolrCloudDistribCmdsTest.test-seed#[1485DDF7CA87529D]) [    ] o.a.s.c.SolrXmlConfig Configuration parameter autoReplicaFailoverWorkLoopDelay is ignored
   [junit4]   2> 2598816 INFO  (TEST-FullSolrCloudDistribCmdsTest.test-seed#[1485DDF7CA87529D]) [    ] o.a.s.c.SolrXmlConfig Configuration parameter autoReplicaFailoverBadNodeExpiration is ignored
   [junit4]   2> 2598818 INFO  (TEST-FullSolrCloudDistribCmdsTest.test-seed#[1485DDF7CA87529D]) [    ] o.a.s.c.SolrXmlConfig MBean server found: com.sun.jmx.mbeanserver.JmxMBeanServer@3e0423d1, but no JMX reporters were configured - adding default JMX reporter.
   [junit4]   2> 2599185 INFO  (TEST-FullSolrCloudDistribCmdsTest.test-seed#[1485DDF7CA87529D]) [    ] o.a.s.c.ZkContainer Zookeeper client=127.0.0.1:43811/solr
   [junit4]   2> 2599186 INFO  (zkConnectionManagerCallback-4936-thread-1) [    ] o.a.s.c.c.ConnectionManager zkClient has connected
   [junit4]   2> 2599188 INFO  (zkConnectionManagerCallback-4938-thread-1) [    ] o.a.s.c.c.ConnectionManager zkClient has connected
   [junit4]   2> 2599194 INFO  (TEST-FullSolrCloudDistribCmdsTest.test-seed#[1485DDF7CA87529D]) [    ] o.a.s.c.c.ZkStateReader Updated live nodes from ZooKeeper... (0) -> (1)
   [junit4]   2> 2599198 INFO  (TEST-FullSolrCloudDistribCmdsTest.test-seed#[1485DDF7CA87529D]) [    ] o.a.s.c.TransientSolrCoreCacheDefault Allocating transient cache for 4 transient cores
   [junit4]   2> 2599198 INFO  (TEST-FullSolrCloudDistribCmdsTest.test-seed#[1485DDF7CA87529D]) [    ] o.a.s.c.ZkController Register node as live in ZooKeeper:/live_nodes/127.0.0.1:41411_
   [junit4]   2> 2599199 INFO  (zkCallback-4918-thread-1) [    ] o.a.s.c.c.ZkStateReader Updated live nodes from ZooKeeper... (1) -> (2)
   [junit4]   2> 2599199 INFO  (zkCallback-4911-thread-1) [    ] o.a.s.c.c.ZkStateReader Updated live nodes from ZooKeeper... (1) -> (2)
   [junit4]   2> 2599203 INFO  (zkCallback-4929-thread-1) [    ] o.a.s.c.c.ZkStateReader Updated live nodes from ZooKeeper... (1) -> (2)
   [junit4]   2> 2599203 INFO  (zkCallback-4937-thread-1) [    ] o.a.s.c.c.ZkStateReader Updated live nodes from ZooKeeper... (1) -> (2)
   [junit4]   2> 2599220 INFO  (zkConnectionManagerCallback-4945-thread-1) [    ] o.a.s.c.c.ConnectionManager zkClient has connected
   [junit4]   2> 2599222 INFO  (TEST-FullSolrCloudDistribCmdsTest.test-seed#[1485DDF7CA87529D]) [    ] o.a.s.c.c.ZkStateReader Updated live nodes from ZooKeeper... (0) -> (2)
   [junit4]   2> 2599223 INFO  (TEST-FullSolrCloudDistribCmdsTest.test-seed#[1485DDF7CA87529D]) [    ] o.a.s.c.s.i.ZkClientClusterStateProvider Cluster at 127.0.0.1:43811/solr ready
   [junit4]   2> 2599223 INFO  (TEST-FullSolrCloudDistribCmdsTest.test-seed#[1485DDF7CA87529D]) [    ] o.a.s.h.a.MetricsHistoryHandler No .system collection, keeping metrics history in memory.
   [junit4]   2> 2599243 INFO  (TEST-FullSolrCloudDistribCmdsTest.test-seed#[1485DDF7CA87529D]) [    ] o.a.s.m.r.SolrJmxReporter JMX monitoring for 'solr.node' (registry 'solr.node') enabled at server: com.sun.jmx.mbeanserver.JmxMBeanServer@3e0423d1
   [junit4]   2> 2599254 INFO  (TEST-FullSolrCloudDistribCmdsTest.test-seed#[1485DDF7CA87529D]) [    ] o.a.s.m.r.SolrJmxReporter JMX monitoring for 'solr.jvm' (registry 'solr.jvm') enabled at server: com.sun.jmx.mbeanserver.JmxMBeanServer@3e0423d1
   [junit4]   2> 2599255 INFO  (TEST-FullSolrCloudDistribCmdsTest.test-seed#[1485DDF7CA87529D]) [    ] o.a.s.m.r.SolrJmxReporter JMX monitoring for 'solr.jetty' (registry 'solr.jetty') enabled at server: com.sun.jmx.mbeanserver.JmxMBeanServer@3e0423d1
   [junit4]   2> 2599256 INFO  (TEST-FullSolrCloudDistribCmdsTest.test-seed#[1485DDF7CA87529D]) [    ] o.a.s.c.CorePropertiesLocator Found 0 core definitions underneath /x1/jenkins/jenkins-slave/workspace/Lucene-Solr-NightlyTests-7.x/checkout/solr/build/solr-core/test/J2/../../../../../../../../../../../x1/jenkins/jenkins-slave/workspace/Lucene-Solr-NightlyTests-7.x/checkout/solr/build/solr-core/test/J2/temp/solr.cloud.FullSolrCloudDistribCmdsTest_1485DDF7CA87529D-001/shard-1-001/cores
   [junit4]   2> 2599293 INFO  (qtp1665255401-26255) [n:127.0.0.1:39633_    ] o.a.s.h.a.CollectionsHandler Invoked Collection Action :addreplica with params node=127.0.0.1:41411_&action=ADDREPLICA&collection=collection1&shard=shard2&type=NRT&wt=javabin&version=2 and sendToOCPQueue=true
   [junit4]   2> 2599303 INFO  (OverseerCollectionConfigSetProcessor-72406226241323012-127.0.0.1:39633_-n_0000000000) [n:127.0.0.1:39633_    ] o.a.s.c.OverseerTaskQueue Response ZK path: /overseer/collection-queue-work/qnr-0000000002 doesn't exist.  Requestor may have disconnected from ZooKeeper
   [junit4]   2> 2599305 INFO  (OverseerThreadFactory-8636-thread-3-processing-n:127.0.0.1:39633_) [n:127.0.0.1:39633_ c:collection1 s:shard2  ] o.a.s.c.a.c.AddReplicaCmd Node Identified 127.0.0.1:41411_ for creating new replica of shard shard2
   [junit4]   2> 2599310 INFO  (qtp688472394-26307) [n:127.0.0.1:41411_    x:collection1_shard2_replica_n61] o.a.s.h.a.CoreAdminOperation core create command qt=/admin/cores&collection.configName=conf1&name=collection1_shard2_replica_n61&action=CREATE&collection=collection1&shard=shard2&wt=javabin&version=2&replicaType=NRT
   [junit4]   2> 2600326 INFO  (qtp688472394-26307) [n:127.0.0.1:41411_ c:collection1 s:shard2  x:collection1_shard2_replica_n61] o.a.s.c.SolrConfig Using Lucene MatchVersion: 7.6.0
   [junit4]   2> 2600337 INFO  (qtp688472394-26307) [n:127.0.0.1:41411_ c:collection1 s:shard2  x:collection1_shard2_replica_n61] o.a.s.s.IndexSchema [collection1_shard2_replica_n61] Schema name=test
   [junit4]   2> 2600416 INFO  (qtp688472394-26307) [n:127.0.0.1:41411_ c:collection1 s:shard2  x:collection1_shard2_replica_n61] o.a.s.s.IndexSchema Loaded schema test/1.6 with uniqueid field id
   [junit4]   2> 2600430 INFO  (qtp688472394-26307) [n:127.0.0.1:41411_ c:collection1 s:shard2  x:collection1_shard2_replica_n61] o.a.s.c.CoreContainer Creating SolrCore 'collection1_shard2_replica_n61' using configuration from collection collection1, trusted=true
   [junit4]   2> 2600430 INFO  (qtp688472394-26307) [n:127.0.0.1:41411_ c:collection1 s:shard2  x:collection1_shard2_replica_n61] o.a.s.m.r.SolrJmxReporter JMX monitoring for 'solr.core.collection1.shard2.replica_n61' (registry 'solr.core.collection1.shard2.replica_n61') enabled at server: com.sun.jmx.mbeanserver.JmxMBeanServer@3e0423d1
   [junit4]   2> 2600430 INFO  (qtp688472394-26307) [n:127.0.0.1:41411_ c:collection1 s:shard2  x:collection1_shard2_replica_n61] o.a.s.c.SolrCore [[collection1_shard2_replica_n61] ] Opening new SolrCore at [/x1/jenkins/jenkins-slave/workspace/Lucene-Solr-NightlyTests-7.x/checkout/solr/build/solr-core/test/J2/temp/solr.cloud.FullSolrCloudDistribCmdsTest_1485DDF7CA87529D-001/shard-1-001/cores/collection1_shard2_replica_n61], dataDir=[/x1/jenkins/jenkins-slave/workspace/Lucene-Solr-NightlyTests-7.x/checkout/solr/build/solr-core/test/J2/../../../../../../../../../../../x1/jenkins/jenkins-slave/workspace/Lucene-Solr-NightlyTests-7.x/checkout/solr/build/solr-core/test/J2/temp/solr.cloud.FullSolrCloudDistribCmdsTest_1485DDF7CA87529D-001/shard-1-001/cores/collection1_shard2_replica_n61/data/]
   [junit4]   2> 2600433 INFO  (qtp688472394-26307) [n:127.0.0.1:41411_ c:collection1 s:shard2  x:collection1_shard2_replica_n61] o.a.s.u.RandomMergePolicy RandomMergePolicy wrapping class org.apache.lucene.index.MockRandomMergePolicy: org.apache.lucene.index.MockRandomMergePolicy@5fe80107
   [junit4]   2> 2600435 WARN  (qtp688472394-26307) [n:127.0.0.1:41411_ c:collection1 s:shard2  x:collection1_shard2_replica_n61] o.a.s.c.RequestHandlers INVALID paramSet a in requestHandler {type = requestHandler,name = /dump,class = DumpRequestHandler,attributes = {initParams=a, name=/dump, class=DumpRequestHandler},args = {defaults={a=A,b=B}}}
   [junit4]   2> 2600478 INFO  (qtp688472394-26307) [n:127.0.0.1:41411_ c:collection1 s:shard2  x:collection1_shard2_replica_n61] o.a.s.u.UpdateHandler Using UpdateLog implementation: org.apache.solr.update.UpdateLog
   [junit4]   2> 2600478 INFO  (qtp688472394-26307) [n:127.0.0.1:41411_ c:collection1 s:shard2  x:collection1_shard2_replica_n61] o.a.s.u.UpdateLog Initializing UpdateLog: dataDir= defaultSyncLevel=FLUSH numRecordsToKeep=100 maxNumLogsToKeep=10 numVersionBuckets=65536
   [junit4]   2> 2600479 INFO  (qtp688472394-26307) [n:127.0.0.1:41411_ c:collection1 s:shard2  x:collection1_shard2_replica_n61] o.a.s.u.CommitTracker Hard AutoCommit: disabled
   [junit4]   2> 2600479 INFO  (qtp688472394-26307) [n:127.0.0.1:41411_ c:collection1 s:shard2  x:collection1_shard2_replica_n61] o.a.s.u.CommitTracker Soft AutoCommit: disabled
   [junit4]   2> 2600481 INFO  (qtp688472394-26307) [n:127.0.0.1:41411_ c:collection1 s:shard2  x:collection1_shard2_replica_n61] o.a.s.u.RandomMergePolicy RandomMergePolicy wrapping class org.apache.lucene.index.TieredMergePolicy: [TieredMergePolicy: maxMergeAtOnce=27, maxMergeAtOnceExplicit=16, maxMergedSegmentMB=1.7158203125, floorSegmentMB=1.88671875, forceMergeDeletesPctAllowed=25.29713956040677, segmentsPerTier=43.0, maxCFSSegmentSizeMB=8.796093022207999E12, noCFSRatio=1.0, deletesPctAllowed=25.53993293286383
   [junit4]   2> 2600481 INFO  (qtp688472394-26307) [n:127.0.0.1:41411_ c:collection1 s:shard2  x:collection1_shard2_replica_n61] o.a.s.s.SolrIndexSearcher Opening [Searcher@31f5c086[collection1_shard2_replica_n61] main]
   [junit4]   2> 2600483 INFO  (qtp688472394-26307) [n:127.0.0.1:41411_ c:collection1 s:shard2  x:collection1_shard2_replica_n61] o.a.s.r.ManagedResourceStorage Configured ZooKeeperStorageIO with znodeBase: /configs/conf1
   [junit4]   2> 2600483 INFO  (qtp688472394-26307) [n:127.0.0.1:41411_ c:collection1 s:shard2  x:collection1_shard2_replica_n61] o.a.s.r.ManagedResourceStorage Loaded null at path _rest_managed.json using ZooKeeperStorageIO:path=/configs/conf1
   [junit4]   2> 2600484 INFO  (qtp688472394-26307) [n:127.0.0.1:41411_ c:collection1 s:shard2  x:collection1_shard2_replica_n61] o.a.s.h.ReplicationHandler Commits will be reserved for 10000ms.
   [junit4]   2> 2600484 INFO  (qtp688472394-26307) [n:127.0.0.1:41411_ c:collection1 s:shard2  x:collection1_shard2_replica_n61] o.a.s.u.UpdateLog Could not find max version in index or recent updates, using new clock 1612742384194420736
   [junit4]   2> 2600486 INFO  (searcherExecutor-8655-thread-1-processing-n:127.0.0.1:41411_ x:collection1_shard2_replica_n61 c:collection1 s:shard2) [n:127.0.0.1:41411_ c:collection1 s:shard2  x:collection1_shard2_replica_n61] o.a.s.c.SolrCore [collection1_shard2_replica_n61] Registered new searcher Searcher@31f5c086[collection1_shard2_replica_n61] main{ExitableDirectoryReader(UninvertingDirectoryReader())}
   [junit4]   2> 2600491 INFO  (qtp688472394-26307) [n:127.0.0.1:41411_ c:collection1 s:shard2  x:collection1_shard2_replica_n61] o.a.s.c.ZkShardTerms Successful update of terms at /collections/collection1/terms/shard2 to Terms{values={core_node62=0}, version=0}
   [junit4]   2> 2600494 INFO  (qtp688472394-26307) [n:127.0.0.1:41411_ c:collection1 s:shard2  x:collection1_shard2_replica_n61] o.a.s.c.ShardLeaderElectionContext Enough replicas found to continue.
   [junit4]   2> 2600494 INFO  (qtp688472394-26307) [n:127.0.0.1:41411_ c:collection1 s:shard2  x:collection1_shard2_replica_n61] o.a.s.c.ShardLeaderElectionContext I may be the new leader - try and sync
   [junit4]   2> 2600494 INFO  (qtp688472394-26307) [n:127.0.0.1:41411_ c:collection1 s:shard2  x:collection1_shard2_replica_n61] o.a.s.c.SyncStrategy Sync replicas to http://127.0.0.1:41411/collection1_shard2_replica_n61/
   [junit4]   2> 2600494 INFO  (qtp688472394-26307) [n:127.0.0.1:41411_ c:collection1 s:shard2  x:collection1_shard2_replica_n61] o.a.s.c.SyncStrategy Sync Success - now sync replicas to me
   [junit4]   2> 2600494 INFO  (qtp688472394-26307) [n:127.0.0.1:41411_ c:collection1 s:shard2  x:collection1_shard2_replica_n61] o.a.s.c.SyncStrategy http://127.0.0.1:41411/collection1_shard2_replica_n61/ has no replicas
   [junit4]   2> 2600494 INFO  (qtp688472394-26307) [n:127.0.0.1:41411_ c:collection1 s:shard2  x:collection1_shard2_replica_n61] o.a.s.c.ShardLeaderElectionContext Found all replicas participating in election, clear LIR
   [junit4]   2> 2600498 INFO  (qtp688472394-26307) [n:127.0.0.1:41411_ c:collection1 s:shard2  x:collection1_shard2_replica_n61] o.a.s.c.ShardLeaderElectionContext I am the new leader: http://127.0.0.1:41411/collection1_shard2_replica_n61/ shard2
   [junit4]   2> 2600600 INFO  (qtp688472394-26307) [n:127.0.0.1:41411_ c:collection1 s:shard2  x:collection1_shard2_replica_n61] o.a.s.c.ZkController I am the leader, no recovery necessary
   [junit4]   2> 2600602 INFO  (qtp688472394-26307) [n:127.0.0.1:41411_ c:collection1 s:shard2  x:collection1_shard2_replica_n61] o.a.s.s.HttpSolrCall [admin] webapp=null path=/admin/cores params={qt=/admin/cores&collection.configName=conf1&name=collection1_shard2_replica_n61&action=CREATE&collection=collection1&shard=shard2&wt=javabin&version=2&replicaType=NRT} status=0 QTime=1292
   [junit4]   2> 2600604 INFO  (qtp1665255401-26255) [n:127.0.0.1:39633_ c:collection1   ] o.a.s.s.HttpSolrCall [admin] webapp=null path=/admin/collections params={node=127.0.0.1:41411_&action=ADDREPLICA&collection=collection1&shard=shard2&type=NRT&wt=javabin&version=2} status=0 QTime=1311
   [junit4]   2> 2600702 INFO  (zkCallback-4937-thread-1) [    ] o.a.s.c.c.ZkStateReader A cluster state change: [WatchedEvent state:SyncConnected type:NodeDataChanged path:/collections/collection1/state.json] for collection [collection1] has occurred - updating... (live nodes size: [2])
   [junit4]   2> 2600727 INFO  (TEST-FullSolrCloudDistribCmdsTest.test-seed#[1485DDF7CA87529D]) [    ] o.a.s.c.AbstractFullDistribZkTestBase create jetty 2 in directory /x1/jenkins/jenkins-slave/workspace/Lucene-Solr-NightlyTests-7.x/checkout/solr/build/solr-core/test/J2/temp/solr.cloud.FullSolrCloudDistribCmdsTest_1485DDF7CA87529D-001/shard-2-001 of type NRT
   [junit4]   2> 2600727 INFO  (TEST-FullSolrCloudDistribCmdsTest.test-seed#[1485DDF7CA87529D]) [    ] o.e.j.s.Server jetty-9.4.11.v20180605; built: 2018-06-05T18:24:03.829Z; git: d5fc0523cfa96bfebfbda19606cad384d772f04c; jvm 1.8.0_172-b11
   [junit4]   2> 2600728 INFO  (TEST-FullSolrCloudDistribCmdsTest.test-seed#[1485DDF7CA87529D]) [    ] o.e.j.s.session DefaultSessionIdManager workerName=node0
   [junit4]   2> 2600728 INFO  (TEST-FullSolrCloudDistribCmdsTest.test-seed#[1485DDF7CA87529D]) [    ] o.e.j.s.session No SessionScavenger set, using defaults
   [junit4]   2> 2600728 INFO  (TEST-FullSolrCloudDistribCmdsTest.test-seed#[1485DDF7CA87529D]) [    ] o.e.j.s.session node0 Scavenging every 660000ms
   [junit4]   2> 2600729 INFO  (TEST-FullSolrCloudDistribCmdsTest.test-seed#[1485DDF7CA87529D]) [    ] o.e.j.s.h.ContextHandler Started o.e.j.s.ServletContextHandler@4afa0ca6{/,null,AVAILABLE}
   [junit4]   2> 2600729 INFO  (TEST-FullSolrCloudDistribCmdsTest.test-seed#[1485DDF7CA87529D]) [    ] o.e.j.s.AbstractConnector Started ServerConnector@21ba3c14{HTTP/1.1,[http/1.1]}{127.0.0.1:34380}
   [junit4]   2> 2600729 INFO  (TEST-FullSolrCloudDistribCmdsTest.test-seed#[1485DDF7CA87529D]) [    ] o.e.j.s.Server Started @2600787ms
   [junit4]   2> 2600729 INFO  (TEST-FullSolrCloudDistribCmdsTest.test-seed#[1485DDF7CA87529D]) [    ] o.a.s.c.s.e.JettySolrRunner Jetty properties: {solr.data.dir=/x1/jenkins/jenkins-slave/workspace/Lucene-Solr-NightlyTests-7.x/checkout/solr/build/solr-core/test/J2/temp/solr.cloud.FullSolrCloudDistribCmdsTest_1485DDF7CA87529D-001/tempDir-001/jetty2, solrconfig=solrconfig.xml, hostContext=/, hostPort=34380, coreRootDirectory=/x1/jenkins/jenkins-slave/workspace/Lucene-Solr-NightlyTests-7.x/checkout/solr/build/solr-core/test/J2/../../../../../../../../../../../x1/jenkins/jenkins-slave/workspace/Lucene-Solr-NightlyTests-7.x/checkout/solr/build/solr-core/test/J2/temp/solr.cloud.FullSolrCloudDistribCmdsTest_1485DDF7CA87529D-001/shard-2-001/cores}
   [junit4]   2> 2600730 ERROR (TEST-FullSolrCloudDistribCmdsTest.test-seed#[1485DDF7CA87529D]) [    ] o.a.s.u.StartupLoggingUtils Missing Java Option solr.log.dir. Logging may be missing or incomplete.
   [junit4]   2> 2600730 INFO  (TEST-FullSolrCloudDistribCmdsTest.test-seed#[1485DDF7CA87529D]) [    ] o.a.s.s.SolrDispatchFilter Using logger factory org.apache.logging.slf4j.Log4jLoggerFactory
   [junit4]   2> 2600731 INFO  (TEST-FullSolrCloudDistribCmdsTest.test-seed#[1485DDF7CA87529D]) [    ] o.a.s.s.SolrDispatchFilter  ___      _       Welcome to Apache Solr? version 7.6.0
   [junit4]   2> 2600731 INFO  (TEST-FullSolrCloudDistribCmdsTest.test-seed#[1485DDF7CA87529D]) [    ] o.a.s.s.SolrDispatchFilter / __| ___| |_ _   Starting in cloud mode on port null
   [junit4]   2> 2600731 INFO  (TEST-FullSolrCloudDistribCmdsTest.test-seed#[1485DDF7CA87529D]) [    ] o.a.s.s.SolrDispatchFilter \__ \/ _ \ | '_|  Install dir: null
   [junit4]   2> 2600731 INFO  (TEST-FullSolrCloudDistribCmdsTest.test-seed#[1485DDF7CA87529D]) [    ] o.a.s.s.SolrDispatchFilter |___/\___/_|_|    Start time: 2018-09-27T06:49:51.033Z
   [junit4]   2> 2600732 INFO  (zkConnectionManagerCallback-4948-thread-1) [    ] o.a.s.c.c.ConnectionManager zkClient has connected
   [junit4]   2> 2600733 INFO  (TEST-FullSolrCloudDistribCmdsTest.test-seed#[1485DDF7CA87529D]) [    ] o.a.s.s.SolrDispatchFilter Loading solr.xml from SolrHome (not found in ZooKeeper)
   [junit4]   2> 2600733 INFO  (TEST-FullSolrCloudDistribCmdsTest.test-seed#[1485DDF7CA87529D]) [    ] o.a.s.c.SolrXmlConfig Loading container configuration from /x1/jenkins/jenkins-slave/workspace/Lucene-Solr-NightlyTests-7.x/checkout/solr/build/solr-core/test/J2/temp/solr.cloud.FullSolrCloudDistribCmdsTest_1485DDF7CA87529D-001/shard-2-001/solr.xml
   [junit4]   2> 2600738 INFO  (TEST-FullSolrCloudDistribCmdsTest.test-seed#[1485DDF7CA87529D]) [    ] o.a.s.c.SolrXmlConfig Configuration parameter autoReplicaFailoverWorkLoopDelay is ignored
   [junit4]   2> 2600738 INFO  (TEST-FullSolrCloudDistribCmdsTest.test-seed#[1485DDF7CA87529D]) [    ] o.a.s.c.SolrXmlConfig Configuration parameter autoReplicaFailoverBadNodeExpiration is ignored
   [junit4]   2> 2600739 INFO  (TEST-FullSolrCloudDistribCmdsTest.test-seed#[1485DDF7CA87529D]) [    ] o.a.s.c.SolrXmlConfig MBean server found: com.sun.jmx.mbeanserver.JmxMBeanServer@3e0423d1, but no JMX reporters were configured - adding default JMX reporter.
   [junit4]   2> 2600967 INFO  (TEST-FullSolrCloudDistribCmdsTest.test-seed#[1485DDF7CA87529D]) [    ] o.a.s.c.ZkContainer Zookeeper client=127.0.0.1:43811/solr
   [junit4]   2> 2600969 INFO  (zkConnectionManagerCallback-4952-thread-1) [    ] o.a.s.c.c.ConnectionManager zkClient has connected
   [junit4]   2> 2600971 INFO  (zkConnectionManagerCallback-4954-thread-1) [    ] o.a.s.c.c.ConnectionManager zkClient has connected
   [junit4]   2> 2600981 INFO  (TEST-FullSolrCloudDistribCmdsTest.test-seed#[1485DDF7CA87529D]) [    ] o.a.s.c.c.ZkStateReader Updated live nodes from ZooKeeper... (0) -> (2)
   [junit4]   2> 2600985 INFO  (TEST-FullSolrCloudDistribCmdsTest.test-seed#[1485DDF7CA87529D]) [    ] o.a.s.c.TransientSolrCoreCacheDefault Allocating transient cache for 4 transient cores
   [junit4]   2> 2600985 INFO  (TEST-FullSolrCloudDistribCmdsTest.test-seed#[1485DDF7CA87529D]) [    ] o.a.s.c.ZkController Register node as live in ZooKeeper:/live_nodes/127.0.0.1:34380_
   [junit4]   2> 2600995 INFO  (zkCallback-4937-thread-1) [    ] o.a.s.c.c.ZkStateReader Updated live nodes from ZooKeeper... (2) -> (3)
   [junit4]   2> 2600995 INFO  (zkCallback-4929-thread-1) [    ] o.a.s.c.c.ZkStateReader Updated live nodes from ZooKeeper... (2) -> (3)
   [junit4]   2> 2600995 INFO  (zkCallback-4918-thread-1) [    ] o.a.s.c.c.ZkStateReader Updated live nodes from ZooKeeper... (2) -> (3)
   [junit4]   2> 2600995 INFO  (zkCallback-4911-thread-1) [    ] o.a.s.c.c.ZkStateReader Updated live nodes from ZooKeeper... (2) -> (3)
   [junit4]   2> 2601002 INFO  (zkCallback-4944-thread-1) [    ] o.a.s.c.c.ZkStateReader Updated live nodes from ZooKeeper... (2) -> (3)
   [junit4]   2> 2601005 INFO  (zkCallback-4953-thread-1) [    ] o.a.s.c.c.ZkStateReader Updated live nodes from ZooKeeper... (2) -> (3)
   [junit4]   2> 2601015 INFO  (zkConnectionManagerCallback-4961-thread-1) [    ] o.a.s.c.c.ConnectionManager zkClient has connected
   [junit4]   2> 2601016 INFO  (TEST-FullSolrCloudDistribCmdsTest.test-seed#[1485DDF7CA87529D]) [    ] o.a.s.c.c.ZkStateReader Updated live nodes from ZooKeeper... (0) -> (3)
   [junit4]   2> 2601017 INFO  (TEST-FullSolrCloudDistribCmdsTest.test-seed#[1485DDF7CA87529D]) [    ] o.a.s.c.s.i.ZkClientClusterStateProvider Cluster at 127.0.0.1:43811/solr ready
   [junit4]   2> 2601018 INFO  (TEST-FullSolrCloudDistribCmdsTest.test-seed#[1485DDF7CA87529D]) [    ] o.a.s.h.a.MetricsHistoryHandler No .system collection, keeping metrics history in memory.
   [junit4]   2> 2601036 INFO  (TEST-FullSolrCloudDistribCmdsTest.test-seed#[1485DDF7CA87529D]) [    ] o.a.s.m.r.SolrJmxReporter JMX monitoring for 'solr.node' (registry 'solr.node') enabled at server: com.sun.jmx.mbeanserver.JmxMBeanServer@3e0423d1
   [junit4]   2> 2601048 INFO  (TEST-FullSolrCloudDistribCmdsTest.test-seed#[1485DDF7CA87529D]) [    ] o.a.s.m.r.SolrJmxReporter JMX monitoring for 'solr.jvm' (registry 'solr.jvm') enabled at server: com.sun.jmx.mbeanserver.JmxMBeanServer@3e0423d1
   [junit4]   2> 2601048 INFO  (TEST-FullSolrCloudDistribCmdsTest.test-seed#[1485DDF7CA87529D]) [    ] o.a.s.m.r.SolrJmxReporter JMX monitoring for 'solr.jetty' (registry 'solr.jetty') enabled at server: com.sun.jmx.mbeanserver.JmxMBeanServer@3e0423d1
   [junit4]   2> 2601051 INFO  (TEST-FullSolrCloudDistribCmdsTest.test-seed#[1485DDF7CA87529D]) [    ] o.a.s.c.CorePropertiesLocator Found 0 core definitions underneath /x1/jenkins/jenkins-slave/workspace/Lucene-Solr-NightlyTests-7.x/checkout/solr/build/solr-core/test/J2/../../../../../../../../../../../x1/jenkins/jenkins-slave/workspace/Lucene-Solr-NightlyTests-7.x/checkout/solr/build/solr-core/test/J2/temp/solr.cloud.FullSolrCloudDistribCmdsTest_1485DDF7CA87529D-001/shard-2-001/cores
   [junit4]   2> 2601093 INFO  (qtp1967232461-26345) [n:127.0.0.1:34380_    ] o.a.s.h.a.CollectionsHandler Invoked Collection Action :addreplica with params node=127.0.0.1:34380_&action=ADDREPLICA&collection=collection1&shard=shard3&type=NRT&wt=javabin&version=2 and sendToOCPQueue=true
   [junit4]   2> 2601095 INFO  (OverseerCollectionConfigSetProcessor-72406226241323012-127.0.0.1:39633_-n_0000000000) [n:127.0.0.1:39633_    ] o.a.s.c.OverseerTaskQueue Response ZK path: /overseer/collection-queue-work/qnr-0000000004 doesn't exist.  Requestor may have disconnected from ZooKeeper
   [junit4]   2> 2601097 INFO  (OverseerThreadFactory-8636-thread-4-processing-n:127.0.0.1:39633_) [n:127.0.0.1:39633_ c:collection1 s:shard3  ] o.a.s.c.a.c.AddReplicaCmd Node Identified 127.0.0.1:34380_ for creating new replica of shard shard3
   [junit4]   2> 2601099 INFO  (qtp1967232461-26340) [n:127.0.0.1:34380_    x:collection1_shard3_replica_n63] o.a.s.h.a.CoreAdminOperation core create command qt=/admin/cores&collection.configName=conf1&name=collection1_shard3_replica_n63&action=CREATE&collection=collection1&shard=shard3&wt=javabin&version=2&replicaType=NRT
   [junit4]   2> 2601207 INFO  (zkCallback-4937-thread-1) [    ] o.a.s.c.c.ZkStateReader A cluster state change: [WatchedEvent state:SyncConnected type:NodeDataChanged path:/collections/collection1/state.json] for collection [collection1] has occurred - updating... (live nodes size: [3])
   [junit4]   2> 2602125 INFO  (qtp1967232461-26340) [n:127.0.0.1:34380_ c:collection1 s:shard3  x:collection1_shard3_replica_n63] o.a.s.c.SolrConfig Using Lucene MatchVersion: 7.6.0
   [junit4]   2> 2602142 INFO  (qtp1967232461-26340) [n:127.0.0.1:34380_ c:collection1 s:shard3  x:collection1_shard3_replica_n63] o.a.s.s.IndexSchema [collection1_shard3_replica_n63] Schema name=test
   [junit4]   2> 2602238 INFO  (qtp1967232461-26340) [n:127.0.0.1:34380_ c:collection1 s:shard3  x:collection1_shard3_replica_n63] o.a.s.s.IndexSchema Loaded schema test/1.6 with uniqueid field id
   [junit4]   2> 2602263 INFO  (qtp1967232461-26340) [n:127.0.0.1:34380_ c:collection1 s:shard3  x:collection1_shard3_replica_n63] o.a.s.c.CoreContainer Creating SolrCore 'collection1_shard3_replica_n63' using configuration from collection collection1, trusted=true
   [junit4]   2> 2602264 INFO  (qtp1967232461-26340) [n:127.0.0.1:34380_ c:collection1 s:shard3  x:collection1_shard3_replica_n63] o.a.s.m.r.SolrJmxReporter JMX monitoring for 'solr.core.collection1.shard3.replica_n63' (registry 'solr.core.collection1.shard3.replica_n63') enabled at server: com.sun.jmx.mbeanserver.JmxMBeanServer@3e0423d1
   [junit4]   2> 2602264 INFO  (qtp1967232461-26340) [n:127.0.0.1:34380_ c:collection1 s:shard3  x:collection1_shard3_replica_n63] o.a.s.c.SolrCore [[collection1_shard3_replica_n63] ] Opening new SolrCore at [/x1/jenkins/jenkins-slave/workspace/Lucene-Solr-NightlyTests-7.x/checkout/solr/build/solr-core/test/J2/temp/solr.cloud.FullSolrCloudDistribCmdsTest_1485DDF7CA87529D-001/shard-2-001/cores/collection1_shard3_replica_n63], dataDir=[/x1/jenkins/jenkins-slave/workspace/Lucene-Solr-NightlyTests-7.x/checkout/solr/build/solr-core/test/J2/../../../../../../../../../../../x1/jenkins/jenkins-slave/workspace/Lucene-Solr-NightlyTests-7.x/checkout/solr/build/solr-core/test/J2/temp/solr.cloud.FullSolrCloudDistribCmdsTest_1485DDF7CA87529D-001/shard-2-001/cores/collection1_shard3_replica_n63/data/]
   [junit4]   2> 2602267 INFO  (qtp1967232461-26340) [n:127.0.0.1:34380_ c:collection1 s:shard3  x:collection1_shard3_replica_n63] o.a.s.u.RandomMergePolicy RandomMergePolicy wrapping class org.apache.lucene.index.MockRandomMergePolicy: org.apache.lucene.index.MockRandomMergePolicy@50c4e016
   [junit4]   2> 2602270 WARN  (qtp1967232461-26340) [n:127.0.0.1:34380_ c:collection1 s:shard3  x:collection1_shard3_replica_n63] o.a.s.c.RequestHandlers INVALID paramSet a in requestHandler {type = requestHandler,name = /dump,class = DumpRequestHandler,attributes = {initParams=a, name=/dump, class=DumpRequestHandler},args = {defaults={a=A,b=B}}}
   [junit4]   2> 2602334 INFO  (qtp1967232461-26340) [n:127.0.0.1:34380_ c:collection1 s:shard3  x:collection1_shard3_replica_n63] o.a.s.u.UpdateHandler Using UpdateLog implementation: org.apache.solr.update.UpdateLog
   [junit4]   2> 2602334 INFO  (qtp1967232461-26340) [n:127.0.0.1:34380_ c:collection1 s:shard3  x:collection1_shard3_replica_n63] o.a.s.u.UpdateLog Initializing UpdateLog: dataDir= defaultSyncLevel=FLUSH numRecordsToKeep=100 maxNumLogsToKeep=10 numVersionBuckets=65536
   [junit4]   2> 2602336 INFO  (qtp1967232461-26340) [n:127.0.0.1:34380_ c:collection1 s:shard3  x:collection1_shard3_replica_n63] o.a.s.u.CommitTracker Hard AutoCommit: disabled
   [junit4]   2> 2602336 INFO  (qtp1967232461-26340) [n:127.0.0.1:34380_ c:collection1 s:shard3  x:collection1_shard3_replica_n63] o.a.s.u.CommitTracker Soft AutoCommit: disabled
   [junit4]   2> 2602338 INFO  (qtp1967232461-26340) [n:127.0.0.1:34380_ c:collection1 s:shard3  x:collection1_shard3_replica_n63] o.a.s.u.RandomMergePolicy RandomMergePolicy wrapping class org.apache.lucene.index.TieredMergePolicy: [TieredMergePolicy: maxMergeAtOnce=27, maxMergeAtOnceExplicit=16, maxMergedSegmentMB=1.7158203125, floorSegmentMB=1.88671875, forceMergeDeletesPctAllowed=25.29713956040677, segmentsPerTier=43.0, maxCFSSegmentSizeMB=8.796093022207999E12, noCFSRatio=1.0, deletesPctAllowed=25.53993293286383
   [junit4]   2> 2602338 INFO  (qtp1967232461-26340) [n:127.0.0.1:34380_ c:collection1 s:shard3  x:collection1_shard3_replica_n63] o.a.s.s.SolrIndexSearcher Opening [Searcher@1fc47612[collection1_shard3_replica_n63] main]
   [junit4]   2> 2602339 INFO  (qtp1967232461-26340) [n:127.0.0.1:34380_ c:collection1 s:shard3  x:collection1_shard3_replica_n63] o.a.s.r.ManagedResourceStorage Configured ZooKeeperStorageIO with znodeBase: /configs/conf1
   [junit4]   2> 2602340 INFO  (qtp1967232461-26340) [n:127.0.0.1:34380_ c:collection1 s:shard3  x:collection1_shard3_replica_n63] o.a.s.r.ManagedResourceStorage Loaded null at path _rest_managed.json using ZooKeeperStorageIO:path=/configs/conf1
   [junit4]   2> 2602341 INFO  (qtp1967232461-26340) [n:127.0.0.1:34380_ c:collection1 s:shard3  x:collection1_shard3_replica_n63] o.a.s.h.ReplicationHandler Commits will be reserved for 10000ms.
   [junit4]   2> 2602342 INFO  (searcherExecutor-8669-thread-1-processing-n:127.0.0.1:34380_ x:collection1_shard3_replica_n63 c:collection1 s:shard3) [n:127.0.0.1:34380_ c:collection1 s:shard3  x:collection1_shard3_replica_n63] o.a.s.c.SolrCore [collection1_shard3_replica_n63] Registered new searcher Searcher@1fc47612[collection1_shard3_replica_n63] main{ExitableDirectoryReader(UninvertingDirectoryReader())}
   [junit4]   2> 2602342 INFO  (qtp1967232461-26340) [n:127.0.0.1:34380_ c:collection1 s:shard3  x:collection1_shard3_replica_n63] o.a.s.u.UpdateLog Could not find max version in index or recent updates, using new clock 1612742386142674944
   [junit4]   2> 2602347 INFO  (qtp1967232461-26340) [n:127.0.0.1:34380_ c:collection1 s:shard3  x:collection1_shard3_replica_n63] o.a.s.c.ZkShardTerms Successful update of terms at /collections/collection1/terms/shard3 to Terms{values={core_node64=0}, version=0}
   [junit4]   2> 2602350 INFO  (qtp1967232461-26340) [n:127.0.0.1:34380_ c:collection1 s:shard3  x:collection1_shard3_replica_n63] o.a.s.c.ShardLeaderElectionContext Enough replicas found to continue.
   [junit4]   2> 2602350 INFO  (qtp1967232461-26340) [n:127.0.0.1:34380_ c:collection1 s:shard3  x:collection1_shard3_replica_n63] o.a.s.c.ShardLeaderElectionContext I may be the new leader - try and sync
   [junit4]   2> 2602350 INFO  (qtp1967232461-26340) [n:127.0.0.1:34380_ c:collection1 s:shard3  x:collection1_shard3_replica_n63] o.a.s.c.SyncStrategy Sync replicas to http://127.0.0.1:34380/collection1_shard3_replica_n63/
   [junit4]   2> 2602350 INFO  (qtp1967232461-26340) [n:127.0.0.1:34380_ c:collection1 s:shard3  x:collection1_shard3_replica_n63] o.a.s.c.SyncStrategy Sync Success - now sync replicas to me
   [junit4]   2> 2602351 INFO  (qtp1967232461-26340) [n:127.0.0.1:34380_ c:collection1 s:shard3  x:collection1_shard3_replica_n63] o.a.s.c.SyncStrategy http://127.0.0.1:34380/collection1_shard3_replica_n63/ has no replicas
   [junit4]   2> 2602351 INFO  (qtp1967232461-26340) [n:127.0.0.1:34380_ c:collection1 s:shard3  x:collection1_shard3_replica_n63] o.a.s.c.ShardLeaderElectionContext Found all replicas participating in election, clear LIR
   [junit4]   2> 2602355 INFO  (qtp1967232461-26340) [n:127.0.0.1:34380_ c:collection1 s:shard3  x:collection1_shard3_replica_n63] o.a.s.c.ShardLeaderElectionContext I am the new leader: http://127.0.0.1:34380/collection1_shard3_replica_n63/ shard3
   [junit4]   2> 2602460 INFO  (zkCallback-4937-thread-1) [    ] o.a.s.c.c.ZkStateReader A cluster state change: [WatchedEvent state:SyncConnected type:NodeDataChanged path:/collections/collection1/state.json] for collection [collection1] has occurred - updating... (live nodes size: [3])
   [junit4]   2> 2602461 INFO  (qtp1967232461-26340) [n:127.0.0.1:34380_ c:collection1 s:shard3  x:collection1_shard3_replica_n63] o.a.s.c.ZkController I am the leader, no recovery necessary
   [junit4]   2> 2602463 INFO  (qtp1967232461-26340) [n:127.0.0.1:34380_ c:collection1 s:shard3  x:collection1_shard3_replica_n63] o.a.s.s.HttpSolrCall [admin] webapp=null path=/admin/cores params={qt=/admin/cores&collection.configName=conf1&name=collection1_shard3_replica_n63&action=CREATE&collection=collection1&shard=shard3&wt=javabin&version=2&replicaType=NRT} status=0 QTime=1363
   [junit4]   2> 2602465 INFO  (qtp1967232461-26345) [n:127.0.0.1:34380_ c:collection1   ] o.a.s.s.HttpSolrCall [admin] webapp=null path=/admin/collections params={node=127.0.0.1:34380_&action=ADDREPLICA&collection=collection1&shard=shard3&type=NRT&wt=javabin&version=2} status=0 QTime=1371
   [junit4]   2> 2602563 INFO  (zkCallback-4953-thread-1) [    ] o.a.s.c.c.ZkStateReader A cluster state change: [WatchedEvent state:SyncConnected type:NodeDataChanged path:/collections/collection1/state.json] for collection [collection1] has occurred - updating... (live nodes size: [3])
   [junit4]   2> 2602563 INFO  (zkCallback-4937-thread-1) [    ] o.a.s.c.c.ZkStateReader A cluster state change: [WatchedEvent state:SyncConnected type:NodeDataChanged path:/collections/collection1/state.json] for collection [collection1] has occurred - updating... (live nodes size: [3])
   [junit4]   2> 2602589 INFO  (TEST-FullSolrCloudDistribCmdsTest.test-seed#[1485DDF7CA87529D]) [    ] o.a.s.c.AbstractFullDistribZkTestBase create jetty 3 in directory /x1/jenkins/jenkins-slave/workspace/Lucene-Solr-NightlyTests-7.x/checkout/solr/build/solr-core/test/J2/temp/solr.cloud.FullSolrCloudDistribCmdsTest_1485DDF7CA87529D-001/shard-3-001 of type NRT
   [junit4]   2> 2602589 INFO  (TEST-FullSolrCloudDistribCmdsTest.test-seed#[1485DDF7CA87529D]) [    ] o.e.j.s.Server jetty-9.4.11.v20180605; built: 2018-06-05T18:24:03.829Z; git: d5fc0523cfa96bfebfbda19606cad384d772f04c; jvm 1.8.0_172-b11
   [junit4]   2> 2602590 INFO  (TEST-FullSolrCloudDistribCmdsTest.test-seed#[1485DDF7CA87529D]) [    ] o.e.j.s.session DefaultSessionIdManager workerName=node0
   [junit4]   2> 2602590 INFO  (TEST-FullSolrCloudDistribCmdsTest.test-seed#[1485DDF7CA87529D]) [    ] o.e.j.s.session No SessionScavenger set, using defaults
   [junit4]   2> 2602591 INFO  (TEST-FullSolrCloudDistribCmdsTest.test-seed#[1485DDF7CA87529D]) [    ] o.e.j.s.session node0 Scavenging every 600000ms
   [junit4]   2> 2602591 INFO  (TEST-FullSolrCloudDistribCmdsTest.test-seed#[1485DDF7CA87529D]) [    ] o.e.j.s.h.ContextHandler Started o.e.j.s.ServletContextHandler@72694539{/,null,AVAILABLE}
   [junit4]   2> 2602591 INFO  (TEST-FullSolrCloudDistribCmdsTest.test-seed#[1485DDF7CA87529D]) [    ] o.e.j.s.AbstractConnector Started ServerConnector@3e7dd5e{HTTP/1.1,[http/1.1]}{127.0.0.1:33187}
   [junit4]   2> 2602591 INFO  (TEST-FullSolrCloudDistribCmdsTest.test-seed#[1485DDF7CA87529D]) [    ] o.e.j.s.Server Started @2602649ms
   [junit4]   2> 2602591 INFO  (TEST-FullSolrCloudDistribCmdsTest.test-seed#[1485DDF7CA87529D]) [    ] o.a.s.c.s.e.JettySolrRunner Jetty properties: {solr.data.dir=/x1/jenkins/jenkins-slave/workspace/Lucene-Solr-NightlyTests-7.x/checkout/solr/build/solr-core/test/J2/temp/solr.cloud.FullSolrCloudDistribCmdsTest_1485DDF7CA87529D-001/tempDir-001/jetty3, solrconfig=solrconfig.xml, hostContext=/, hostPort=33187, coreRootDirectory=/x1/jenkins/jenkins-slave/workspace/Lucene-Solr-NightlyTests-7.x/checkout/solr/build/solr-core/test/J2/../../../../../../../../../../../x1/jenkins/jenkins-slave/workspace/Lucene-Solr-NightlyTests-7.x/checkout/solr/build/solr-core/test/J2/temp/solr.cloud.FullSolrCloudDistribCmdsTest_1485DDF7CA87529D-001/shard-3-001/cores}
   [junit4]   2> 2602592 ERROR (TEST-FullSolrCloudDistribCmdsTest.test-seed#[1485DDF7CA87529D]) [    ] o.a.s.u.StartupLoggingUtils Missing Java Option solr.log.dir. Logging may be missing or incomplete.
   [junit4]   2> 2602598 INFO  (TEST-FullSolrCloudDistribCmdsTest.test-seed#[1485DDF7CA87529D]) [    ] o.a.s.s.SolrDispatchFilter Using logger factory org.apache.logging.slf4j.Log4jLoggerFactory
   [junit4]   2> 2602598 INFO  (TEST-FullSolrCloudDistribCmdsTest.test-seed#[1485DDF7CA87529D]) [    ] o.a.s.s.SolrDispatchFilter  ___      _       Welcome to Apache Solr? version 7.6.0
   [junit4]   2> 2602598 INFO  (TEST-FullSolrCloudDistribCmdsTest.test-seed#[1485DDF7CA87529D]) [    ] o.a.s.s.SolrDispatchFilter / __| ___| |_ _   Starting in cloud mode on port null
   [junit4]   2> 2602598 INFO  (TEST-FullSolrCloudDistribCmdsTest.test-seed#[1485DDF7CA87529D]) [    ] o.a.s.s.SolrDispatchFilter \__ \/ _ \ | '_|  Install dir: null
   [junit4]   2> 2602598 INFO  (TEST-FullSolrCloudDistribCmdsTest.test-seed#[1485DDF7CA87529D]) [    ] o.a.s.s.SolrDispatchFilter |___/\___/_|_|    Start time: 2018-09-27T06:49:52.900Z
   [junit4]   2> 2602600 INFO  (zkConnectionManagerCallback-4964-thread-1) [    ] o.a.s.c.c.ConnectionManager zkClient has connected
   [junit4]   2> 2602601 INFO  (TEST-FullSolrCloudDistribCmdsTest.test-seed#[1485DDF7CA87529D]) [    ] o.a.s.s.SolrDispatchFilter Loading solr.xml from SolrHome (not found in ZooKeeper)
   [junit4]   2> 2602601 INFO  (TEST-FullSolrCloudDistribCmdsTest.test-seed#[1485DDF7CA87529D]) [    ] o.a.s.c.SolrXmlConfig Loading container configuration from /x1/jenkins/jenkins-slave/workspace/Lucene-Solr-NightlyTests-7.x/checkout/solr/build/solr-core/test/J2/temp/solr.cloud.FullSolrCloudDistribCmdsTest_1485DDF7CA87529D-001/shard-3-001/solr.xml
   [junit4]   2> 2602605 INFO  (TEST-FullSolrCloudDistribCmdsTest.test-seed#[1485DDF7CA87529D]) [    ] o.a.s.c.SolrXmlConfig Configuration parameter autoReplicaFailoverWorkLoopDelay is ignored
   [junit4]   2> 2602605 INFO  (TEST-FullSolrCloudDistribCmdsTest.test-seed#[1485DDF7CA87529D]) [    ] o.a.s.c.SolrXmlConfig Configuration parameter autoReplicaFailoverBadNodeExpiration is ignored
   [junit4]   2> 2602606 INFO  (TEST-FullSolrCloudDistribCmdsTest.test-seed#[1485DDF7CA87529D]) [    ] o.a.s.c.SolrXmlConfig MBean server found: com.sun.jmx.mbeanserver.JmxMBeanServer@3e0423d1, but no JMX reporters were configured - adding default JMX reporter.
   [junit4]   2> 2602667 INFO  (TEST-FullSolrCloudDistribCmdsTest.test-seed#[1485DDF7CA87529D]) [    ] o.a.s.c.ZkContainer Zookeeper client=127.0.0.1:43811/solr
   [junit4]   2> 2602668 INFO  (zkConnectionManagerCallback-4968-thread-1) [    ] o.a.s.c.c.ConnectionManager zkClient has connected
   [junit4]   2> 2602670 INFO  (zkConnectionManagerCallback-4970-thread-1) [    ] o.a.s.c.c.ConnectionManager zkClient has connected
   [junit4]   2> 2602675 INFO  (TEST-FullSolrCloudDistribCmdsTest.test-seed#[1485DDF7CA87529D]) [    ] o.a.s.c.c.ZkStateReader Updated live nodes from ZooKeeper... (0) -> (3)
   [junit4]   2> 2602679 INFO  (TEST-FullSolrCloudDistribCmdsTest.test-seed#[1485DDF7CA87529D]) [    ] o.a.s.c.TransientSolrCoreCacheDefault Allocating transient cache for 4 transient cores
   [junit4]   2> 2602679 INFO  (TEST-FullSolrCloudDistribCmdsTest.test-seed#[1485DDF7CA87529D]) [    ] o.a.s.c.ZkController Register node as live in ZooKeeper:/live_nodes/127.0.0.1:33187_
   [junit4]   2> 2602680 INFO  (zkCallback-4929-thread-1) [    ] o.a.s.c.c.ZkStateReader Updated live nodes from ZooKeeper... (3) -> (4)
   [junit4]   2> 2602680 INFO  (zkCallback-4937-thread-1) [    ] o.a.s.c.c.ZkStateReader Updated live nodes from ZooKeeper... (3) -> (4)
   [junit4]   2> 2602680 INFO  (zkCallback-4918-thread-1) [    ] o.a.s.c.c.ZkStateReader Updated live nodes from ZooKeeper... (3) -> (4)
   [junit4]   2> 2602680 INFO  (zkCallback-4911-thread-1) [    ] o.a.s.c.c.ZkStateReader Updated live nodes from ZooKeeper... (3) -> (4)
   [junit4]   2> 2602680 INFO  (zkCallback-4953-thread-1) [    ] o.a.s.c.c.ZkStateReader Updated live nodes from ZooKeeper... (3) -> (4)
   [junit4]   2> 2602691 INFO  (zkCallback-4960-thread-1) [    ] o.a.s.c.c.ZkStateReader Updated live nodes from ZooKeeper... (3) -> (4)
   [junit4]   2> 2602691 INFO  (zkCallback-4944-thread-1) [    ] o.a.s.c.c.ZkStateReader Updated live nodes from ZooKeeper... (3) -> (4)
   [junit4]   2> 2602692 INFO  (zkCallback-4969-thread-1) [    ] o.a.s.c.c.ZkStateReader Updated live nodes from ZooKeeper... (3) -> (4)
   [junit4]   2> 2602701 INFO  (zkConnectionManagerCallback-4977-thread-1) [    ] o.a.s.c.c.ConnectionManager zkClient has connected
   [junit4]   2> 2602702 INFO  (TEST-FullSolrCloudDistribCmdsTest.test-seed#[1485DDF7CA87529D]) [    ] o.a.s.c.c.ZkStateReader Updated live nodes from ZooKeeper... (0) -> (4)
   [junit4]   2> 2602703 INFO  (TEST-FullSolrCloudDistribCmdsTest.test-seed#[1485DDF7CA87529D]) [    ] o.a.s.c.s.i.ZkClientClusterStateProvider Cluster at 127.0.0.1:43811/solr ready
   [junit4]   2> 2602703 INFO  (TEST-FullSolrCloudDistribCmdsTest.test-seed#[1485DDF7CA87529D]) [    ] o.a.s.h.a.MetricsHistoryHandler No .system collection, keeping metrics history in memory.
   [junit4]   2> 2602728 INFO  (TEST-FullSolrCloudDistribCmdsTest.test-seed#[1485DDF7CA87529D]) [    ] o.a.s.m.r.SolrJmxReporter JMX monitoring for 'solr.node' (registry 'solr.node') enabled at server: com.sun.jmx.mbeanserver.JmxMBeanServer@3e0423d1
   [junit4]   2> 2602760 INFO  (TEST-FullSolrCloudDistribCmdsTest.test-seed#[1485DDF7CA87529D]) [    ] o.a.s.m.r.SolrJmxReporter JMX monitoring for 'solr.jvm' (registry 'solr.jvm') enabled at server: com.sun.jmx.mbeanserver.JmxMBeanServer@3e0423d1
   [junit4]   2> 2602760 INFO  (TEST-FullSolrCloudDistribCmdsTest.test-seed#[1485DDF7CA87529D]) [    ] o.a.s.m.r.SolrJmxReporter JMX monitoring for 'solr.jetty' (registry 'solr.jetty') enabled at server: com.sun.jmx.mbeanserver.JmxMBeanServer@3e0423d1
   [junit4]   2> 2602761 INFO  (TEST-FullSolrCloudDistribCmdsTest.test-seed#[1485DDF7CA87529D]) [    ] o.a.s.c.CorePropertiesLocator Found 0 core definitions underneath /x1/jenkins/jenkins-slave/workspace/Lucene-Solr-NightlyTests-7.x/checkout/solr/build/solr-core/test/J2/../../../../../../../../../../../x1/jenkins/jenkins-slave/workspace/Lucene-Solr-NightlyTests-7.x/checkout/solr/build/solr-core/test/J2/temp/solr.cloud.FullSolrCloudDistribCmdsTest_1485DDF7CA87529D-001/shard-3-001/cores
   [junit4]   2> 2602809 INFO  (qtp221204085-26383) [n:127.0.0.1:33187_    ] o.a.s.h.a.CollectionsHandler Invoked Collection Action :addreplica with params node=127.0.0.1:33187_&action=ADDREPLICA&collection=collection1&shard=shard1&type=NRT&wt=javabin&version=2 and sendToOCPQueue=true
   [junit4]   2> 2602811 INFO  (OverseerCollectionConfigSetProcessor-72406226241323012-127.0.0.1:39633_-n_0000000000) [n:127.0.0.1:39633_    ] o.a.s.c.OverseerTaskQueue Response ZK path: /overseer/collection-queue-work/qnr-0000000006 doesn't exist.  Requestor may have disconnected from ZooKeeper
   [junit4]   2> 2602812 INFO  (OverseerThreadFactory-8636-thread-5-processing-n:127.0.0.1:39633_) [n:127.0.0.1:39633_ c:collection1 s:shard1  ] o.a.s.c.a.c.AddReplicaCmd Node Identified 127.0.0.1:33187_ for creating new replica of shard shard1
   [junit4]   2> 2602814 INFO  (qtp221204085-26378) [n:127.0.0.1:33187_    x:collection1_shard1_replica_n65] o.a.s.h.a.CoreAdminOperation core create command qt=/admin/cores&collection.configName=conf1&name=collection1_shard1_replica_n65&action=CREATE&collection=collection1&shard=shard1&wt=javabin&version=2&replicaType=NRT
   [junit4]   2> 2602919 INFO  (zkCallback-4953-thread-1) [    ] o.a.s.c.c.ZkStateReader A cluster state change: [WatchedEvent state:SyncConnected type:NodeDataChanged path:/collections/collection1/state.json] for collection [collection1] has occurred - updating... (live nodes size: [4])
   [junit4]   2> 2602919 INFO  (zkCallback-4937-thread-1) [    ] o.a.s.c.c.ZkStateReader A cluster state change: [WatchedEvent state:SyncConnected type:NodeDataChanged path:/collections/collection1/state.json] for collection [collection1] has occurred - updating... (live nodes size: [4])
   [junit4]   2> 2603830 INFO  (qtp221204085-26378) [n:127.0.0.1:33187_ c:collection1 s:shard1  x:collection1_shard1_replica_n65] o.a.s.c.SolrConfig Using Lucene MatchVersion: 7.6.0
   [junit4]   2> 2603851 INFO  (qtp221204085-26378) [n:127.0.0.1:33187_ c:collection1 s:shard1  x:collection1_shard1_replica_n65] o.a.s.s.IndexSchema [collection1_shard1_replica_n65] Schema name=test
   [junit4]   2> 2603952 INFO  (qtp221204085-26378) [n:127.0.0.1:33187_ c:collection1 s:shard1  x:collection1_shard1_replica_n65] o.a.s.s.IndexSchema Loaded schema test/1.6 with uniqueid field id
   [junit4]   2> 2603966 INFO  (qtp221204085-26378) [n:127.0.0.1:33187_ c:collection1 s:shard1  x:collection1_shard1_replica_n65] o.a.s.c.CoreContainer Creating SolrCore 'col

[...truncated too long message...]

terprops.json
   [junit4]   2> 	26	/solr/clusterstate.json
   [junit4]   2> 	15	/solr/collections/collection2/state.json
   [junit4]   2> 	4	/solr/autoscaling.json
   [junit4]   2> 	2	/solr/collections/collection2/leader_elect/shard1/election/72406226241323022-core_node3-n_0000000000
   [junit4]   2> 	2	/solr/overseer_elect/election/72406226241323022-127.0.0.1:34380_-n_0000000002
   [junit4]   2> 	2	/solr/collections/collection2/leader_elect/shard4/election/72406226241323030-core_node24-n_0000000000
   [junit4]   2> 
   [junit4]   2> Maximum concurrent children watches above limit:
   [junit4]   2> 
   [junit4]   2> 	26	/solr/live_nodes
   [junit4]   2> 	26	/solr/collections
   [junit4]   2> 	4	/solr/overseer/queue
   [junit4]   2> 	4	/solr/autoscaling/events/.scheduled_maintenance
   [junit4]   2> 	4	/solr/overseer/collection-queue-work
   [junit4]   2> 	4	/solr/overseer/queue-work
   [junit4]   2> 	3	/solr/autoscaling/events/.auto_add_replicas
   [junit4]   2> 
   [junit4]   2> NOTE: download the large Jenkins line-docs file by running 'ant get-jenkins-line-docs' in the lucene directory.
   [junit4]   2> NOTE: reproduce with: ant test  -Dtestcase=FullSolrCloudDistribCmdsTest -Dtests.method=test -Dtests.seed=1485DDF7CA87529D -Dtests.multiplier=2 -Dtests.nightly=true -Dtests.slow=true -Dtests.linedocsfile=/home/jenkins/jenkins-slave/workspace/Lucene-Solr-NightlyTests-7.x/test-data/enwiki.random.lines.txt -Dtests.locale=es-HN -Dtests.timezone=America/Inuvik -Dtests.asserts=true -Dtests.file.encoding=US-ASCII
   [junit4] ERROR    156s J2 | FullSolrCloudDistribCmdsTest.test <<<
   [junit4]    > Throwable #1: org.apache.solr.client.solrj.SolrServerException: No live SolrServers available to handle this request:[http://127.0.0.1:38828/collection2, http://127.0.0.1:41411/collection2, http://127.0.0.1:41270/collection2, http://127.0.0.1:34380/collection2, http://127.0.0.1:39633/collection2]
   [junit4]    > 	at __randomizedtesting.SeedInfo.seed([1485DDF7CA87529D:9CD1E22D647B3F65]:0)
   [junit4]    > 	at org.apache.solr.client.solrj.impl.LBHttpSolrClient.request(LBHttpSolrClient.java:462)
   [junit4]    > 	at org.apache.solr.client.solrj.impl.CloudSolrClient.sendRequest(CloudSolrClient.java:1107)
   [junit4]    > 	at org.apache.solr.client.solrj.impl.CloudSolrClient.requestWithRetryOnStaleState(CloudSolrClient.java:884)
   [junit4]    > 	at org.apache.solr.client.solrj.impl.CloudSolrClient.request(CloudSolrClient.java:817)
   [junit4]    > 	at org.apache.solr.client.solrj.SolrRequest.process(SolrRequest.java:194)
   [junit4]    > 	at org.apache.solr.client.solrj.SolrClient.query(SolrClient.java:942)
   [junit4]    > 	at org.apache.solr.client.solrj.SolrClient.query(SolrClient.java:957)
   [junit4]    > 	at org.apache.solr.cloud.CloudInspectUtil.compareResults(CloudInspectUtil.java:193)
   [junit4]    > 	at org.apache.solr.cloud.CloudInspectUtil.compareResults(CloudInspectUtil.java:167)
   [junit4]    > 	at org.apache.solr.cloud.FullSolrCloudDistribCmdsTest.testIndexingBatchPerRequestWithHttpSolrClient(FullSolrCloudDistribCmdsTest.java:669)
   [junit4]    > 	at org.apache.solr.cloud.FullSolrCloudDistribCmdsTest.test(FullSolrCloudDistribCmdsTest.java:153)
   [junit4]    > 	at org.apache.solr.BaseDistributedSearchTestCase$ShardsRepeatRule$ShardsFixedStatement.callStatement(BaseDistributedSearchTestCase.java:1008)
   [junit4]    > 	at org.apache.solr.BaseDistributedSearchTestCase$ShardsRepeatRule$ShardsStatement.evaluate(BaseDistributedSearchTestCase.java:983)
   [junit4]    > 	at java.lang.Thread.run(Thread.java:748)
   [junit4]    > Caused by: org.apache.solr.client.solrj.impl.HttpSolrClient$RemoteSolrException: Error from server at http://127.0.0.1:39633/collection2: Impossible Exception
   [junit4]    > 	at org.apache.solr.client.solrj.impl.HttpSolrClient.executeMethod(HttpSolrClient.java:643)
   [junit4]    > 	at org.apache.solr.client.solrj.impl.HttpSolrClient.request(HttpSolrClient.java:255)
   [junit4]    > 	at org.apache.solr.client.solrj.impl.HttpSolrClient.request(HttpSolrClient.java:244)
   [junit4]    > 	at org.apache.solr.client.solrj.impl.LBHttpSolrClient.doRequest(LBHttpSolrClient.java:483)
   [junit4]    > 	at org.apache.solr.client.solrj.impl.LBHttpSolrClient.request(LBHttpSolrClient.java:413)
   [junit4]    > 	... 51 more
   [junit4]   2> NOTE: leaving temporary files on disk at: /x1/jenkins/jenkins-slave/workspace/Lucene-Solr-NightlyTests-7.x/checkout/solr/build/solr-core/test/J2/temp/solr.cloud.FullSolrCloudDistribCmdsTest_1485DDF7CA87529D-001
   [junit4]   2> Sep 27, 2018 6:52:21 AM com.carrotsearch.randomizedtesting.ThreadLeakControl checkThreadLeaks
   [junit4]   2> WARNING: Will linger awaiting termination of 1 leaked thread(s).
   [junit4]   2> NOTE: test params are: codec=SimpleText, sim=RandomSimilarity(queryNorm=false): {}, locale=es-HN, timezone=America/Inuvik
   [junit4]   2> NOTE: Linux 4.4.0-130-generic amd64/Oracle Corporation 1.8.0_172 (64-bit)/cpus=4,threads=1,free=104889392,total=477626368
   [junit4]   2> NOTE: All tests run in this JVM: [SolrIndexSplitterTest, TestJsonFacetRefinement, TestDeleteCollectionOnDownNodes, TestSerializedLuceneMatchVersion, LeaderElectionContextKeyTest, OverseerRolesTest, TestSQLHandler, CoreAdminHandlerTest, TestNRTOpen, ClassificationUpdateProcessorIntegrationTest, TriggerIntegrationTest, Tagger2Test, ConnectionManagerTest, TestFuzzyAnalyzedSuggestions, JvmMetricsTest, TestTestInjection, TestNumericTerms64, TestRealTimeGet, SolrCmdDistributorTest, PeerSyncTest, TestAddFieldRealTimeGet, SimpleMLTQParserTest, CSVRequestHandlerTest, LukeRequestHandlerTest, ClusterStateUpdateTest, ResponseHeaderTest, SignificantTermsQParserPluginTest, SolrMetricManagerTest, TestTlogReplica, DistribCursorPagingTest, SchemaApiFailureTest, DirectSolrConnectionTest, DateMathParserTest, TestDFISimilarityFactory, TestQueryUtils, SuggesterWFSTTest, DeleteReplicaTest, SpellCheckCollatorTest, HLLUtilTest, TestCloudSearcherWarming, OpenCloseCoreStressTest, BadIndexSchemaTest, TestSubQueryTransformer, CoreMergeIndexesAdminHandlerTest, QueryParsingTest, TestPerFieldSimilarity, MultiTermTest, TestMacroExpander, DistanceFunctionTest, TestLMDirichletSimilarityFactory, TestPolicyCloud, ScheduledMaintenanceTriggerTest, LeaderFailoverAfterPartitionTest, TestReload, TestJettySolrRunner, TestPartialUpdateDeduplication, TestUseDocValuesAsStored2, DirectSolrSpellCheckerTest, UtilsToolTest, VMParamsZkACLAndCredentialsProvidersTest, SimpleFacetsTest, SegmentsInfoRequestHandlerTest, SearchRateTriggerIntegrationTest, BlockCacheTest, SearchHandlerTest, ForceLeaderTest, TestJmxIntegration, TestExactSharedStatsCache, UpdateRequestProcessorFactoryTest, TestSearcherReuse, TestHashQParserPlugin, TestSolrQueryResponse, SolrTestCaseJ4Test, TestImplicitCoreProperties, TestSolrCloudSnapshots, BadComponentTest, OpenExchangeRatesOrgProviderTest, TestShortCircuitedRequests, TestCoreDiscovery, StatelessScriptUpdateProcessorFactoryTest, TestRequestForwarding, UpdateParamsTest, DistributedIntervalFacetingTest, BlockJoinFacetRandomTest, TestFaceting, TestConfigsApi, SolrXmlInZkTest, TestNoOpRegenerator, BasicZkTest, TestDocTermOrdsUninvertLimit, ChaosMonkeySafeLeaderTest, NodeAddedTriggerIntegrationTest, TestCloudNestedDocsSort, TestSolrFieldCacheBean, HttpPartitionTest, IndexSchemaRuntimeFieldTest, TestBlendedInfixSuggestions, SpellingQueryConverterTest, TestReplicaProperties, TestBlobHandler, TestLockTree, PeerSyncWithLeaderAndIndexFingerprintCachingTest, TestFastLRUCache, TestCollectionsAPIViaSolrCloudCluster, TestDistributedStatsComponentCardinality, DistributedDebugComponentTest, JsonLoaderTest, TestStressRecovery, TestDynamicFieldResource, AnalysisErrorHandlingTest, TestSolrCloudWithDelegationTokens, HighlighterMaxOffsetTest, TestSchemaResource, TestSimExecutePlanAction, TestSimpleTrackingShardHandler, TestSafeXMLParsing, SolrShardReporterTest, TestComplexPhraseQParserPlugin, TestOmitPositions, AdminHandlersProxyTest, ShardSplitTest, TestBulkSchemaAPI, TestValueSourceCache, DirectUpdateHandlerTest, QueryElevationComponentTest, TestSha256AuthenticationProvider, AlternateDirectoryTest, HdfsRecoverLeaseTest, DistributedQueryComponentCustomSortTest, PreAnalyzedFieldTest, TestDocSet, ConcurrentDeleteAndCreateCollectionTest, HDFSCollectionsAPITest, SliceStateTest, MigrateRouteKeyTest, TestLegacyField, ChaosMonkeySafeLeaderWithPullReplicasTest, CleanupOldIndexTest, CloudExitableDirectoryReaderTest, ClusterStateTest, CollectionPropsTest, CollectionStateFormat2Test, CollectionsAPISolrJTest, ConcurrentCreateRoutedAliasTest, ConfigSetsAPITest, CreateCollectionCleanupTest, CreateRoutedAliasTest, DeleteStatusTest, FullSolrCloudDistribCmdsTest]
   [junit4] Completed [458/833 (2!)] on J2 in 156.92s, 1 test, 1 error <<< FAILURES!

[...truncated 1355 lines...]
   [junit4] JVM J2: stdout was not empty, see: /x1/jenkins/jenkins-slave/workspace/Lucene-Solr-NightlyTests-7.x/checkout/solr/build/solr-core/test/temp/junit4-J2-20180927_060630_170191989804801832298.sysout
   [junit4] >>> JVM J2 emitted unexpected output (verbatim) ----
   [junit4] java.lang.OutOfMemoryError: GC overhead limit exceeded
   [junit4] Dumping heap to /x1/jenkins/jenkins-slave/workspace/Lucene-Solr-NightlyTests-7.x/checkout/heapdumps/java_pid32338.hprof ...
   [junit4] Heap dump file created [458101876 bytes in 1.479 secs]
   [junit4] <<< JVM J2: EOF ----

[...truncated 8973 lines...]
BUILD FAILED
/x1/jenkins/jenkins-slave/workspace/Lucene-Solr-NightlyTests-7.x/checkout/build.xml:651: The following error occurred while executing this line:
/x1/jenkins/jenkins-slave/workspace/Lucene-Solr-NightlyTests-7.x/checkout/build.xml:585: Some of the tests produced a heap dump, but did not fail. Maybe a suppressed OutOfMemoryError? Dumps created:
* java_pid32338.hprof

Total time: 278 minutes 26 seconds
Build step 'Invoke Ant' marked build as failure
Archiving artifacts
Recording test results
Email was triggered for: Failure - Any
Sending email for trigger: Failure - Any

Mime
View raw message