lucene-dev mailing list archives

Site index · List index
Message view « Date » · « Thread »
Top « Date » · « Thread »
From Apache Jenkins Server <jenk...@builds.apache.org>
Subject [JENKINS] Lucene-Solr-BadApples-NightlyTests-master - Build # 30 - Still Unstable
Date Fri, 28 Sep 2018 19:39:19 GMT
Build: https://builds.apache.org/job/Lucene-Solr-BadApples-NightlyTests-master/30/

3 tests failed.
FAILED:  org.apache.solr.cloud.MoveReplicaHDFSTest.testFailedMove

Error Message:
No live SolrServers available to handle this request:[http://127.0.0.1:36856/solr/MoveReplicaHDFSTest_failed_coll_true, http://127.0.0.1:35500/solr/MoveReplicaHDFSTest_failed_coll_true]

Stack Trace:
org.apache.solr.client.solrj.SolrServerException: No live SolrServers available to handle this request:[http://127.0.0.1:36856/solr/MoveReplicaHDFSTest_failed_coll_true, http://127.0.0.1:35500/solr/MoveReplicaHDFSTest_failed_coll_true]
	at __randomizedtesting.SeedInfo.seed([408E7BC14D58FA08:EA43A833FA8B2FD8]:0)
	at org.apache.solr.client.solrj.impl.LBHttpSolrClient.request(LBHttpSolrClient.java:462)
	at org.apache.solr.client.solrj.impl.CloudSolrClient.sendRequest(CloudSolrClient.java:1107)
	at org.apache.solr.client.solrj.impl.CloudSolrClient.requestWithRetryOnStaleState(CloudSolrClient.java:884)
	at org.apache.solr.client.solrj.impl.CloudSolrClient.requestWithRetryOnStaleState(CloudSolrClient.java:994)
	at org.apache.solr.client.solrj.impl.CloudSolrClient.request(CloudSolrClient.java:817)
	at org.apache.solr.client.solrj.SolrRequest.process(SolrRequest.java:194)
	at org.apache.solr.client.solrj.SolrClient.query(SolrClient.java:942)
	at org.apache.solr.cloud.MoveReplicaTest.testFailedMove(MoveReplicaTest.java:301)
	at sun.reflect.NativeMethodAccessorImpl.invoke0(Native Method)
	at sun.reflect.NativeMethodAccessorImpl.invoke(NativeMethodAccessorImpl.java:62)
	at sun.reflect.DelegatingMethodAccessorImpl.invoke(DelegatingMethodAccessorImpl.java:43)
	at java.lang.reflect.Method.invoke(Method.java:498)
	at com.carrotsearch.randomizedtesting.RandomizedRunner.invoke(RandomizedRunner.java:1742)
	at com.carrotsearch.randomizedtesting.RandomizedRunner$8.evaluate(RandomizedRunner.java:935)
	at com.carrotsearch.randomizedtesting.RandomizedRunner$9.evaluate(RandomizedRunner.java:971)
	at com.carrotsearch.randomizedtesting.RandomizedRunner$10.evaluate(RandomizedRunner.java:985)
	at com.carrotsearch.randomizedtesting.rules.SystemPropertiesRestoreRule$1.evaluate(SystemPropertiesRestoreRule.java:57)
	at org.apache.lucene.util.TestRuleSetupTeardownChained$1.evaluate(TestRuleSetupTeardownChained.java:49)
	at org.apache.lucene.util.AbstractBeforeAfterRule$1.evaluate(AbstractBeforeAfterRule.java:45)
	at org.apache.lucene.util.TestRuleThreadAndTestName$1.evaluate(TestRuleThreadAndTestName.java:48)
	at org.apache.lucene.util.TestRuleIgnoreAfterMaxFailures$1.evaluate(TestRuleIgnoreAfterMaxFailures.java:64)
	at org.apache.lucene.util.TestRuleMarkFailure$1.evaluate(TestRuleMarkFailure.java:47)
	at com.carrotsearch.randomizedtesting.rules.StatementAdapter.evaluate(StatementAdapter.java:36)
	at com.carrotsearch.randomizedtesting.ThreadLeakControl$StatementRunner.run(ThreadLeakControl.java:368)
	at com.carrotsearch.randomizedtesting.ThreadLeakControl.forkTimeoutingTask(ThreadLeakControl.java:817)
	at com.carrotsearch.randomizedtesting.ThreadLeakControl$3.evaluate(ThreadLeakControl.java:468)
	at com.carrotsearch.randomizedtesting.RandomizedRunner.runSingleTest(RandomizedRunner.java:944)
	at com.carrotsearch.randomizedtesting.RandomizedRunner$5.evaluate(RandomizedRunner.java:830)
	at com.carrotsearch.randomizedtesting.RandomizedRunner$6.evaluate(RandomizedRunner.java:880)
	at com.carrotsearch.randomizedtesting.RandomizedRunner$7.evaluate(RandomizedRunner.java:891)
	at com.carrotsearch.randomizedtesting.rules.StatementAdapter.evaluate(StatementAdapter.java:36)
	at com.carrotsearch.randomizedtesting.rules.SystemPropertiesRestoreRule$1.evaluate(SystemPropertiesRestoreRule.java:57)
	at org.apache.lucene.util.AbstractBeforeAfterRule$1.evaluate(AbstractBeforeAfterRule.java:45)
	at com.carrotsearch.randomizedtesting.rules.StatementAdapter.evaluate(StatementAdapter.java:36)
	at org.apache.lucene.util.TestRuleStoreClassName$1.evaluate(TestRuleStoreClassName.java:41)
	at com.carrotsearch.randomizedtesting.rules.NoShadowingOrOverridesOnMethodsRule$1.evaluate(NoShadowingOrOverridesOnMethodsRule.java:40)
	at com.carrotsearch.randomizedtesting.rules.NoShadowingOrOverridesOnMethodsRule$1.evaluate(NoShadowingOrOverridesOnMethodsRule.java:40)
	at com.carrotsearch.randomizedtesting.rules.StatementAdapter.evaluate(StatementAdapter.java:36)
	at com.carrotsearch.randomizedtesting.rules.StatementAdapter.evaluate(StatementAdapter.java:36)
	at com.carrotsearch.randomizedtesting.rules.StatementAdapter.evaluate(StatementAdapter.java:36)
	at org.apache.lucene.util.TestRuleAssertionsRequired$1.evaluate(TestRuleAssertionsRequired.java:53)
	at org.apache.lucene.util.TestRuleMarkFailure$1.evaluate(TestRuleMarkFailure.java:47)
	at org.apache.lucene.util.TestRuleIgnoreAfterMaxFailures$1.evaluate(TestRuleIgnoreAfterMaxFailures.java:64)
	at org.apache.lucene.util.TestRuleIgnoreTestSuites$1.evaluate(TestRuleIgnoreTestSuites.java:54)
	at com.carrotsearch.randomizedtesting.rules.StatementAdapter.evaluate(StatementAdapter.java:36)
	at com.carrotsearch.randomizedtesting.ThreadLeakControl$StatementRunner.run(ThreadLeakControl.java:368)
	at java.lang.Thread.run(Thread.java:748)
Caused by: org.apache.solr.client.solrj.impl.HttpSolrClient$RemoteSolrException: Error from server at http://127.0.0.1:36856/solr/MoveReplicaHDFSTest_failed_coll_true: no servers hosting shard: shard2
	at org.apache.solr.client.solrj.impl.HttpSolrClient.executeMethod(HttpSolrClient.java:643)
	at org.apache.solr.client.solrj.impl.HttpSolrClient.request(HttpSolrClient.java:255)
	at org.apache.solr.client.solrj.impl.HttpSolrClient.request(HttpSolrClient.java:244)
	at org.apache.solr.client.solrj.impl.LBHttpSolrClient.doRequest(LBHttpSolrClient.java:483)
	at org.apache.solr.client.solrj.impl.LBHttpSolrClient.request(LBHttpSolrClient.java:413)
	... 46 more


FAILED:  org.apache.solr.cloud.TestAuthenticationFramework.testBasics

Error Message:
Error from server at http://127.0.0.1:45047/solr/testcollection_shard1_replica_n2: Expected mime type application/octet-stream but got text/html. <html> <head> <meta http-equiv="Content-Type" content="text/html;charset=utf-8"/> <title>Error 404 Can not find: /solr/testcollection_shard1_replica_n2/update</title> </head> <body><h2>HTTP ERROR 404</h2> <p>Problem accessing /solr/testcollection_shard1_replica_n2/update. Reason: <pre>    Can not find: /solr/testcollection_shard1_replica_n2/update</pre></p><hr><a href="http://eclipse.org/jetty">Powered by Jetty:// 9.4.11.v20180605</a><hr/>  </body> </html> 

Stack Trace:
org.apache.solr.client.solrj.impl.CloudSolrClient$RouteException: Error from server at http://127.0.0.1:45047/solr/testcollection_shard1_replica_n2: Expected mime type application/octet-stream but got text/html. <html>
<head>
<meta http-equiv="Content-Type" content="text/html;charset=utf-8"/>
<title>Error 404 Can not find: /solr/testcollection_shard1_replica_n2/update</title>
</head>
<body><h2>HTTP ERROR 404</h2>
<p>Problem accessing /solr/testcollection_shard1_replica_n2/update. Reason:
<pre>    Can not find: /solr/testcollection_shard1_replica_n2/update</pre></p><hr><a href="http://eclipse.org/jetty">Powered by Jetty:// 9.4.11.v20180605</a><hr/>

</body>
</html>

	at __randomizedtesting.SeedInfo.seed([408E7BC14D58FA08:7D56D5ED75B6A478]:0)
	at org.apache.solr.client.solrj.impl.CloudSolrClient.directUpdate(CloudSolrClient.java:551)
	at org.apache.solr.client.solrj.impl.CloudSolrClient.sendRequest(CloudSolrClient.java:1016)
	at org.apache.solr.client.solrj.impl.CloudSolrClient.requestWithRetryOnStaleState(CloudSolrClient.java:884)
	at org.apache.solr.client.solrj.impl.CloudSolrClient.requestWithRetryOnStaleState(CloudSolrClient.java:949)
	at org.apache.solr.client.solrj.impl.CloudSolrClient.requestWithRetryOnStaleState(CloudSolrClient.java:949)
	at org.apache.solr.client.solrj.impl.CloudSolrClient.requestWithRetryOnStaleState(CloudSolrClient.java:949)
	at org.apache.solr.client.solrj.impl.CloudSolrClient.requestWithRetryOnStaleState(CloudSolrClient.java:949)
	at org.apache.solr.client.solrj.impl.CloudSolrClient.requestWithRetryOnStaleState(CloudSolrClient.java:949)
	at org.apache.solr.client.solrj.impl.CloudSolrClient.request(CloudSolrClient.java:817)
	at org.apache.solr.client.solrj.SolrRequest.process(SolrRequest.java:194)
	at org.apache.solr.client.solrj.request.UpdateRequest.commit(UpdateRequest.java:233)
	at org.apache.solr.cloud.TestAuthenticationFramework.collectionCreateSearchDeleteTwice(TestAuthenticationFramework.java:125)
	at org.apache.solr.cloud.TestAuthenticationFramework.testBasics(TestAuthenticationFramework.java:76)
	at sun.reflect.NativeMethodAccessorImpl.invoke0(Native Method)
	at sun.reflect.NativeMethodAccessorImpl.invoke(NativeMethodAccessorImpl.java:62)
	at sun.reflect.DelegatingMethodAccessorImpl.invoke(DelegatingMethodAccessorImpl.java:43)
	at java.lang.reflect.Method.invoke(Method.java:498)
	at com.carrotsearch.randomizedtesting.RandomizedRunner.invoke(RandomizedRunner.java:1742)
	at com.carrotsearch.randomizedtesting.RandomizedRunner$8.evaluate(RandomizedRunner.java:935)
	at com.carrotsearch.randomizedtesting.RandomizedRunner$9.evaluate(RandomizedRunner.java:971)
	at com.carrotsearch.randomizedtesting.RandomizedRunner$10.evaluate(RandomizedRunner.java:985)
	at com.carrotsearch.randomizedtesting.rules.SystemPropertiesRestoreRule$1.evaluate(SystemPropertiesRestoreRule.java:57)
	at org.apache.lucene.util.TestRuleSetupTeardownChained$1.evaluate(TestRuleSetupTeardownChained.java:49)
	at org.apache.lucene.util.AbstractBeforeAfterRule$1.evaluate(AbstractBeforeAfterRule.java:45)
	at org.apache.lucene.util.TestRuleThreadAndTestName$1.evaluate(TestRuleThreadAndTestName.java:48)
	at org.apache.lucene.util.TestRuleIgnoreAfterMaxFailures$1.evaluate(TestRuleIgnoreAfterMaxFailures.java:64)
	at org.apache.lucene.util.TestRuleMarkFailure$1.evaluate(TestRuleMarkFailure.java:47)
	at com.carrotsearch.randomizedtesting.rules.StatementAdapter.evaluate(StatementAdapter.java:36)
	at com.carrotsearch.randomizedtesting.ThreadLeakControl$StatementRunner.run(ThreadLeakControl.java:368)
	at com.carrotsearch.randomizedtesting.ThreadLeakControl.forkTimeoutingTask(ThreadLeakControl.java:817)
	at com.carrotsearch.randomizedtesting.ThreadLeakControl$3.evaluate(ThreadLeakControl.java:468)
	at com.carrotsearch.randomizedtesting.RandomizedRunner.runSingleTest(RandomizedRunner.java:944)
	at com.carrotsearch.randomizedtesting.RandomizedRunner$5.evaluate(RandomizedRunner.java:830)
	at com.carrotsearch.randomizedtesting.RandomizedRunner$6.evaluate(RandomizedRunner.java:880)
	at com.carrotsearch.randomizedtesting.RandomizedRunner$7.evaluate(RandomizedRunner.java:891)
	at com.carrotsearch.randomizedtesting.rules.StatementAdapter.evaluate(StatementAdapter.java:36)
	at com.carrotsearch.randomizedtesting.rules.SystemPropertiesRestoreRule$1.evaluate(SystemPropertiesRestoreRule.java:57)
	at org.apache.lucene.util.AbstractBeforeAfterRule$1.evaluate(AbstractBeforeAfterRule.java:45)
	at com.carrotsearch.randomizedtesting.rules.StatementAdapter.evaluate(StatementAdapter.java:36)
	at org.apache.lucene.util.TestRuleStoreClassName$1.evaluate(TestRuleStoreClassName.java:41)
	at com.carrotsearch.randomizedtesting.rules.NoShadowingOrOverridesOnMethodsRule$1.evaluate(NoShadowingOrOverridesOnMethodsRule.java:40)
	at com.carrotsearch.randomizedtesting.rules.NoShadowingOrOverridesOnMethodsRule$1.evaluate(NoShadowingOrOverridesOnMethodsRule.java:40)
	at com.carrotsearch.randomizedtesting.rules.StatementAdapter.evaluate(StatementAdapter.java:36)
	at com.carrotsearch.randomizedtesting.rules.StatementAdapter.evaluate(StatementAdapter.java:36)
	at com.carrotsearch.randomizedtesting.rules.StatementAdapter.evaluate(StatementAdapter.java:36)
	at org.apache.lucene.util.TestRuleAssertionsRequired$1.evaluate(TestRuleAssertionsRequired.java:53)
	at org.apache.lucene.util.TestRuleMarkFailure$1.evaluate(TestRuleMarkFailure.java:47)
	at org.apache.lucene.util.TestRuleIgnoreAfterMaxFailures$1.evaluate(TestRuleIgnoreAfterMaxFailures.java:64)
	at org.apache.lucene.util.TestRuleIgnoreTestSuites$1.evaluate(TestRuleIgnoreTestSuites.java:54)
	at com.carrotsearch.randomizedtesting.rules.StatementAdapter.evaluate(StatementAdapter.java:36)
	at com.carrotsearch.randomizedtesting.ThreadLeakControl$StatementRunner.run(ThreadLeakControl.java:368)
	at java.lang.Thread.run(Thread.java:748)
Caused by: org.apache.solr.client.solrj.impl.HttpSolrClient$RemoteSolrException: Error from server at http://127.0.0.1:45047/solr/testcollection_shard1_replica_n2: Expected mime type application/octet-stream but got text/html. <html>
<head>
<meta http-equiv="Content-Type" content="text/html;charset=utf-8"/>
<title>Error 404 Can not find: /solr/testcollection_shard1_replica_n2/update</title>
</head>
<body><h2>HTTP ERROR 404</h2>
<p>Problem accessing /solr/testcollection_shard1_replica_n2/update. Reason:
<pre>    Can not find: /solr/testcollection_shard1_replica_n2/update</pre></p><hr><a href="http://eclipse.org/jetty">Powered by Jetty:// 9.4.11.v20180605</a><hr/>

</body>
</html>

	at org.apache.solr.client.solrj.impl.HttpSolrClient.executeMethod(HttpSolrClient.java:607)
	at org.apache.solr.client.solrj.impl.HttpSolrClient.request(HttpSolrClient.java:255)
	at org.apache.solr.client.solrj.impl.HttpSolrClient.request(HttpSolrClient.java:244)
	at org.apache.solr.client.solrj.impl.LBHttpSolrClient.doRequest(LBHttpSolrClient.java:483)
	at org.apache.solr.client.solrj.impl.LBHttpSolrClient.request(LBHttpSolrClient.java:413)
	at org.apache.solr.client.solrj.impl.CloudSolrClient.lambda$directUpdate$0(CloudSolrClient.java:528)
	at java.util.concurrent.FutureTask.run(FutureTask.java:266)
	at org.apache.solr.common.util.ExecutorUtil$MDCAwareThreadPoolExecutor.lambda$execute$0(ExecutorUtil.java:209)
	at java.util.concurrent.ThreadPoolExecutor.runWorker(ThreadPoolExecutor.java:1149)
	at java.util.concurrent.ThreadPoolExecutor$Worker.run(ThreadPoolExecutor.java:624)
	... 1 more


FAILED:  org.apache.solr.cloud.autoscaling.sim.TestSimLargeCluster.testNodeLost

Error Message:
java.util.concurrent.TimeoutException: last ClusterState: znodeVersion: 307 live nodes:[127.0.0.1:10082_solr, 127.0.0.1:10004_solr, 127.0.0.1:10018_solr, 127.0.0.1:10049_solr, 127.0.0.1:10104_solr, 127.0.0.1:10020_solr, 127.0.0.1:10065_solr, 127.0.0.1:10021_solr, 127.0.0.1:10005_solr, 127.0.0.1:10066_solr, 127.0.0.1:10035_solr, 127.0.0.1:10019_solr, 127.0.0.1:10096_solr, 127.0.0.1:10022_solr, 127.0.0.1:10105_solr, 127.0.0.1:10047_solr, 127.0.0.1:10102_solr, 127.0.0.1:10095_solr, 127.0.0.1:10081_solr, 127.0.0.1:10084_solr, 127.0.0.1:10052_solr, 127.0.0.1:10006_solr, 127.0.0.1:10079_solr, 127.0.0.1:10098_solr, 127.0.0.1:10003_solr, 127.0.0.1:10054_solr, 127.0.0.1:10099_solr, 127.0.0.1:10101_solr, 127.0.0.1:10071_solr, 127.0.0.1:10023_solr, 127.0.0.1:10076_solr, 127.0.0.1:10007_solr, 127.0.0.1:10107_solr, 127.0.0.1:10055_solr, 127.0.0.1:10010_solr, 127.0.0.1:10016_solr, 127.0.0.1:10070_solr, 127.0.0.1:10077_solr, 127.0.0.1:10038_solr, 127.0.0.1:10032_solr, 127.0.0.1:10108_solr, 127.0.0.1:10093_solr, 127.0.0.1:10061_solr, 127.0.0.1:10067_solr, 127.0.0.1:10086_solr, 127.0.0.1:10089_solr, 127.0.0.1:10045_solr, 127.0.0.1:10042_solr, 127.0.0.1:10029_solr, 127.0.0.1:10083_solr, 127.0.0.1:10080_solr, 127.0.0.1:10064_solr, 127.0.0.1:10043_solr, 127.0.0.1:10057_solr, 127.0.0.1:10074_solr, 127.0.0.1:10026_solr, 127.0.0.1:10012_solr, 127.0.0.1:10060_solr, 127.0.0.1:10073_solr, 127.0.0.1:10013_solr, 127.0.0.1:10058_solr, 127.0.0.1:10090_solr, 127.0.0.1:10039_solr, 127.0.0.1:10025_solr, 127.0.0.1:10044_solr, 127.0.0.1:10028_solr, 127.0.0.1:10092_solr, 127.0.0.1:10041_solr, 127.0.0.1:10087_solr, 127.0.0.1:10009_solr, 127.0.0.1:10030_solr, 127.0.0.1:10011_solr, 127.0.0.1:10040_solr, 127.0.0.1:10085_solr, 127.0.0.1:10046_solr, 127.0.0.1:10068_solr, 127.0.0.1:10063_solr, 127.0.0.1:10015_solr, 127.0.0.1:10069_solr, 127.0.0.1:10110_solr, 127.0.0.1:10062_solr, 127.0.0.1:10008_solr, 127.0.0.1:10024_solr, 127.0.0.1:10050_solr, 127.0.0.1:10075_solr, 127.0.0.1:10078_solr, 127.0.0.1:10097_solr, 127.0.0.1:10031_solr, 127.0.0.1:10034_solr, 127.0.0.1:10091_solr, 127.0.0.1:10094_solr, 127.0.0.1:10106_solr, 127.0.0.1:10100_solr, 127.0.0.1:10037_solr, 127.0.0.1:10109_solr, 127.0.0.1:10053_solr, 127.0.0.1:10059_solr, 127.0.0.1:10103_solr, 127.0.0.1:10056_solr, 127.0.0.1:10072_solr] collections:{.system=DocCollection(.system//clusterstate.json/307)={   "replicationFactor":"1",   "pullReplicas":"0",   "router":{"name":"compositeId"},   "maxShardsPerNode":"1",   "autoAddReplicas":"false",   "nrtReplicas":"1",   "tlogReplicas":"0",   "autoCreated":"true",   "shards":{"shard1":{       "replicas":{},       "range":"80000000-7fffffff",       "state":"active"}}}}, last coll state: DocCollection(.system//clusterstate.json/307)={   "replicationFactor":"1",   "pullReplicas":"0",   "router":{"name":"compositeId"},   "maxShardsPerNode":"1",   "autoAddReplicas":"false",   "nrtReplicas":"1",   "tlogReplicas":"0",   "autoCreated":"true",   "shards":{"shard1":{       "replicas":{},       "range":"80000000-7fffffff",       "state":"active"}}}

Stack Trace:
java.io.IOException: java.util.concurrent.TimeoutException: last ClusterState: znodeVersion: 307
live nodes:[127.0.0.1:10082_solr, 127.0.0.1:10004_solr, 127.0.0.1:10018_solr, 127.0.0.1:10049_solr, 127.0.0.1:10104_solr, 127.0.0.1:10020_solr, 127.0.0.1:10065_solr, 127.0.0.1:10021_solr, 127.0.0.1:10005_solr, 127.0.0.1:10066_solr, 127.0.0.1:10035_solr, 127.0.0.1:10019_solr, 127.0.0.1:10096_solr, 127.0.0.1:10022_solr, 127.0.0.1:10105_solr, 127.0.0.1:10047_solr, 127.0.0.1:10102_solr, 127.0.0.1:10095_solr, 127.0.0.1:10081_solr, 127.0.0.1:10084_solr, 127.0.0.1:10052_solr, 127.0.0.1:10006_solr, 127.0.0.1:10079_solr, 127.0.0.1:10098_solr, 127.0.0.1:10003_solr, 127.0.0.1:10054_solr, 127.0.0.1:10099_solr, 127.0.0.1:10101_solr, 127.0.0.1:10071_solr, 127.0.0.1:10023_solr, 127.0.0.1:10076_solr, 127.0.0.1:10007_solr, 127.0.0.1:10107_solr, 127.0.0.1:10055_solr, 127.0.0.1:10010_solr, 127.0.0.1:10016_solr, 127.0.0.1:10070_solr, 127.0.0.1:10077_solr, 127.0.0.1:10038_solr, 127.0.0.1:10032_solr, 127.0.0.1:10108_solr, 127.0.0.1:10093_solr, 127.0.0.1:10061_solr, 127.0.0.1:10067_solr, 127.0.0.1:10086_solr, 127.0.0.1:10089_solr, 127.0.0.1:10045_solr, 127.0.0.1:10042_solr, 127.0.0.1:10029_solr, 127.0.0.1:10083_solr, 127.0.0.1:10080_solr, 127.0.0.1:10064_solr, 127.0.0.1:10043_solr, 127.0.0.1:10057_solr, 127.0.0.1:10074_solr, 127.0.0.1:10026_solr, 127.0.0.1:10012_solr, 127.0.0.1:10060_solr, 127.0.0.1:10073_solr, 127.0.0.1:10013_solr, 127.0.0.1:10058_solr, 127.0.0.1:10090_solr, 127.0.0.1:10039_solr, 127.0.0.1:10025_solr, 127.0.0.1:10044_solr, 127.0.0.1:10028_solr, 127.0.0.1:10092_solr, 127.0.0.1:10041_solr, 127.0.0.1:10087_solr, 127.0.0.1:10009_solr, 127.0.0.1:10030_solr, 127.0.0.1:10011_solr, 127.0.0.1:10040_solr, 127.0.0.1:10085_solr, 127.0.0.1:10046_solr, 127.0.0.1:10068_solr, 127.0.0.1:10063_solr, 127.0.0.1:10015_solr, 127.0.0.1:10069_solr, 127.0.0.1:10110_solr, 127.0.0.1:10062_solr, 127.0.0.1:10008_solr, 127.0.0.1:10024_solr, 127.0.0.1:10050_solr, 127.0.0.1:10075_solr, 127.0.0.1:10078_solr, 127.0.0.1:10097_solr, 127.0.0.1:10031_solr, 127.0.0.1:10034_solr, 127.0.0.1:10091_solr, 127.0.0.1:10094_solr, 127.0.0.1:10106_solr, 127.0.0.1:10100_solr, 127.0.0.1:10037_solr, 127.0.0.1:10109_solr, 127.0.0.1:10053_solr, 127.0.0.1:10059_solr, 127.0.0.1:10103_solr, 127.0.0.1:10056_solr, 127.0.0.1:10072_solr]
collections:{.system=DocCollection(.system//clusterstate.json/307)={
  "replicationFactor":"1",
  "pullReplicas":"0",
  "router":{"name":"compositeId"},
  "maxShardsPerNode":"1",
  "autoAddReplicas":"false",
  "nrtReplicas":"1",
  "tlogReplicas":"0",
  "autoCreated":"true",
  "shards":{"shard1":{
      "replicas":{},
      "range":"80000000-7fffffff",
      "state":"active"}}}}, last coll state: DocCollection(.system//clusterstate.json/307)={
  "replicationFactor":"1",
  "pullReplicas":"0",
  "router":{"name":"compositeId"},
  "maxShardsPerNode":"1",
  "autoAddReplicas":"false",
  "nrtReplicas":"1",
  "tlogReplicas":"0",
  "autoCreated":"true",
  "shards":{"shard1":{
      "replicas":{},
      "range":"80000000-7fffffff",
      "state":"active"}}}
	at __randomizedtesting.SeedInfo.seed([408E7BC14D58FA08:FF9BB53FCEB29F8E]:0)
	at org.apache.solr.cloud.autoscaling.sim.SimClusterStateProvider.createSystemCollection(SimClusterStateProvider.java:1344)
	at org.apache.solr.cloud.autoscaling.sim.TestSimLargeCluster.setupTest(TestSimLargeCluster.java:137)
	at sun.reflect.NativeMethodAccessorImpl.invoke0(Native Method)
	at sun.reflect.NativeMethodAccessorImpl.invoke(NativeMethodAccessorImpl.java:62)
	at sun.reflect.DelegatingMethodAccessorImpl.invoke(DelegatingMethodAccessorImpl.java:43)
	at java.lang.reflect.Method.invoke(Method.java:498)
	at com.carrotsearch.randomizedtesting.RandomizedRunner.invoke(RandomizedRunner.java:1742)
	at com.carrotsearch.randomizedtesting.RandomizedRunner$9.evaluate(RandomizedRunner.java:969)
	at com.carrotsearch.randomizedtesting.RandomizedRunner$10.evaluate(RandomizedRunner.java:985)
	at com.carrotsearch.randomizedtesting.rules.SystemPropertiesRestoreRule$1.evaluate(SystemPropertiesRestoreRule.java:57)
	at org.apache.lucene.util.TestRuleSetupTeardownChained$1.evaluate(TestRuleSetupTeardownChained.java:49)
	at org.apache.lucene.util.AbstractBeforeAfterRule$1.evaluate(AbstractBeforeAfterRule.java:45)
	at org.apache.lucene.util.TestRuleThreadAndTestName$1.evaluate(TestRuleThreadAndTestName.java:48)
	at org.apache.lucene.util.TestRuleIgnoreAfterMaxFailures$1.evaluate(TestRuleIgnoreAfterMaxFailures.java:64)
	at org.apache.lucene.util.TestRuleMarkFailure$1.evaluate(TestRuleMarkFailure.java:47)
	at com.carrotsearch.randomizedtesting.rules.StatementAdapter.evaluate(StatementAdapter.java:36)
	at com.carrotsearch.randomizedtesting.ThreadLeakControl$StatementRunner.run(ThreadLeakControl.java:368)
	at com.carrotsearch.randomizedtesting.ThreadLeakControl.forkTimeoutingTask(ThreadLeakControl.java:817)
	at com.carrotsearch.randomizedtesting.ThreadLeakControl$3.evaluate(ThreadLeakControl.java:468)
	at com.carrotsearch.randomizedtesting.RandomizedRunner.runSingleTest(RandomizedRunner.java:944)
	at com.carrotsearch.randomizedtesting.RandomizedRunner$5.evaluate(RandomizedRunner.java:830)
	at com.carrotsearch.randomizedtesting.RandomizedRunner$6.evaluate(RandomizedRunner.java:880)
	at com.carrotsearch.randomizedtesting.RandomizedRunner$7.evaluate(RandomizedRunner.java:891)
	at com.carrotsearch.randomizedtesting.rules.StatementAdapter.evaluate(StatementAdapter.java:36)
	at com.carrotsearch.randomizedtesting.rules.SystemPropertiesRestoreRule$1.evaluate(SystemPropertiesRestoreRule.java:57)
	at org.apache.lucene.util.AbstractBeforeAfterRule$1.evaluate(AbstractBeforeAfterRule.java:45)
	at com.carrotsearch.randomizedtesting.rules.StatementAdapter.evaluate(StatementAdapter.java:36)
	at org.apache.lucene.util.TestRuleStoreClassName$1.evaluate(TestRuleStoreClassName.java:41)
	at com.carrotsearch.randomizedtesting.rules.NoShadowingOrOverridesOnMethodsRule$1.evaluate(NoShadowingOrOverridesOnMethodsRule.java:40)
	at com.carrotsearch.randomizedtesting.rules.NoShadowingOrOverridesOnMethodsRule$1.evaluate(NoShadowingOrOverridesOnMethodsRule.java:40)
	at com.carrotsearch.randomizedtesting.rules.StatementAdapter.evaluate(StatementAdapter.java:36)
	at com.carrotsearch.randomizedtesting.rules.StatementAdapter.evaluate(StatementAdapter.java:36)
	at com.carrotsearch.randomizedtesting.rules.StatementAdapter.evaluate(StatementAdapter.java:36)
	at org.apache.lucene.util.TestRuleAssertionsRequired$1.evaluate(TestRuleAssertionsRequired.java:53)
	at org.apache.lucene.util.TestRuleMarkFailure$1.evaluate(TestRuleMarkFailure.java:47)
	at org.apache.lucene.util.TestRuleIgnoreAfterMaxFailures$1.evaluate(TestRuleIgnoreAfterMaxFailures.java:64)
	at org.apache.lucene.util.TestRuleIgnoreTestSuites$1.evaluate(TestRuleIgnoreTestSuites.java:54)
	at com.carrotsearch.randomizedtesting.rules.StatementAdapter.evaluate(StatementAdapter.java:36)
	at com.carrotsearch.randomizedtesting.ThreadLeakControl$StatementRunner.run(ThreadLeakControl.java:368)
	at java.lang.Thread.run(Thread.java:748)
Caused by: java.util.concurrent.TimeoutException: last ClusterState: znodeVersion: 307
live nodes:[127.0.0.1:10082_solr, 127.0.0.1:10004_solr, 127.0.0.1:10018_solr, 127.0.0.1:10049_solr, 127.0.0.1:10104_solr, 127.0.0.1:10020_solr, 127.0.0.1:10065_solr, 127.0.0.1:10021_solr, 127.0.0.1:10005_solr, 127.0.0.1:10066_solr, 127.0.0.1:10035_solr, 127.0.0.1:10019_solr, 127.0.0.1:10096_solr, 127.0.0.1:10022_solr, 127.0.0.1:10105_solr, 127.0.0.1:10047_solr, 127.0.0.1:10102_solr, 127.0.0.1:10095_solr, 127.0.0.1:10081_solr, 127.0.0.1:10084_solr, 127.0.0.1:10052_solr, 127.0.0.1:10006_solr, 127.0.0.1:10079_solr, 127.0.0.1:10098_solr, 127.0.0.1:10003_solr, 127.0.0.1:10054_solr, 127.0.0.1:10099_solr, 127.0.0.1:10101_solr, 127.0.0.1:10071_solr, 127.0.0.1:10023_solr, 127.0.0.1:10076_solr, 127.0.0.1:10007_solr, 127.0.0.1:10107_solr, 127.0.0.1:10055_solr, 127.0.0.1:10010_solr, 127.0.0.1:10016_solr, 127.0.0.1:10070_solr, 127.0.0.1:10077_solr, 127.0.0.1:10038_solr, 127.0.0.1:10032_solr, 127.0.0.1:10108_solr, 127.0.0.1:10093_solr, 127.0.0.1:10061_solr, 127.0.0.1:10067_solr, 127.0.0.1:10086_solr, 127.0.0.1:10089_solr, 127.0.0.1:10045_solr, 127.0.0.1:10042_solr, 127.0.0.1:10029_solr, 127.0.0.1:10083_solr, 127.0.0.1:10080_solr, 127.0.0.1:10064_solr, 127.0.0.1:10043_solr, 127.0.0.1:10057_solr, 127.0.0.1:10074_solr, 127.0.0.1:10026_solr, 127.0.0.1:10012_solr, 127.0.0.1:10060_solr, 127.0.0.1:10073_solr, 127.0.0.1:10013_solr, 127.0.0.1:10058_solr, 127.0.0.1:10090_solr, 127.0.0.1:10039_solr, 127.0.0.1:10025_solr, 127.0.0.1:10044_solr, 127.0.0.1:10028_solr, 127.0.0.1:10092_solr, 127.0.0.1:10041_solr, 127.0.0.1:10087_solr, 127.0.0.1:10009_solr, 127.0.0.1:10030_solr, 127.0.0.1:10011_solr, 127.0.0.1:10040_solr, 127.0.0.1:10085_solr, 127.0.0.1:10046_solr, 127.0.0.1:10068_solr, 127.0.0.1:10063_solr, 127.0.0.1:10015_solr, 127.0.0.1:10069_solr, 127.0.0.1:10110_solr, 127.0.0.1:10062_solr, 127.0.0.1:10008_solr, 127.0.0.1:10024_solr, 127.0.0.1:10050_solr, 127.0.0.1:10075_solr, 127.0.0.1:10078_solr, 127.0.0.1:10097_solr, 127.0.0.1:10031_solr, 127.0.0.1:10034_solr, 127.0.0.1:10091_solr, 127.0.0.1:10094_solr, 127.0.0.1:10106_solr, 127.0.0.1:10100_solr, 127.0.0.1:10037_solr, 127.0.0.1:10109_solr, 127.0.0.1:10053_solr, 127.0.0.1:10059_solr, 127.0.0.1:10103_solr, 127.0.0.1:10056_solr, 127.0.0.1:10072_solr]
collections:{.system=DocCollection(.system//clusterstate.json/307)={
  "replicationFactor":"1",
  "pullReplicas":"0",
  "router":{"name":"compositeId"},
  "maxShardsPerNode":"1",
  "autoAddReplicas":"false",
  "nrtReplicas":"1",
  "tlogReplicas":"0",
  "autoCreated":"true",
  "shards":{"shard1":{
      "replicas":{},
      "range":"80000000-7fffffff",
      "state":"active"}}}}, last coll state: DocCollection(.system//clusterstate.json/307)={
  "replicationFactor":"1",
  "pullReplicas":"0",
  "router":{"name":"compositeId"},
  "maxShardsPerNode":"1",
  "autoAddReplicas":"false",
  "nrtReplicas":"1",
  "tlogReplicas":"0",
  "autoCreated":"true",
  "shards":{"shard1":{
      "replicas":{},
      "range":"80000000-7fffffff",
      "state":"active"}}}
	at org.apache.solr.cloud.CloudTestUtils.waitForState(CloudTestUtils.java:112)
	at org.apache.solr.cloud.autoscaling.sim.SimClusterStateProvider.createSystemCollection(SimClusterStateProvider.java:1341)
	... 39 more




Build Log:
[...truncated 13286 lines...]
   [junit4] Suite: org.apache.solr.cloud.MoveReplicaHDFSTest
   [junit4]   2> 702897 INFO  (SUITE-MoveReplicaHDFSTest-seed#[408E7BC14D58FA08]-worker) [    ] o.a.s.SolrTestCaseJ4 SecureRandom sanity checks: test.solr.allowed.securerandom=null & java.security.egd=file:/dev/./urandom
   [junit4]   2> Creating dataDir: /x1/jenkins/jenkins-slave/workspace/Lucene-Solr-BadApples-NightlyTests-master/checkout/solr/build/solr-core/test/J0/temp/solr.cloud.MoveReplicaHDFSTest_408E7BC14D58FA08-001/init-core-data-001
   [junit4]   2> 702898 WARN  (SUITE-MoveReplicaHDFSTest-seed#[408E7BC14D58FA08]-worker) [    ] o.a.s.SolrTestCaseJ4 startTrackingSearchers: numOpens=22 numCloses=22
   [junit4]   2> 702898 INFO  (SUITE-MoveReplicaHDFSTest-seed#[408E7BC14D58FA08]-worker) [    ] o.a.s.SolrTestCaseJ4 Using TrieFields (NUMERIC_POINTS_SYSPROP=false) w/NUMERIC_DOCVALUES_SYSPROP=true
   [junit4]   2> 702900 INFO  (SUITE-MoveReplicaHDFSTest-seed#[408E7BC14D58FA08]-worker) [    ] o.a.s.SolrTestCaseJ4 Randomized ssl (false) and clientAuth (true) via: @org.apache.solr.util.RandomizeSSL(reason=, ssl=NaN, value=NaN, clientAuth=NaN)
   [junit4]   2> 702901 INFO  (SUITE-MoveReplicaHDFSTest-seed#[408E7BC14D58FA08]-worker) [    ] o.a.s.c.MiniSolrCloudCluster Starting cluster of 4 servers in /x1/jenkins/jenkins-slave/workspace/Lucene-Solr-BadApples-NightlyTests-master/checkout/solr/build/solr-core/test/J0/temp/solr.cloud.MoveReplicaHDFSTest_408E7BC14D58FA08-001/tempDir-001
   [junit4]   2> 702901 INFO  (SUITE-MoveReplicaHDFSTest-seed#[408E7BC14D58FA08]-worker) [    ] o.a.s.c.ZkTestServer STARTING ZK TEST SERVER
   [junit4]   2> 702901 INFO  (Thread-950) [    ] o.a.s.c.ZkTestServer client port:0.0.0.0/0.0.0.0:0
   [junit4]   2> 702901 INFO  (Thread-950) [    ] o.a.s.c.ZkTestServer Starting server
   [junit4]   2> 702908 ERROR (Thread-950) [    ] o.a.z.s.ZooKeeperServer ZKShutdownHandler is not registered, so ZooKeeper server won't take any action on ERROR or SHUTDOWN server state changes
   [junit4]   2> 703001 INFO  (SUITE-MoveReplicaHDFSTest-seed#[408E7BC14D58FA08]-worker) [    ] o.a.s.c.ZkTestServer start zk server on port:37063
   [junit4]   2> 703011 INFO  (zkConnectionManagerCallback-1204-thread-1) [    ] o.a.s.c.c.ConnectionManager zkClient has connected
   [junit4]   2> 703021 INFO  (jetty-launcher-1201-thread-2) [    ] o.e.j.s.Server jetty-9.4.11.v20180605; built: 2018-06-05T18:24:03.829Z; git: d5fc0523cfa96bfebfbda19606cad384d772f04c; jvm 1.8.0_172-b11
   [junit4]   2> 703021 INFO  (jetty-launcher-1201-thread-1) [    ] o.e.j.s.Server jetty-9.4.11.v20180605; built: 2018-06-05T18:24:03.829Z; git: d5fc0523cfa96bfebfbda19606cad384d772f04c; jvm 1.8.0_172-b11
   [junit4]   2> 703022 INFO  (jetty-launcher-1201-thread-4) [    ] o.e.j.s.Server jetty-9.4.11.v20180605; built: 2018-06-05T18:24:03.829Z; git: d5fc0523cfa96bfebfbda19606cad384d772f04c; jvm 1.8.0_172-b11
   [junit4]   2> 703022 INFO  (jetty-launcher-1201-thread-1) [    ] o.e.j.s.session DefaultSessionIdManager workerName=node0
   [junit4]   2> 703022 INFO  (jetty-launcher-1201-thread-1) [    ] o.e.j.s.session No SessionScavenger set, using defaults
   [junit4]   2> 703022 INFO  (jetty-launcher-1201-thread-1) [    ] o.e.j.s.session node0 Scavenging every 660000ms
   [junit4]   2> 703022 INFO  (jetty-launcher-1201-thread-3) [    ] o.e.j.s.Server jetty-9.4.11.v20180605; built: 2018-06-05T18:24:03.829Z; git: d5fc0523cfa96bfebfbda19606cad384d772f04c; jvm 1.8.0_172-b11
   [junit4]   2> 703023 INFO  (jetty-launcher-1201-thread-1) [    ] o.e.j.s.h.ContextHandler Started o.e.j.s.ServletContextHandler@6173f845{/solr,null,AVAILABLE}
   [junit4]   2> 703024 INFO  (jetty-launcher-1201-thread-2) [    ] o.e.j.s.session DefaultSessionIdManager workerName=node0
   [junit4]   2> 703024 INFO  (jetty-launcher-1201-thread-2) [    ] o.e.j.s.session No SessionScavenger set, using defaults
   [junit4]   2> 703024 INFO  (jetty-launcher-1201-thread-2) [    ] o.e.j.s.session node0 Scavenging every 660000ms
   [junit4]   2> 703024 INFO  (jetty-launcher-1201-thread-2) [    ] o.e.j.s.h.ContextHandler Started o.e.j.s.ServletContextHandler@7cd8e2a1{/solr,null,AVAILABLE}
   [junit4]   2> 703025 INFO  (jetty-launcher-1201-thread-4) [    ] o.e.j.s.session DefaultSessionIdManager workerName=node0
   [junit4]   2> 703025 INFO  (jetty-launcher-1201-thread-4) [    ] o.e.j.s.session No SessionScavenger set, using defaults
   [junit4]   2> 703025 INFO  (jetty-launcher-1201-thread-4) [    ] o.e.j.s.session node0 Scavenging every 600000ms
   [junit4]   2> 703025 INFO  (jetty-launcher-1201-thread-4) [    ] o.e.j.s.h.ContextHandler Started o.e.j.s.ServletContextHandler@f76d42d{/solr,null,AVAILABLE}
   [junit4]   2> 703025 INFO  (jetty-launcher-1201-thread-4) [    ] o.e.j.s.AbstractConnector Started ServerConnector@32967b5b{HTTP/1.1,[http/1.1]}{127.0.0.1:36856}
   [junit4]   2> 703025 INFO  (jetty-launcher-1201-thread-4) [    ] o.e.j.s.Server Started @703075ms
   [junit4]   2> 703025 INFO  (jetty-launcher-1201-thread-4) [    ] o.a.s.c.s.e.JettySolrRunner Jetty properties: {hostContext=/solr, hostPort=36856}
   [junit4]   2> 703026 ERROR (jetty-launcher-1201-thread-4) [    ] o.a.s.u.StartupLoggingUtils Missing Java Option solr.log.dir. Logging may be missing or incomplete.
   [junit4]   2> 703026 INFO  (jetty-launcher-1201-thread-4) [    ] o.a.s.s.SolrDispatchFilter Using logger factory org.apache.logging.slf4j.Log4jLoggerFactory
   [junit4]   2> 703026 INFO  (jetty-launcher-1201-thread-4) [    ] o.a.s.s.SolrDispatchFilter  ___      _       Welcome to Apache Solr™ version 8.0.0
   [junit4]   2> 703026 INFO  (jetty-launcher-1201-thread-4) [    ] o.a.s.s.SolrDispatchFilter / __| ___| |_ _   Starting in cloud mode on port null
   [junit4]   2> 703026 INFO  (jetty-launcher-1201-thread-4) [    ] o.a.s.s.SolrDispatchFilter \__ \/ _ \ | '_|  Install dir: null
   [junit4]   2> 703026 INFO  (jetty-launcher-1201-thread-4) [    ] o.a.s.s.SolrDispatchFilter |___/\___/_|_|    Start time: 2018-09-28T17:44:41.476Z
   [junit4]   2> 703028 INFO  (jetty-launcher-1201-thread-3) [    ] o.e.j.s.session DefaultSessionIdManager workerName=node0
   [junit4]   2> 703028 INFO  (jetty-launcher-1201-thread-3) [    ] o.e.j.s.session No SessionScavenger set, using defaults
   [junit4]   2> 703028 INFO  (jetty-launcher-1201-thread-3) [    ] o.e.j.s.session node0 Scavenging every 660000ms
   [junit4]   2> 703029 INFO  (jetty-launcher-1201-thread-3) [    ] o.e.j.s.h.ContextHandler Started o.e.j.s.ServletContextHandler@105cd30f{/solr,null,AVAILABLE}
   [junit4]   2> 703029 INFO  (jetty-launcher-1201-thread-2) [    ] o.e.j.s.AbstractConnector Started ServerConnector@55908c2{HTTP/1.1,[http/1.1]}{127.0.0.1:40869}
   [junit4]   2> 703029 INFO  (jetty-launcher-1201-thread-2) [    ] o.e.j.s.Server Started @703078ms
   [junit4]   2> 703029 INFO  (jetty-launcher-1201-thread-2) [    ] o.a.s.c.s.e.JettySolrRunner Jetty properties: {hostContext=/solr, hostPort=40869}
   [junit4]   2> 703029 ERROR (jetty-launcher-1201-thread-2) [    ] o.a.s.u.StartupLoggingUtils Missing Java Option solr.log.dir. Logging may be missing or incomplete.
   [junit4]   2> 703029 INFO  (jetty-launcher-1201-thread-2) [    ] o.a.s.s.SolrDispatchFilter Using logger factory org.apache.logging.slf4j.Log4jLoggerFactory
   [junit4]   2> 703029 INFO  (jetty-launcher-1201-thread-2) [    ] o.a.s.s.SolrDispatchFilter  ___      _       Welcome to Apache Solr™ version 8.0.0
   [junit4]   2> 703029 INFO  (jetty-launcher-1201-thread-2) [    ] o.a.s.s.SolrDispatchFilter / __| ___| |_ _   Starting in cloud mode on port null
   [junit4]   2> 703029 INFO  (jetty-launcher-1201-thread-2) [    ] o.a.s.s.SolrDispatchFilter \__ \/ _ \ | '_|  Install dir: null
   [junit4]   2> 703029 INFO  (jetty-launcher-1201-thread-2) [    ] o.a.s.s.SolrDispatchFilter |___/\___/_|_|    Start time: 2018-09-28T17:44:41.479Z
   [junit4]   2> 703031 INFO  (zkConnectionManagerCallback-1206-thread-1) [    ] o.a.s.c.c.ConnectionManager zkClient has connected
   [junit4]   2> 703031 INFO  (jetty-launcher-1201-thread-4) [    ] o.a.s.s.SolrDispatchFilter solr.xml found in ZooKeeper. Loading...
   [junit4]   2> 703036 INFO  (jetty-launcher-1201-thread-3) [    ] o.e.j.s.AbstractConnector Started ServerConnector@7b95d28e{HTTP/1.1,[http/1.1]}{127.0.0.1:36558}
   [junit4]   2> 703036 INFO  (jetty-launcher-1201-thread-3) [    ] o.e.j.s.Server Started @703085ms
   [junit4]   2> 703036 INFO  (jetty-launcher-1201-thread-3) [    ] o.a.s.c.s.e.JettySolrRunner Jetty properties: {hostContext=/solr, hostPort=36558}
   [junit4]   2> 703036 ERROR (jetty-launcher-1201-thread-3) [    ] o.a.s.u.StartupLoggingUtils Missing Java Option solr.log.dir. Logging may be missing or incomplete.
   [junit4]   2> 703036 INFO  (jetty-launcher-1201-thread-3) [    ] o.a.s.s.SolrDispatchFilter Using logger factory org.apache.logging.slf4j.Log4jLoggerFactory
   [junit4]   2> 703036 INFO  (jetty-launcher-1201-thread-3) [    ] o.a.s.s.SolrDispatchFilter  ___      _       Welcome to Apache Solr™ version 8.0.0
   [junit4]   2> 703036 INFO  (jetty-launcher-1201-thread-3) [    ] o.a.s.s.SolrDispatchFilter / __| ___| |_ _   Starting in cloud mode on port null
   [junit4]   2> 703036 INFO  (jetty-launcher-1201-thread-3) [    ] o.a.s.s.SolrDispatchFilter \__ \/ _ \ | '_|  Install dir: null
   [junit4]   2> 703036 INFO  (jetty-launcher-1201-thread-3) [    ] o.a.s.s.SolrDispatchFilter |___/\___/_|_|    Start time: 2018-09-28T17:44:41.486Z
   [junit4]   2> 703038 INFO  (jetty-launcher-1201-thread-1) [    ] o.e.j.s.AbstractConnector Started ServerConnector@49171dd1{HTTP/1.1,[http/1.1]}{127.0.0.1:37513}
   [junit4]   2> 703038 INFO  (jetty-launcher-1201-thread-1) [    ] o.e.j.s.Server Started @703088ms
   [junit4]   2> 703038 INFO  (jetty-launcher-1201-thread-1) [    ] o.a.s.c.s.e.JettySolrRunner Jetty properties: {hostContext=/solr, hostPort=37513}
   [junit4]   2> 703040 ERROR (jetty-launcher-1201-thread-1) [    ] o.a.s.u.StartupLoggingUtils Missing Java Option solr.log.dir. Logging may be missing or incomplete.
   [junit4]   2> 703040 INFO  (jetty-launcher-1201-thread-1) [    ] o.a.s.s.SolrDispatchFilter Using logger factory org.apache.logging.slf4j.Log4jLoggerFactory
   [junit4]   2> 703040 INFO  (jetty-launcher-1201-thread-1) [    ] o.a.s.s.SolrDispatchFilter  ___      _       Welcome to Apache Solr™ version 8.0.0
   [junit4]   2> 703040 INFO  (jetty-launcher-1201-thread-1) [    ] o.a.s.s.SolrDispatchFilter / __| ___| |_ _   Starting in cloud mode on port null
   [junit4]   2> 703040 INFO  (jetty-launcher-1201-thread-1) [    ] o.a.s.s.SolrDispatchFilter \__ \/ _ \ | '_|  Install dir: null
   [junit4]   2> 703040 INFO  (jetty-launcher-1201-thread-1) [    ] o.a.s.s.SolrDispatchFilter |___/\___/_|_|    Start time: 2018-09-28T17:44:41.490Z
   [junit4]   2> 703042 INFO  (zkConnectionManagerCallback-1210-thread-1) [    ] o.a.s.c.c.ConnectionManager zkClient has connected
   [junit4]   2> 703043 INFO  (jetty-launcher-1201-thread-3) [    ] o.a.s.s.SolrDispatchFilter solr.xml found in ZooKeeper. Loading...
   [junit4]   2> 703043 INFO  (zkConnectionManagerCallback-1208-thread-1) [    ] o.a.s.c.c.ConnectionManager zkClient has connected
   [junit4]   2> 703043 INFO  (zkConnectionManagerCallback-1212-thread-1) [    ] o.a.s.c.c.ConnectionManager zkClient has connected
   [junit4]   2> 703043 INFO  (jetty-launcher-1201-thread-1) [    ] o.a.s.s.SolrDispatchFilter solr.xml found in ZooKeeper. Loading...
   [junit4]   2> 703064 INFO  (jetty-launcher-1201-thread-2) [    ] o.a.s.s.SolrDispatchFilter solr.xml found in ZooKeeper. Loading...
   [junit4]   2> 703331 INFO  (jetty-launcher-1201-thread-2) [    ] o.a.s.c.ZkContainer Zookeeper client=127.0.0.1:37063/solr
   [junit4]   2> 703374 INFO  (zkConnectionManagerCallback-1216-thread-1) [    ] o.a.s.c.c.ConnectionManager zkClient has connected
   [junit4]   2> 703375 INFO  (jetty-launcher-1201-thread-4) [    ] o.a.s.c.ZkContainer Zookeeper client=127.0.0.1:37063/solr
   [junit4]   2> 703384 DEBUG (jetty-launcher-1201-thread-2) [n:127.0.0.1:40869_solr    ] o.a.s.c.ZkController Added new OnReconnect listener org.apache.solr.cloud.ZkController$$Lambda$43/392580282@437efedc
   [junit4]   2> 703384 INFO  (zkConnectionManagerCallback-1220-thread-1) [    ] o.a.s.c.c.ConnectionManager zkClient has connected
   [junit4]   2> 703387 INFO  (zkConnectionManagerCallback-1222-thread-1) [    ] o.a.s.c.c.ConnectionManager zkClient has connected
   [junit4]   2> 703389 INFO  (jetty-launcher-1201-thread-3) [    ] o.a.s.c.ZkContainer Zookeeper client=127.0.0.1:37063/solr
   [junit4]   2> 703390 DEBUG (jetty-launcher-1201-thread-4) [n:127.0.0.1:36856_solr    ] o.a.s.c.ZkController Added new OnReconnect listener org.apache.solr.cloud.ZkController$$Lambda$43/392580282@70244d97
   [junit4]   2> 703391 INFO  (zkConnectionManagerCallback-1228-thread-1) [    ] o.a.s.c.c.ConnectionManager zkClient has connected
   [junit4]   2> 703394 INFO  (zkConnectionManagerCallback-1226-thread-1) [    ] o.a.s.c.c.ConnectionManager zkClient has connected
   [junit4]   2> 703395 DEBUG (jetty-launcher-1201-thread-3) [n:127.0.0.1:36558_solr    ] o.a.s.c.ZkController Added new OnReconnect listener org.apache.solr.cloud.ZkController$$Lambda$43/392580282@7c8fe9ae
   [junit4]   2> 703419 INFO  (zkConnectionManagerCallback-1230-thread-1) [    ] o.a.s.c.c.ConnectionManager zkClient has connected
   [junit4]   2> 703434 DEBUG (SyncThread:0) [    ] o.a.s.c.ZkTestServer Watch added: create/delete: /solr/clusterprops.json
   [junit4]   2> 703436 DEBUG (SyncThread:0) [    ] o.a.s.c.ZkTestServer Watch added: children: /solr/live_nodes
   [junit4]   2> 703436 DEBUG (SyncThread:0) [    ] o.a.s.c.ZkTestServer Watch added: data: /solr/clusterstate.json
   [junit4]   2> 703437 DEBUG (SyncThread:0) [    ] o.a.s.c.ZkTestServer Watch added: children: /solr/collections
   [junit4]   2> 703438 DEBUG (SyncThread:0) [    ] o.a.s.c.ZkTestServer Watch added: create/delete: /solr/aliases.json
   [junit4]   2> 703439 DEBUG (SyncThread:0) [    ] o.a.s.c.ZkTestServer Watch added: create/delete: /solr/security.json
   [junit4]   2> 703443 DEBUG (SyncThread:0) [    ] o.a.s.c.ZkTestServer Watch added: create/delete: /solr/clusterprops.json
   [junit4]   2> 703443 DEBUG (SyncThread:0) [    ] o.a.s.c.ZkTestServer Watch added: children: /solr/live_nodes
   [junit4]   2> 703443 DEBUG (SyncThread:0) [    ] o.a.s.c.ZkTestServer Watch added: data: /solr/clusterstate.json
   [junit4]   2> 703444 DEBUG (SyncThread:0) [    ] o.a.s.c.ZkTestServer Watch added: children: /solr/collections
   [junit4]   2> 703444 DEBUG (SyncThread:0) [    ] o.a.s.c.ZkTestServer Watch added: create/delete: /solr/aliases.json
   [junit4]   2> 703445 DEBUG (SyncThread:0) [    ] o.a.s.c.ZkTestServer Watch added: create/delete: /solr/security.json
   [junit4]   2> 703448 DEBUG (jetty-launcher-1201-thread-3) [n:127.0.0.1:36558_solr    ] o.a.s.c.LeaderElector Joined leadership election with path: /overseer_elect/election/72414463843303434-127.0.0.1:36558_solr-n_0000000000
   [junit4]   2> 703448 INFO  (jetty-launcher-1201-thread-3) [n:127.0.0.1:36558_solr    ] o.a.s.c.OverseerElectionContext I am going to be the leader 127.0.0.1:36558_solr
   [junit4]   2> 703448 DEBUG (jetty-launcher-1201-thread-2) [n:127.0.0.1:40869_solr    ] o.a.s.c.LeaderElector Joined leadership election with path: /overseer_elect/election/72414463843303431-127.0.0.1:40869_solr-n_0000000001
   [junit4]   2> 703449 INFO  (jetty-launcher-1201-thread-3) [n:127.0.0.1:36558_solr    ] o.a.s.c.Overseer Overseer (id=72414463843303434-127.0.0.1:36558_solr-n_0000000000) starting
   [junit4]   2> 703449 DEBUG (SyncThread:0) [    ] o.a.s.c.ZkTestServer Watch added: data: /solr/overseer_elect/election/72414463843303434-127.0.0.1:36558_solr-n_0000000000
   [junit4]   2> 703450 DEBUG (jetty-launcher-1201-thread-2) [n:127.0.0.1:40869_solr    ] o.a.s.c.LeaderElector Watching path /overseer_elect/election/72414463843303434-127.0.0.1:36558_solr-n_0000000000 to know if I could be the leader
   [junit4]   2> 703451 INFO  (jetty-launcher-1201-thread-2) [n:127.0.0.1:40869_solr    ] o.a.s.c.ZkController Register node as live in ZooKeeper:/live_nodes/127.0.0.1:40869_solr
   [junit4]   2> 703452 DEBUG (SyncThread:0) [    ] o.a.s.c.ZkTestServer Watch fired: children: /solr/live_nodes
   [junit4]   2> 703452 DEBUG (SyncThread:0) [    ] o.a.s.c.ZkTestServer Watch fired: children: /solr/live_nodes
   [junit4]   2> 703459 DEBUG (SyncThread:0) [    ] o.a.s.c.ZkTestServer Watch added: children: /solr/live_nodes
   [junit4]   2> 703471 INFO  (zkCallback-1229-thread-1) [    ] o.a.s.c.c.ZkStateReader Updated live nodes from ZooKeeper... (0) -> (1)
   [junit4]   2> 703475 DEBUG (SyncThread:0) [    ] o.a.s.c.ZkTestServer Watch added: children: /solr/live_nodes
   [junit4]   2> 703476 INFO  (zkCallback-1221-thread-1) [    ] o.a.s.c.c.ZkStateReader Updated live nodes from ZooKeeper... (0) -> (1)
   [junit4]   2> 703491 INFO  (zkConnectionManagerCallback-1241-thread-1) [    ] o.a.s.c.c.ConnectionManager zkClient has connected
   [junit4]   2> 703493 DEBUG (SyncThread:0) [    ] o.a.s.c.ZkTestServer Watch added: create/delete: /solr/clusterprops.json
   [junit4]   2> 703493 DEBUG (SyncThread:0) [    ] o.a.s.c.ZkTestServer Watch added: children: /solr/live_nodes
   [junit4]   2> 703493 INFO  (jetty-launcher-1201-thread-3) [n:127.0.0.1:36558_solr    ] o.a.s.c.c.ZkStateReader Updated live nodes from ZooKeeper... (0) -> (1)
   [junit4]   2> 703493 DEBUG (SyncThread:0) [    ] o.a.s.c.ZkTestServer Watch added: data: /solr/clusterstate.json
   [junit4]   2> 703493 DEBUG (SyncThread:0) [    ] o.a.s.c.ZkTestServer Watch added: children: /solr/collections
   [junit4]   2> 703494 DEBUG (SyncThread:0) [    ] o.a.s.c.ZkTestServer Watch added: create/delete: /solr/aliases.json
   [junit4]   2> 703494 INFO  (jetty-launcher-1201-thread-3) [n:127.0.0.1:36558_solr    ] o.a.s.c.s.i.ZkClientClusterStateProvider Cluster at 127.0.0.1:37063/solr ready
   [junit4]   2> 703515 INFO  (OverseerStateUpdate-72414463843303434-127.0.0.1:36558_solr-n_0000000000) [n:127.0.0.1:36558_solr    ] o.a.s.c.Overseer Starting to work on the main queue : 127.0.0.1:36558_solr
   [junit4]   2> 703515 DEBUG (OverseerCollectionConfigSetProcessor-72414463843303434-127.0.0.1:36558_solr-n_0000000000) [n:127.0.0.1:36558_solr    ] o.a.s.c.OverseerTaskProcessor Process current queue of overseer operations
   [junit4]   2> 703516 DEBUG (SyncThread:0) [    ] o.a.s.c.ZkTestServer Watch added: children: /solr/overseer/queue-work
   [junit4]   2> 703517 DEBUG (SyncThread:0) [    ] o.a.s.c.ZkTestServer Watch added: children: /solr/overseer/queue
   [junit4]   2> 703517 DEBUG (OverseerCollectionConfigSetProcessor-72414463843303434-127.0.0.1:36558_solr-n_0000000000) [n:127.0.0.1:36558_solr    ] o.a.s.c.OverseerTaskProcessor Cleaning up work-queue. #Running tasks: 0
   [junit4]   2> 703517 DEBUG (OverseerCollectionConfigSetProcessor-72414463843303434-127.0.0.1:36558_solr-n_0000000000) [n:127.0.0.1:36558_solr    ] o.a.s.c.OverseerTaskProcessor RunningTasks: []
   [junit4]   2> 703517 DEBUG (OverseerCollectionConfigSetProcessor-72414463843303434-127.0.0.1:36558_solr-n_0000000000) [n:127.0.0.1:36558_solr    ] o.a.s.c.OverseerTaskProcessor BlockedTasks: []
   [junit4]   2> 703517 DEBUG (OverseerCollectionConfigSetProcessor-72414463843303434-127.0.0.1:36558_solr-n_0000000000) [n:127.0.0.1:36558_solr    ] o.a.s.c.OverseerTaskProcessor CompletedTasks: []
   [junit4]   2> 703517 DEBUG (OverseerCollectionConfigSetProcessor-72414463843303434-127.0.0.1:36558_solr-n_0000000000) [n:127.0.0.1:36558_solr    ] o.a.s.c.OverseerTaskProcessor RunningZKTasks: []
   [junit4]   2> 703517 DEBUG (OverseerCollectionConfigSetProcessor-72414463843303434-127.0.0.1:36558_solr-n_0000000000) [n:127.0.0.1:36558_solr    ] o.a.s.c.OverseerTaskQueue Peeking for top 100 elements. ExcludeSet: []
   [junit4]   2> 703517 DEBUG (SyncThread:0) [    ] o.a.s.c.ZkTestServer Watch added: children: /solr/overseer/collection-queue-work
   [junit4]   2> 703519 INFO  (zkConnectionManagerCallback-1246-thread-1) [    ] o.a.s.c.c.ConnectionManager zkClient has connected
   [junit4]   2> 703519 DEBUG (jetty-launcher-1201-thread-3) [n:127.0.0.1:36558_solr    ] o.a.s.c.ZkController Publish node=127.0.0.1:36558_solr as DOWN
   [junit4]   2> 703520 DEBUG (SyncThread:0) [    ] o.a.s.c.ZkTestServer Watch added: create/delete: /solr/clusterprops.json
   [junit4]   2> 703520 DEBUG (SyncThread:0) [    ] o.a.s.c.ZkTestServer Watch added: children: /solr/live_nodes
   [junit4]   2> 703520 INFO  (jetty-launcher-1201-thread-2) [n:127.0.0.1:40869_solr    ] o.a.s.c.c.ZkStateReader Updated live nodes from ZooKeeper... (0) -> (1)
   [junit4]   2> 703520 DEBUG (SyncThread:0) [    ] o.a.s.c.ZkTestServer Watch fired: children: /solr/overseer/queue
   [junit4]   2> 703520 DEBUG (SyncThread:0) [    ] o.a.s.c.ZkTestServer Watch added: data: /solr/clusterstate.json
   [junit4]   2> 703520 INFO  (jetty-launcher-1201-thread-3) [n:127.0.0.1:36558_solr    ] o.a.s.c.TransientSolrCoreCacheDefault Allocating transient cache for 2147483647 transient cores
   [junit4]   2> 703520 INFO  (jetty-launcher-1201-thread-3) [n:127.0.0.1:36558_solr    ] o.a.s.c.ZkController Register node as live in ZooKeeper:/live_nodes/127.0.0.1:36558_solr
   [junit4]   2> 703520 DEBUG (SyncThread:0) [    ] o.a.s.c.ZkTestServer Watch added: children: /solr/overseer/queue
   [junit4]   2> 703520 DEBUG (OverseerAutoScalingTriggerThread-72414463843303434-127.0.0.1:36558_solr-n_0000000000) [    ] o.a.s.c.a.OverseerTriggerThread Adding .auto_add_replicas and .scheduled_maintenance triggers
   [junit4]   2> 703521 DEBUG (SyncThread:0) [    ] o.a.s.c.ZkTestServer Watch added: children: /solr/collections
   [junit4]   2> 703521 DEBUG (SyncThread:0) [    ] o.a.s.c.ZkTestServer Watch added: create/delete: /solr/aliases.json
   [junit4]   2> 703521 DEBUG (OverseerStateUpdate-72414463843303434-127.0.0.1:36558_solr-n_0000000000) [n:127.0.0.1:36558_solr    ] o.a.s.c.Overseer processMessage: queueSize: 1, message = {
   [junit4]   2>   "operation":"downnode",
   [junit4]   2>   "node_name":"127.0.0.1:36558_solr"} current state version: 0
   [junit4]   2> 703521 DEBUG (OverseerStateUpdate-72414463843303434-127.0.0.1:36558_solr-n_0000000000) [n:127.0.0.1:36558_solr    ] o.a.s.c.o.NodeMutator DownNode state invoked for node: 127.0.0.1:36558_solr
   [junit4]   2> 703521 DEBUG (SyncThread:0) [    ] o.a.s.c.ZkTestServer Watch fired: children: /solr/live_nodes
   [junit4]   2> 703521 DEBUG (SyncThread:0) [    ] o.a.s.c.ZkTestServer Watch fired: children: /solr/live_nodes
   [junit4]   2> 703521 DEBUG (SyncThread:0) [    ] o.a.s.c.ZkTestServer Watch fired: children: /solr/live_nodes
   [junit4]   2> 703521 DEBUG (SyncThread:0) [    ] o.a.s.c.ZkTestServer Watch fired: children: /solr/live_nodes
   [junit4]   2> 703522 INFO  (jetty-launcher-1201-thread-2) [n:127.0.0.1:40869_solr    ] o.a.s.c.s.i.ZkClientClusterStateProvider Cluster at 127.0.0.1:37063/solr ready
   [junit4]   2> 703522 DEBUG (SyncThread:0) [    ] o.a.s.c.ZkTestServer Watch added: children: /solr/live_nodes
   [junit4]   2> 703522 INFO  (zkCallback-1229-thread-1) [    ] o.a.s.c.c.ZkStateReader Updated live nodes from ZooKeeper... (1) -> (2)
   [junit4]   2> 703522 DEBUG (SyncThread:0) [    ] o.a.s.c.ZkTestServer Watch added: create/delete: /solr/clusterprops.json
   [junit4]   2> 703523 DEBUG (SyncThread:0) [    ] o.a.s.c.ZkTestServer Watch added: children: /solr/live_nodes
   [junit4]   2> 703523 INFO  (jetty-launcher-1201-thread-4) [n:127.0.0.1:36856_solr    ] o.a.s.c.c.ZkStateReader Updated live nodes from ZooKeeper... (0) -> (2)
   [junit4]   2> 703523 DEBUG (SyncThread:0) [    ] o.a.s.c.ZkTestServer Watch added: data: /solr/autoscaling.json
   [junit4]   2> 703523 DEBUG (SyncThread:0) [    ] o.a.s.c.ZkTestServer Watch added: data: /solr/clusterstate.json
   [junit4]   2> 703523 DEBUG (OverseerAutoScalingTriggerThread-72414463843303434-127.0.0.1:36558_solr-n_0000000000) [    ] o.a.s.c.a.OverseerTriggerThread Refreshing /autoscaling.json with znode version 1
   [junit4]   2> 703523 DEBUG (SyncThread:0) [    ] o.a.s.c.ZkTestServer Watch added: children: /solr/collections
   [junit4]   2> 703524 DEBUG (SyncThread:0) [    ] o.a.s.c.ZkTestServer Watch added: create/delete: /solr/aliases.json
   [junit4]   2> 703524 DEBUG (OverseerAutoScalingTriggerThread-72414463843303434-127.0.0.1:36558_solr-n_0000000000) [    ] o.a.s.c.a.OverseerTriggerThread Current znodeVersion 1, lastZnodeVersion -1
   [junit4]   2> 703524 DEBUG (OverseerAutoScalingTriggerThread-72414463843303434-127.0.0.1:36558_solr-n_0000000000) [    ] o.a.s.c.a.OverseerTriggerThread Processed trigger updates upto znodeVersion 1
   [junit4]   2> 703524 DEBUG (SyncThread:0) [    ] o.a.s.c.ZkTestServer Watch added: create/delete: /solr/security.json
   [junit4]   2> 703525 DEBUG (SyncThread:0) [    ] o.a.s.c.ZkTestServer Watch added: children: /solr/live_nodes
   [junit4]   2> 703526 DEBUG (jetty-launcher-1201-thread-4) [n:127.0.0.1:36856_solr    ] o.a.s.c.LeaderElector Joined leadership election with path: /overseer_elect/election/72414463843303432-127.0.0.1:36856_solr-n_0000000002
   [junit4]   2> 703526 DEBUG (SyncThread:0) [    ] o.a.s.c.ZkTestServer Watch added: data: /solr/overseer_elect/election/72414463843303431-127.0.0.1:40869_solr-n_0000000001
   [junit4]   2> 703526 DEBUG (jetty-launcher-1201-thread-4) [n:127.0.0.1:36856_solr    ] o.a.s.c.LeaderElector Watching path /overseer_elect/election/72414463843303431-127.0.0.1:40869_solr-n_0000000001 to know if I could be the leader
   [junit4]   2> 703527 DEBUG (jetty-launcher-1201-thread-4) [n:127.0.0.1:36856_solr    ] o.a.s.c.ZkController Publish node=127.0.0.1:36856_solr as DOWN
   [junit4]   2> 703527 DEBUG (SyncThread:0) [    ] o.a.s.c.ZkTestServer Watch fired: children: /solr/overseer/queue
   [junit4]   2> 703528 INFO  (jetty-launcher-1201-thread-4) [n:127.0.0.1:36856_solr    ] o.a.s.c.TransientSolrCoreCacheDefault Allocating transient cache for 2147483647 transient cores
   [junit4]   2> 703528 INFO  (jetty-launcher-1201-thread-4) [n:127.0.0.1:36856_solr    ] o.a.s.c.ZkController Register node as live in ZooKeeper:/live_nodes/127.0.0.1:36856_solr
   [junit4]   2> 703528 DEBUG (SyncThread:0) [    ] o.a.s.c.ZkTestServer Watch added: children: /solr/overseer/queue
   [junit4]   2> 703528 DEBUG (OverseerStateUpdate-72414463843303434-127.0.0.1:36558_solr-n_0000000000) [n:127.0.0.1:36558_solr    ] o.a.s.c.Overseer processMessage: queueSize: 2, message = {
   [junit4]   2>   "operation":"downnode",
   [junit4]   2>   "node_name":"127.0.0.1:36856_solr"} current state version: 0
   [junit4]   2> 703528 DEBUG (OverseerStateUpdate-72414463843303434-127.0.0.1:36558_solr-n_0000000000) [n:127.0.0.1:36558_solr    ] o.a.s.c.o.NodeMutator DownNode state invoked for node: 127.0.0.1:36856_solr
   [junit4]   2> 703528 DEBUG (SyncThread:0) [    ] o.a.s.c.ZkTestServer Watch fired: children: /solr/live_nodes
   [junit4]   2> 703528 DEBUG (SyncThread:0) [    ] o.a.s.c.ZkTestServer Watch fired: children: /solr/live_nodes
   [junit4]   2> 703528 DEBUG (SyncThread:0) [    ] o.a.s.c.ZkTestServer Watch fired: children: /solr/live_nodes
   [junit4]   2> 703531 DEBUG (SyncThread:0) [    ] o.a.s.c.ZkTestServer Watch added: children: /solr/live_nodes
   [junit4]   2> 703531 INFO  (zkCallback-1229-thread-1) [    ] o.a.s.c.c.ZkStateReader Updated live nodes from ZooKeeper... (2) -> (3)
   [junit4]   2> 703543 DEBUG (SyncThread:0) [    ] o.a.s.c.ZkTestServer Watch added: children: /solr/live_nodes
   [junit4]   2> 703543 INFO  (zkCallback-1221-thread-1) [    ] o.a.s.c.c.ZkStateReader Updated live nodes from ZooKeeper... (1) -> (3)
   [junit4]   2> 703543 INFO  (jetty-launcher-1201-thread-2) [n:127.0.0.1:40869_solr    ] o.a.s.h.a.MetricsHistoryHandler No .system collection, keeping metrics history in memory.
   [junit4]   2> 703544 DEBUG (SyncThread:0) [    ] o.a.s.c.ZkTestServer Watch added: children: /solr/live_nodes
   [junit4]   2> 703559 DEBUG (SyncThread:0) [    ] o.a.s.c.ZkTestServer Watch added: children: /solr/live_nodes
   [junit4]   2> 703573 INFO  (jetty-launcher-1201-thread-2) [n:127.0.0.1:40869_solr    ] o.a.s.m.r.SolrJmxReporter JMX monitoring for 'solr_40869.solr.node' (registry 'solr.node') enabled at server: com.sun.jmx.mbeanserver.JmxMBeanServer@79eb9e4
   [junit4]   2> 703575 DEBUG (SyncThread:0) [    ] o.a.s.c.ZkTestServer Watch added: children: /solr/live_nodes
   [junit4]   2> 703581 INFO  (jetty-launcher-1201-thread-2) [n:127.0.0.1:40869_solr    ] o.a.s.m.r.SolrJmxReporter JMX monitoring for 'solr_40869.solr.jvm' (registry 'solr.jvm') enabled at server: com.sun.jmx.mbeanserver.JmxMBeanServer@79eb9e4
   [junit4]   2> 703581 INFO  (jetty-launcher-1201-thread-2) [n:127.0.0.1:40869_solr    ] o.a.s.m.r.SolrJmxReporter JMX monitoring for 'solr_40869.solr.jetty' (registry 'solr.jetty') enabled at server: com.sun.jmx.mbeanserver.JmxMBeanServer@79eb9e4
   [junit4]   2> 703582 INFO  (jetty-launcher-1201-thread-2) [n:127.0.0.1:40869_solr    ] o.a.s.c.CorePropertiesLocator Found 0 core definitions underneath /x1/jenkins/jenkins-slave/workspace/Lucene-Solr-BadApples-NightlyTests-master/checkout/solr/build/solr-core/test/J0/temp/solr.cloud.MoveReplicaHDFSTest_408E7BC14D58FA08-001/tempDir-001/node1/.
   [junit4]   2> 703583 INFO  (zkCallback-1240-thread-1) [    ] o.a.s.c.c.ZkStateReader Updated live nodes from ZooKeeper... (1) -> (3)
   [junit4]   2> 703583 INFO  (zkCallback-1245-thread-1) [    ] o.a.s.c.c.ZkStateReader Updated live nodes from ZooKeeper... (1) -> (3)
   [junit4]   2> 703583 INFO  (zkCallback-1227-thread-1) [    ] o.a.s.c.c.ZkStateReader Updated live nodes from ZooKeeper... (2) -> (3)
   [junit4]   2> 703584 DEBUG (SyncThread:0) [    ] o.a.s.c.ZkTestServer Watch added: children: /solr/autoscaling/events/.scheduled_maintenance
   [junit4]   2> 703585 DEBUG (OverseerAutoScalingTriggerThread-72414463843303434-127.0.0.1:36558_solr-n_0000000000) [    ] o.a.s.c.a.NodeLostTrigger NodeLostTrigger .auto_add_replicas - Initial livenodes: [127.0.0.1:40869_solr, 127.0.0.1:36856_solr, 127.0.0.1:36558_solr]
   [junit4]   2> 703615 INFO  (jetty-launcher-1201-thread-3) [n:127.0.0.1:36558_solr    ] o.a.s.h.a.MetricsHistoryHandler No .system collection, keeping metrics history in memory.
   [junit4]   2> 703623 DEBUG (OverseerAutoScalingTriggerThread-72414463843303434-127.0.0.1:36558_solr-n_0000000000) [    ] o.a.s.c.a.OverseerTriggerThread -- clean old nodeAdded markers
   [junit4]   2> 703623 DEBUG (SyncThread:0) [    ] o.a.s.c.ZkTestServer Watch added: children: /solr/autoscaling/events/.auto_add_replicas
   [junit4]   2> 703638 INFO  (jetty-launcher-1201-thread-3) [n:127.0.0.1:36558_solr    ] o.a.s.m.r.SolrJmxReporter JMX monitoring for 'solr_36558.solr.node' (registry 'solr.node') enabled at server: com.sun.jmx.mbeanserver.JmxMBeanServer@79eb9e4
   [junit4]   2> 703643 DEBUG (SyncThread:0) [    ] o.a.s.c.ZkTestServer Watch fired: children: /solr/overseer/queue
   [junit4]   2> 703643 DEBUG (OverseerAutoScalingTriggerThread-72414463843303434-127.0.0.1:36558_solr-n_0000000000) [    ] o.a.s.c.a.OverseerTriggerThread Current znodeVersion 1, lastZnodeVersion 1
   [junit4]   2> 703643 DEBUG (ScheduledTrigger-2219-thread-1) [    ] o.a.s.c.a.NodeLostTrigger Running NodeLostTrigger: .auto_add_replicas with currently live nodes: 3
   [junit4]   2> 703643 DEBUG (SyncThread:0) [    ] o.a.s.c.ZkTestServer Watch added: children: /solr/overseer/queue
   [junit4]   2> 703646 INFO  (jetty-launcher-1201-thread-3) [n:127.0.0.1:36558_solr    ] o.a.s.m.r.SolrJmxReporter JMX monitoring for 'solr_36558.solr.jvm' (registry 'solr.jvm') enabled at server: com.sun.jmx.mbeanserver.JmxMBeanServer@79eb9e4
   [junit4]   2> 703646 INFO  (jetty-launcher-1201-thread-3) [n:127.0.0.1:36558_solr    ] o.a.s.m.r.SolrJmxReporter JMX monitoring for 'solr_36558.solr.jetty' (registry 'solr.jetty') enabled at server: com.sun.jmx.mbeanserver.JmxMBeanServer@79eb9e4
   [junit4]   2> 703647 INFO  (jetty-launcher-1201-thread-3) [n:127.0.0.1:36558_solr    ] o.a.s.c.CorePropertiesLocator Found 0 core definitions underneath /x1/jenkins/jenkins-slave/workspace/Lucene-Solr-BadApples-NightlyTests-master/checkout/solr/build/solr-core/test/J0/temp/solr.cloud.MoveReplicaHDFSTest_408E7BC14D58FA08-001/tempDir-001/node4/.
   [junit4]   2> 703648 INFO  (zkConnectionManagerCallback-1253-thread-1) [    ] o.a.s.c.c.ConnectionManager zkClient has connected
   [junit4]   2> 703649 DEBUG (SyncThread:0) [    ] o.a.s.c.ZkTestServer Watch added: create/delete: /solr/clusterprops.json
   [junit4]   2> 703649 DEBUG (SyncThread:0) [    ] o.a.s.c.ZkTestServer Watch added: children: /solr/live_nodes
   [junit4]   2> 703649 INFO  (jetty-launcher-1201-thread-4) [n:127.0.0.1:36856_solr    ] o.a.s.c.c.ZkStateReader Updated live nodes from ZooKeeper... (0) -> (3)
   [junit4]   2> 703649 DEBUG (SyncThread:0) [    ] o.a.s.c.ZkTestServer Watch added: data: /solr/clusterstate.json
   [junit4]   2> 703649 DEBUG (SyncThread:0) [    ] o.a.s.c.ZkTestServer Watch added: children: /solr/collections
   [junit4]   2> 703649 DEBUG (SyncThread:0) [    ] o.a.s.c.ZkTestServer Watch added: create/delete: /solr/aliases.json
   [junit4]   2> 703650 INFO  (jetty-launcher-1201-thread-4) [n:127.0.0.1:36856_solr    ] o.a.s.c.s.i.ZkClientClusterStateProvider Cluster at 127.0.0.1:37063/solr ready
   [junit4]   2> 703657 INFO  (jetty-launcher-1201-thread-4) [n:127.0.0.1:36856_solr    ] o.a.s.h.a.MetricsHistoryHandler No .system collection, keeping metrics history in memory.
   [junit4]   2> 703673 INFO  (jetty-launcher-1201-thread-4) [n:127.0.0.1:36856_solr    ] o.a.s.m.r.SolrJmxReporter JMX monitoring for 'solr_36856.solr.node' (registry 'solr.node') enabled at server: com.sun.jmx.mbeanserver.JmxMBeanServer@79eb9e4
   [junit4]   2> 703680 INFO  (jetty-launcher-1201-thread-4) [n:127.0.0.1:36856_solr    ] o.a.s.m.r.SolrJmxReporter JMX monitoring for 'solr_36856.solr.jvm' (registry 'solr.jvm') enabled at server: com.sun.jmx.mbeanserver.JmxMBeanServer@79eb9e4
   [junit4]   2> 703681 INFO  (jetty-launcher-1201-thread-4) [n:127.0.0.1:36856_solr    ] o.a.s.m.r.SolrJmxReporter JMX monitoring for 'solr_36856.solr.jetty' (registry 'solr.jetty') enabled at server: com.sun.jmx.mbeanserver.JmxMBeanServer@79eb9e4
   [junit4]   2> 703681 INFO  (jetty-launcher-1201-thread-4) [n:127.0.0.1:36856_solr    ] o.a.s.c.CorePropertiesLocator Found 0 core definitions underneath /x1/jenkins/jenkins-slave/workspace/Lucene-Solr-BadApples-NightlyTests-master/checkout/solr/build/solr-core/test/J0/temp/solr.cloud.MoveReplicaHDFSTest_408E7BC14D58FA08-001/tempDir-001/node3/.
   [junit4]   2> 703712 INFO  (jetty-launcher-1201-thread-1) [    ] o.a.s.c.ZkContainer Zookeeper client=127.0.0.1:37063/solr
   [junit4]   2> 703724 INFO  (zkConnectionManagerCallback-1258-thread-1) [    ] o.a.s.c.c.ConnectionManager zkClient has connected
   [junit4]   2> 703726 DEBUG (jetty-launcher-1201-thread-1) [n:127.0.0.1:37513_solr    ] o.a.s.c.ZkController Added new OnReconnect listener org.apache.solr.cloud.ZkController$$Lambda$43/392580282@43e096f1
   [junit4]   2> 703727 INFO  (zkConnectionManagerCallback-1260-thread-1) [    ] o.a.s.c.c.ConnectionManager zkClient has connected
   [junit4]   2> 703732 DEBUG (SyncThread:0) [    ] o.a.s.c.ZkTestServer Watch added: create/delete: /solr/clusterprops.json
   [junit4]   2> 703732 DEBUG (SyncThread:0) [    ] o.a.s.c.ZkTestServer Watch added: children: /solr/live_nodes
   [junit4]   2> 703733 INFO  (jetty-launcher-1201-thread-1) [n:127.0.0.1:37513_solr    ] o.a.s.c.c.ZkStateReader Updated live nodes from ZooKeeper... (0) -> (3)
   [junit4]   2> 703733 DEBUG (SyncThread:0) [    ] o.a.s.c.ZkTestServer Watch added: data: /solr/clusterstate.json
   [junit4]   2> 703733 DEBUG (SyncThread:0) [    ] o.a.s.c.ZkTestServer Watch added: children: /solr/collections
   [junit4]   2> 703733 DEBUG (SyncThread:0) [    ] o.a.s.c.ZkTestServer Watch added: create/delete: /solr/aliases.json
   [junit4]   2> 703734 DEBUG (SyncThread:0) [    ] o.a.s.c.ZkTestServer Watch added: create/delete: /solr/security.json
   [junit4]   2> 703735 DEBUG (jetty-launcher-1201-thread-1) [n:127.0.0.1:37513_solr    ] o.a.s.c.LeaderElector Joined leadership election with path: /overseer_elect/election/72414463843303439-127.0.0.1:37513_solr-n_0000000003
   [junit4]   2> 703736 DEBUG (SyncThread:0) [    ] o.a.s.c.ZkTestServer Watch added: data: /solr/overseer_elect/election/72414463843303432-127.0.0.1:36856_solr-n_0000000002
   [junit4]   2> 703736 DEBUG (jetty-launcher-1201-thread-1) [n:127.0.0.1:37513_solr    ] o.a.s.c.LeaderElector Watching path /overseer_elect/election/72414463843303432-127.0.0.1:36856_solr-n_0000000002 to know if I could be the leader
   [junit4]   2> 703736 DEBUG (jetty-launcher-1201-thread-1) [n:127.0.0.1:37513_solr    ] o.a.s.c.ZkController Publish node=127.0.0.1:37513_solr as DOWN
   [junit4]   2> 703737 DEBUG (SyncThread:0) [    ] o.a.s.c.ZkTestServer Watch fired: children: /solr/overseer/queue
   [junit4]   2> 703737 INFO  (jetty-launcher-1201-thread-1) [n:127.0.0.1:37513_solr    ] o.a.s.c.TransientSolrCoreCacheDefault Allocating transient cache for 2147483647 transient cores
   [junit4]   2> 703737 INFO  (jetty-launcher-1201-thread-1) [n:127.0.0.1:37513_solr    ] o.a.s.c.ZkController Register node as live in ZooKeeper:/live_nodes/127.0.0.1:37513_solr
   [junit4]   2> 703737 DEBUG (SyncThread:0) [    ] o.a.s.c.ZkTestServer Watch added: children: /solr/overseer/queue
   [junit4]   2> 703738 DEBUG (SyncThread:0) [    ] o.a.s.c.ZkTestServer Watch fired: children: /solr/live_nodes
   [junit4]   2> 703738 DEBUG (SyncThread:0) [    ] o.a.s.c.ZkTestServer Watch fired: children: /solr/live_nodes
   [junit4]   2> 703738 DEBUG (SyncThread:0) [    ] o.a.s.c.ZkTestServer Watch fired: children: /solr/live_nodes
   [junit4]   2> 703738 DEBUG (SyncThread:0) [    ] o.a.s.c.ZkTestServer Watch fired: children: /solr/live_nodes
   [junit4]   2> 703738 DEBUG (SyncThread:0) [    ] o.a.s.c.ZkTestServer Watch fired: children: /solr/live_nodes
   [junit4]   2> 703738 DEBUG (SyncThread:0) [    ] o.a.s.c.ZkTestServer Watch fired: children: /solr/live_nodes
   [junit4]   2> 703738 DEBUG (OverseerStateUpdate-72414463843303434-127.0.0.1:36558_solr-n_0000000000) [n:127.0.0.1:36558_solr    ] o.a.s.c.Overseer processMessage: queueSize: 1, message = {
   [junit4]   2>   "operation":"downnode",
   [junit4]   2>   "node_name":"127.0.0.1:37513_solr"} current state version: 0
   [junit4]   2> 703738 DEBUG (SyncThread:0) [    ] o.a.s.c.ZkTestServer Watch fired: children: /solr/live_nodes
   [junit4]   2> 703738 DEBUG (OverseerStateUpdate-72414463843303434-127.0.0.1:36558_solr-n_0000000000) [n:127.0.0.1:36558_solr    ] o.a.s.c.o.NodeMutator DownNode state invoked for node: 127.0.0.1:37513_solr
   [junit4]   2> 703739 DEBUG (SyncThread:0) [    ] o.a.s.c.ZkTestServer Watch added: children: /solr/live_nodes
   [junit4]   2> 703739 DEBUG (SyncThread:0) [    ] o.a.s.c.ZkTestServer Watch added: children: /solr/live_nodes
   [junit4]   2> 703739 DEBUG (SyncThread:0) [    ] o.a.s.c.ZkTestServer Watch added: children: /solr/live_nodes
   [junit4]   2> 703739 DEBUG (SyncThread:0) [    ] o.a.s.c.ZkTestServer Watch added: children: /solr/live_nodes
   [junit4]   2> 703739 INFO  (zkCallback-1240-thread-2) [    ] o.a.s.c.c.ZkStateReader Updated live nodes from ZooKeeper... (3) -> (4)
   [junit4]   2> 703739 DEBUG (SyncThread:0) [    ] o.a.s.c.ZkTestServer Watch added: children: /solr/live_nodes
   [junit4]   2> 703739 INFO  (zkCallback-1229-thread-1) [    ] o.a.s.c.c.ZkStateReader Updated live nodes from ZooKeeper... (3) -> (4)
   [junit4]   2> 703739 INFO  (zkCallback-1221-thread-1) [    ] o.a.s.c.c.ZkStateReader Updated live nodes from ZooKeeper... (3) -> (4)
   [junit4]   2> 703739 INFO  (zkCallback-1245-thread-1) [    ] o.a.s.c.c.ZkStateReader Updated live nodes from ZooKeeper... (3) -> (4)
   [junit4]   2> 703739 DEBUG (SyncThread:0) [    ] o.a.s.c.ZkTestServer Watch added: children: /solr/live_nodes
   [junit4]   2> 703739 INFO  (zkCallback-1227-thread-1) [    ] o.a.s.c.c.ZkStateReader Updated live nodes from ZooKeeper... (3) -> (4)
   [junit4]   2> 703746 INFO  (zkCallback-1252-thread-1) [    ] o.a.s.c.c.ZkStateReader Updated live nodes from ZooKeeper... (3) -> (4)
   [junit4]   2> 703746 DEBUG (SyncThread:0) [    ] o.a.s.c.ZkTestServer Watch added: children: /solr/live_nodes
   [junit4]   2> 703751 INFO  (zkCallback-1259-thread-1) [    ] o.a.s.c.c.ZkStateReader Updated live nodes from ZooKeeper... (3) -> (4)
   [junit4]   2> 703766 INFO  (zkConnectionManagerCallback-1267-thread-1) [    ] o.a.s.c.c.ConnectionManager zkClient has connected
   [junit4]   2> 703767 DEBUG (SyncThread:0) [    ] o.a.s.c.ZkTestServer Watch added: create/delete: /solr/clusterprops.json
   [junit4]   2> 703767 DEBUG (SyncThread:0) [    ] o.a.s.c.ZkTestServer Watch added: children: /solr/live_nodes
   [junit4]   2> 703768 INFO  (jetty-launcher-1201-thread-1) [n:127.0.0.1:37513_solr    ] o.a.s.c.c.ZkStateReader Updated live nodes from ZooKeeper... (0) -> (4)
   [junit4]   2> 703768 DEBUG (SyncThread:0) [    ] o.a.s.c.ZkTestServer Watch added: data: /solr/clusterstate.json
   [junit4]   2> 703768 DEBUG (SyncThread:0) [    ] o.a.s.c.ZkTestServer Watch added: children: /solr/collections
   [junit4]   2> 703768 DEBUG (SyncThread:0) [    ] o.a.s.c.ZkTestServer Watch added: create/delete: /solr/aliases.json
   [junit4]   2> 703770 INFO  (jetty-launcher-1201-thread-1) [n:127.0.0.1:37513_solr    ] o.a.s.c.s.i.ZkClientClusterStateProvider Cluster at 127.0.0.1:37063/solr ready
   [junit4]   2> 703770 INFO  (jetty-launcher-1201-thread-1) [n:127.0.0.1:37513_solr    ] o.a.s.h.a.MetricsHistoryHandler No .system collection, keeping metrics history in memory.
   [junit4]   2> 703785 INFO  (jetty-launcher-1201-thread-1) [n:127.0.0.1:37513_solr    ] o.a.s.m.r.SolrJmxReporter JMX monitoring for 'solr_37513.solr.node' (registry 'solr.node') enabled at server: com.sun.jmx.mbeanserver.JmxMBeanServer@79eb9e4
   [junit4]   2> 703793 INFO  (jetty-launcher-1201-thread-1) [n:127.0.0.1:37513_solr    ] o.a.s.m.r.SolrJmxReporter JMX monitoring for 'solr_37513.solr.jvm' (registry 'solr.jvm') enabled at server: com.sun.jmx.mbeanserver.JmxMBeanServer@79eb9e4
   [junit4]   2> 703794 INFO  (jetty-launcher-1201-thread-1) [n:127.0.0.1:37513_solr    ] o.a.s.m.r.SolrJmxReporter JMX monitoring for 'solr_37513.solr.jetty' (registry 'solr.jetty') enabled at server: com.sun.jmx.mbeanserver.JmxMBeanServer@79eb9e4
   [junit4]   2> 703794 INFO  (jetty-launcher-1201-thread-1) [n:127.0.0.1:37513_solr    ] o.a.s.c.CorePropertiesLocator Found 0 core definitions underneath /x1/jenkins/jenkins-slave/workspace/Lucene-Solr-BadApples-NightlyTests-master/checkout/solr/build/solr-core/test/J0/temp/solr.cloud.MoveReplicaHDFSTest_408E7BC14D58FA08-001/tempDir-001/node2/.
   [junit4]   2> 703834 INFO  (zkConnectionManagerCallback-1270-thread-1) [    ] o.a.s.c.c.ConnectionManager zkClient has connected
   [junit4]   2> 703838 INFO  (zkConnectionManagerCallback-1275-thread-1) [    ] o.a.s.c.c.ConnectionManager zkClient has connected
   [junit4]   2> 703839 DEBUG (SyncThread:0) [    ] o.a.s.c.ZkTestServer Watch fired: children: /solr/overseer/queue
   [junit4]   2> 703840 DEBUG (SyncThread:0) [    ] o.a.s.c.ZkTestServer Watch added: create/delete: /solr/clusterprops.json
   [junit4]   2> 703840 DEBUG (SyncThread:0) [    ] o.a.s.c.ZkTestServer Watch added: children: /solr/overseer/queue
   [junit4]   2> 703840 DEBUG (SyncThread:0) [    ] o.a.s.c.ZkTestServer Watch added: children: /solr/live_nodes
   [junit4]   2> 703840 INFO  (SUITE-MoveReplicaHDFSTest-seed#[408E7BC14D58FA08]-worker) [    ] o.a.s.c.c.ZkStateReader Updated live nodes from ZooKeeper... (0) -> (4)
   [junit4]   2> 703840 DEBUG (SyncThread:0) [    ] o.a.s.c.ZkTestServer Watch added: data: /solr/clusterstate.json
   [junit4]   2> 703840 DEBUG (SyncThread:0) [    ] o.a.s.c.ZkTestServer Watch added: children: /solr/collections
   [junit4]   2> 703840 DEBUG (SyncThread:0) [    ] o.a.s.c.ZkTestServer Watch added: create/delete: /solr/aliases.json
   [junit4]   2> 703841 INFO  (SUITE-MoveReplicaHDFSTest-seed#[408E7BC14D58FA08]-worker) [    ] o.a.s.c.s.i.ZkClientClusterStateProvider Cluster at 127.0.0.1:37063/solr ready
   [junit4]   2> 703845 INFO  (qtp415503312-5428) [n:127.0.0.1:36558_solr    ] o.a.s.h.a.CollectionsHandler Invoked Collection Action :overseerstatus with params action=OVERSEERSTATUS&wt=javabin&version=2 and sendToOCPQueue=true
   [junit4]   2> 703845 DEBUG (SyncThread:0) [    ] o.a.s.c.ZkTestServer Watch fired: children: /solr/overseer/collection-queue-work
   [junit4]   2> 703846 DEBUG (SyncThread:0) [    ] o.a.s.c.ZkTestServer Watch added: create/delete: /solr/overseer/collection-queue-work/qnr-0000000000
   [junit4]   2> 703846 DEBUG (SyncThread:0) [    ] o.a.s.c.ZkTestServer Watch added: children: /solr/overseer/collection-queue-work
   [junit4]   2> 703846 DEBUG (OverseerCollectionConfigSetProcessor-72414463843303434-127.0.0.1:36558_solr-n_0000000000) [n:127.0.0.1:36558_solr    ] o.a.s.c.ZkDistributedQueue Found child node with improper name: qnr-0000000000
   [junit4]   2> 703846 DEBUG (SyncThread:0) [    ] o.a.s.c.ZkTestServer Watch fired: children: /solr/overseer/collection-queue-work
   [junit4]   2> 703846 DEBUG (SyncThread:0) [    ] o.a.s.c.ZkTestServer Watch added: children: /solr/overseer/collection-queue-work
   [junit4]   2> 703846 DEBUG (OverseerCollectionConfigSetProcessor-72414463843303434-127.0.0.1:36558_solr-n_0000000000) [n:127.0.0.1:36558_solr    ] o.a.s.c.ZkDistributedQueue Found child node with improper name: qnr-0000000000
   [junit4]   2> 703847 DEBUG (OverseerCollectionConfigSetProcessor-72414463843303434-127.0.0.1:36558_solr-n_0000000000) [n:127.0.0.1:36558_solr    ] o.a.s.c.OverseerTaskQueue Returning topN elements: [/overseer/collection-queue-work/qn-0000000000, ]
   [junit4]   2> 703847 DEBUG (OverseerCollectionConfigSetProcessor-72414463843303434-127.0.0.1:36558_solr-n_0000000000) [n:127.0.0.1:36558_solr    ] o.a.s.c.OverseerTaskProcessor Got 1 tasks from work-queue : [[org.apache.solr.cloud.OverseerTaskQueue$QueueEvent@2e684ecf]]
   [junit4]   2> 703847 DEBUG (OverseerCollectionConfigSetProcessor-72414463843303434-127.0.0.1:36558_solr-n_0000000000) [n:127.0.0.1:36558_solr    ] o.a.s.c.OverseerTaskProcessor Marked task [/overseer/collection-queue-work/qn-0000000000] as running
   [junit4]   2> 703847 DEBUG (OverseerCollectionConfigSetProcessor-72414463843303434-127.0.0.1:36558_solr-n_0000000000) [n:127.0.0.1:36558_solr    ] o.a.s.c.OverseerTaskProcessor Overseer Collection Message Handler: Get the message id:/overseer/collection-queue-work/qn-0000000000 message:{"operation":"overseerstatus"}
   [junit4]   2> 703847 DEBUG (OverseerCollectionConfigSetProcessor-72414463843303434-127.0.0.1:36558_solr-n_0000000000) [n:127.0.0.1:36558_solr    ] o.a.s.c.OverseerTaskProcessor Cleaning up work-queue. #Running tasks: 1
   [junit4]   2> 703847 DEBUG (OverseerCollectionConfigSetProcessor-72414463843303434-127.0.0.1:36558_solr-n_0000000000) [n:127.0.0.1:36558_solr    ] o.a.s.c.OverseerTaskProcessor RunningTasks: [/overseer/collection-queue-work/qn-0000000000]
   [junit4]   2> 703847 DEBUG (OverseerCollectionConfigSetProcessor-72414463843303434-127.0.0.1:36558_solr-n_0000000000) [n:127.0.0.1:36558_solr    ] o.a.s.c.OverseerTaskProcessor BlockedTasks: []
   [junit4]   2> 703847 DEBUG (OverseerCollectionConfigSetProcessor-72414463843303434-127.0.0.1:36558_solr-n_0000000000) [n:127.0.0.1:36558_solr    ] o.a.s.c.OverseerTaskProcessor CompletedTasks: []
   [junit4]   2> 703847 DEBUG (OverseerCollectionConfigSetProcessor-72414463843303434-127.0.0.1:36558_solr-n_0000000000) [n:127.0.0.1:36558_solr    ] o.a.s.c.OverseerTaskProcessor RunningZKTasks: [/overseer/collection-queue-work/qn-0000000000]
   [junit4]   2> 703848 DEBUG (OverseerCollectionConfigSetProcessor-72414463843303434-127.0.0.1:36558_solr-n_0000000000) [n:127.0.0.1:36558_solr    ] o.a.s.c.OverseerTaskQueue Peeking for top 99 elements. ExcludeSet: [/overseer/collection-queue-work/qn-0000000000],[]
   [junit4]   2> 703848 DEBUG (OverseerThreadFactory-2221-thread-1-processing-n:127.0.0.1:36558_solr) [n:127.0.0.1:36558_solr    ] o.a.s.c.OverseerTaskProcessor Runner processing /overseer/collection-queue-work/qn-0000000000
   [junit4]   2> 703848 DEBUG (OverseerThreadFactory-2221-thread-1-processing-n:127.0.0.1:36558_solr) [n:127.0.0.1:36558_solr    ] o.a.s.c.a.c.OverseerCollectionMessageHandler OverseerCollectionMessageHandler.processMessage : overseerstatus , {"operation":"overseerstatus"}
   [junit4]   2> 703856 DEBUG (OverseerThreadFactory-2221-thread-1-processing-n:127.0.0.1:36558_solr) [n:127.0.0.1:36558_solr    ] o.a.s.c.OverseerTaskProcessor Completed task:[/overseer/collection-queue-work/qn-0000000000]
   [junit4]   2> 703857 DEBUG (SyncThread:0) [    ] o.a.s.c.ZkTestServer Watch fired: data: /solr/overseer/collection-queue-work/qnr-0000000000
   [junit4]   2> 703857 DEBUG (zkCallback-1229-thread-1) [    ] o.a.s.c.OverseerTaskQueue NodeDataChanged fired on path /overseer/collection-queue-work/qnr-0000000000 state SyncConnected latchEventType null
   [junit4]   2> 703857 DEBUG (SyncThread:0) [    ] o.a.s.c.ZkTestServer Watch fired: children: /solr/overseer/collection-queue-work
   [junit4]   2> 703858 DEBUG (SyncThread:0) [    ] o.a.s.c.ZkTestServer Watch added: children: /solr/overseer/collection-queue-work
   [junit4]   2> 703858 DEBUG (OverseerCollectionConfigSetProcessor-72414463843303434-127.0.0.1:36558_solr-n_0000000000) [n:127.0.0.1:36558_solr    ] o.a.s.c.ZkDistributedQueue Found child node with improper name: qnr-0000000000
   [junit4]   2> 703860 DEBUG (SyncThread:0) [    ] o.a.s.c.ZkTestServer Watch fired: children: /solr/overseer/collection-queue-work
   [junit4]   2> 703860 DEBUG (OverseerThreadFactory-2221-thread-1-processing-n:127.0.0.1:36558_solr) [n:127.0.0.1:36558_solr    ] o.a.s.c.OverseerTaskProcessor Marked task [/overseer/collection-queue-work/qn-0000000000] as completed.
   [junit4]   2> 703862 DEBUG (SyncThread:0) [    ] o.a.s.c.ZkTestServer Watch added: children: /solr/overseer/collection-queue-work
   [junit4]   2> 703861 INFO  (qtp415503312-5428) [n:127.0.0.1:36558_solr    ] o.a.s.s.HttpSolrCall [admin] webapp=null path=/admin/collections params={action=OVERSEERSTATUS&wt=javabin&version=2} status=0 QTime=16
   [junit4]   1> Formatting using clusterid: testClusterID
   [junit4]   2> 703875 DEBUG (OverseerThreadFactory-2221-thread-1-processing-n:127.0.0.1:36558_solr) [n:127.0.0.1:36558_solr    ] o.a.s.c.OverseerTaskProcessor RunningTasks: []
   [junit4]   2> 703875 DEBUG (OverseerThreadFactory-2221-thread-1-processing-n:127.0.0.1:36558_solr) [n:127.0.0.1:36558_solr    ] o.a.s.c.OverseerTaskProcessor BlockedTasks: []
   [junit4]   2> 703875 DEBUG (OverseerThreadFactory-2221-thread-1-processing-n:127.0.0.1:36558_solr) [n:127.0.0.1:36558_solr    ] o.a.s.c.OverseerTaskProcessor CompletedTasks: [/overseer/collection-queue-work/qn-0000000000]
   [junit4]   2> 703875 DEBUG (OverseerThreadFactory-2221-thread-1-processing-n:127.0.0.1:36558_solr) [n:127.0.0.1:36558_solr    ] o.a.s.c.OverseerTaskProcessor RunningZKTasks: [/overseer/collection-queue-work/qn-0000000000]
   [junit4]   2> 703875 DEBUG (OverseerThreadFactory-2221-thread-1-processing-n:127.0.0.1:36558_solr) [n:127.0.0.1:36558_solr    ] o.a.s.c.OverseerTaskProcessor Overseer Collection Message Handler: Message id:/overseer/collection-queue-work/qn-0000000000 complete, response:{leader=127.0.0.1:36558_solr,overseer_queue_size=0,overseer_work_queue_size=0,overseer_collection_queue_size=2,overseer_operations={am_i_leader={requests=4,errors=0,avgRequestsPerSecond=11.872227584429234,5minRateRequestsPerSecond=0.0,15minRateRequestsPerSecond=0.0,avgTimePerRequest=0.28632951249505706,medianRequestTime=0.275529,75thPcRequestTime=0.275529,95thPcRequestTime=0.423896,99thPcRequestTime=0.423896,999thPcRequestTime=0.423896},downnode={requests=3,errors=0,avgRequestsPerSecond=9.075289582507759,5minRateRequestsPerSecond=0.0,15minRateRequestsPerSecond=0.0,avgTimePerRequest=0.04920866869043996,medianRequestTime=0.050399,75thPcRequestTime=0.054304,95thPcRequestTime=0.054304,99thPcRequestTime=0.054304,999thPcRequestTime=0.054304}},collection_operations={am_i_leader={requests=3,errors=0,avgRequestsPerSecond=8.920459412342316,5minRateRequestsPerSecond=0.0,15minRateRequestsPerSecond=0.0,avgTimePerRequest=0.33454169836195874,medianRequestTime=0.302221,75thPcRequestTime=0.420053,95thPcRequestTime=0.420053,99thPcRequestTime=0.420053,999thPcRequestTime=0.420053},overseerstatus={requests=0,errors=0,avgRequestsPerSecond=0.0,5minRateRequestsPerSecond=0.0,15minRateRequestsPerSecond=0.0,avgTimePerRequest=0.0,medianRequestTime=0.0,75thPcRequestTime=0.0,95thPcRequestTime=0.0,99thPcRequestTime=0.0,999thPcRequestTime=0.0}},overseer_queue={},overseer_internal_queue={peek={avgRequestsPerSecond=2.9810920569544437,5minRateRequestsPerSecond=0.0,15minRateRequestsPerSecond=0.0,avgTimePerRequest=0.228764,medianRequestTime=0.228764,75thPcRequestTime=0.228764,95thPcRequestTime=0.228764,99thPcRequestTime=0.228764,999thPcRequestTime=0.228764}},collection_queue={peektopn_wait2000={avgRequestsPerSecond=2.989718382400671,5minRateRequestsPerSecond=0.0,15minRateRequestsPerSecond=0.0,avgTimePerRequest=329.680884,medianRequestTime=329.680884,75thPcRequestTime=329.680884,95thPcRequestTime=329.680884,99thPcRequestTime=329.680884,999thPcRequestTime=329.680884}}}
   [junit4]   2> 703904 WARN  (SUITE-MoveReplicaHDFSTest-seed#[408E7BC14D58FA08]-worker) [    ] o.a.h.m.i.MetricsConfig Cannot locate configuration: tried hadoop-metrics2-namenode.properties,hadoop-metrics2.properties
   [junit4]   2> 703913 WARN  (SUITE-MoveReplicaHDFSTest-seed#[408E7BC14D58FA08]-worker) [    ] o.a.h.h.HttpRequestLog Jetty request log can only be enabled using Log4j
   [junit4]   2> 703915 INFO  (SUITE-MoveReplicaHDFSTest-seed#[408E7BC14D58FA08]-worker) [    ] o.m.log jetty-6.1.26
   [junit4]   2> 703932 INFO  (SUITE-MoveReplicaHDFSTest-seed#[408E7BC14D58FA08]-worker) [    ] o.m.log Extract jar:file:/x1/jenkins/.ivy2/cache/org.apache.hadoop/hadoop-hdfs/tests/hadoop-hdfs-2.7.4-tests.jar!/webapps/hdfs to ./temp/Jetty_localhost_36269_hdfs____.1micro/webapp
   [junit4]   2> 704308 INFO  (SUITE-MoveReplicaHDFSTest-seed#[408E7BC14D58FA08]-worker) [    ] o.m.log Started HttpServer2$SelectChannelConnectorWithSafeStartup@localhost:36269
   [junit4]   2> 704393 WARN  (SUITE-MoveReplicaHDFSTest-seed#[408E7BC14D58FA08]-worker) [    ] o.a.h.h.HttpRequestLog Jetty request log can only be enabled using Log4j
   [junit4]   2> 704399 INFO  (SUITE-MoveReplicaHDFSTest-seed#[408E7BC14D58FA08]-worker) [    ] o.m.log jetty-6.1.26
   [junit4]   2> 704415 INFO  (SUITE-MoveReplicaHDFSTest-seed#[408E7BC14D58FA08]-worker) [    ] o.m.log Extract jar:file:/x1/jenkins/.ivy2/cache/org.apache.hadoop/hadoop-hdfs/tests/hadoop-hdfs-2.7.4-tests.jar!/webapps/datanode to ./temp/Jetty_localhost_33315_datanode____7lodjy/webapp
   [junit4]   2> 704645 DEBUG (ScheduledTrigger-2219-thread-2) [    ] o.a.s.c.a.NodeLostTrigger Running NodeLostTrigger: .auto_add_replicas with currently live nodes: 4
   [junit4]   2> 705007 INFO  (SUITE-MoveReplicaHDFSTest-seed#[408E7BC14D58FA08]-worker) [    ] o.m.log Started HttpServer2$SelectChannelConnectorWithSafeStartup@localhost:33315
   [junit4]   2> 705275 WARN  (SUITE-MoveReplicaHDFSTest-seed#[408E7BC14D58FA08]-worker) [    ] o.a.h.h.HttpRequestLog Jetty request log can only be enabled using Log4j
   [junit4]   2> 705276 INFO  (SUITE-MoveReplicaHDFSTest-seed#[408E7BC14D58FA08]-worker) [    ] o.m.log jetty-6.1.26
   [junit4]   2> 705310 INFO  (SUITE-MoveReplicaHDFSTest-seed#[408E7BC14D58FA08]-worker) [    ] o.m.log Extract jar:file:/x1/jenkins/.ivy2/cache/org.apache.hadoop/hadoop-hdfs/tests/hadoop-hdfs-2.7.4-tests.jar!/webapps/datanode to ./temp/Jetty_localhost_45734_datanode____txakgu/webapp
   [junit4]   2> 705360 ERROR (DataNode: [[[DISK]file:/x1/jenkins/jenkins-slave/workspace/Lucene-Solr-BadApples-NightlyTests-master/checkout/solr/build/solr-core/test/J0/temp/solr.cloud.MoveReplicaHDFSTest_408E7BC14D58FA08-001/tempDir-002/hdfsBaseDir/data/data1/, [DISK]file:/x1/jenkins/jenkins-slave/workspace/Lucene-Solr-BadApples-NightlyTests-master/checkout/solr/build/solr-core/test/J0/temp/solr.cloud.MoveReplicaHDFSTest_408E7BC14D58FA08-001/tempDir-002/hdfsBaseDir/data/data2/]]  heartbeating to localhost/127.0.0.1:33240) [    ] o.a.h.h.s.d.DirectoryScanner dfs.datanode.directoryscan.throttle.limit.ms.per.sec set to value below 1 ms/sec. Assuming default value of 1000
   [junit4]   2> 705388 INFO  (Block report processor) [    ] BlockStateChange BLOCK* processReport 0x135890d15e22bd: from storage DS-ee077b84-a11d-4d96-b9f1-886151750dae node DatanodeRegistration(127.0.0.1:38029, datanodeUuid=8e57cba8-55ee-4c5a-8eaf-80fbcabebefe, infoPort=38208, infoSecurePort=0, ipcPort=42798, storageInfo=lv=-56;cid=testClusterID;nsid=949270109;c=0), blocks: 0, hasStaleStorage: true, processing time: 0 msecs
   [junit4]   2> 705388 INFO  (Block report processor) [    ] BlockStateChange BLOCK* processReport 0x135890d15e22bd: from storage DS-2e268a09-f6d1-44d7-a6cb-d87c2584cdf3 node DatanodeRegistration(127.0.0.1:38029, datanodeUuid=8e57cba8-55ee-4c5a-8eaf-80fbcabebefe, infoPort=38208, infoSecurePort=0, ipcPort=42798, storageInfo=lv=-56;cid=testClusterID;nsid=949270109;c=0), blocks: 0, hasStaleStorage: false, processing time: 0 msecs
   [junit4]   2> 705678 DEBUG (ScheduledTrigger-2219-thread-4) [    ] o.a.s.c.a.NodeLostTrigger Running NodeLostTrigger: .auto_add_replicas with currently live nodes: 4
   [junit4]   2> 705728 INFO  (SUITE-MoveReplicaHDFSTest-seed#[408E7BC14D58FA08]-worker) [    ] o.m.log Started HttpServer2$SelectChannelConnectorWithSafeStartup@localhost:45734
   [junit4]   2> 705820 ERROR (DataNode: [[[DISK]file:/x1/jenkins/jenkins-slave/workspace/Lucene-Solr-BadApples-NightlyTests-master/checkout/solr/build/solr-core/test/J0/temp/solr.cloud.MoveReplicaHDFSTest_408E7BC14D58FA08-001/tempDir-002/hdfsBaseDir/data/data3/, [DISK]file:/x1/jenkins/jenkins-slave/workspace/Lucene-Solr-BadApples-NightlyTests-master/checkout/solr/build/solr-core/test/J0/temp/solr.cloud.MoveReplicaHDFSTest_408E7BC14D58FA08-001/tempDir-002/hdfsBaseDir/data/data4/]]  heartbeating to localhost/127.0.0.1:33240) [    ] o.a.h.h.s.d.DirectoryScanner dfs.datanode.directoryscan.throttle.limit.ms.per.sec set to value below 1 ms/sec. Assuming default value of 1000
   [junit4]   2> 705832 INFO  (Block report processor) [    ] BlockStateChange BLOCK* processReport 0x135890ebd63cd9: from storage DS-5430302c-6fd7-474c-aef2-c39ebf5caf09 node DatanodeRegistration(127.0.0.1:38237, datanodeUuid=60f281a9-25fc-4d63-9271-77206a214109, infoPort=33469, infoSecurePort=0, ipcPort=36715, storageInfo=lv=-56;cid=testClusterID;nsid=949270109;c=0), blocks: 0, hasStaleStorage: true, processing time: 0 msecs
   [junit4]   2> 705832 INFO  (Block report processor) [    ] BlockStateChange BLOCK* processReport 0x135890ebd63cd9: from storage DS-595c19d1-b351-4af5-afea-63203350850d node DatanodeRegistration(127.0.0.1:38237, datanodeUuid=60f281a9-25fc-4d63-9271-77206a214109, infoPort=33469, infoSecurePort=0, ipcPort=36715, storageInfo=lv=-56;cid=testClusterID;nsid=949270109;c=0), blocks: 0, hasStaleStorage: false, processing time: 0 msecs
   [junit4]   2> 705850 DEBUG (OverseerCollectionConfigSetProcessor-72414463843303434-127.0.0.1:36558_solr-n_0000000000) [n:127.0.0.1:36558_solr    ] o.a.s.c.OverseerTaskProcessor Got 0 tasks from work-queue : [[]]
   [junit4]   2> 705850 DEBUG (OverseerCollectionConfigSetProcessor-72414463843303434-127.0.0.1:36558_solr-n_0000000000) [n:127.0.0.1:36558_solr    ] o.a.s.c.OverseerTaskProcessor Cleaning up work-queue. #Running tasks: 0
   [junit4]   2> 705850 INFO  (OverseerCollectionConfigSetProcessor-72414463843303434-127.0.0.1:36558_solr-n_0000000000) [n:127.0.0.1:36558_solr    ] o.a.s.c.OverseerTaskQueue Response ZK path: /overseer/collection-queue-work/qnr-0000000000 doesn't exist.  Requestor may have disconnected from ZooKeeper
   [junit4]   2> 705851 DEBUG (OverseerCollectionConfigSetProcessor-72414463843303434-127.0.0.1:36558_solr-n_0000000000) [n:127.0.0.1:36558_solr    ] o.a.s.c.OverseerTaskProcessor RunningTasks: []
   [junit4]   2> 705851 DEBUG (OverseerCollectionConfigSetProcessor-72414463843303434-127.0.0.1:36558_solr-n_0000000000) [n:127.0.0.1:36558_solr    ] o.a.s.c.OverseerTaskProcessor BlockedTasks: []
   [junit4]   2> 705851 DEBUG (OverseerCollectionConfigSetProcessor-72414463843303434-127.0.0.1:36558_solr-n_0000000000) [n:127.0.0.1:36558_solr    ] o.a.s.c.OverseerTaskProcessor CompletedTasks: []
   [junit4]   2> 705851 DEBUG (OverseerCollectionConfigSetProcessor-72414463843303434-127.0.0.1:36558_solr-n_0000000000) [n:127.0.0.1:36558_solr    ] o.a.s.c.OverseerTaskProcessor RunningZKTasks: []
   [junit4]   2> 705851 DEBUG (OverseerCollectionConfigSetProcessor-72414463843303434-127.0.0.1:36558_solr-n_0000000000) [n:127.0.0.1:36558_solr    ] o.a.s.c.OverseerTaskQueue Peeking for top 100 elements. ExcludeSet: []
   [junit4]   2> 705978 INFO  (TEST-MoveReplicaHDFSTest.testNormalMove-seed#[408E7BC14D58FA08]) [    ] o.a.s.SolrTestCaseJ4 ###Starting testNormalMove
   [junit4]   2> 705979 DEBUG (SyncThread:0) [    ] o.a.s.c.ZkTestServer Watch added: create/delete: /solr/clusterprops.json
   [junit4]   2> 705979 DEBUG (SyncThread:0) [    ] o.a.s.c.ZkTestServer Watch added: children: /solr/live_nodes
   [junit4]   2> 705979 INFO  (TEST-MoveReplicaHDFSTest.testNormalMove-seed#[408E7BC14D58FA08]) [    ] o.a.s.c.c.ZkStateReader Updated live nodes from ZooKeeper... (0) -> (4)
   [junit4]   2> 705980 DEBUG (SyncThread:0) [    ] o.a.s.c.ZkTestServer Watch added: data: /solr/clusterstate.json
   [junit4]   2> 705980 DEBUG (SyncThread:0) [    ] o.a.s.c.ZkTestServer Watch added: children: /solr/collections
   [junit4]   2> 705980 DEBUG (SyncThread:0) [    ] o.a.s.c.ZkTestServer Watch added: create/delete: /solr/aliases.json
   [junit4]   2> 705981 DEBUG (SyncThread:0) [    ] o.a.s.c.ZkTestServer Watch fired: data: /solr/aliases.json
   [junit4]   2> 705981 DEBUG (SyncThread:0) [    ] o.a.s.c.ZkTestServer Watch fired: data: /solr/aliases.json
   [junit4]   2> 705981 DEBUG (SyncThread:0) [    ] o.a.s.c.ZkTestServer Watch fired: data: /solr/aliases.json
   [junit4]   2> 705981 DEBUG (SyncThread:0) [    ] o.a.s.c.ZkTestServer Watch fired: data: /solr

[...truncated too long message...]

onfigure:
[ivy:configure] :: loading settings :: file = /x1/jenkins/jenkins-slave/workspace/Lucene-Solr-BadApples-NightlyTests-master/checkout/lucene/top-level-ivy-settings.xml

resolve:

ivy-availability-check:
[loadresource] Do not set property disallowed.ivy.jars.list as its length is 0.

-ivy-fail-disallowed-ivy-version:

ivy-fail:

ivy-fail:

ivy-configure:
[ivy:configure] :: loading settings :: file = /x1/jenkins/jenkins-slave/workspace/Lucene-Solr-BadApples-NightlyTests-master/checkout/lucene/top-level-ivy-settings.xml

resolve:

ivy-availability-check:
[loadresource] Do not set property disallowed.ivy.jars.list as its length is 0.

-ivy-fail-disallowed-ivy-version:

ivy-fail:

ivy-configure:
[ivy:configure] :: loading settings :: file = /x1/jenkins/jenkins-slave/workspace/Lucene-Solr-BadApples-NightlyTests-master/checkout/lucene/top-level-ivy-settings.xml

resolve:

ivy-availability-check:
[loadresource] Do not set property disallowed.ivy.jars.list as its length is 0.

-ivy-fail-disallowed-ivy-version:

ivy-fail:

ivy-fail:

ivy-configure:
[ivy:configure] :: loading settings :: file = /x1/jenkins/jenkins-slave/workspace/Lucene-Solr-BadApples-NightlyTests-master/checkout/lucene/top-level-ivy-settings.xml

resolve:

ivy-availability-check:
[loadresource] Do not set property disallowed.ivy.jars.list as its length is 0.

-ivy-fail-disallowed-ivy-version:

ivy-fail:

ivy-fail:

ivy-configure:
[ivy:configure] :: loading settings :: file = /x1/jenkins/jenkins-slave/workspace/Lucene-Solr-BadApples-NightlyTests-master/checkout/lucene/top-level-ivy-settings.xml

resolve:

ivy-availability-check:
[loadresource] Do not set property disallowed.ivy.jars.list as its length is 0.

-ivy-fail-disallowed-ivy-version:

ivy-fail:

ivy-fail:

ivy-configure:
[ivy:configure] :: loading settings :: file = /x1/jenkins/jenkins-slave/workspace/Lucene-Solr-BadApples-NightlyTests-master/checkout/lucene/top-level-ivy-settings.xml

resolve:

ivy-availability-check:
[loadresource] Do not set property disallowed.ivy.jars.list as its length is 0.

-ivy-fail-disallowed-ivy-version:

ivy-fail:

ivy-fail:

ivy-configure:
[ivy:configure] :: loading settings :: file = /x1/jenkins/jenkins-slave/workspace/Lucene-Solr-BadApples-NightlyTests-master/checkout/lucene/top-level-ivy-settings.xml

resolve:

ivy-availability-check:
[loadresource] Do not set property disallowed.ivy.jars.list as its length is 0.

-ivy-fail-disallowed-ivy-version:

ivy-fail:

ivy-fail:

ivy-configure:
[ivy:configure] :: loading settings :: file = /x1/jenkins/jenkins-slave/workspace/Lucene-Solr-BadApples-NightlyTests-master/checkout/lucene/top-level-ivy-settings.xml

resolve:

ivy-availability-check:
[loadresource] Do not set property disallowed.ivy.jars.list as its length is 0.

-ivy-fail-disallowed-ivy-version:

ivy-fail:

ivy-fail:

ivy-configure:
[ivy:configure] :: loading settings :: file = /x1/jenkins/jenkins-slave/workspace/Lucene-Solr-BadApples-NightlyTests-master/checkout/lucene/top-level-ivy-settings.xml

resolve:

ivy-availability-check:
[loadresource] Do not set property disallowed.ivy.jars.list as its length is 0.

-ivy-fail-disallowed-ivy-version:

ivy-fail:

ivy-fail:

ivy-configure:
[ivy:configure] :: loading settings :: file = /x1/jenkins/jenkins-slave/workspace/Lucene-Solr-BadApples-NightlyTests-master/checkout/lucene/top-level-ivy-settings.xml

resolve:

ivy-availability-check:
[loadresource] Do not set property disallowed.ivy.jars.list as its length is 0.

-ivy-fail-disallowed-ivy-version:

ivy-fail:

ivy-fail:

ivy-configure:
[ivy:configure] :: loading settings :: file = /x1/jenkins/jenkins-slave/workspace/Lucene-Solr-BadApples-NightlyTests-master/checkout/lucene/top-level-ivy-settings.xml

resolve:

ivy-availability-check:
[loadresource] Do not set property disallowed.ivy.jars.list as its length is 0.

-ivy-fail-disallowed-ivy-version:

ivy-fail:

ivy-fail:

ivy-configure:
[ivy:configure] :: loading settings :: file = /x1/jenkins/jenkins-slave/workspace/Lucene-Solr-BadApples-NightlyTests-master/checkout/lucene/top-level-ivy-settings.xml

resolve:

ivy-availability-check:
[loadresource] Do not set property disallowed.ivy.jars.list as its length is 0.

-ivy-fail-disallowed-ivy-version:

ivy-fail:

ivy-fail:

ivy-configure:
[ivy:configure] :: loading settings :: file = /x1/jenkins/jenkins-slave/workspace/Lucene-Solr-BadApples-NightlyTests-master/checkout/lucene/top-level-ivy-settings.xml

resolve:

jar-checksums:
    [mkdir] Created dir: /x1/jenkins/jenkins-slave/workspace/Lucene-Solr-BadApples-NightlyTests-master/checkout/solr/null909221363
     [copy] Copying 238 files to /x1/jenkins/jenkins-slave/workspace/Lucene-Solr-BadApples-NightlyTests-master/checkout/solr/null909221363
   [delete] Deleting directory /x1/jenkins/jenkins-slave/workspace/Lucene-Solr-BadApples-NightlyTests-master/checkout/solr/null909221363

check-working-copy:
[ivy:cachepath] :: resolving dependencies :: org.eclipse.jgit#org.eclipse.jgit-caller;working
[ivy:cachepath] 	confs: [default]
[ivy:cachepath] 	found org.eclipse.jgit#org.eclipse.jgit;4.6.0.201612231935-r in public
[ivy:cachepath] 	found com.jcraft#jsch;0.1.53 in public
[ivy:cachepath] 	found com.googlecode.javaewah#JavaEWAH;1.1.6 in public
[ivy:cachepath] 	found org.apache.httpcomponents#httpclient;4.3.6 in public
[ivy:cachepath] 	found org.apache.httpcomponents#httpcore;4.3.3 in public
[ivy:cachepath] 	found commons-logging#commons-logging;1.1.3 in public
[ivy:cachepath] 	found commons-codec#commons-codec;1.6 in public
[ivy:cachepath] 	found org.slf4j#slf4j-api;1.7.2 in public
[ivy:cachepath] :: resolution report :: resolve 63ms :: artifacts dl 55ms
	---------------------------------------------------------------------
	|                  |            modules            ||   artifacts   |
	|       conf       | number| search|dwnlded|evicted|| number|dwnlded|
	---------------------------------------------------------------------
	|      default     |   8   |   0   |   0   |   0   ||   8   |   0   |
	---------------------------------------------------------------------
[wc-checker] Initializing working copy...
[wc-checker] SLF4J: Failed to load class "org.slf4j.impl.StaticLoggerBinder".
[wc-checker] SLF4J: Defaulting to no-operation (NOP) logger implementation
[wc-checker] SLF4J: See http://www.slf4j.org/codes.html#StaticLoggerBinder for further details.
[wc-checker] Checking working copy status...

-jenkins-base:

BUILD SUCCESSFUL
Total time: 314 minutes 10 seconds
Archiving artifacts
java.lang.InterruptedException: no matches found within 10000
	at hudson.FilePath$34.hasMatch(FilePath.java:2678)
	at hudson.FilePath$34.invoke(FilePath.java:2557)
	at hudson.FilePath$34.invoke(FilePath.java:2547)
	at hudson.FilePath$FileCallableWrapper.call(FilePath.java:2918)
Also:   hudson.remoting.Channel$CallSiteStackTrace: Remote call to lucene
		at hudson.remoting.Channel.attachCallSiteStackTrace(Channel.java:1741)
		at hudson.remoting.UserRequest$ExceptionResponse.retrieve(UserRequest.java:357)
		at hudson.remoting.Channel.call(Channel.java:955)
		at hudson.FilePath.act(FilePath.java:1036)
		at hudson.FilePath.act(FilePath.java:1025)
		at hudson.FilePath.validateAntFileMask(FilePath.java:2547)
		at hudson.tasks.ArtifactArchiver.perform(ArtifactArchiver.java:243)
		at hudson.tasks.BuildStepCompatibilityLayer.perform(BuildStepCompatibilityLayer.java:81)
		at hudson.tasks.BuildStepMonitor$1.perform(BuildStepMonitor.java:20)
		at hudson.model.AbstractBuild$AbstractBuildExecution.perform(AbstractBuild.java:744)
		at hudson.model.AbstractBuild$AbstractBuildExecution.performAllBuildSteps(AbstractBuild.java:690)
		at hudson.model.Build$BuildExecution.post2(Build.java:186)
		at hudson.model.AbstractBuild$AbstractBuildExecution.post(AbstractBuild.java:635)
		at hudson.model.Run.execute(Run.java:1819)
		at hudson.model.FreeStyleBuild.run(FreeStyleBuild.java:43)
		at hudson.model.ResourceController.execute(ResourceController.java:97)
		at hudson.model.Executor.run(Executor.java:429)
Caused: hudson.FilePath$TunneledInterruptedException
	at hudson.FilePath$FileCallableWrapper.call(FilePath.java:2920)
	at hudson.remoting.UserRequest.perform(UserRequest.java:212)
	at hudson.remoting.UserRequest.perform(UserRequest.java:54)
	at hudson.remoting.Request$2.run(Request.java:369)
	at hudson.remoting.InterceptingExecutorService$1.call(InterceptingExecutorService.java:72)
	at java.util.concurrent.FutureTask.run(FutureTask.java:266)
	at java.util.concurrent.ThreadPoolExecutor.runWorker(ThreadPoolExecutor.java:1142)
	at java.util.concurrent.ThreadPoolExecutor$Worker.run(ThreadPoolExecutor.java:617)
	at java.lang.Thread.run(Thread.java:748)
Caused: java.lang.InterruptedException: java.lang.InterruptedException: no matches found within 10000
	at hudson.FilePath.act(FilePath.java:1038)
	at hudson.FilePath.act(FilePath.java:1025)
	at hudson.FilePath.validateAntFileMask(FilePath.java:2547)
	at hudson.tasks.ArtifactArchiver.perform(ArtifactArchiver.java:243)
	at hudson.tasks.BuildStepCompatibilityLayer.perform(BuildStepCompatibilityLayer.java:81)
	at hudson.tasks.BuildStepMonitor$1.perform(BuildStepMonitor.java:20)
	at hudson.model.AbstractBuild$AbstractBuildExecution.perform(AbstractBuild.java:744)
	at hudson.model.AbstractBuild$AbstractBuildExecution.performAllBuildSteps(AbstractBuild.java:690)
	at hudson.model.Build$BuildExecution.post2(Build.java:186)
	at hudson.model.AbstractBuild$AbstractBuildExecution.post(AbstractBuild.java:635)
	at hudson.model.Run.execute(Run.java:1819)
	at hudson.model.FreeStyleBuild.run(FreeStyleBuild.java:43)
	at hudson.model.ResourceController.execute(ResourceController.java:97)
	at hudson.model.Executor.run(Executor.java:429)
No artifacts found that match the file pattern "**/*.events,heapdumps/**,**/hs_err_pid*". Configuration error?
Recording test results
Build step 'Publish JUnit test result report' changed build result to UNSTABLE
Email was triggered for: Unstable (Test Failures)
Sending email for trigger: Unstable (Test Failures)

Mime
View raw message