lucene-dev mailing list archives

Site index · List index
Message view « Date » · « Thread »
Top « Date » · « Thread »
From Apache Jenkins Server <jenk...@builds.apache.org>
Subject [JENKINS] Lucene-Solr-Tests-master - Build # 2803 - Unstable
Date Tue, 11 Sep 2018 13:36:33 GMT
Build: https://builds.apache.org/job/Lucene-Solr-Tests-master/2803/

2 tests failed.
FAILED:  org.apache.solr.cloud.autoscaling.sim.TestSimTriggerIntegration.testEventFromRestoredState

Error Message:
The trigger did not fire at all

Stack Trace:
java.lang.AssertionError: The trigger did not fire at all
	at __randomizedtesting.SeedInfo.seed([D02FFFAB803928F3:D0194B6BA9348C99]:0)
	at org.junit.Assert.fail(Assert.java:93)
	at org.junit.Assert.assertTrue(Assert.java:43)
	at org.apache.solr.cloud.autoscaling.sim.TestSimTriggerIntegration.testEventFromRestoredState(TestSimTriggerIntegration.java:713)
	at sun.reflect.NativeMethodAccessorImpl.invoke0(Native Method)
	at sun.reflect.NativeMethodAccessorImpl.invoke(NativeMethodAccessorImpl.java:62)
	at sun.reflect.DelegatingMethodAccessorImpl.invoke(DelegatingMethodAccessorImpl.java:43)
	at java.lang.reflect.Method.invoke(Method.java:498)
	at com.carrotsearch.randomizedtesting.RandomizedRunner.invoke(RandomizedRunner.java:1742)
	at com.carrotsearch.randomizedtesting.RandomizedRunner$8.evaluate(RandomizedRunner.java:935)
	at com.carrotsearch.randomizedtesting.RandomizedRunner$9.evaluate(RandomizedRunner.java:971)
	at com.carrotsearch.randomizedtesting.RandomizedRunner$10.evaluate(RandomizedRunner.java:985)
	at com.carrotsearch.randomizedtesting.rules.SystemPropertiesRestoreRule$1.evaluate(SystemPropertiesRestoreRule.java:57)
	at org.apache.lucene.util.TestRuleSetupTeardownChained$1.evaluate(TestRuleSetupTeardownChained.java:49)
	at org.apache.lucene.util.AbstractBeforeAfterRule$1.evaluate(AbstractBeforeAfterRule.java:45)
	at org.apache.lucene.util.TestRuleThreadAndTestName$1.evaluate(TestRuleThreadAndTestName.java:48)
	at org.apache.lucene.util.TestRuleIgnoreAfterMaxFailures$1.evaluate(TestRuleIgnoreAfterMaxFailures.java:64)
	at org.apache.lucene.util.TestRuleMarkFailure$1.evaluate(TestRuleMarkFailure.java:47)
	at com.carrotsearch.randomizedtesting.rules.StatementAdapter.evaluate(StatementAdapter.java:36)
	at com.carrotsearch.randomizedtesting.ThreadLeakControl$StatementRunner.run(ThreadLeakControl.java:368)
	at com.carrotsearch.randomizedtesting.ThreadLeakControl.forkTimeoutingTask(ThreadLeakControl.java:817)
	at com.carrotsearch.randomizedtesting.ThreadLeakControl$3.evaluate(ThreadLeakControl.java:468)
	at com.carrotsearch.randomizedtesting.RandomizedRunner.runSingleTest(RandomizedRunner.java:944)
	at com.carrotsearch.randomizedtesting.RandomizedRunner$5.evaluate(RandomizedRunner.java:830)
	at com.carrotsearch.randomizedtesting.RandomizedRunner$6.evaluate(RandomizedRunner.java:880)
	at com.carrotsearch.randomizedtesting.RandomizedRunner$7.evaluate(RandomizedRunner.java:891)
	at com.carrotsearch.randomizedtesting.rules.StatementAdapter.evaluate(StatementAdapter.java:36)
	at com.carrotsearch.randomizedtesting.rules.SystemPropertiesRestoreRule$1.evaluate(SystemPropertiesRestoreRule.java:57)
	at org.apache.lucene.util.AbstractBeforeAfterRule$1.evaluate(AbstractBeforeAfterRule.java:45)
	at com.carrotsearch.randomizedtesting.rules.StatementAdapter.evaluate(StatementAdapter.java:36)
	at org.apache.lucene.util.TestRuleStoreClassName$1.evaluate(TestRuleStoreClassName.java:41)
	at com.carrotsearch.randomizedtesting.rules.NoShadowingOrOverridesOnMethodsRule$1.evaluate(NoShadowingOrOverridesOnMethodsRule.java:40)
	at com.carrotsearch.randomizedtesting.rules.NoShadowingOrOverridesOnMethodsRule$1.evaluate(NoShadowingOrOverridesOnMethodsRule.java:40)
	at com.carrotsearch.randomizedtesting.rules.StatementAdapter.evaluate(StatementAdapter.java:36)
	at com.carrotsearch.randomizedtesting.rules.StatementAdapter.evaluate(StatementAdapter.java:36)
	at com.carrotsearch.randomizedtesting.rules.StatementAdapter.evaluate(StatementAdapter.java:36)
	at org.apache.lucene.util.TestRuleAssertionsRequired$1.evaluate(TestRuleAssertionsRequired.java:53)
	at org.apache.lucene.util.TestRuleMarkFailure$1.evaluate(TestRuleMarkFailure.java:47)
	at org.apache.lucene.util.TestRuleIgnoreAfterMaxFailures$1.evaluate(TestRuleIgnoreAfterMaxFailures.java:64)
	at org.apache.lucene.util.TestRuleIgnoreTestSuites$1.evaluate(TestRuleIgnoreTestSuites.java:54)
	at com.carrotsearch.randomizedtesting.rules.StatementAdapter.evaluate(StatementAdapter.java:36)
	at com.carrotsearch.randomizedtesting.ThreadLeakControl$StatementRunner.run(ThreadLeakControl.java:368)
	at java.lang.Thread.run(Thread.java:748)


FAILED:  org.apache.solr.cloud.autoscaling.sim.TestSimTriggerIntegration.testSearchRate

Error Message:
The trigger did not start in time

Stack Trace:
java.lang.AssertionError: The trigger did not start in time
	at __randomizedtesting.SeedInfo.seed([D02FFFAB803928F3:8D67E1224FFF8EBC]:0)
	at org.junit.Assert.fail(Assert.java:93)
	at org.junit.Assert.assertTrue(Assert.java:43)
	at org.apache.solr.cloud.autoscaling.sim.TestSimTriggerIntegration.testSearchRate(TestSimTriggerIntegration.java:1262)
	at sun.reflect.NativeMethodAccessorImpl.invoke0(Native Method)
	at sun.reflect.NativeMethodAccessorImpl.invoke(NativeMethodAccessorImpl.java:62)
	at sun.reflect.DelegatingMethodAccessorImpl.invoke(DelegatingMethodAccessorImpl.java:43)
	at java.lang.reflect.Method.invoke(Method.java:498)
	at com.carrotsearch.randomizedtesting.RandomizedRunner.invoke(RandomizedRunner.java:1742)
	at com.carrotsearch.randomizedtesting.RandomizedRunner$8.evaluate(RandomizedRunner.java:935)
	at com.carrotsearch.randomizedtesting.RandomizedRunner$9.evaluate(RandomizedRunner.java:971)
	at com.carrotsearch.randomizedtesting.RandomizedRunner$10.evaluate(RandomizedRunner.java:985)
	at com.carrotsearch.randomizedtesting.rules.SystemPropertiesRestoreRule$1.evaluate(SystemPropertiesRestoreRule.java:57)
	at org.apache.lucene.util.TestRuleSetupTeardownChained$1.evaluate(TestRuleSetupTeardownChained.java:49)
	at org.apache.lucene.util.AbstractBeforeAfterRule$1.evaluate(AbstractBeforeAfterRule.java:45)
	at org.apache.lucene.util.TestRuleThreadAndTestName$1.evaluate(TestRuleThreadAndTestName.java:48)
	at org.apache.lucene.util.TestRuleIgnoreAfterMaxFailures$1.evaluate(TestRuleIgnoreAfterMaxFailures.java:64)
	at org.apache.lucene.util.TestRuleMarkFailure$1.evaluate(TestRuleMarkFailure.java:47)
	at com.carrotsearch.randomizedtesting.rules.StatementAdapter.evaluate(StatementAdapter.java:36)
	at com.carrotsearch.randomizedtesting.ThreadLeakControl$StatementRunner.run(ThreadLeakControl.java:368)
	at com.carrotsearch.randomizedtesting.ThreadLeakControl.forkTimeoutingTask(ThreadLeakControl.java:817)
	at com.carrotsearch.randomizedtesting.ThreadLeakControl$3.evaluate(ThreadLeakControl.java:468)
	at com.carrotsearch.randomizedtesting.RandomizedRunner.runSingleTest(RandomizedRunner.java:944)
	at com.carrotsearch.randomizedtesting.RandomizedRunner$5.evaluate(RandomizedRunner.java:830)
	at com.carrotsearch.randomizedtesting.RandomizedRunner$6.evaluate(RandomizedRunner.java:880)
	at com.carrotsearch.randomizedtesting.RandomizedRunner$7.evaluate(RandomizedRunner.java:891)
	at com.carrotsearch.randomizedtesting.rules.StatementAdapter.evaluate(StatementAdapter.java:36)
	at com.carrotsearch.randomizedtesting.rules.SystemPropertiesRestoreRule$1.evaluate(SystemPropertiesRestoreRule.java:57)
	at org.apache.lucene.util.AbstractBeforeAfterRule$1.evaluate(AbstractBeforeAfterRule.java:45)
	at com.carrotsearch.randomizedtesting.rules.StatementAdapter.evaluate(StatementAdapter.java:36)
	at org.apache.lucene.util.TestRuleStoreClassName$1.evaluate(TestRuleStoreClassName.java:41)
	at com.carrotsearch.randomizedtesting.rules.NoShadowingOrOverridesOnMethodsRule$1.evaluate(NoShadowingOrOverridesOnMethodsRule.java:40)
	at com.carrotsearch.randomizedtesting.rules.NoShadowingOrOverridesOnMethodsRule$1.evaluate(NoShadowingOrOverridesOnMethodsRule.java:40)
	at com.carrotsearch.randomizedtesting.rules.StatementAdapter.evaluate(StatementAdapter.java:36)
	at com.carrotsearch.randomizedtesting.rules.StatementAdapter.evaluate(StatementAdapter.java:36)
	at com.carrotsearch.randomizedtesting.rules.StatementAdapter.evaluate(StatementAdapter.java:36)
	at org.apache.lucene.util.TestRuleAssertionsRequired$1.evaluate(TestRuleAssertionsRequired.java:53)
	at org.apache.lucene.util.TestRuleMarkFailure$1.evaluate(TestRuleMarkFailure.java:47)
	at org.apache.lucene.util.TestRuleIgnoreAfterMaxFailures$1.evaluate(TestRuleIgnoreAfterMaxFailures.java:64)
	at org.apache.lucene.util.TestRuleIgnoreTestSuites$1.evaluate(TestRuleIgnoreTestSuites.java:54)
	at com.carrotsearch.randomizedtesting.rules.StatementAdapter.evaluate(StatementAdapter.java:36)
	at com.carrotsearch.randomizedtesting.ThreadLeakControl$StatementRunner.run(ThreadLeakControl.java:368)
	at java.lang.Thread.run(Thread.java:748)




Build Log:
[...truncated 12365 lines...]
   [junit4] Suite: org.apache.solr.cloud.autoscaling.sim.TestSimTriggerIntegration
   [junit4]   2> 21380 INFO  (SUITE-TestSimTriggerIntegration-seed#[D02FFFAB803928F3]-worker) [    ] o.a.s.SolrTestCaseJ4 SecureRandom sanity checks: test.solr.allowed.securerandom=null & java.security.egd=file:/dev/./urandom
   [junit4]   2> Creating dataDir: /home/jenkins/jenkins-slave/workspace/Lucene-Solr-Tests-master/solr/build/solr-core/test/J0/temp/solr.cloud.autoscaling.sim.TestSimTriggerIntegration_D02FFFAB803928F3-001/init-core-data-001
   [junit4]   2> 22795 INFO  (SUITE-TestSimTriggerIntegration-seed#[D02FFFAB803928F3]-worker) [    ] o.a.s.SolrTestCaseJ4 Using TrieFields (NUMERIC_POINTS_SYSPROP=false) w/NUMERIC_DOCVALUES_SYSPROP=true
   [junit4]   2> 23344 INFO  (SUITE-TestSimTriggerIntegration-seed#[D02FFFAB803928F3]-worker) [    ] o.e.j.u.log Logging initialized @23544ms to org.eclipse.jetty.util.log.Slf4jLog
   [junit4]   2> 23383 INFO  (SUITE-TestSimTriggerIntegration-seed#[D02FFFAB803928F3]-worker) [    ] o.a.s.SolrTestCaseJ4 Randomized ssl (true) and clientAuth (false) via: @org.apache.solr.util.RandomizeSSL(reason=, ssl=NaN, value=NaN, clientAuth=NaN)
   [junit4]   2> 44724 INFO  (SUITE-TestSimTriggerIntegration-seed#[D02FFFAB803928F3]-worker) [    ] o.a.s.c.SolrResourceLoader solr home defaulted to 'solr/' (could not find system property or JNDI)
   [junit4]   2> 45390 DEBUG (SUITE-TestSimTriggerIntegration-seed#[D02FFFAB803928F3]-worker) [    ] o.a.s.c.a.s.SimClusterStateProvider --- new Overseer leader: 127.0.0.1:10000_solr
   [junit4]   2> 45713 INFO  (SUITE-TestSimTriggerIntegration-seed#[D02FFFAB803928F3]-worker) [    ] o.a.s.h.a.MetricsHistoryHandler No .system collection, keeping metrics history in memory.
   [junit4]   2> 45903 DEBUG (Simulated OverseerAutoScalingTriggerThread) [    ] o.a.s.c.a.OverseerTriggerThread Adding .auto_add_replicas and .scheduled_maintenance triggers
   [junit4] IGNOR/A 0.07s J0 | TestSimTriggerIntegration.testNodeAddedTriggerRestoreState
   [junit4]    > Assumption #1: 'badapple' test group is disabled (@BadApple(bugUrl=https://issues.apache.org/jira/browse/SOLR-12028))
   [junit4]   2> 45974 DEBUG (Simulated OverseerAutoScalingTriggerThread) [    ] o.a.s.c.a.OverseerTriggerThread Refreshing /autoscaling.json with znode version 0
   [junit4]   2> 46437 INFO  (TEST-TestSimTriggerIntegration.testEventFromRestoredState-seed#[D02FFFAB803928F3]) [    ] o.a.s.SolrTestCaseJ4 ###Starting testEventFromRestoredState
   [junit4]   2> 47225 DEBUG (Simulated OverseerAutoScalingTriggerThread) [    ] o.a.s.c.a.OverseerTriggerThread Current znodeVersion 0, lastZnodeVersion -1
   [junit4]   2> 47226 DEBUG (Simulated OverseerAutoScalingTriggerThread) [    ] o.a.s.c.a.OverseerTriggerThread Processed trigger updates upto znodeVersion 0
   [junit4]   2> 47236 DEBUG (TEST-TestSimTriggerIntegration.testEventFromRestoredState-seed#[D02FFFAB803928F3]) [    ] o.a.s.c.a.OverseerTriggerThread Refreshing /autoscaling.json with znode version 1
   [junit4]   2> 47238 INFO  (TEST-TestSimTriggerIntegration.testEventFromRestoredState-seed#[D02FFFAB803928F3]) [    ] o.a.s.c.a.s.SimCloudManager === Restarting OverseerTriggerThread and clearing object cache...
   [junit4]   2> 47347 DEBUG (TEST-TestSimTriggerIntegration.testEventFromRestoredState-seed#[D02FFFAB803928F3]) [    ] o.a.s.c.a.ScheduledTriggers Shutting down scheduled thread pool executor now
   [junit4]   2> 47348 DEBUG (TEST-TestSimTriggerIntegration.testEventFromRestoredState-seed#[D02FFFAB803928F3]) [    ] o.a.s.c.a.ScheduledTriggers Shutting down action executor now
   [junit4]   2> 47370 DEBUG (TEST-TestSimTriggerIntegration.testEventFromRestoredState-seed#[D02FFFAB803928F3]) [    ] o.a.s.c.a.ScheduledTriggers Awaiting termination for action executor
   [junit4]   2> 47370 DEBUG (TEST-TestSimTriggerIntegration.testEventFromRestoredState-seed#[D02FFFAB803928F3]) [    ] o.a.s.c.a.ScheduledTriggers Awaiting termination for scheduled thread pool executor
   [junit4]   2> 47370 DEBUG (TEST-TestSimTriggerIntegration.testEventFromRestoredState-seed#[D02FFFAB803928F3]) [    ] o.a.s.c.a.ScheduledTriggers ScheduledTriggers closed completely
   [junit4]   2> 47370 DEBUG (TEST-TestSimTriggerIntegration.testEventFromRestoredState-seed#[D02FFFAB803928F3]) [    ] o.a.s.c.a.OverseerTriggerThread OverseerTriggerThread has been closed explicitly
   [junit4]   2> 47517 DEBUG (Simulated OverseerAutoScalingTriggerThread) [    ] o.a.s.c.a.OverseerTriggerThread Adding .auto_add_replicas and .scheduled_maintenance triggers
   [junit4]   2> 47518 DEBUG (Simulated OverseerAutoScalingTriggerThread) [    ] o.a.s.c.a.OverseerTriggerThread Refreshing /autoscaling.json with znode version 2
   [junit4]   2> 47519 DEBUG (Simulated OverseerAutoScalingTriggerThread) [    ] o.a.s.c.a.OverseerTriggerThread Current znodeVersion 2, lastZnodeVersion -1
   [junit4]   2> 47519 DEBUG (Simulated OverseerAutoScalingTriggerThread) [    ] o.a.s.c.a.OverseerTriggerThread Processed trigger updates upto znodeVersion 2
   [junit4]   2> 47496 WARN  (Simulated OverseerAutoScalingTriggerThread) [    ] o.a.s.c.a.OverseerTriggerThread Exception initializing trigger .scheduled_maintenance, configuration ignored
   [junit4]   2> org.apache.lucene.store.AlreadyClosedException: ScheduledTriggers has been closed and cannot be used anymore
   [junit4]   2> 	at org.apache.solr.cloud.autoscaling.ScheduledTriggers.add(ScheduledTriggers.java:202) ~[java/:?]
   [junit4]   2> 	at org.apache.solr.cloud.autoscaling.OverseerTriggerThread.run(OverseerTriggerThread.java:242) [java/:?]
   [junit4]   2> 	at java.lang.Thread.run(Thread.java:748) [?:1.8.0_172]
   [junit4]   2> 47603 WARN  (Simulated OverseerAutoScalingTriggerThread) [    ] o.a.s.c.a.OverseerTriggerThread Exception initializing trigger .auto_add_replicas, configuration ignored
   [junit4]   2> org.apache.lucene.store.AlreadyClosedException: ScheduledTriggers has been closed and cannot be used anymore
   [junit4]   2> 	at org.apache.solr.cloud.autoscaling.ScheduledTriggers.add(ScheduledTriggers.java:202) ~[java/:?]
   [junit4]   2> 	at org.apache.solr.cloud.autoscaling.OverseerTriggerThread.run(OverseerTriggerThread.java:242) [java/:?]
   [junit4]   2> 	at java.lang.Thread.run(Thread.java:748) [?:1.8.0_172]
   [junit4]   2> 47603 DEBUG (Simulated OverseerAutoScalingTriggerThread) [    ] o.a.s.c.a.OverseerTriggerThread -- clean old nodeAdded markers
   [junit4]   2> 47604 WARN  (Simulated OverseerAutoScalingTriggerThread) [    ] o.a.s.c.a.OverseerTriggerThread Interrupted
   [junit4]   2> java.lang.InterruptedException: null
   [junit4]   2> 	at java.util.concurrent.locks.AbstractQueuedSynchronizer.acquireInterruptibly(AbstractQueuedSynchronizer.java:1220) ~[?:1.8.0_172]
   [junit4]   2> 	at java.util.concurrent.locks.ReentrantLock.lockInterruptibly(ReentrantLock.java:335) ~[?:1.8.0_172]
   [junit4]   2> 	at org.apache.solr.cloud.autoscaling.OverseerTriggerThread.run(OverseerTriggerThread.java:177) [java/:?]
   [junit4]   2> 	at java.lang.Thread.run(Thread.java:748) [?:1.8.0_172]
   [junit4]   2> 47810 DEBUG (Simulated OverseerAutoScalingTriggerThread) [    ] o.a.s.c.a.NodeLostTrigger NodeLostTrigger .auto_add_replicas - Initial livenodes: [127.0.0.1:10001_solr, 127.0.0.1:10000_solr]
   [junit4]   2> 47831 DEBUG (Simulated OverseerAutoScalingTriggerThread) [    ] o.a.s.c.a.OverseerTriggerThread -- clean old nodeAdded markers
   [junit4]   2> 47831 DEBUG (Simulated OverseerAutoScalingTriggerThread) [    ] o.a.s.c.a.OverseerTriggerThread Current znodeVersion 2, lastZnodeVersion 2
   [junit4]   2> 47955 DEBUG (ScheduledTrigger-8-thread-2) [    ] o.a.s.c.a.NodeLostTrigger Running NodeLostTrigger: .auto_add_replicas with currently live nodes: 2
   [junit4]   2> 48152 DEBUG (ScheduledTrigger-8-thread-1) [    ] o.a.s.c.a.NodeLostTrigger Running NodeLostTrigger: .auto_add_replicas with currently live nodes: 2
   [junit4]   2> 48188 DEBUG (ScheduledTrigger-8-thread-1) [    ] o.a.s.c.a.NodeLostTrigger Running NodeLostTrigger: .auto_add_replicas with currently live nodes: 2
   [junit4]   2> 48245 DEBUG (ScheduledTrigger-8-thread-2) [    ] o.a.s.c.a.NodeLostTrigger Running NodeLostTrigger: .auto_add_replicas with currently live nodes: 2
   [junit4]   2> 48282 DEBUG (ScheduledTrigger-8-thread-2) [    ] o.a.s.c.a.NodeLostTrigger Running NodeLostTrigger: .auto_add_replicas with currently live nodes: 2
   [junit4]   2> 48318 DEBUG (ScheduledTrigger-8-thread-2) [    ] o.a.s.c.a.NodeLostTrigger Running NodeLostTrigger: .auto_add_replicas with currently live nodes: 2
   [junit4]   2> 48355 DEBUG (ScheduledTrigger-8-thread-2) [    ] o.a.s.c.a.NodeLostTrigger Running NodeLostTrigger: .auto_add_replicas with currently live nodes: 2
   [junit4]   2> 48392 DEBUG (ScheduledTrigger-8-thread-2) [    ] o.a.s.c.a.NodeLostTrigger Running NodeLostTrigger: .auto_add_replicas with currently live nodes: 2
   [junit4]   2> 48428 DEBUG (ScheduledTrigger-8-thread-2) [    ] o.a.s.c.a.NodeLostTrigger Running NodeLostTrigger: .auto_add_replicas with currently live nodes: 2
   [junit4]   2> 48457 DEBUG (ScheduledTrigger-8-thread-2) [    ] o.a.s.c.a.NodeLostTrigger Running NodeLostTrigger: .auto_add_replicas with currently live nodes: 2
   [junit4]   2> 48493 DEBUG (ScheduledTrigger-8-thread-2) [    ] o.a.s.c.a.NodeLostTrigger Running NodeLostTrigger: .auto_add_replicas with currently live nodes: 2
   [junit4]   2> 48579 DEBUG (ScheduledTrigger-8-thread-2) [    ] o.a.s.c.a.NodeLostTrigger Running NodeLostTrigger: .auto_add_replicas with currently live nodes: 2
   [junit4]   2> 48600 DEBUG (ScheduledTrigger-8-thread-2) [    ] o.a.s.c.a.NodeLostTrigger Running NodeLostTrigger: .auto_add_replicas with currently live nodes: 2
   [junit4]   2> 48636 DEBUG (ScheduledTrigger-8-thread-2) [    ] o.a.s.c.a.NodeLostTrigger Running NodeLostTrigger: .auto_add_replicas with currently live nodes: 2
   [junit4]   2> 48709 DEBUG (ScheduledTrigger-8-thread-2) [    ] o.a.s.c.a.NodeLostTrigger Running NodeLostTrigger: .auto_add_replicas with currently live nodes: 2
   [junit4]   2> 48746 DEBUG (ScheduledTrigger-8-thread-2) [    ] o.a.s.c.a.NodeLostTrigger Running NodeLostTrigger: .auto_add_replicas with currently live nodes: 2
   [junit4]   2> 48857 DEBUG (simCloudManagerPool-7-thread-1) [    ] o.a.s.c.a.AutoScalingHandler Verified autoscaling configuration
   [junit4]   2> 48858 DEBUG (simCloudManagerPool-7-thread-1) [    ] o.a.s.c.a.OverseerTriggerThread Refreshing /autoscaling.json with znode version 3
   [junit4]   2> 48873 DEBUG (Simulated OverseerAutoScalingTriggerThread) [    ] o.a.s.c.a.OverseerTriggerThread Processed trigger updates upto znodeVersion 3
   [junit4]   2> 48873 DEBUG (Simulated OverseerAutoScalingTriggerThread) [    ] o.a.s.c.a.OverseerTriggerThread -- clean old nodeAdded markers
   [junit4]   2> 48874 DEBUG (Simulated OverseerAutoScalingTriggerThread) [    ] o.a.s.c.a.OverseerTriggerThread Current znodeVersion 3, lastZnodeVersion 3
   [junit4]   2> 48874 DEBUG (ScheduledTrigger-8-thread-2) [    ] o.a.s.c.a.NodeLostTrigger Running NodeLostTrigger: .auto_add_replicas with currently live nodes: 2
   [junit4]   2> 48894 DEBUG (ScheduledTrigger-8-thread-1) [    ] o.a.s.c.a.NodeLostTrigger Running NodeLostTrigger: .auto_add_replicas with currently live nodes: 2
   [junit4]   2> 48933 DEBUG (ScheduledTrigger-8-thread-1) [    ] o.a.s.c.a.NodeLostTrigger Running NodeLostTrigger: .auto_add_replicas with currently live nodes: 2
   [junit4]   2> 48953 DEBUG (ScheduledTrigger-8-thread-1) [    ] o.a.s.c.a.NodeLostTrigger Running NodeLostTrigger: .auto_add_replicas with currently live nodes: 2
   [junit4]   2> 48989 DEBUG (ScheduledTrigger-8-thread-1) [    ] o.a.s.c.a.NodeLostTrigger Running NodeLostTrigger: .auto_add_replicas with currently live nodes: 2
   [junit4]   2> 49026 DEBUG (ScheduledTrigger-8-thread-1) [    ] o.a.s.c.a.NodeLostTrigger Running NodeLostTrigger: .auto_add_replicas with currently live nodes: 2
   [junit4]   2> 49063 DEBUG (ScheduledTrigger-8-thread-1) [    ] o.a.s.c.a.NodeLostTrigger Running NodeLostTrigger: .auto_add_replicas with currently live nodes: 2
   [junit4]   2> 49099 DEBUG (ScheduledTrigger-8-thread-1) [    ] o.a.s.c.a.NodeLostTrigger Running NodeLostTrigger: .auto_add_replicas with currently live nodes: 2
   [junit4]   2> 49136 DEBUG (ScheduledTrigger-8-thread-1) [    ] o.a.s.c.a.NodeLostTrigger Running NodeLostTrigger: .auto_add_replicas with currently live nodes: 2
   [junit4]   2> 49173 DEBUG (ScheduledTrigger-8-thread-1) [    ] o.a.s.c.a.NodeLostTrigger Running NodeLostTrigger: .auto_add_replicas with currently live nodes: 2
   [junit4]   2> 49209 DEBUG (ScheduledTrigger-8-thread-1) [    ] o.a.s.c.a.NodeLostTrigger Running NodeLostTrigger: .auto_add_replicas with currently live nodes: 2
   [junit4]   2> 49246 DEBUG (ScheduledTrigger-8-thread-1) [    ] o.a.s.c.a.NodeLostTrigger Running NodeLostTrigger: .auto_add_replicas with currently live nodes: 2
   [junit4]   2> 49283 DEBUG (ScheduledTrigger-8-thread-1) [    ] o.a.s.c.a.NodeLostTrigger Running NodeLostTrigger: .auto_add_replicas with currently live nodes: 2
   [junit4]   2> 49319 DEBUG (ScheduledTrigger-8-thread-1) [    ] o.a.s.c.a.NodeLostTrigger Running NodeLostTrigger: .auto_add_replicas with currently live nodes: 2
   [junit4]   2> 49356 DEBUG (ScheduledTrigger-8-thread-1) [    ] o.a.s.c.a.NodeLostTrigger Running NodeLostTrigger: .auto_add_replicas with currently live nodes: 2
   [junit4]   2> 49392 DEBUG (ScheduledTrigger-8-thread-1) [    ] o.a.s.c.a.NodeLostTrigger Running NodeLostTrigger: .auto_add_replicas with currently live nodes: 2
   [junit4]   2> 49448 DEBUG (ScheduledTrigger-8-thread-1) [    ] o.a.s.c.a.NodeLostTrigger Running NodeLostTrigger: .auto_add_replicas with currently live nodes: 2
   [junit4]   2> 49563 DEBUG (ScheduledTrigger-8-thread-1) [    ] o.a.s.c.a.NodeLostTrigger Running NodeLostTrigger: .auto_add_replicas with currently live nodes: 2
   [junit4]   2> 49565 DEBUG (simCloudManagerPool-7-thread-2) [    ] o.a.s.c.a.s.SimClusterStateProvider -- submit leader election for .system / shard1
   [junit4]   2> 49600 DEBUG (ScheduledTrigger-8-thread-1) [    ] o.a.s.c.a.NodeLostTrigger Running NodeLostTrigger: .auto_add_replicas with currently live nodes: 2
   [junit4]   2> 49629 DEBUG (simCloudManagerPool-7-thread-3) [    ] o.a.s.c.a.s.SimClusterStateProvider Running leader election for .system / shard1
   [junit4]   2> 49739 DEBUG (ScheduledTrigger-8-thread-1) [    ] o.a.s.c.a.NodeLostTrigger Running NodeLostTrigger: .auto_add_replicas with currently live nodes: 2
   [junit4]   2> 49774 DEBUG (ScheduledTrigger-8-thread-1) [    ] o.a.s.c.a.NodeLostTrigger Running NodeLostTrigger: .auto_add_replicas with currently live nodes: 2
   [junit4]   2> 49814 DEBUG (ScheduledTrigger-8-thread-1) [    ] o.a.s.c.a.NodeLostTrigger Running NodeLostTrigger: .auto_add_replicas with currently live nodes: 2
   [junit4]   2> 49884 DEBUG (ScheduledTrigger-8-thread-2) [    ] o.a.s.c.a.NodeLostTrigger Running NodeLostTrigger: .auto_add_replicas with currently live nodes: 2
   [junit4]   2> 49901 DEBUG (simCloudManagerPool-7-thread-3) [    ] o.a.s.c.a.s.SimClusterStateProvider -- elected new leader for .system / shard1: core_node1
   [junit4]   2> 49921 DEBUG (ScheduledTrigger-8-thread-1) [    ] o.a.s.c.a.NodeLostTrigger Running NodeLostTrigger: .auto_add_replicas with currently live nodes: 2
   [junit4]   2> 49957 DEBUG (ScheduledTrigger-8-thread-1) [    ] o.a.s.c.a.NodeLostTrigger Running NodeLostTrigger: .auto_add_replicas with currently live nodes: 2
   [junit4]   2> 50067 DEBUG (ScheduledTrigger-8-thread-1) [    ] o.a.s.c.a.NodeLostTrigger Running NodeLostTrigger: .auto_add_replicas with currently live nodes: 2
   [junit4]   2> 50068 DEBUG (simCloudManagerPool-7-thread-4) [    ] o.a.s.c.a.AutoScalingHandler Verified autoscaling configuration
   [junit4]   2> 50069 DEBUG (simCloudManagerPool-7-thread-4) [    ] o.a.s.c.a.OverseerTriggerThread Refreshing /autoscaling.json with znode version 4
   [junit4]   2> 50070 DEBUG (Simulated OverseerAutoScalingTriggerThread) [    ] o.a.s.c.a.OverseerTriggerThread Processed trigger updates upto znodeVersion 4
   [junit4]   2> 50071 INFO  (Simulated OverseerAutoScalingTriggerThread) [    ] o.a.s.c.a.s.TestSimTriggerIntegration TestTriggerAction init
   [junit4]   2> 50104 DEBUG (ScheduledTrigger-8-thread-1) [    ] o.a.s.c.a.NodeLostTrigger Running NodeLostTrigger: .auto_add_replicas with currently live nodes: 2
   [junit4]   2> 50071 DEBUG (Simulated OverseerAutoScalingTriggerThread) [    ] o.a.s.c.a.NodeAddedTrigger NodeAddedTrigger node_added_trigger - Initial livenodes: [127.0.0.1:10001_solr, 127.0.0.1:10000_solr]
   [junit4]   2> 50170 DEBUG (ScheduledTrigger-8-thread-2) [    ] o.a.s.c.a.NodeLostTrigger Running NodeLostTrigger: .auto_add_replicas with currently live nodes: 3
   [junit4]   2> 50186 DEBUG (Simulated OverseerAutoScalingTriggerThread) [    ] o.a.s.c.a.NodeAddedTrigger NodeAddedTrigger node_added_trigger instantiated with properties: {event=nodeAdded, waitFor=10, actions=[{name=test, class=org.apache.solr.cloud.autoscaling.sim.TestSimTriggerIntegration$TestTriggerAction}], enabled=true}
   [junit4]   2> 50186 DEBUG (Simulated OverseerAutoScalingTriggerThread) [    ] o.a.s.c.a.NodeAddedTrigger NodeAddedTrigger node_added_trigger - removing marker path: /autoscaling/nodeAdded/127.0.0.1:10002_solr
   [junit4]   2> 50187 DEBUG (Simulated OverseerAutoScalingTriggerThread) [    ] o.a.s.c.a.OverseerTriggerThread Current znodeVersion 4, lastZnodeVersion 4
   [junit4]   2> 50194 DEBUG (ScheduledTrigger-8-thread-4) [    ] o.a.s.c.a.NodeAddedTrigger Running NodeAddedTrigger node_added_trigger
   [junit4]   2> 50194 DEBUG (ScheduledTrigger-8-thread-4) [    ] o.a.s.c.a.NodeAddedTrigger Found livenodes: 3
   [junit4]   2> 50194 DEBUG (ScheduledTrigger-8-thread-4) [    ] o.a.s.c.a.NodeAddedTrigger Tracking new node: 127.0.0.1:10002_solr at time 19003640283097657
   [junit4]   2> 50206 DEBUG (ScheduledTrigger-8-thread-2) [    ] o.a.s.c.a.NodeLostTrigger Running NodeLostTrigger: .auto_add_replicas with currently live nodes: 3
   [junit4]   2> 50215 DEBUG (ScheduledTrigger-8-thread-4) [    ] o.a.s.c.a.NodeAddedTrigger Running NodeAddedTrigger node_added_trigger
   [junit4]   2> 50215 DEBUG (ScheduledTrigger-8-thread-4) [    ] o.a.s.c.a.NodeAddedTrigger Found livenodes: 3
   [junit4]   2> 50230 DEBUG (ScheduledTrigger-8-thread-4) [    ] o.a.s.c.a.NodeLostTrigger Running NodeLostTrigger: .auto_add_replicas with currently live nodes: 3
   [junit4]   2> 50267 DEBUG (ScheduledTrigger-8-thread-2) [    ] o.a.s.c.a.NodeLostTrigger Running NodeLostTrigger: .auto_add_replicas with currently live nodes: 3
   [junit4]   2> 50287 DEBUG (ScheduledTrigger-8-thread-3) [    ] o.a.s.c.a.NodeLostTrigger Running NodeLostTrigger: .auto_add_replicas with currently live nodes: 3
   [junit4]   2> 50303 DEBUG (ScheduledTrigger-8-thread-1) [    ] o.a.s.c.a.NodeAddedTrigger Running NodeAddedTrigger node_added_trigger
   [junit4]   2> 50304 DEBUG (ScheduledTrigger-8-thread-1) [    ] o.a.s.c.a.NodeAddedTrigger Found livenodes: 3
   [junit4]   2> 50324 DEBUG (ScheduledTrigger-8-thread-4) [    ] o.a.s.c.a.NodeAddedTrigger Running NodeAddedTrigger node_added_trigger
   [junit4]   2> 50324 DEBUG (ScheduledTrigger-8-thread-4) [    ] o.a.s.c.a.NodeAddedTrigger Found livenodes: 3
   [junit4]   2> 50324 DEBUG (ScheduledTrigger-8-thread-3) [    ] o.a.s.c.a.NodeLostTrigger Running NodeLostTrigger: .auto_add_replicas with currently live nodes: 3
   [junit4]   2> 50360 DEBUG (ScheduledTrigger-8-thread-4) [    ] o.a.s.c.a.NodeAddedTrigger Running NodeAddedTrigger node_added_trigger
   [junit4]   2> 50360 DEBUG (ScheduledTrigger-8-thread-4) [    ] o.a.s.c.a.NodeAddedTrigger Found livenodes: 3
   [junit4]   2> 50361 DEBUG (ScheduledTrigger-8-thread-4) [    ] o.a.s.c.a.NodeLostTrigger Running NodeLostTrigger: .auto_add_replicas with currently live nodes: 3
   [junit4]   2> 50397 DEBUG (ScheduledTrigger-8-thread-4) [    ] o.a.s.c.a.NodeAddedTrigger Running NodeAddedTrigger node_added_trigger
   [junit4]   2> 50397 DEBUG (ScheduledTrigger-8-thread-4) [    ] o.a.s.c.a.NodeAddedTrigger Found livenodes: 3
   [junit4]   2> 50397 DEBUG (ScheduledTrigger-8-thread-4) [    ] o.a.s.c.a.NodeAddedTrigger NodeAddedTrigger node_added_trigger firing registered processor for nodes: [127.0.0.1:10002_solr] added at times [19003640283097657], now=19003650440005607
   [junit4]   2> 50400 DEBUG (ScheduledTrigger-8-thread-3) [    ] o.a.s.c.a.NodeLostTrigger Running NodeLostTrigger: .auto_add_replicas with currently live nodes: 3
   [junit4]   2> 50414 DEBUG (ScheduledTrigger-8-thread-4) [    ] o.a.s.c.a.ScheduledTriggers ++++++++ Cooldown inactive - processing event: {
   [junit4]   2>   "id":"4383b5cc836a39T158m3oi9y37mfw59we0xjo2ea",
   [junit4]   2>   "source":"node_added_trigger",
   [junit4]   2>   "eventTime":19003640283097657,
   [junit4]   2>   "eventType":"NODEADDED",
   [junit4]   2>   "properties":{
   [junit4]   2>     "eventTimes":[19003640283097657],
   [junit4]   2>     "preferredOperation":"movereplica",
   [junit4]   2>     "nodeNames":["127.0.0.1:10002_solr"]}}
   [junit4]   2> 50450 DEBUG (ScheduledTrigger-8-thread-4) [    ] o.a.s.c.a.ScheduledTriggers Pausing all triggers: [.auto_add_replicas, node_added_trigger]
   [junit4]   2> 50572 INFO  (TEST-TestSimTriggerIntegration.testEventFromRestoredState-seed#[D02FFFAB803928F3]) [    ] o.a.s.SolrTestCaseJ4 ###Ending testEventFromRestoredState
   [junit4]   2> 50626 INFO  (TEST-TestSimTriggerIntegration.testEventFromRestoredState-seed#[D02FFFAB803928F3]) [    ] o.a.s.c.a.s.SimSolrCloudTestCase #######################################
   [junit4]   2> ############ CLUSTER STATE ############
   [junit4]   2> #######################################
   [junit4]   2> ## Live nodes:		3
   [junit4]   2> ## Empty nodes:	2
   [junit4]   2> ## Dead nodes:		0
   [junit4]   2> ## Collections:	[.system]
   [junit4]   2> ## Max replicas per node:	1
   [junit4]   2> ## Min replicas per node:	0
   [junit4]   2> ## Total replicas:		1
   [junit4]   2> ## * .system		1
   [junit4]   2> ##		- active           1
   [junit4]   2> ######### Solr op counts ##########
   [junit4]   2> ##		- autoscaling        2
   [junit4]   2> ##		- update             2
   [junit4]   2> ######### Autoscaling event counts ###########
   [junit4]   2> ## * Trigger: node_added_trigger
   [junit4]   2> ##		- STARTED         1
   [junit4]   2> 
   [junit4]   2> NOTE: reproduce with: ant test  -Dtestcase=TestSimTriggerIntegration -Dtests.method=testEventFromRestoredState -Dtests.seed=D02FFFAB803928F3 -Dtests.multiplier=2 -Dtests.slow=true -Dtests.locale=hr-HR -Dtests.timezone=Pacific/Tahiti -Dtests.asserts=true -Dtests.file.encoding=ISO-8859-1
   [junit4] FAILURE 4.70s J0 | TestSimTriggerIntegration.testEventFromRestoredState <<<
   [junit4]    > Throwable #1: java.lang.AssertionError: The trigger did not fire at all
   [junit4]    > 	at __randomizedtesting.SeedInfo.seed([D02FFFAB803928F3:D0194B6BA9348C99]:0)
   [junit4]    > 	at org.apache.solr.cloud.autoscaling.sim.TestSimTriggerIntegration.testEventFromRestoredState(TestSimTriggerIntegration.java:713)
   [junit4]    > 	at java.lang.Thread.run(Thread.java:748)
   [junit4] IGNOR/A 0.00s J0 | TestSimTriggerIntegration.testNodeAddedTrigger
   [junit4]    > Assumption #1: 'badapple' test group is disabled (@BadApple(bugUrl=https://issues.apache.org/jira/browse/SOLR-12028))
   [junit4]   2> 50650 DEBUG (ScheduledTrigger-8-thread-4) [    ] o.a.s.c.a.NodeAddedTrigger NodeAddedTrigger node_added_trigger - removing marker path: /autoscaling/nodeAdded/127.0.0.1:10002_solr
   [junit4]   2> 50650 DEBUG (AutoscalingActionExecutor-9-thread-1) [    ] o.a.s.c.a.ScheduledTriggers -- processing actions for {
   [junit4]   2>   "id":"4383b5cc836a39T158m3oi9y37mfw59we0xjo2ea",
   [junit4]   2>   "source":"node_added_trigger",
   [junit4]   2>   "eventTime":19003640283097657,
   [junit4]   2>   "eventType":"NODEADDED",
   [junit4]   2>   "properties":{
   [junit4]   2>     "eventTimes":[19003640283097657],
   [junit4]   2>     "preferredOperation":"movereplica",
   [junit4]   2>     "_enqueue_time_":19003653109272857,
   [junit4]   2>     "nodeNames":["127.0.0.1:10002_solr"]}}
   [junit4]   2> 50745 DEBUG (AutoscalingActionExecutor-9-thread-1) [    ] o.a.s.c.a.ScheduledTriggers Resuming trigger: .auto_add_replicas after 100ms
   [junit4]   2> 50745 DEBUG (AutoscalingActionExecutor-9-thread-1) [    ] o.a.s.c.a.ScheduledTriggers Resuming trigger: node_added_trigger after 100ms
   [junit4]   2> 50745 DEBUG (AutoscalingActionExecutor-9-thread-1) [    ] o.a.s.c.a.ScheduledTriggers -- processing took 4750 ms for event id=4383b5cc836a39T158m3oi9y37mfw59we0xjo2ea
   [junit4]   2> 50819 INFO  (TEST-TestSimTriggerIntegration.testSearchRate-seed#[D02FFFAB803928F3]) [    ] o.a.s.SolrTestCaseJ4 ###Starting testSearchRate
   [junit4]   2> 50819 DEBUG (TEST-TestSimTriggerIntegration.testSearchRate-seed#[D02FFFAB803928F3]) [    ] o.a.s.c.a.OverseerTriggerThread Refreshing /autoscaling.json with znode version 5
   [junit4]   2> 50819 DEBUG (TEST-TestSimTriggerIntegration.testSearchRate-seed#[D02FFFAB803928F3]) [    ] o.a.s.c.a.s.SimNodeStateProvider --removing value for 127.0.0.1:10002_solr
   [junit4]   2> 50820 DEBUG (Simulated OverseerAutoScalingTriggerThread) [    ] o.a.s.c.a.OverseerTriggerThread Processed trigger updates upto znodeVersion 5
   [junit4]   2> 50820 DEBUG (Simulated OverseerAutoScalingTriggerThread) [    ] o.a.s.c.a.OverseerTriggerThread -- clean old nodeLost markers
   [junit4]   2> 50821 DEBUG (Simulated OverseerAutoScalingTriggerThread) [    ] o.a.s.c.a.OverseerTriggerThread -- clean old nodeAdded markers
   [junit4]   2> 50821 DEBUG (Simulated OverseerAutoScalingTriggerThread) [    ] o.a.s.c.a.OverseerTriggerThread Current znodeVersion 5, lastZnodeVersion 5
   [junit4]   2> 50833 INFO  (TEST-TestSimTriggerIntegration.testSearchRate-seed#[D02FFFAB803928F3]) [    ] o.a.s.c.a.s.SimCloudManager === Restarting OverseerTriggerThread and clearing object cache...
   [junit4]   2> 50833 DEBUG (TEST-TestSimTriggerIntegration.testSearchRate-seed#[D02FFFAB803928F3]) [    ] o.a.s.c.a.ScheduledTriggers Shutting down scheduled thread pool executor now
   [junit4]   2> 50833 DEBUG (TEST-TestSimTriggerIntegration.testSearchRate-seed#[D02FFFAB803928F3]) [    ] o.a.s.c.a.ScheduledTriggers Shutting down action executor now
   [junit4]   2> 50834 DEBUG (TEST-TestSimTriggerIntegration.testSearchRate-seed#[D02FFFAB803928F3]) [    ] o.a.s.c.a.ScheduledTriggers Awaiting termination for action executor
   [junit4]   2> 50834 DEBUG (TEST-TestSimTriggerIntegration.testSearchRate-seed#[D02FFFAB803928F3]) [    ] o.a.s.c.a.ScheduledTriggers Awaiting termination for scheduled thread pool executor
   [junit4]   2> 50837 WARN  (Simulated OverseerAutoScalingTriggerThread) [    ] o.a.s.c.a.OverseerTriggerThread OverseerTriggerThread woken up but we are closed, exiting.
   [junit4]   2> 50852 DEBUG (TEST-TestSimTriggerIntegration.testSearchRate-seed#[D02FFFAB803928F3]) [    ] o.a.s.c.a.ScheduledTriggers ScheduledTriggers closed completely
   [junit4]   2> 50853 DEBUG (TEST-TestSimTriggerIntegration.testSearchRate-seed#[D02FFFAB803928F3]) [    ] o.a.s.c.a.OverseerTriggerThread OverseerTriggerThread has been closed explicitly
   [junit4]   2> 50854 DEBUG (Simulated OverseerAutoScalingTriggerThread) [    ] o.a.s.c.a.OverseerTriggerThread Adding .auto_add_replicas and .scheduled_maintenance triggers
   [junit4]   2> 50854 DEBUG (Simulated OverseerAutoScalingTriggerThread) [    ] o.a.s.c.a.OverseerTriggerThread Refreshing /autoscaling.json with znode version 6
   [junit4]   2> 50855 DEBUG (Simulated OverseerAutoScalingTriggerThread) [    ] o.a.s.c.a.OverseerTriggerThread Current znodeVersion 6, lastZnodeVersion -1
   [junit4]   2> 50855 DEBUG (Simulated OverseerAutoScalingTriggerThread) [    ] o.a.s.c.a.OverseerTriggerThread Processed trigger updates upto znodeVersion 6
   [junit4]   2> 50856 DEBUG (Simulated OverseerAutoScalingTriggerThread) [    ] o.a.s.c.a.NodeLostTrigger NodeLostTrigger .auto_add_replicas - Initial livenodes: [127.0.0.1:10001_solr, 127.0.0.1:10000_solr]
   [junit4]   2> 50889 DEBUG (Simulated OverseerAutoScalingTriggerThread) [    ] o.a.s.c.a.OverseerTriggerThread -- clean old nodeAdded markers
   [junit4]   2> 50889 DEBUG (Simulated OverseerAutoScalingTriggerThread) [    ] o.a.s.c.a.OverseerTriggerThread Current znodeVersion 6, lastZnodeVersion 6
   [junit4]   2> 50890 DEBUG (ScheduledTrigger-11-thread-2) [    ] o.a.s.c.a.NodeLostTrigger Running NodeLostTrigger: .auto_add_replicas with currently live nodes: 2
   [junit4]   2> 50926 DEBUG (ScheduledTrigger-11-thread-2) [    ] o.a.s.c.a.NodeLostTrigger Running NodeLostTrigger: .auto_add_replicas with currently live nodes: 2
   [junit4]   2> 50964 DEBUG (ScheduledTrigger-11-thread-3) [    ] o.a.s.c.a.NodeLostTrigger Running NodeLostTrigger: .auto_add_replicas with currently live nodes: 2
   [junit4]   2> 50999 DEBUG (ScheduledTrigger-11-thread-4) [    ] o.a.s.c.a.NodeLostTrigger Running NodeLostTrigger: .auto_add_replicas with currently live nodes: 2
   [junit4]   2> 50983 DEBUG (simCloudManagerPool-10-thread-1) [    ] o.a.s.c.a.AutoScalingHandler Verified autoscaling configuration
   [junit4]   2> 51016 DEBUG (simCloudManagerPool-10-thread-1) [    ] o.a.s.c.a.OverseerTriggerThread Refreshing /autoscaling.json with znode version 7
   [junit4]   2> 51018 DEBUG (Simulated OverseerAutoScalingTriggerThread) [    ] o.a.s.c.a.OverseerTriggerThread Processed trigger updates upto znodeVersion 7
   [junit4]   2> 51019 DEBUG (Simulated OverseerAutoScalingTriggerThread) [    ] o.a.s.c.a.OverseerTriggerThread -- clean old nodeAdded markers
   [junit4]   2> 51019 DEBUG (Simulated OverseerAutoScalingTriggerThread) [    ] o.a.s.c.a.OverseerTriggerThread Current znodeVersion 7, lastZnodeVersion 7
   [junit4]   2> 51036 DEBUG (ScheduledTrigger-11-thread-4) [    ] o.a.s.c.a.NodeLostTrigger Running NodeLostTrigger: .auto_add_replicas with currently live nodes: 2
   [junit4]   2> 51072 DEBUG (ScheduledTrigger-11-thread-4) [    ] o.a.s.c.a.NodeLostTrigger Running NodeLostTrigger: .auto_add_replicas with currently live nodes: 2
   [junit4]   2> 51073 DEBUG (simCloudManagerPool-10-thread-2) [    ] o.a.s.c.a.s.SimClusterStateProvider -- submit leader election for .system / shard1
   [junit4]   2> 51109 DEBUG (ScheduledTrigger-11-thread-4) [    ] o.a.s.c.a.NodeLostTrigger Running NodeLostTrigger: .auto_add_replicas with currently live nodes: 2
   [junit4]   2> 51125 DEBUG (simCloudManagerPool-10-thread-3) [    ] o.a.s.c.a.s.SimClusterStateProvider Running leader election for .system / shard1
   [junit4]   2> 51126 DEBUG (simCloudManagerPool-10-thread-3) [    ] o.a.s.c.a.s.SimClusterStateProvider -- elected new leader for .system / shard1: core_node2
   [junit4]   2> 51146 DEBUG (ScheduledTrigger-11-thread-4) [    ] o.a.s.c.a.NodeLostTrigger Running NodeLostTrigger: .auto_add_replicas with currently live nodes: 2
   [junit4]   2> 51182 DEBUG (ScheduledTrigger-11-thread-4) [    ] o.a.s.c.a.NodeLostTrigger Running NodeLostTrigger: .auto_add_replicas with currently live nodes: 2
   [junit4]   2> 51219 DEBUG (ScheduledTrigger-11-thread-4) [    ] o.a.s.c.a.NodeLostTrigger Running NodeLostTrigger: .auto_add_replicas with currently live nodes: 2
   [junit4]   2> 51231 DEBUG (simCloudManagerPool-10-thread-5) [    ] o.a.s.c.a.s.SimClusterStateProvider -- submit leader election for collection1 / shard1
   [junit4]   2> 51247 DEBUG (simCloudManagerPool-10-thread-7) [    ] o.a.s.c.a.s.SimClusterStateProvider Running leader election for collection1 / shard1
   [junit4]   2> 51255 DEBUG (ScheduledTrigger-11-thread-4) [    ] o.a.s.c.a.NodeLostTrigger Running NodeLostTrigger: .auto_add_replicas with currently live nodes: 2
   [junit4]   2> 51268 DEBUG (simCloudManagerPool-10-thread-7) [    ] o.a.s.c.a.s.SimClusterStateProvider -- elected new leader for collection1 / shard1: core_node1
   [junit4]   2> 51330 DEBUG (ScheduledTrigger-11-thread-4) [    ] o.a.s.c.a.NodeLostTrigger Running NodeLostTrigger: .auto_add_replicas with currently live nodes: 2
   [junit4]   2> 51332 DEBUG (simCloudManagerPool-10-thread-6) [    ] o.a.s.c.a.s.SimClusterStateProvider -- already has leader collection1 / shard1
   [junit4]   2> 51366 DEBUG (ScheduledTrigger-11-thread-4) [    ] o.a.s.c.a.NodeLostTrigger Running NodeLostTrigger: .auto_add_replicas with currently live nodes: 2
   [junit4]   2> 51398 DEBUG (ScheduledTrigger-11-thread-4) [    ] o.a.s.c.a.NodeLostTrigger Running NodeLostTrigger: .auto_add_replicas with currently live nodes: 2
   [junit4]   2> 51420 DEBUG (ScheduledTrigger-11-thread-4) [    ] o.a.s.c.a.NodeLostTrigger Running NodeLostTrigger: .auto_add_replicas with currently live nodes: 2
   [junit4]   2> 51454 DEBUG (ScheduledTrigger-11-thread-4) [    ] o.a.s.c.a.NodeLostTrigger Running NodeLostTrigger: .auto_add_replicas with currently live nodes: 2
   [junit4]   2> 51461 DEBUG (simCloudManagerPool-10-thread-8) [    ] o.a.s.c.a.AutoScalingHandler Verified autoscaling configuration
   [junit4]   2> 51461 DEBUG (simCloudManagerPool-10-thread-8) [    ] o.a.s.c.a.OverseerTriggerThread Refreshing /autoscaling.json with znode version 8
   [junit4]   2> 51475 DEBUG (Simulated OverseerAutoScalingTriggerThread) [    ] o.a.s.c.a.OverseerTriggerThread Processed trigger updates upto znodeVersion 8
   [junit4]   2> 51475 DEBUG (Simulated OverseerAutoScalingTriggerThread) [    ] o.a.s.c.a.OverseerTriggerThread -- clean old nodeAdded markers
   [junit4]   2> 51476 DEBUG (Simulated OverseerAutoScalingTriggerThread) [    ] o.a.s.c.a.OverseerTriggerThread Current znodeVersion 8, lastZnodeVersion 8
   [junit4]   2> 51495 DEBUG (ScheduledTrigger-11-thread-4) [    ] o.a.s.c.a.NodeLostTrigger Running NodeLostTrigger: .auto_add_replicas with currently live nodes: 2
   [junit4]   2> 51527 DEBUG (ScheduledTrigger-11-thread-4) [    ] o.a.s.c.a.NodeLostTrigger Running NodeLostTrigger: .auto_add_replicas with currently live nodes: 2
   [junit4]   2> 51548 DEBUG (ScheduledTrigger-11-thread-4) [    ] o.a.s.c.a.NodeLostTrigger Running NodeLostTrigger: .auto_add_replicas with currently live nodes: 2
   [junit4]   2> 51551 DEBUG (ScheduledTrigger-11-thread-3) [    ] o.a.s.c.a.SearchRateTrigger ### rates for node 127.0.0.1:10001_solr
   [junit4]   2> 51564 DEBUG (simCloudManagerPool-10-thread-9) [    ] o.a.s.c.a.AutoScalingHandler Verified autoscaling configuration
   [junit4]   2> 51565 DEBUG (simCloudManagerPool-10-thread-9) [    ] o.a.s.c.a.OverseerTriggerThread Refreshing /autoscaling.json with znode version 9
   [junit4]   2> 51585 DEBUG (ScheduledTrigger-11-thread-3) [    ] o.a.s.c.a.SearchRateTrigger ### rates for node 127.0.0.1:10000_solr
   [junit4]   2> 51585 DEBUG (ScheduledTrigger-11-thread-3) [    ] o.a.s.c.a.SearchRateTrigger ###  metrics:solr.core.collection1.shard1.replica_n2:QUERY./select.requestTimes:1minRate	250
   [junit4]   2> 51586 DEBUG (ScheduledTrigger-11-thread-4) [    ] o.a.s.c.a.NodeLostTrigger Running NodeLostTrigger: .auto_add_replicas with currently live nodes: 2
   [junit4]   2> 51586 DEBUG (Simulated OverseerAutoScalingTriggerThread) [    ] o.a.s.c.a.OverseerTriggerThread Processed trigger updates upto znodeVersion 9
   [junit4]   2> 51587 DEBUG (Simulated OverseerAutoScalingTriggerThread) [    ] o.a.s.c.a.OverseerTriggerThread -- clean old nodeAdded markers
   [junit4]   2> 51587 DEBUG (Simulated OverseerAutoScalingTriggerThread) [    ] o.a.s.c.a.OverseerTriggerThread Current znodeVersion 9, lastZnodeVersion 9
   [junit4]   2> 51606 DEBUG (ScheduledTrigger-11-thread-4) [    ] o.a.s.c.a.NodeLostTrigger Running NodeLostTrigger: .auto_add_replicas with currently live nodes: 2
   [junit4]   2> 51620 DEBUG (ScheduledTrigger-11-thread-3) [    ] o.a.s.c.a.SearchRateTrigger ## Collection: collection1
   [junit4]   2> 51620 DEBUG (ScheduledTrigger-11-thread-3) [    ] o.a.s.c.a.SearchRateTrigger ##  - shard1
   [junit4]   2> 51621 DEBUG (ScheduledTrigger-11-thread-3) [    ] o.a.s.c.a.SearchRateTrigger ##     collection1_shard1_replica_n2  250.0
   [junit4]   2> 51641 DEBUG (ScheduledTrigger-11-thread-4) [    ] o.a.s.c.a.NodeLostTrigger Running NodeLostTrigger: .auto_add_replicas with currently live nodes: 2
   [junit4]   2> 51678 DEBUG (ScheduledTrigger-11-thread-4) [    ] o.a.s.c.a.NodeLostTrigger Running NodeLostTrigger: .auto_add_replicas with currently live nodes: 2
   [junit4]   2> 51715 DEBUG (ScheduledTrigger-11-thread-4) [    ] o.a.s.c.a.NodeLostTrigger Running NodeLostTrigger: .auto_add_replicas with currently live nodes: 2
   [junit4]   2> 51732 DEBUG (ScheduledTrigger-11-thread-3) [    ] o.a.s.c.a.SearchRateTrigger -- collection1.shard1: totalShardRate=250.0, shardRate=125.0
   [junit4]   2> 51751 DEBUG (ScheduledTrigger-11-thread-4) [    ] o.a.s.c.a.NodeLostTrigger Running NodeLostTrigger: .auto_add_replicas with currently live nodes: 2
   [junit4]   2> 51784 DEBUG (ScheduledTrigger-11-thread-4) [    ] o.a.s.c.a.NodeLostTrigger Running NodeLostTrigger: .auto_add_replicas with currently live nodes: 2
   [junit4]   2> 51785 DEBUG (ScheduledTrigger-11-thread-4) [    ] o.a.s.c.a.SearchRateTrigger ### rates for node 127.0.0.1:10001_solr
   [junit4]   2> 51785 DEBUG (ScheduledTrigger-11-thread-4) [    ] o.a.s.c.a.SearchRateTrigger ###  metrics:solr.core.collection1.shard1.replica_n1:QUERY./select.requestTimes:1minRate	250
   [junit4]   2> 51785 DEBUG (ScheduledTrigger-11-thread-4) [    ] o.a.s.c.a.SearchRateTrigger ### rates for node 127.0.0.1:10000_solr
   [junit4]   2> 51785 DEBUG (ScheduledTrigger-11-thread-4) [    ] o.a.s.c.a.SearchRateTrigger ###  metrics:solr.core.collection1.shard1.replica_n2:QUERY./select.requestTimes:1minRate	250
   [junit4]   2> 51785 DEBUG (ScheduledTrigger-11-thread-4) [    ] o.a.s.c.a.SearchRateTrigger ## Collection: collection1
   [junit4]   2> 51785 DEBUG (ScheduledTrigger-11-thread-4) [    ] o.a.s.c.a.SearchRateTrigger ##  - shard1
   [junit4]   2> 51785 DEBUG (ScheduledTrigger-11-thread-4) [    ] o.a.s.c.a.SearchRateTrigger ##     collection1_shard1_replica_n1  250.0
   [junit4]   2> 51785 DEBUG (ScheduledTrigger-11-thread-4) [    ] o.a.s.c.a.SearchRateTrigger ##     collection1_shard1_replica_n2  250.0
   [junit4]   2> 51786 DEBUG (ScheduledTrigger-11-thread-4) [    ] o.a.s.c.a.SearchRateTrigger -- collection1.shard1: totalShardRate=500.0, shardRate=250.0
   [junit4]   2> 51820 DEBUG (ScheduledTrigger-11-thread-1) [    ] o.a.s.c.a.NodeLostTrigger Running NodeLostTrigger: .auto_add_replicas with currently live nodes: 2
   [junit4]   2> 51857 DEBUG (ScheduledTrigger-11-thread-1) [    ] o.a.s.c.a.NodeLostTrigger Running NodeLostTrigger: .auto_add_replicas with currently live nodes: 2
   [junit4]   2> 51895 DEBUG (ScheduledTrigger-11-thread-1) [    ] o.a.s.c.a.NodeLostTrigger Running NodeLostTrigger: .auto_add_replicas with currently live nodes: 2
   [junit4]   2> 51911 DEBUG (ScheduledTrigger-11-thread-4) [    ] o.a.s.c.a.ScheduledTriggers ++++++++ Cooldown inactive - processing event: {
   [junit4]   2>   "id":"4383c668567eafT158m3oi9y37mfw59we0xjo2ed",
   [junit4]   2>   "source":"search_rate_trigger",
   [junit4]   2>   "eventTime":19003711616876207,
   [junit4]   2>   "eventType":"SEARCHRATE",
   [junit4]   2>   "properties":{
   [junit4]   2>     "hotReplicas":[{"core_node2":{
   [junit4]   2>           "core":"collection1_shard1_replica_n2",
   [junit4]   2>           "shard":"shard1",
   [junit4]   2>           "collection":"collection1",
   [junit4]   2>           "node_name":"127.0.0.1:10000_solr",
   [junit4]   2>           "type":"NRT",
   [junit4]   2>           "SEARCHER.searcher.maxDoc":0,
   [junit4]   2>           "SEARCHER.searcher.deletedDocs":0,
   [junit4]   2>           "INDEX.sizeInBytes":10240,
   [junit4]   2>           "rate":250.0,
   [junit4]   2>           "state":"active",
   [junit4]   2>           "QUERY./select.requestTimes:1minRate":250,
   [junit4]   2>           "INDEX.sizeInGB":9.5367431640625E-6,
   [junit4]   2>           "SEARCHER.searcher.numDocs":0}}],
   [junit4]   2>     "coldNodes":{},
   [junit4]   2>     "coldShards":{},
   [junit4]   2>     "coldReplicas":[],
   [junit4]   2>     "violationType":["hotShards"],
   [junit4]   2>     "coldCollections":{},
   [junit4]   2>     "hotShards":{"collection1":{"shard1":250.0}},
   [junit4]   2>     "hotCollections":{"collection1":500.0},
   [junit4]   2>     "hotNodes":{"127.0.0.1:10000_solr":250.0},
   [junit4]   2>     "requestedOps":[
   [junit4]   2>       {
   [junit4]   2>         "action":"ADDREPLICA",
   [junit4]   2>         "hints":{"COLL_SHARD":[{
   [junit4]   2>               "first":"collection1",
   [junit4]   2>               "second":"shard1"}]}},
   [junit4]   2>       {
   [junit4]   2>         "action":"ADDREPLICA",
   [junit4]   2>         "hints":{"COLL_SHARD":[{
   [junit4]   2>               "first":"collection1",
   [junit4]   2>               "second":"shard1"}]}},
   [junit4]   2>       {
   [junit4]   2>         "action":"ADDREPLICA",
   [junit4]   2>         "hints":{"COLL_SHARD":[{
   [junit4]   2>               "first":"collection1",
   [junit4]   2>               "second":"shard1"}]}}]}}
   [junit4]   2> 51912 DEBUG (ScheduledTrigger-11-thread-4) [    ] o.a.s.c.a.ScheduledTriggers Pausing all triggers: [.auto_add_replicas, search_rate_trigger]
   [junit4]   2> 51968 INFO  (TEST-TestSimTriggerIntegration.testSearchRate-seed#[D02FFFAB803928F3]) [    ] o.a.s.SolrTestCaseJ4 ###Ending testSearchRate
   [junit4]   2> 51968 INFO  (TEST-TestSimTriggerIntegration.testSearchRate-seed#[D02FFFAB803928F3]) [    ] o.a.s.c.a.s.SimSolrCloudTestCase #######################################
   [junit4]   2> ############ CLUSTER STATE ############
   [junit4]   2> #######################################
   [junit4]   2> ## Live nodes:		2
   [junit4]   2> ## Empty nodes:	0
   [junit4]   2> ## Dead nodes:		0
   [junit4]   2> ## Collections:	[collection1, .system]
   [junit4]   2> ## Max replicas per node:	2
   [junit4]   2> ## Min replicas per node:	1
   [junit4]   2> ## Total replicas:		3
   [junit4]   2> ## * .system		1
   [junit4]   2> ##		- active           1
   [junit4]   2> ## * collection1		2
   [junit4]   2> ##		- active           2
   [junit4]   2> ######### Solr op counts ##########
   [junit4]   2> ##		- CREATE             1
   [junit4]   2> ##		- autoscaling        3
   [junit4]   2> ##		- update             1
   [junit4]   2> ######### Autoscaling event counts ###########
   [junit4]   2> ## * Trigger: search_rate_trigger
   [junit4]   2> ##		- STARTED         1
   [junit4]   2> 
   [junit4]   2> NOTE: reproduce with: ant test  -Dtestcase=TestSimTriggerIntegration -Dtests.method=testSearchRate -Dtests.seed=D02FFFAB803928F3 -Dtests.multiplier=2 -Dtests.slow=true -Dtests.locale=hr-HR -Dtests.timezone=Pacific/Tahiti -Dtests.asserts=true -Dtests.file.encoding=ISO-8859-1
   [junit4] FAILURE 1.32s J0 | TestSimTriggerIntegration.testSearchRate <<<
   [junit4]    > Throwable #1: java.lang.AssertionError: The trigger did not start in time
   [junit4]    > 	at __randomizedtesting.SeedInfo.seed([D02FFFAB803928F3:8D67E1224FFF8EBC]:0)
   [junit4]    > 	at org.apache.solr.cloud.autoscaling.sim.TestSimTriggerIntegration.testSearchRate(TestSimTriggerIntegration.java:1262)
   [junit4]    > 	at java.lang.Thread.run(Thread.java:748)
   [junit4] IGNOR/A 0.00s J0 | TestSimTriggerIntegration.testListeners
   [junit4]    > Assumption #1: 'badapple' test group is disabled (@BadApple(bugUrl=https://issues.apache.org/jira/browse/SOLR-12028))
   [junit4]   2> 52019 DEBUG (AutoscalingActionExecutor-12-thread-1) [    ] o.a.s.c.a.ScheduledTriggers -- processing actions for {
   [junit4]   2>   "id":"4383c668567eafT158m3oi9y37mfw59we0xjo2ed",
   [junit4]   2>   "source":"search_rate_trigger",
   [junit4]   2>   "eventTime":19003711616876207,
   [junit4]   2>   "eventType":"SEARCHRATE",
   [junit4]   2>   "properties":{
   [junit4]   2>     "hotReplicas":[{"core_node2":{
   [junit4]   2>           "core":"collection1_shard1_replica_n2",
   [junit4]   2>           "shard":"shard1",
   [junit4]   2>           "collection":"collection1",
   [junit4]   2>           "node_name":"127.0.0.1:10000_solr",
   [junit4]   2>           "type":"NRT",
   [junit4]   2>           "SEARCHER.searcher.maxDoc":0,
   [junit4]   2>           "SEARCHER.searcher.deletedDocs":0,
   [junit4]   2>           "INDEX.sizeInBytes":10240,
   [junit4]   2>           "rate":250.0,
   [junit4]   2>           "state":"active",
   [junit4]   2>           "QUERY./select.requestTimes:1minRate":250,
   [junit4]   2>           "INDEX.sizeInGB":9.5367431640625E-6,
   [junit4]   2>           "SEARCHER.searcher.numDocs":0}}],
   [junit4]   2>     "coldNodes":{},
   [junit4]   2>     "coldShards":{},
   [junit4]   2>     "coldReplicas":[],
   [junit4]   2>     "violationType":["hotShards"],
   [junit4]   2>     "coldCollections":{},
   [junit4]   2>     "hotShards":{"collection1":{"shard1":250.0}},
   [junit4]   2>     "hotCollections":{"collection1":500.0},
   [junit4]   2>     "hotNodes":{"127.0.0.1:10000_solr":250.0},
   [junit4]   2>     "_enqueue_time_":19003726167686207,
   [junit4]   2>     "requestedOps":[
   [junit4]   2>       {
   [junit4]   2>         "action":"ADDREPLICA",
   [junit4]   2>         "hints":{"COLL_SHARD":[{
   [junit4]   2>               "first":"collection1",
   [junit4]   2>               "second":"shard1"}]}},
   [junit4]   2>       {
   [junit4]   2>         "action":"ADDREPLICA",
   [junit4]   2>         "hints":{"COLL_SHARD":[{
   [junit4]   2>               "first":"collection1",
   [junit4]   2>               "second":"shard1"}]}},
   [junit4]   2>       {
   [junit4]   2>         "action":"ADDREPLICA",
   [junit4]   2>         "hints":{"COLL_SHARD":[{
   [junit4]   2>               "first":"collection1",
   [junit4]   2>               "second":"shard1"}]}}]}}
   [junit4]   2> 52122 DEBUG (AutoscalingActionExecutor-12-thread-1) [    ] o.a.s.c.a.ComputePlanAction -- processing event: {
   [junit4]   2>   "id":"4383c668567eafT158m3oi9y37mfw59we0xjo2ed",
   [junit4]   2>   "source":"search_rate_trigger",
   [junit4]   2>   "eventTime":19003711616876207,
   [junit4]   2>   "eventType":"SEARCHRATE",
   [junit4]   2>   "properties":{
   [junit4]   2>     "hotReplicas":[{"core_node2":{
   [junit4]   2>           "core":"collection1_shard1_replica_n2",
   [junit4]   2>           "shard":"shard1",
   [junit4]   2>           "collection":"collection1",
   [junit4]   2>           "node_name":"127.0.0.1:10000_solr",
   [junit4]   2>           "type":"NRT",
   [junit4]   2>           "SEARCHER.searcher.maxDoc":0,
   [junit4]   2>           "SEARCHER.searcher.deletedDocs":0,
   [junit4]   2>           "INDEX.sizeInBytes":10240,
   [junit4]   2>           "rate":250.0,
   [junit4]   2>           "state":"active",
   [junit4]   2>           "QUERY./select.requestTimes:1minRate":250,
   [junit4]   2>           "INDEX.sizeInGB":9.5367431640625E-6,
   [junit4]   2>           "SEARCHER.searcher.numDocs":0}}],
   [junit4]   2>     "coldNodes":{},
   [junit4]   2>     "coldShards":{},
   [junit4]   2>     "coldReplicas":[],
   [junit4]   2>     "violationType":["hotShards"],
   [junit4]   2>     "coldCollections":{},
   [junit4]   2>     "hotShards":{"collection1":{"shard1":250.0}},
   [junit4]   2>     "hotCollections":{"collection1":500.0},
   [junit4]   2>     "hotNodes":{"127.0.0.1:10000_solr":250.0},
   [junit4]   2>     "_enqueue_time_":19003726167686207,
   [junit4]   2>     "requestedOps":[
   [junit4]   2>       {
   [junit4]   2>         "action":"ADDREPLICA",
   [junit4]   2>         "hints":{"COLL_SHARD":[{
   [junit4]   2>               "first":"collection1",
   [junit4]   2>               "second":"shard1"}]}},
   [junit4]   2>       {
   [junit4]   2>         "action":"ADDREPLICA",
   [junit4]   2>         "hints":{"COLL_SHARD":[{
   [junit4]   2>               "first":"collection1",
   [junit4]   2>               "second":"shard1"}]}},
   [junit4]   2>       {
   [junit4]   2>         "action":"ADDREPLICA",
   [junit4]   2>         "hints":{"COLL_SHARD":[{
   [junit4]   2>               "first":"collection1",
   [junit4]   2>               "second":"shard1"}]}}]}} with context properties: {AFTER_ACTION=[start], BEFORE_ACTION=[start, compute]}
   [junit4]   2> 52286 INFO  (AutoscalingActionExecutor-12-thread-1) [    ] o.a.s.c.a.ComputePlanAction Computed Plan: action=ADDREPLICA&collection=collection1&shard=shard1&node=127.0.0.1:10000_solr&type=NRT
   [junit4]   2> 52288 INFO  (AutoscalingActionExecutor-12-thread-1) [    ] o.a.s.c.a.ComputePlanAction Computed Plan: action=ADDREPLICA&collection=collection1&shard=shard1&node=127.0.0.1:10000_solr&type=NRT
   [junit4]   2> 52321 INFO  (AutoscalingActionExecutor-12-thread-1) [    ] o.a.s.c.a.ComputePlanAction Computed Plan: action=ADDREPLICA&collection=collection1&shard=shard1&node=127.0.0.1:10001_solr&type=NRT
   [junit4]   2> 52321 INFO  (AutoscalingActionExecutor-12-thread-1) [    ] o.a.s.c.s.c.a.PolicyHelper returnSession, curr-time 19003746644 sessionWrapper.createTime 19003739357472857, this.sessionWrapper.createTime 19003739357472857 
   [junit4]   2> 52322 DEBUG (AutoscalingActionExecutor-12-thread-1) [    ] o.a.s.c.a.ExecutePlanAction -- processing event: {
   [junit4]   2>   "id":"4383c668567eafT158m3oi9y37mfw59we0xjo2ed",
   [junit4]   2>   "source":"search_rate_trigger",
   [junit4]   2>   "eventTime":19003711616876207,
   [junit4]   2>   "eventType":"SEARCHRATE",
   [junit4]   2>   "properties":{
   [junit4]   2>     "hotReplicas":[{"core_node2":{
   [junit4]   2>           "core":"collection1_shard1_replica_n2",
   [junit4]   2>           "shard":"shard1",
   [junit4]   2>           "collection":"collection1",
   [junit4]   2>           "node_name":"127.0.0.1:10000_solr",
   [junit4]   2>           "type":"NRT",
   [junit4]   2>           "SEARCHER.searcher.maxDoc":0,
   [junit4]   2>           "SEARCHER.searcher.deletedDocs":0,
   [junit4]   2>           "INDEX.sizeInBytes":10240,
   [junit4]   2>           "rate":250.0,
   [junit4]   2>           "state":"active",
   [junit4]   2>           "QUERY./select.requestTimes:1minRate":250,
   [junit4]   2>           "INDEX.sizeInGB":9.5367431640625E-6,
   [junit4]   2>           "SEARCHER.searcher.numDocs":0}}],
   [junit4]   2>     "__start__":3,
   [junit4]   2>     "coldNodes":{},
   [junit4]   2>     "coldShards":{},
   [junit4]   2>     "coldReplicas":[],
   [junit4]   2>     "violationType":["hotShards"],
   [junit4]   2>     "coldCollections":{},
   [junit4]   2>     "hotShards":{"collection1":{"shard1":250.0}},
   [junit4]   2>     "hotCollections":{"collection1":500.0},
   [junit4]   2>     "hotNodes":{"127.0.0.1:10000_solr":250.0},
   [junit4]   2>     "_enqueue_time_":19003726167686207,
   [junit4]   2>     "requestedOps":[
   [junit4]   2>       {
   [junit4]   2>         "action":"ADDREPLICA",
   [junit4]   2>         "hints":{"COLL_SHARD":[{
   [junit4]   2>               "first":"collection1",
   [junit4]   2>               "second":"shard1"}]}},
   [junit4]   2>       {
   [junit4]   2>         "action":"ADDREPLICA",
   [junit4]   2>         "hints":{"COLL_SHARD":[{
   [junit4]   2>               "first":"collection1",
   [junit4]   2>               "second":"shard1"}]}},
   [junit4]   2>       {
   [junit4]   2>         "action":"ADDREPLICA",
   [junit4]   2>         "hints":{"COLL_SHARD":[{
   [junit4]   2>               "first":"collection1",
   [junit4]   2>               "second":"shard1"}]}}]}} with context properties: {operations=[org.apache.solr.client.solrj.request.CollectionAdminRequest$AddReplica@2488afa0, org.apache.solr.client.solrj.request.CollectionAdminRequest$AddReplica@3a27de7d, org.apache.solr.client.solrj.request.CollectionAdminRequest$AddReplica@44d53e97], AFTER_ACTION=[start, compute], BEFORE_ACTION=[start, compute, execute]}
   [junit4]   2> 52323 DEBUG (AutoscalingActionExecutor-12-thread-1) [    ] o.a.s.c.a.ExecutePlanAction Executing operation: action=ADDREPLICA&collection=collection1&shard=shard1&node=127.0.0.1:10000_solr&type=NRT
   [junit4]   2> 52379 INFO  (TEST-TestSimTriggerIntegration.testNodeLostTriggerRestoreState-seed#[D02FFFAB803928F3]) [    ] o.a.s.SolrTestCaseJ4 ###Starting testNodeLostTriggerRestoreState
   [junit4]   2> 52379 DEBUG (TEST-TestSimTriggerIntegration.testNodeLostTriggerRestoreState-seed#[D02FFFAB803928F3]) [    ] o.a.s.c.a.OverseerTriggerThread Refreshing /autoscaling.json with znode version 10
   [junit4]   2> 52380 INFO  (TEST-TestSimTriggerIntegration.testNodeLostTriggerRestoreState-seed#[D02FFFAB803928F3]) [    ] o.a.s.c.a.s.SimCloudManager === Restarting OverseerTriggerThread and clearing object cache...
   [junit4]   2> 52380 WARN  (Simulated OverseerAutoScalingTriggerThread) [    ] o.a.s.c.a.OverseerTriggerThread OverseerTriggerThread woken up but we are closed, exiting.
   [junit4]   2> 52381 DEBUG (TEST-TestSimTriggerIntegration.testNodeLostTriggerRestoreState-seed#[D02FFFAB803928F3]) [    ] o.a.s.c.a.ScheduledTriggers Shutting down scheduled thread pool executor now
   [junit4]   2> 52381 DEBUG (TEST-TestSimTriggerIntegration.testNodeLostTriggerRestoreState-seed#[D02FFFAB803928F3]) [    ] o.a.s.c.a.ScheduledTriggers Shutting down action executor now
   [junit4]   2> 52381 DEBUG (TEST-TestSimTriggerIntegration.testNodeLostTriggerRestoreState-seed#[D02FFFAB803928F3]) [    ] o.a.s.c.a.ScheduledTriggers Awaiting termination for action executor
   [junit4]   2> 52489 INFO  (simCloudManagerPool-10-thread-16) [    ] o.a.s.c.a.c.AddReplicaCmd Node Identified 127.0.0.1:10000_solr for creating new replica of shard shard1
   [junit4]   2> 52496 DEBUG (simCloudManagerPool-10-thread-18) [    ] o.a.s.c.a.s.SimClusterStateProvider -- submit leader election for .system / shard1
   [junit4]   2> 52516 DEBUG (simCloudManagerPool-10-thread-19) [    ] o.a.s.c.a.s.SimClusterStateProvider Running leader election for .system / shard1
   [junit4]   2> 52536 DEBUG (simCloudManagerPool-10-thread-19) [    ] o.a.s.c.a.s.SimClusterStateProvider -- elected new leader for .system / shard1: core_node3
   [junit4]   2> 52553 DEBUG (simCloudManagerPool-10-thread-16) [    ] o.a.s.c.a.s.SimClusterStateProvider -- submit leader election for collection1 / shard1
   [junit4]   2> 52589 DEBUG (simCloudManagerPool-10-thread-20) [    ] o.a.s.c.a.s.SimClusterStateProvider Running leader election for collection1 / shard1
   [junit4]   2> 52590 DEBUG (simCloudManagerPool-10-thread-20) [    ] o.a.s.c.a.s.SimClusterStateProvider -- elected new leader for collection1 / shard1: core_node4
   [junit4]   2> 52591 WARN  (AutoscalingActionExecutor-12-thread-1) [    ] o.a.s.c.a.ScheduledTriggers Exception executing actions
   [junit4]   2> org.apache.solr.cloud.autoscaling.TriggerActionException: Error processing action for trigger event: {
   [junit4]   2>   "id":"4383c668567eafT158m3oi9y37mfw59we0xjo2ed",
   [junit4]   2>   "source":"search_rate_trigger",
   [junit4]   2>   "eventTime":19003711616876207,
   [junit4]   2>   "eventType":"SEARCHRATE",
   [junit4]   2>   "properties":{
   [junit4]   2>     "hotReplicas":[{"core_node2":{
   [junit4]   2>           "core":"collection1_shard1_replica_n2",
   [junit4]   2>           "shard":"shard1",
   [junit4]   2>           "collection":"collection1",
   [junit4]   2>           "node_name":"127.0.0.1:10000_solr",
   [junit4]   2>           "type":"NRT",
   [junit4]   2>           "SEARCHER.searcher.maxDoc":0,
   [junit4]   2>           "SEARCHER.searcher.deletedDocs":0,
   [junit4]   2>           "INDEX.sizeInBytes":10240,
   [junit4]   2>           "rate":250.0,
   [junit4]   2>           "state":"active",
   [junit4]   2>           "QUERY./select.requestTimes:1minRate":250,
   [junit4]   2>           "INDEX.sizeInGB":9.5367431640625E-6,
   [junit4]   2>           "SEARCHER.searcher.numDocs":0}}],
   [junit4]   2>     "__start__":3,
   [junit4]   2>     "coldNodes":{},
   [junit4]   2>     "coldShards":{},
   [junit4]   2>     "coldReplicas":[],
   [junit4]   2>     "violationType":["hotShards"],
   [junit4]   2>     "coldCollections":{},
   [junit4]   2>     "hotShards":{"collection1":{"shard1":250.0}},
   [junit4]   2>     "hotCollections":{"collection1":500.0},
   [junit4]   2>     "hotNodes":{"127.0.0.1:10000_solr":250.0},
   [junit4]   2>     "_enqueue_time_":19003726167686207,
   [junit4]   2>     "requestedOps":[
   [junit4]   2>       {
   [junit4]   2>         "action":"ADDREPLICA",
   [junit4]   2>         "hints":{"COLL_SHARD":[{
   [junit4]   2>               "first":"collection1",
   [junit4]   2>               "second":"shard1"}]}},
   [junit4]   2>       {
   [junit4]   2>         "action":"ADDREPLICA",
   [junit4]   2>         "hints":{"COLL_SHARD":[{
   [junit4]   2>               "first":"collection1",
   [junit4]   2>               "second":"shard1"}]}},
   [junit4]   2>       {
   [junit4]   2>         "action":"ADDREPLICA",
   [junit4]   2>         "hints":{"COLL_SHARD":[{
   [junit4]   2>               "first":"collection1",
   [junit4]   2>               "second":"shard1"}]}}]}}
   [junit4]   2> 	at org.apache.solr.cloud.autoscaling.ScheduledTriggers.lambda$null$3(ScheduledTriggers.java:311) ~[java/:?]
   [junit4]   2> 	at java.util.concurrent.Executors$RunnableAdapter.call(Executors.java:511) ~[?:1.8.0_172]
   [junit4]   2> 	at java.util.concurrent.FutureTask.run(FutureTask.java:266) ~[?:1.8.0_172]
   [junit4]   2> 	at org.apache.solr.common.util.ExecutorUtil$MDCAwareThreadPoolExecutor.lambda$execute$0(ExecutorUtil.java:209) ~[java/:?]
   [junit4]   2> 	at java.util.concurrent.ThreadPoolExecutor.runWorker(ThreadPoolExecutor.java:1149) [?:1.8.0_172]
   [junit4]   2> 	at java.util.concurrent.ThreadPoolExecutor$Worker.run(ThreadPoolExecutor.java:624) [?:1.8.0_172]
   [junit4]   2> 	at java.lang.Thread.run(Thread.java:748) [?:1.8.0_172]
   [junit4]   2> Caused by: org.apache.solr.common.SolrException: Unexpected exception while processing event: {
   [junit4]   2>   "id":"4383c668567eafT158m3oi9y37mfw59we0xjo2ed",
   [junit4]   2>   "source":"search_rate_trigger",
   [junit4]   2>   "eventTime":19003711616876207,
   [junit4]   2>   "eventType":"SEARCHRATE",
   [junit4]   2>   "properties":{
   [junit4]   2>     "hotReplicas":[{"core_node2":{
   [junit4]   2>           "core":"collection1_shard1_replica_n2",
   [junit4]   2>           "shard":"shard1",
   [junit4]   2>           "collection":"collection1",
   [junit4]   2>           "node_name":"127.0.0.1:10000_solr",
   [junit4]   2>           "type":"NRT",
   [junit4]   2>           "SEARCHER.searcher.maxDoc":0,
   [junit4]   2>           "SEARCHER.searcher.deletedDocs":0,
   [junit4]   2>           "INDEX.sizeInBytes":10240,
   [junit4]   2>           "rate":250.0,
   [junit4]   2>           "state":"active",
   [junit4]   2>           "QUERY./select.requestTimes:1minRate":250,
   [junit4]   2>           "INDEX.sizeInGB":9.5367431640625E-6,
   [junit4]   2>           "SEARCHER.searcher.numDocs":0}}],
   [junit4]   2>     "__start__":3,
   [junit4]   2>     "coldNodes":{},
   [junit4]   2>     "coldShards":{},
   [junit4]   2>     "coldReplicas":[],
   [junit4]   2>     "violationType":["hotShards"],
   [junit4]   2>     "coldCollections":{},
   [junit4]   2>     "hotShards":{"collection1":{"shard1":250.0}},
   [junit4]   2>     "hotCollections":{"collection1":500.0},
   [junit4]   2>     "hotNodes":{"127.0.0.1:10000_solr":250.0},
   [junit4]   2>     "_enqueue_time_":19003726167686207,
   [junit4]   2>     "requestedOps":[
   [junit4]   2>       {
   [junit4]   2>         "action":"ADDREPLICA",
   [junit4]   2>         "hints":{"COLL_SHARD":[{
   [junit4]   2>               "first":"collection1",
   [junit4]   2>               "second":"shard1"}]}},
   [junit4]   2>       {
   [junit4]   2>         "action":"ADDREPLICA",
   [junit4]   2>         "hints":{"COLL_SHARD":[{
   [junit4]   2>               "first":"collection1",
   [junit4]   2>               "second":"shard1"}]}},
   [junit4]   2>       {
   [junit4]   2>         "action":"ADDREPLICA",
   [junit4]   2>         "hints":{"COLL_SHARD":[{
   [junit4]   2>               "first":"collection1",
   [junit4]   2>               "second":"shard1"}]}}]}}
   [junit4]   2> 	at org.apache.solr.cloud.autoscaling.ExecutePlanAction.process(ExecutePlanAction.java:120) ~[java/:?]
   [junit4]   2> 	at org.apache.solr.cloud.autoscaling.ScheduledTriggers.lambda$null$3(ScheduledTriggers.java:308) ~[java/:?]
   [junit4]   2> 	... 6 more
   [junit4]   2> Caused by: org.apache.solr.common.SolrException: Unexpected exception executing operation: action=ADDREPLICA&async=search_rate_trigger/4383c668567eafT158m3oi9y37mfw59we0xjo2ed/0&waitForFinalState=true&collection=collection1&shard=shard1&node=127.0.0.1:10000_solr&type=NRT
   [junit4]   2> 	at org.apache.solr.cloud.autoscaling.ExecutePlanAction.process(ExecutePlanAction.java:110) ~[java/:?]
   [junit4]   2> 	at org.apache.solr.cloud.autoscaling.ScheduledTriggers.lambda$null$3(ScheduledTriggers.java:308) ~[java/:?]
   [junit4]   2> 	... 6 more
   [junit4]   2> Caused by: java.io.IOException: java.lang.InterruptedException
   [junit4]   2> 	at org.apache.solr.cloud.autoscaling.sim.SimCloudManager.request(SimCloudManager.java:632) ~[test/:?]
   [junit4]   2> 	at org.apache.solr.cloud.autoscaling.ExecutePlanAction.process(ExecutePlanAction.java:80) ~[java/:?]
   [junit4]   2> 	at org.apache.solr.cloud.autoscaling.ScheduledTriggers.lambda$null$3(ScheduledTriggers.java:308) ~[java/:?]
   [junit4]   2> 	... 6 more
   [junit4]   2> Caused by: java.lang.InterruptedException
   [junit4]   2> 	at java.util.concurrent.FutureTask.awaitDone(FutureTask.java:404) ~[?:1.8.0_172]
   [junit4]   2> 	at java.util.concurrent.FutureTask.get(FutureTask.java:191) ~[?:1.8.0_172]
   [junit4]   2> 	at org.apache.solr.cloud.autoscaling.sim.SimCloudManager.request(SimCloudManager.java:630) ~[test/:?]
   [junit4]   2> 	at org.apache.solr.cloud.autoscaling.ExecutePlanAction.process(ExecutePlanAction.java:80) ~[java/:?]
   [junit4]   2> 	at org.apache.solr.cloud.autoscaling.ScheduledTriggers.lambda$null$3(ScheduledTriggers.java:308) ~[java/:?]
   [junit4]   2> 	... 6 more
   [junit4]   2> 52592 DEBUG (AutoscalingActionExecutor-12-thread-1) [    ] o.a.s.c.a.ScheduledTriggers -- processing took 28678 ms for event id=4383c668567eafT158m3oi9y37mfw59we0xjo2ed
   [junit4]   2> 52593 DEBUG (TEST-TestSimTriggerIntegration.testNodeLostTriggerRestoreState-seed#[D02FFFAB803928F3]) [    ] o.a.s.c.a.ScheduledTriggers Awaiting termination for scheduled thread pool executor
   [junit4]   2> 52593 DEBUG (TEST-TestSimTriggerIntegration.testNodeLostTriggerRestoreState-seed#[D02FFFAB803928F3]) [    ] o.a.s.c.a.ScheduledTriggers ScheduledTriggers closed completely
   [junit4]   2> 52593 DEBUG (TEST-TestSimTriggerIntegration.testNodeLostTriggerRestoreState-seed#[D02FFFAB803928F3]) [    ] o.a.s.c.a.OverseerTriggerThread OverseerTriggerThread has been closed explicitly
   [junit4]   2> 52650 DEBUG (Simulated OverseerAutoScalingTriggerThread) [    ] o.a.s.c.a.OverseerTriggerThread Adding .auto_add_replicas and .scheduled_maintenance triggers
   [junit4]   2> 52669 DEBUG (Simulated OverseerAutoScalingTriggerThread) [    ] o.a.s.c.a.OverseerTriggerThread Refreshing /autoscaling.json with znode version 11
   [junit4]   2> 52669 DEBUG (Simulated OverseerAutoScalingTriggerThread) [    ] o.a.s.c.a.OverseerTriggerThread Current znodeVersion 11, lastZnodeVersion -1
   [junit4]   2> 52669 DEBUG (Simulated OverseerAutoScalingTriggerThread) [    ] o.a.s.c.a.OverseerTriggerThread Processed trigger updates upto znodeVersion 11
   [junit4]   2> 52700 DEBUG (Simulated OverseerAutoScalingTriggerThread) [    ] o.a.s.c.a.NodeLostTrigger NodeLostTrigger .auto_add_replicas - Initial livenodes: [127.0.0.1:10001_solr, 127.0.0.1:10000_solr]
   [junit4]   2> 52701 DEBUG (Simulated OverseerAutoScalingTriggerThread) [    ] o.a.s.c.a.OverseerTriggerThread -- clean old nodeAdded markers
   [junit4]   2> 52701 DEBUG (Simulated OverseerAutoScalingTriggerThread) [    ] o.a.s.c.a.OverseerTriggerThread Current znodeVersion 11, lastZnodeVersion 11
   [junit4]   2> 52703 DEBUG (ScheduledTrigger-14-thread-2) [    ] o.a.s.c.a.NodeLostTrigger Running NodeLostTrigger: .auto_add_replicas with currently live nodes: 2
   [junit4]   2> 52745 DEBUG (simCloudManagerPool-13-thread-1) [    ] o.a.s.c.a.AutoScalingHandler Verified autoscaling configuration
   [junit4]   2> 52745 DEBUG (simCloudManagerPool-13-thread-1) [    ] o.a.s.c.a.OverseerTriggerThread Refreshing /autoscaling.json with znode version 12
   [junit4]   2> 52772 DEBUG (ScheduledTrigger-14-thread-3) [    ] o.a.s.c.a.NodeLostTrigger Running NodeLostTrigger: .auto_add_replicas with currently live nodes: 2
   [junit4]   2> 52776 DEBUG (Simulated OverseerAutoScalingTriggerThread) [    ] o.a.s.c.a.OverseerTriggerThread Processed trigger updates upto znodeVersion 12
   [junit4]   2> 52793 DEBUG (ScheduledTrigger-14-thread-3) [    ] o.a.s.c.a.NodeLostTrigger Running NodeLostTrigger: .auto_add_replicas with currently live nodes: 3
   [junit4]   2> 52830 DEBUG (ScheduledTrigger-14-thread-1) [    ] o.a.s.c.a.NodeLostTrigger Running NodeLostTrigger: .auto_add_replicas with currently live nodes: 3
   [junit4]   2> 52831 DEBUG (Simulated OverseerAutoScalingTriggerThread) [    ] o.a.s.c.a.OverseerTriggerThread -- clean old nodeAdded markers
   [junit4]   2> 52831 DEBUG (Simulated OverseerAutoScalingTriggerThread) [    ] o.a.s.c.a.OverseerTriggerThread Current znodeVersion 12, lastZnodeVersion 12
   [junit4]   2> 52847 DEBUG (simCloudManagerPool-13-thread-2) [    ] o.a.s.c.a.AutoScalingHandler Verified autoscaling configuration
   [junit4]   2> 52847 DEBUG (simCloudManagerPool-13-thread-2) [    ] o.a.s.c.a.OverseerTriggerThread Refreshing /autoscaling.json with znode version 13
   [junit4]   2> 52848 DEBUG (Simulated OverseerAutoScalingTriggerThread) [    ] o.a.s.c.a.OverseerTriggerThread Processed trigger updates upto znodeVersion 13
   [junit4]   2> 52849 INFO  (Simulated OverseerAutoScalingTriggerThread) [    ] o.a.s.c.a.s.TestSimTriggerIntegration TestTriggerAction init
   [junit4]   2> 52849 DEBUG (Simulated OverseerAutoScalingTriggerThread) [    ] o.a.s.c.a.NodeLostTrigger NodeLostTrigger node_lost_restore_trigger - Initial livenodes: [127.0.0.1:10001_solr, 127.0.0.1:10000_solr, 127.0.0.1:10003_solr]
   [junit4]   2> 52849 DEBUG (Simulated OverseerAutoScalingTriggerThread) [    ] o.a.s.c.a.OverseerTriggerThread -- clean old nodeAdded markers
   [junit4]   2> 52849 DEBUG (Simulated OverseerAutoScalingTriggerThread) [    ] o.a.s.c.a.OverseerTriggerThread Current znodeVersion 13, lastZnodeVersion 13
   [junit4]   2> 52854 DEBUG (ScheduledTrigger-14-thread-2) [    ] o.a.s.c.a.NodeLostTrigger Running NodeLostTrigger: node_lost_restore_trigger with currently live nodes: 2
   [junit4]   2> 52854 DEBUG (ScheduledTrigger-14-thread-2) [    ] o.a.s.c.a.NodeLostTrigger Tracking lost node: 127.0.0.1:10003_solr
   [junit4]   2> 52854 DEBUG (ScheduledTrigger-14-thread-2) [    ] o.a.s.c.a.NodeLostTrigger Running NodeLostTrigger: .auto_add_replicas with currently live nodes: 2
   [junit4]   2> 52854 DEBUG (ScheduledTrigger-14-thread-2) [    ] o.a.s.c.a.NodeLostTrigger Tracking lost node: 127.0.0.1:10003_solr
   [junit4]   2> 52890 DEBUG (ScheduledTrigger-14-thread-2) [    ] o.a.s.c.a.NodeLostTrigger Running NodeLostTrigger: node_lost_restore_trigger with currently live nodes: 2
   [junit4]   2> 52890 DEBUG (ScheduledTrigger-14-thread-2) [    ] o.a.s.c.a.NodeLostTrigger Running NodeLostTrigger: .auto_add_replicas with currently live nodes: 2
   [junit4]   2> 52905 DEBUG (simCloudManagerPool-13-thread-3) [    ] o.a.s.c.a.AutoScalingHandler Verified autoscaling configuration
   [junit4]   2> 52905 DEBUG (simCloudManagerPool-13-thread-3) [    ] o.a.s.c.a.OverseerTriggerThread Refreshing /autoscaling.json with znode version 14
   [junit4]   2> 52906 DEBUG (Simulated OverseerAutoScalingTriggerThread) [    ] o.a.s.c.a.OverseerTriggerThread Processed trigger updates upto znodeVersion 14
   [junit4]   2> 52956 DEBUG (ScheduledTrigger-14-thread-2) [    ] o.a.s.c.a.NodeLostTrigger Running NodeLostTrigger: .auto_add_replicas with currently live nodes: 2
   [junit4]   2> 52956 INFO  (Simulated OverseerAutoScalingTriggerThread) [    ] o.a.s.c.a.s.TestSimTriggerIntegration TestTriggerAction init
   [junit4]   2> 52956 DEBUG (Simulated OverseerAutoScalingTriggerThread) [    ] o.a.s.c.a.NodeLostTrigger NodeLostTrigger node_lost_restore_trigger - Initial livenodes: [127.0.0.1:10001_solr, 127.0.0.1:10000_solr]
   [junit4]   2> 52956 DEBUG (Simulated OverseerAutoScalingTriggerThread) [    ] o.a.s.c.a.NodeLostTrigger Adding lost node from marker path: 127.0.0.1:10003_solr
   [junit4]   2> 52956 DEBUG (Simulated OverseerAutoScalingTriggerThread) [    ] o.a.s.c.a.OverseerTriggerThread -- clean old nodeAdded markers
   [junit4]   2> 52956 DEBUG (Simulated OverseerAutoScalingTriggerThread) [    ] o.a.s.c.a.OverseerTriggerThread Current znodeVersion 14, lastZnodeVersion 14
   [junit4]   2> 52956 DEBUG (ScheduledTrigger-14-thread-1) [    ] o.a.s.c.a.NodeLostTrigger Running NodeLostTrigger: node_lost_restore_trigger with currently live nodes: 2
   [junit4]   2> 52956 DEBUG (ScheduledTrigger-14-thread-1) [    ] o.a.s.c.a.NodeLostTrigger NodeLostTrigger firing registered processor for lost nodes: [127.0.0.1:10003_solr]
   [junit4]   2> 52957 DEBUG (ScheduledTrigger-14-thread-1) [    ] o.a.s.c.a.ScheduledTriggers ++++++++ Cooldown inactive - processing event: {
   [junit4]   2>   "id":"4383d5f317c3d7T158m3oi9y37mfw59we0xjo2eg",
   [junit4]   2>   "source":"node_lost_restore_trigger",
   [junit4]   2>   "eventTime":19003778369307607,
   [junit4]   2>   "eventType":"NODELOST",
   [junit4]   2>   "properties":{
   [junit4]   2>     "eventTimes":[19003778369307607],
   [junit4]   2>     "preferredOperation":"movereplica",
   [junit4]   2>     "nodeNames":["127.0.0.1:10003_solr"]}}
   [junit4]   2> 52972 DEBUG (ScheduledTrigger-14-thread-1) [    ] o.a.s.c.a.ScheduledTriggers Pausing all triggers: [.auto_add_replicas, node_lost_restore_trigger]
   [junit4]   2> 52974 DEBUG (AutoscalingActionExecutor-15-thread-1) [    ] o.a.s.c.a.ScheduledTriggers -- processing actions for {
   [junit4]   2>   "id":"4383d5f317c3d7T158m3oi9y37mfw59we0xjo2eg",
   [junit4]   2>   "source":"node_lost_restore_trigger",
   [junit4]   2>   "eventTime":19003778369307607,
   [junit4]   2>   "eventType":"NODELOST",
   [junit4]   2>   "properties":{
   [junit4]   2>     "eventTimes":[19003778369307607],
   [junit4]   2>     "preferredOperation":"movereplica",
   [junit4]   2>     "_enqueue_time_":19003779158422157,
   [junit4]   2>     "nodeNames":["127.0.0.1:10003_solr"]}}
   [junit4]   2> 52992 INFO  (TEST-TestSimTriggerIntegration.testNodeLostTriggerRestoreState-seed#[D02FFFAB803928F3]) [    ] o.a.s.SolrTestCaseJ4 ###Ending testNodeLostTriggerRestoreState
   [junit4]   2> 52992 DEBUG (AutoscalingActionExecutor-15-thread-1) [    ] o.a.s.c.a.ScheduledTriggers Resuming trigger: .auto_add_replicas after 100ms
   [junit4]   2> 52992 DEBUG (AutoscalingActionExecutor-15-thread-1) [    ] o.a.s.c.a.ScheduledTriggers Resuming trigger: node_lost_restore_trigger after 100ms
   [junit4]   2> 52992 DEBUG (AutoscalingActionExecutor-15-thread-1) [    ] o.a.s.c.a.ScheduledTriggers -- processing took 935 ms for event id=4383d5f317c3d7T158m3oi9y37mfw59we0xjo2eg
   [junit4]   2> 52993 INFO  (TEST-TestSimTriggerIntegration.testNodeLostTriggerRestoreState-seed#[D02FFFAB803928F3]) [    ] o.a.s.c.a.s.SimSolrCloudTestCase #######################################
   [junit4]   2> ############ CLUSTER STATE ############
   [junit4]   2> #######################################
   [junit4]   2> ## Live nodes:		2
   [junit4]   2> ## Empty nodes:	0
   [junit4]   2> ## Dead nodes:		1
   [junit4]   2> ##		127.0.0.1:10003_solr
   [junit4]   2> ## Collections:	[collection1, .system]
   [junit4]   2> ## Max replicas per node:	1
   [junit4]   2> ## Min replicas per node:	1
   [junit4]   2> ## Total replicas:		2
   [junit4]   2> ## * .system		1
   [junit4]   2> ##		- active           1
   [junit4]   2> ## * collection1		1
   [junit4]   2> ##		- active           1
   [junit4]   2> ######### Solr op counts ##########
   [junit4]   2> ##		- autoscaling        3
   [junit4]   2> ##		- update             2
   [junit4]   2> ######### Autoscaling event counts ###########
   [junit4]   2> ## * Trigger: node_lost_restore_trigger
   [junit4]   2> ##		- STARTED         1
   [junit4]   2> ##		- SUCCEEDED       1
   [junit4]   2> ## * Trigger: search_rate_trigger
   [junit4]   2> ##		- FAILED          1
   [junit4]   2> 
   [junit4]   2> 53023 INFO  (TEST-TestSimTriggerIntegration.testNodeLostTrigger-seed#[D02FFFAB803928F3]) [    ] o.a.s.SolrTestCaseJ4 ###Starting testNodeLostTrigger
   [junit4]   2> 53023 DEBUG (TEST-TestSimTriggerIntegration.testNodeLostTrigger-seed#[D02FFFAB803928F3]) [    ] o.a.s.c.a.OverseerTriggerThread Refreshing /autoscaling.json with znode version 15
   [junit4]   2> 53023 DEBUG (TEST-TestSimTriggerIntegration.testNodeLostTrigger-seed#[D02FFFAB803928F3]) [    ] o.a.s.c.a.s.SimNodeStateProvider - removing dead node values: 127.0.0.1:10003_solr
   [junit4]   2> 53024 INFO  (TEST-TestSimTriggerIntegration.testNodeLostTrigger-seed#[D02FFFAB803928F3]) [    ] o.a.s.c.a.s.SimCloudManager === Restarting OverseerTriggerThread and clearing object cache...
   [junit4]   2> 53036 WARN  (Simulated OverseerAutoScalingTriggerThread) [    ] o.a.s.c.a.OverseerTriggerThread OverseerTriggerThread woken up but we are closed, exiting.
   [junit4]   2> 53037 DEBUG (TEST-TestSimTriggerIntegration.testNodeLostTrigger-seed#[D02FFFAB803928F3]) [    ] o.a.s.c.a.ScheduledTriggers Shutting down scheduled thread pool executor now
   [junit4]   2> 53037 DEBUG (TEST-TestSimTriggerIntegration.testNodeLostTrigger-seed#[D02FFFAB803928F3]) [    ] o.a.s.c.a.ScheduledTriggers Shutting down action executor now
   [junit4]   2> 53037 DEBUG (TEST-TestSimTriggerIntegration.testNodeLostTrigger-seed#[D02FFFAB803928F3]) [    ] o.a.s.c.a.ScheduledTriggers Awaiting termination for action executor
   [junit4]   2> 53038 DEBUG (TEST-TestSimTriggerIntegration.testNodeLostTrigger-seed#[D02FFFAB803928F3]) [    ] o.a.s.c.a.ScheduledTriggers Awaiting termination for scheduled thread pool executor
   [junit4]   2> 53057 DEBUG (TEST-TestSimTriggerIntegration.testNodeLostTrigger-seed#[D02FFFAB803928F3]) [    ] o.a.s.c.a.ScheduledTriggers ScheduledTriggers closed completely
   [junit4]   2> 53057 DEBUG (TEST-TestSimTriggerIntegration.testNodeLostTrigger-seed#[D02FFFAB803928F3]) [    ] o.a.s.c.a.OverseerTriggerThread OverseerTriggerThread has been closed explicitly
   [junit4]   2> 53067 DEBUG (Simulated OverseerAutoScalingTriggerThread) [    ] o.a.s.c.a.OverseerTriggerThread Adding .auto_add_replicas and .scheduled_maintenance triggers
   [junit4]   2> 53069 DEBUG (Simulated OverseerAutoScalingTriggerThread) [    ] o.a.s.c.a.OverseerTriggerThread Refreshing /autoscaling.json with znode version 16
   [junit4]   2> 53086 DEBUG (Simulated OverseerAutoScalingTriggerThread) [    ] o.a.s.c.a.OverseerTriggerThread Current znodeVersion 16, lastZnodeVersion -1
   [junit4]   2> 53086 DEBUG (Simulated OverseerAutoScalingTriggerThread) [    ] o.a.s.c.a.OverseerTriggerThread Processed trigger updates upto znodeVersion 16
   [junit4]   2> 53104 DEBUG (Simulated OverseerAutoScalingTriggerThread) [    ] o.a.s.c.a.NodeLostTrigger NodeLostTrigger .auto_add_replicas - Initial livenodes: [127.0.0.1:10001_solr, 127.0.0.1:10000_solr]
   [junit4]   2> 53105 DEBUG (Simulated OverseerAutoScalingTriggerThread) [    ] o.a.s.c.a.OverseerTriggerThread -- clean old nodeAdded markers
   [junit4]   2> 53105 DEBUG (Simulated OverseerAutoScalingTriggerThread) [    ] o.a.s.c.a.OverseerTriggerThread Current znodeVersion 16, lastZnodeVersion 16
   [junit4]   2> 53118 DEBUG (ScheduledTrigger-17-thread-2) [    ] o.a.s.c.a.NodeLostTrigger Running NodeLostTrigger: .auto_add_replicas with currently live nodes: 2
   [junit4]   2> 53139 DEBUG (ScheduledTrigger-17-thread-1) [    ] o.a.s.c.a.NodeLostTrigger Running NodeLostTrigger: .auto_add_replicas with currently live nodes: 2
   [junit4]   2> 53160 DEBUG (ScheduledTrigger-17-thread-4) [    ] o.a.s.c.a.NodeLostTrigger Running NodeLostTrigger: .auto_add_replicas with currently live nodes: 2
   [junit4]   2> 53166 DEBUG (simCloudManagerPool-16-thread-1) [    ] o.a.s.c.a.AutoScalingHandler Verified autoscaling configuration
   [junit4]   2> 53188 DEBUG (ScheduledTrigger-17-thread-4) [    ] o.a.s.c.a.NodeLostTrigger Running NodeLostTrigger: .auto_add_replicas with currently live nodes: 2
   [junit4]   2> 53224 DEBUG (ScheduledTrigger-17-thread-4) [    ] o.a.s.c.a.NodeLostTrigger Running NodeLostTrigger: .auto_add_replicas with currently live nodes: 2
   [junit4]   2> 53240 DEBUG (simCloudManagerPool-16-thread-1) [    ] o.a.s.c.a.OverseerTriggerThread Refreshing /autoscaling.json with znode version 17
   [junit4]   2> 53243 DEBUG (Simulated OverseerAutoScalingTriggerThread) [    ] o.a.s.c.a.OverseerTriggerThread Processed trigger updates upto znodeVersion 17
   [junit4]   2> 53243 DEBUG (Simulated OverseerAutoScalingTriggerThread) [    ] o.a.s.c.a.OverseerTriggerThread -- clean old nodeAdded markers
   [junit4]   2> 53243 DEBUG (Simulated OverseerAutoScalingTriggerThread) [    ] o.a.s.c.a.OverseerTriggerThread Current znodeVersion 17, lastZnodeVersion 17
   [junit4]   2> 53260 DEBUG (ScheduledTrigger-17-thread-4) [    ] o.a.s.c.a.NodeLostTrigger Running NodeLostTrigger: .auto_add_replicas with currently live nodes: 2
   [junit4]   2> 53297 DEBUG (ScheduledTrigger-17-thread-4) [    ] o.a.s.c.a.NodeLostTrigger Running NodeLostTrigger: .auto_add_replicas with currently live nodes: 2
   [junit4]   2> 53301 DEBUG (simCloudManagerPool-16-thread-2) [    ] o.a.s.c.a.s.SimClusterStateProvider -- submit leader election for .system / shard1
   [junit4]   2> 53322 DEBUG (simCloudManagerPool-16-thread-3) [    ] o.a.s.c.a.s.SimClusterStateProvider Running leader election for .system / shard1
   [junit4]   2> 53374 DEBUG (ScheduledTrigger-17-thread-4) [    ] o.a.s.c.a.NodeLostTrigger Running NodeLostTrigger: .auto_add_replicas with currently live nodes: 2
   [junit4]   2> 53395 DEBUG (simCloudManagerPool-16-thread-3) [    ] o.a.s.c.a.s.SimClusterStateProvider -- elected new leader for .system / shard1: core_node4
   [junit4]   2> 53395 DEBUG (ScheduledTrigger-17-thread-4) [    ] o.a.s.c.a.NodeLostTrigger Running NodeLostTrigger: .auto_add_replicas with currently live nodes: 2
   [junit4]   2> 53412 DEBUG (simCloudManagerPool-16-thread-4) [    ] o.a.s.c.a.AutoScalingHandler Verified autoscaling configuration
   [junit4]   2> 53413 DEBUG (simCloudManagerPool-16-thread-4) [    ] o.a.s.c.a.OverseerTriggerThread Refreshing /autoscaling.json with znode version 18
   [junit4]   2> 53413 DEBUG (Simulated OverseerAutoScalingTriggerThread) [    ] o.a.s.c.a.OverseerTriggerThread Processed trigger updates upto znodeVersion 18
   [junit4]   2> 53414 INFO  (Simulated OverseerAutoScalingTriggerThread) [    ] o.a.s.c.a.s.TestSimTriggerIntegration TestTriggerAction init
   [junit4]   2> 53414 DEBUG (Simulated OverseerAutoScalingTriggerThread) [    ] o.a.s.c.a.NodeLostTrigger NodeLostTrigger node_lost_trigger - Initial livenodes: [127.0.0.1:10001_solr, 127.0.0.1:10000_solr]
   [junit4]   2> 53414 DEBUG (Simulated OverseerAutoScalingTriggerThread) [    ] o.a.s.c.a.OverseerTriggerThread -- clean old nodeAdded markers
   [junit4]   2> 53414 DEBUG (Simulated OverseerAutoScalingTriggerThread) [    ] o.a.s.c.a.OverseerTriggerThread Current znodeVersion 18, lastZnodeVersion 18
   [junit4]   2> 53415 DEBUG (ScheduledTrigger-17-thread-1) [    ] o.a.s.c.a.NodeLostTrigger Running NodeLostTrigger: node_lost_trigger with currently live nodes: 2
   [junit4]   2> 53427 DEBUG (ScheduledTrigger-17-thread-1) [    ] o.a.s.c.a.NodeLostTrigger Running NodeLostTrigger: .auto_add_replicas with currently live nodes: 2
   [junit4]   2> 53443 DEBUG (ScheduledTrigger-17-thread-1) [    ] o.a.s.c.a.NodeLostTrigger Running NodeLostTrigger: node_lost_trigger with currently live nodes: 1
   [junit4]   2> 53444 DEBUG (ScheduledTrigger-17-thread-1) [    ] o.a.s.c.a.NodeLostTrigger Tracking lost node: 127.0.0.1:10001_solr
   [junit4]   2> 53447 DEBUG (ScheduledTrigger-17-thread-3) [    ] o.a.s.c.a.NodeLostTrigger Running NodeLostTrigger: .auto_add_replicas with currently live nodes: 1
   [junit4]   2> 53448 DEBUG (ScheduledTrigger-17-thread-3) [    ] o.a.s.c.a.NodeLostTrigger Tracking lost node: 127.0.0.1:10001_solr
   [junit4]   2> 53464 DEBUG (ScheduledTrigger-17-thread-1) [    ] o.a.s.c.a.NodeLostTrigger Running NodeLostTrigger: node_lost_trigger with currently live nodes: 1
   [junit4]   2> 53480 DEBUG (ScheduledTrigger-17-thread-1) [    ] o.a.s.c.a.NodeLostTrigger Running NodeLostTrigger: .auto_add_replicas with currently live nodes: 1
   [junit4]   2> 53500 DEBUG (ScheduledTrigger-17-thread-1) [    ] o.a.s.c.a.NodeLostTrigger Running NodeLostTrigger: node_lost_trigger with currently live nodes: 1
   [junit4]   2> 53501 DEBUG (ScheduledTrigger-17-thread-1) [    ] o.a.s.c.a.Node

[...truncated too long message...]

ivy-fail-disallowed-ivy-version:

ivy-fail:

ivy-fail:

ivy-configure:
[ivy:configure] :: loading settings :: file = /home/jenkins/jenkins-slave/workspace/Lucene-Solr-Tests-master/lucene/top-level-ivy-settings.xml

resolve:

ivy-availability-check:
[loadresource] Do not set property disallowed.ivy.jars.list as its length is 0.

-ivy-fail-disallowed-ivy-version:

ivy-fail:

ivy-configure:
[ivy:configure] :: loading settings :: file = /home/jenkins/jenkins-slave/workspace/Lucene-Solr-Tests-master/lucene/top-level-ivy-settings.xml

resolve:

ivy-availability-check:
[loadresource] Do not set property disallowed.ivy.jars.list as its length is 0.

-ivy-fail-disallowed-ivy-version:

ivy-fail:

ivy-fail:

ivy-configure:
[ivy:configure] :: loading settings :: file = /home/jenkins/jenkins-slave/workspace/Lucene-Solr-Tests-master/lucene/top-level-ivy-settings.xml

resolve:

ivy-availability-check:
[loadresource] Do not set property disallowed.ivy.jars.list as its length is 0.

-ivy-fail-disallowed-ivy-version:

ivy-fail:

ivy-configure:
[ivy:configure] :: loading settings :: file = /home/jenkins/jenkins-slave/workspace/Lucene-Solr-Tests-master/lucene/top-level-ivy-settings.xml

resolve:

ivy-availability-check:
[loadresource] Do not set property disallowed.ivy.jars.list as its length is 0.

-ivy-fail-disallowed-ivy-version:

ivy-fail:

ivy-fail:

ivy-configure:
[ivy:configure] :: loading settings :: file = /home/jenkins/jenkins-slave/workspace/Lucene-Solr-Tests-master/lucene/top-level-ivy-settings.xml

resolve:

ivy-availability-check:
[loadresource] Do not set property disallowed.ivy.jars.list as its length is 0.

-ivy-fail-disallowed-ivy-version:

ivy-fail:

ivy-fail:

ivy-configure:
[ivy:configure] :: loading settings :: file = /home/jenkins/jenkins-slave/workspace/Lucene-Solr-Tests-master/lucene/top-level-ivy-settings.xml

resolve:

ivy-availability-check:
[loadresource] Do not set property disallowed.ivy.jars.list as its length is 0.

-ivy-fail-disallowed-ivy-version:

ivy-fail:

ivy-fail:

ivy-configure:
[ivy:configure] :: loading settings :: file = /home/jenkins/jenkins-slave/workspace/Lucene-Solr-Tests-master/lucene/top-level-ivy-settings.xml

resolve:

ivy-availability-check:
[loadresource] Do not set property disallowed.ivy.jars.list as its length is 0.

-ivy-fail-disallowed-ivy-version:

ivy-fail:

ivy-fail:

ivy-configure:
[ivy:configure] :: loading settings :: file = /home/jenkins/jenkins-slave/workspace/Lucene-Solr-Tests-master/lucene/top-level-ivy-settings.xml

resolve:

ivy-availability-check:
[loadresource] Do not set property disallowed.ivy.jars.list as its length is 0.

-ivy-fail-disallowed-ivy-version:

ivy-fail:

ivy-fail:

ivy-configure:
[ivy:configure] :: loading settings :: file = /home/jenkins/jenkins-slave/workspace/Lucene-Solr-Tests-master/lucene/top-level-ivy-settings.xml

resolve:

ivy-availability-check:
[loadresource] Do not set property disallowed.ivy.jars.list as its length is 0.

-ivy-fail-disallowed-ivy-version:

ivy-fail:

ivy-fail:

ivy-configure:
[ivy:configure] :: loading settings :: file = /home/jenkins/jenkins-slave/workspace/Lucene-Solr-Tests-master/lucene/top-level-ivy-settings.xml

resolve:

ivy-availability-check:
[loadresource] Do not set property disallowed.ivy.jars.list as its length is 0.

-ivy-fail-disallowed-ivy-version:

ivy-fail:

ivy-fail:

ivy-configure:
[ivy:configure] :: loading settings :: file = /home/jenkins/jenkins-slave/workspace/Lucene-Solr-Tests-master/lucene/top-level-ivy-settings.xml

resolve:

ivy-availability-check:
[loadresource] Do not set property disallowed.ivy.jars.list as its length is 0.

-ivy-fail-disallowed-ivy-version:

ivy-fail:

ivy-fail:

ivy-configure:
[ivy:configure] :: loading settings :: file = /home/jenkins/jenkins-slave/workspace/Lucene-Solr-Tests-master/lucene/top-level-ivy-settings.xml

resolve:

ivy-availability-check:
[loadresource] Do not set property disallowed.ivy.jars.list as its length is 0.

-ivy-fail-disallowed-ivy-version:

ivy-fail:

ivy-fail:

ivy-configure:
[ivy:configure] :: loading settings :: file = /home/jenkins/jenkins-slave/workspace/Lucene-Solr-Tests-master/lucene/top-level-ivy-settings.xml

resolve:

ivy-availability-check:
[loadresource] Do not set property disallowed.ivy.jars.list as its length is 0.

-ivy-fail-disallowed-ivy-version:

ivy-fail:

ivy-fail:

ivy-configure:
[ivy:configure] :: loading settings :: file = /home/jenkins/jenkins-slave/workspace/Lucene-Solr-Tests-master/lucene/top-level-ivy-settings.xml

resolve:

jar-checksums:
    [mkdir] Created dir: /home/jenkins/jenkins-slave/workspace/Lucene-Solr-Tests-master/solr/null1232536622
     [copy] Copying 238 files to /home/jenkins/jenkins-slave/workspace/Lucene-Solr-Tests-master/solr/null1232536622
   [delete] Deleting directory /home/jenkins/jenkins-slave/workspace/Lucene-Solr-Tests-master/solr/null1232536622

check-working-copy:
[ivy:cachepath] :: resolving dependencies :: org.eclipse.jgit#org.eclipse.jgit-caller;working
[ivy:cachepath] 	confs: [default]
[ivy:cachepath] 	found org.eclipse.jgit#org.eclipse.jgit;4.6.0.201612231935-r in public
[ivy:cachepath] 	found com.jcraft#jsch;0.1.53 in public
[ivy:cachepath] 	found com.googlecode.javaewah#JavaEWAH;1.1.6 in public
[ivy:cachepath] 	found org.apache.httpcomponents#httpclient;4.3.6 in public
[ivy:cachepath] 	found org.apache.httpcomponents#httpcore;4.3.3 in public
[ivy:cachepath] 	found commons-logging#commons-logging;1.1.3 in public
[ivy:cachepath] 	found commons-codec#commons-codec;1.6 in public
[ivy:cachepath] 	found org.slf4j#slf4j-api;1.7.2 in public
[ivy:cachepath] :: resolution report :: resolve 46ms :: artifacts dl 1ms
	---------------------------------------------------------------------
	|                  |            modules            ||   artifacts   |
	|       conf       | number| search|dwnlded|evicted|| number|dwnlded|
	---------------------------------------------------------------------
	|      default     |   8   |   0   |   0   |   0   ||   8   |   0   |
	---------------------------------------------------------------------
[wc-checker] Initializing working copy...
[wc-checker] SLF4J: Failed to load class "org.slf4j.impl.StaticLoggerBinder".
[wc-checker] SLF4J: Defaulting to no-operation (NOP) logger implementation
[wc-checker] SLF4J: See http://www.slf4j.org/codes.html#StaticLoggerBinder for further details.
[wc-checker] Checking working copy status...

-jenkins-base:

BUILD SUCCESSFUL
Total time: 215 minutes 53 seconds
Archiving artifacts
java.lang.InterruptedException: no matches found within 10000
	at hudson.FilePath$34.hasMatch(FilePath.java:2678)
	at hudson.FilePath$34.invoke(FilePath.java:2557)
	at hudson.FilePath$34.invoke(FilePath.java:2547)
	at hudson.FilePath$FileCallableWrapper.call(FilePath.java:2918)
Also:   hudson.remoting.Channel$CallSiteStackTrace: Remote call to lucene2
		at hudson.remoting.Channel.attachCallSiteStackTrace(Channel.java:1741)
		at hudson.remoting.UserRequest$ExceptionResponse.retrieve(UserRequest.java:357)
		at hudson.remoting.Channel.call(Channel.java:955)
		at hudson.FilePath.act(FilePath.java:1036)
		at hudson.FilePath.act(FilePath.java:1025)
		at hudson.FilePath.validateAntFileMask(FilePath.java:2547)
		at hudson.tasks.ArtifactArchiver.perform(ArtifactArchiver.java:243)
		at hudson.tasks.BuildStepCompatibilityLayer.perform(BuildStepCompatibilityLayer.java:81)
		at hudson.tasks.BuildStepMonitor$1.perform(BuildStepMonitor.java:20)
		at hudson.model.AbstractBuild$AbstractBuildExecution.perform(AbstractBuild.java:744)
		at hudson.model.AbstractBuild$AbstractBuildExecution.performAllBuildSteps(AbstractBuild.java:690)
		at hudson.model.Build$BuildExecution.post2(Build.java:186)
		at hudson.model.AbstractBuild$AbstractBuildExecution.post(AbstractBuild.java:635)
		at hudson.model.Run.execute(Run.java:1819)
		at hudson.model.FreeStyleBuild.run(FreeStyleBuild.java:43)
		at hudson.model.ResourceController.execute(ResourceController.java:97)
		at hudson.model.Executor.run(Executor.java:429)
Caused: hudson.FilePath$TunneledInterruptedException
	at hudson.FilePath$FileCallableWrapper.call(FilePath.java:2920)
	at hudson.remoting.UserRequest.perform(UserRequest.java:212)
	at hudson.remoting.UserRequest.perform(UserRequest.java:54)
	at hudson.remoting.Request$2.run(Request.java:369)
	at hudson.remoting.InterceptingExecutorService$1.call(InterceptingExecutorService.java:72)
	at java.util.concurrent.FutureTask.run(FutureTask.java:266)
	at java.util.concurrent.ThreadPoolExecutor.runWorker(ThreadPoolExecutor.java:1142)
	at java.util.concurrent.ThreadPoolExecutor$Worker.run(ThreadPoolExecutor.java:617)
	at java.lang.Thread.run(Thread.java:748)
Caused: java.lang.InterruptedException: java.lang.InterruptedException: no matches found within 10000
	at hudson.FilePath.act(FilePath.java:1038)
	at hudson.FilePath.act(FilePath.java:1025)
	at hudson.FilePath.validateAntFileMask(FilePath.java:2547)
	at hudson.tasks.ArtifactArchiver.perform(ArtifactArchiver.java:243)
	at hudson.tasks.BuildStepCompatibilityLayer.perform(BuildStepCompatibilityLayer.java:81)
	at hudson.tasks.BuildStepMonitor$1.perform(BuildStepMonitor.java:20)
	at hudson.model.AbstractBuild$AbstractBuildExecution.perform(AbstractBuild.java:744)
	at hudson.model.AbstractBuild$AbstractBuildExecution.performAllBuildSteps(AbstractBuild.java:690)
	at hudson.model.Build$BuildExecution.post2(Build.java:186)
	at hudson.model.AbstractBuild$AbstractBuildExecution.post(AbstractBuild.java:635)
	at hudson.model.Run.execute(Run.java:1819)
	at hudson.model.FreeStyleBuild.run(FreeStyleBuild.java:43)
	at hudson.model.ResourceController.execute(ResourceController.java:97)
	at hudson.model.Executor.run(Executor.java:429)
No artifacts found that match the file pattern "**/*.events,heapdumps/**,**/hs_err_pid*". Configuration error?
Recording test results
Build step 'Publish JUnit test result report' changed build result to UNSTABLE
Email was triggered for: Unstable (Test Failures)
Sending email for trigger: Unstable (Test Failures)

Mime
View raw message