lucene-dev mailing list archives

Site index · List index
Message view « Date » · « Thread »
Top « Date » · « Thread »
From Policeman Jenkins Server <jenk...@thetaphi.de>
Subject [JENKINS] Lucene-Solr-7.x-Linux (64bit/jdk1.8.0_172) - Build # 2776 - Unstable!
Date Thu, 20 Sep 2018 11:21:34 GMT
Build: https://jenkins.thetaphi.de/job/Lucene-Solr-7.x-Linux/2776/
Java: 64bit/jdk1.8.0_172 -XX:-UseCompressedOops -XX:+UseConcMarkSweepGC

1 tests failed.
FAILED:  org.apache.solr.cloud.TestWithCollection.testAddReplicaWithPolicy

Error Message:
Error from server at https://127.0.0.1:43629/solr: Collection: testMoveReplicaMainCollection_abc is co-located with collection: testMoveReplicaMainCollection_xyz remove the link using modify collection API or delete the co-located collection: testMoveReplicaMainCollection_xyz

Stack Trace:
org.apache.solr.client.solrj.impl.HttpSolrClient$RemoteSolrException: Error from server at https://127.0.0.1:43629/solr: Collection: testMoveReplicaMainCollection_abc is co-located with collection: testMoveReplicaMainCollection_xyz remove the link using modify collection API or delete the co-located collection: testMoveReplicaMainCollection_xyz
	at __randomizedtesting.SeedInfo.seed([AEBD9C0133E3AE84:35E7555B94AB3108]:0)
	at org.apache.solr.client.solrj.impl.HttpSolrClient.executeMethod(HttpSolrClient.java:643)
	at org.apache.solr.client.solrj.impl.HttpSolrClient.request(HttpSolrClient.java:255)
	at org.apache.solr.client.solrj.impl.HttpSolrClient.request(HttpSolrClient.java:244)
	at org.apache.solr.client.solrj.impl.LBHttpSolrClient.doRequest(LBHttpSolrClient.java:483)
	at org.apache.solr.client.solrj.impl.LBHttpSolrClient.request(LBHttpSolrClient.java:413)
	at org.apache.solr.client.solrj.impl.CloudSolrClient.sendRequest(CloudSolrClient.java:1107)
	at org.apache.solr.client.solrj.impl.CloudSolrClient.requestWithRetryOnStaleState(CloudSolrClient.java:884)
	at org.apache.solr.client.solrj.impl.CloudSolrClient.request(CloudSolrClient.java:817)
	at org.apache.solr.client.solrj.SolrRequest.process(SolrRequest.java:194)
	at org.apache.solr.client.solrj.SolrRequest.process(SolrRequest.java:211)
	at org.apache.solr.cloud.MiniSolrCloudCluster.deleteAllCollections(MiniSolrCloudCluster.java:461)
	at org.apache.solr.cloud.TestWithCollection.setUp(TestWithCollection.java:94)
	at sun.reflect.GeneratedMethodAccessor36.invoke(Unknown Source)
	at sun.reflect.DelegatingMethodAccessorImpl.invoke(DelegatingMethodAccessorImpl.java:43)
	at java.lang.reflect.Method.invoke(Method.java:498)
	at com.carrotsearch.randomizedtesting.RandomizedRunner.invoke(RandomizedRunner.java:1742)
	at com.carrotsearch.randomizedtesting.RandomizedRunner$9.evaluate(RandomizedRunner.java:969)
	at com.carrotsearch.randomizedtesting.RandomizedRunner$10.evaluate(RandomizedRunner.java:985)
	at com.carrotsearch.randomizedtesting.rules.SystemPropertiesRestoreRule$1.evaluate(SystemPropertiesRestoreRule.java:57)
	at org.apache.lucene.util.TestRuleSetupTeardownChained$1.evaluate(TestRuleSetupTeardownChained.java:49)
	at org.apache.lucene.util.AbstractBeforeAfterRule$1.evaluate(AbstractBeforeAfterRule.java:45)
	at org.apache.lucene.util.TestRuleThreadAndTestName$1.evaluate(TestRuleThreadAndTestName.java:48)
	at org.apache.lucene.util.TestRuleIgnoreAfterMaxFailures$1.evaluate(TestRuleIgnoreAfterMaxFailures.java:64)
	at org.apache.lucene.util.TestRuleMarkFailure$1.evaluate(TestRuleMarkFailure.java:47)
	at com.carrotsearch.randomizedtesting.rules.StatementAdapter.evaluate(StatementAdapter.java:36)
	at com.carrotsearch.randomizedtesting.ThreadLeakControl$StatementRunner.run(ThreadLeakControl.java:368)
	at com.carrotsearch.randomizedtesting.ThreadLeakControl.forkTimeoutingTask(ThreadLeakControl.java:817)
	at com.carrotsearch.randomizedtesting.ThreadLeakControl$3.evaluate(ThreadLeakControl.java:468)
	at com.carrotsearch.randomizedtesting.RandomizedRunner.runSingleTest(RandomizedRunner.java:944)
	at com.carrotsearch.randomizedtesting.RandomizedRunner$5.evaluate(RandomizedRunner.java:830)
	at com.carrotsearch.randomizedtesting.RandomizedRunner$6.evaluate(RandomizedRunner.java:880)
	at com.carrotsearch.randomizedtesting.RandomizedRunner$7.evaluate(RandomizedRunner.java:891)
	at com.carrotsearch.randomizedtesting.rules.StatementAdapter.evaluate(StatementAdapter.java:36)
	at com.carrotsearch.randomizedtesting.rules.SystemPropertiesRestoreRule$1.evaluate(SystemPropertiesRestoreRule.java:57)
	at org.apache.lucene.util.AbstractBeforeAfterRule$1.evaluate(AbstractBeforeAfterRule.java:45)
	at com.carrotsearch.randomizedtesting.rules.StatementAdapter.evaluate(StatementAdapter.java:36)
	at org.apache.lucene.util.TestRuleStoreClassName$1.evaluate(TestRuleStoreClassName.java:41)
	at com.carrotsearch.randomizedtesting.rules.NoShadowingOrOverridesOnMethodsRule$1.evaluate(NoShadowingOrOverridesOnMethodsRule.java:40)
	at com.carrotsearch.randomizedtesting.rules.NoShadowingOrOverridesOnMethodsRule$1.evaluate(NoShadowingOrOverridesOnMethodsRule.java:40)
	at com.carrotsearch.randomizedtesting.rules.StatementAdapter.evaluate(StatementAdapter.java:36)
	at com.carrotsearch.randomizedtesting.rules.StatementAdapter.evaluate(StatementAdapter.java:36)
	at com.carrotsearch.randomizedtesting.rules.StatementAdapter.evaluate(StatementAdapter.java:36)
	at org.apache.lucene.util.TestRuleAssertionsRequired$1.evaluate(TestRuleAssertionsRequired.java:53)
	at org.apache.lucene.util.TestRuleMarkFailure$1.evaluate(TestRuleMarkFailure.java:47)
	at org.apache.lucene.util.TestRuleIgnoreAfterMaxFailures$1.evaluate(TestRuleIgnoreAfterMaxFailures.java:64)
	at org.apache.lucene.util.TestRuleIgnoreTestSuites$1.evaluate(TestRuleIgnoreTestSuites.java:54)
	at com.carrotsearch.randomizedtesting.rules.StatementAdapter.evaluate(StatementAdapter.java:36)
	at com.carrotsearch.randomizedtesting.ThreadLeakControl$StatementRunner.run(ThreadLeakControl.java:368)
	at java.lang.Thread.run(Thread.java:748)




Build Log:
[...truncated 14219 lines...]
   [junit4] Suite: org.apache.solr.cloud.TestWithCollection
   [junit4]   2> 1962742 INFO  (SUITE-TestWithCollection-seed#[AEBD9C0133E3AE84]-worker) [    ] o.a.s.SolrTestCaseJ4 SecureRandom sanity checks: test.solr.allowed.securerandom=null & java.security.egd=file:/dev/./urandom
   [junit4]   2> Creating dataDir: /home/jenkins/workspace/Lucene-Solr-7.x-Linux/solr/build/solr-core/test/J0/temp/solr.cloud.TestWithCollection_AEBD9C0133E3AE84-001/init-core-data-001
   [junit4]   2> 1962743 WARN  (SUITE-TestWithCollection-seed#[AEBD9C0133E3AE84]-worker) [    ] o.a.s.SolrTestCaseJ4 startTrackingSearchers: numOpens=616 numCloses=616
   [junit4]   2> 1962744 INFO  (SUITE-TestWithCollection-seed#[AEBD9C0133E3AE84]-worker) [    ] o.a.s.SolrTestCaseJ4 Using PointFields (NUMERIC_POINTS_SYSPROP=true) w/NUMERIC_DOCVALUES_SYSPROP=false
   [junit4]   2> 1962745 INFO  (SUITE-TestWithCollection-seed#[AEBD9C0133E3AE84]-worker) [    ] o.a.s.SolrTestCaseJ4 Randomized ssl (true) and clientAuth (true) via: @org.apache.solr.util.RandomizeSSL(reason=, ssl=NaN, value=NaN, clientAuth=NaN)
   [junit4]   2> 1962745 INFO  (SUITE-TestWithCollection-seed#[AEBD9C0133E3AE84]-worker) [    ] o.a.s.c.MiniSolrCloudCluster Starting cluster of 2 servers in /home/jenkins/workspace/Lucene-Solr-7.x-Linux/solr/build/solr-core/test/J0/temp/solr.cloud.TestWithCollection_AEBD9C0133E3AE84-001/tempDir-001
   [junit4]   2> 1962746 INFO  (SUITE-TestWithCollection-seed#[AEBD9C0133E3AE84]-worker) [    ] o.a.s.c.ZkTestServer STARTING ZK TEST SERVER
   [junit4]   2> 1962746 INFO  (Thread-4765) [    ] o.a.s.c.ZkTestServer client port:0.0.0.0/0.0.0.0:0
   [junit4]   2> 1962746 INFO  (Thread-4765) [    ] o.a.s.c.ZkTestServer Starting server
   [junit4]   2> 1962748 ERROR (Thread-4765) [    ] o.a.z.s.ZooKeeperServer ZKShutdownHandler is not registered, so ZooKeeper server won't take any action on ERROR or SHUTDOWN server state changes
   [junit4]   2> 1962846 INFO  (SUITE-TestWithCollection-seed#[AEBD9C0133E3AE84]-worker) [    ] o.a.s.c.ZkTestServer start zk server on port:32899
   [junit4]   2> 1962848 INFO  (zkConnectionManagerCallback-5316-thread-1) [    ] o.a.s.c.c.ConnectionManager zkClient has connected
   [junit4]   2> 1962856 INFO  (jetty-launcher-5313-thread-1) [    ] o.e.j.s.Server jetty-9.4.11.v20180605; built: 2018-06-05T18:24:03.829Z; git: d5fc0523cfa96bfebfbda19606cad384d772f04c; jvm 1.8.0_172-b11
   [junit4]   2> 1962857 INFO  (jetty-launcher-5313-thread-2) [    ] o.e.j.s.Server jetty-9.4.11.v20180605; built: 2018-06-05T18:24:03.829Z; git: d5fc0523cfa96bfebfbda19606cad384d772f04c; jvm 1.8.0_172-b11
   [junit4]   2> 1962893 INFO  (jetty-launcher-5313-thread-1) [    ] o.e.j.s.session DefaultSessionIdManager workerName=node0
   [junit4]   2> 1962893 INFO  (jetty-launcher-5313-thread-1) [    ] o.e.j.s.session No SessionScavenger set, using defaults
   [junit4]   2> 1962893 INFO  (jetty-launcher-5313-thread-1) [    ] o.e.j.s.session node0 Scavenging every 660000ms
   [junit4]   2> 1962893 INFO  (jetty-launcher-5313-thread-2) [    ] o.e.j.s.session DefaultSessionIdManager workerName=node0
   [junit4]   2> 1962894 INFO  (jetty-launcher-5313-thread-2) [    ] o.e.j.s.session No SessionScavenger set, using defaults
   [junit4]   2> 1962894 INFO  (jetty-launcher-5313-thread-2) [    ] o.e.j.s.session node0 Scavenging every 600000ms
   [junit4]   2> 1962894 INFO  (jetty-launcher-5313-thread-1) [    ] o.e.j.s.h.ContextHandler Started o.e.j.s.ServletContextHandler@1a9bce60{/solr,null,AVAILABLE}
   [junit4]   2> 1962895 INFO  (jetty-launcher-5313-thread-2) [    ] o.e.j.s.h.ContextHandler Started o.e.j.s.ServletContextHandler@7c0c1333{/solr,null,AVAILABLE}
   [junit4]   2> 1962896 INFO  (jetty-launcher-5313-thread-1) [    ] o.e.j.s.AbstractConnector Started ServerConnector@15b23e8b{SSL,[ssl, http/1.1]}{127.0.0.1:44249}
   [junit4]   2> 1962896 INFO  (jetty-launcher-5313-thread-2) [    ] o.e.j.s.AbstractConnector Started ServerConnector@21eb061f{SSL,[ssl, http/1.1]}{127.0.0.1:43629}
   [junit4]   2> 1962896 INFO  (jetty-launcher-5313-thread-2) [    ] o.e.j.s.Server Started @1962931ms
   [junit4]   2> 1962896 INFO  (jetty-launcher-5313-thread-1) [    ] o.e.j.s.Server Started @1962931ms
   [junit4]   2> 1962896 INFO  (jetty-launcher-5313-thread-2) [    ] o.a.s.c.s.e.JettySolrRunner Jetty properties: {hostContext=/solr, hostPort=43629}
   [junit4]   2> 1962896 INFO  (jetty-launcher-5313-thread-1) [    ] o.a.s.c.s.e.JettySolrRunner Jetty properties: {hostContext=/solr, hostPort=44249}
   [junit4]   2> 1962896 ERROR (jetty-launcher-5313-thread-2) [    ] o.a.s.u.StartupLoggingUtils Missing Java Option solr.log.dir. Logging may be missing or incomplete.
   [junit4]   2> 1962896 ERROR (jetty-launcher-5313-thread-1) [    ] o.a.s.u.StartupLoggingUtils Missing Java Option solr.log.dir. Logging may be missing or incomplete.
   [junit4]   2> 1962896 INFO  (jetty-launcher-5313-thread-2) [    ] o.a.s.s.SolrDispatchFilter Using logger factory org.apache.logging.slf4j.Log4jLoggerFactory
   [junit4]   2> 1962896 INFO  (jetty-launcher-5313-thread-1) [    ] o.a.s.s.SolrDispatchFilter Using logger factory org.apache.logging.slf4j.Log4jLoggerFactory
   [junit4]   2> 1962896 INFO  (jetty-launcher-5313-thread-2) [    ] o.a.s.s.SolrDispatchFilter  ___      _       Welcome to Apache Solr? version 7.6.0
   [junit4]   2> 1962896 INFO  (jetty-launcher-5313-thread-1) [    ] o.a.s.s.SolrDispatchFilter  ___      _       Welcome to Apache Solr? version 7.6.0
   [junit4]   2> 1962896 INFO  (jetty-launcher-5313-thread-2) [    ] o.a.s.s.SolrDispatchFilter / __| ___| |_ _   Starting in cloud mode on port null
   [junit4]   2> 1962896 INFO  (jetty-launcher-5313-thread-1) [    ] o.a.s.s.SolrDispatchFilter / __| ___| |_ _   Starting in cloud mode on port null
   [junit4]   2> 1962896 INFO  (jetty-launcher-5313-thread-2) [    ] o.a.s.s.SolrDispatchFilter \__ \/ _ \ | '_|  Install dir: null
   [junit4]   2> 1962896 INFO  (jetty-launcher-5313-thread-1) [    ] o.a.s.s.SolrDispatchFilter \__ \/ _ \ | '_|  Install dir: null
   [junit4]   2> 1962896 INFO  (jetty-launcher-5313-thread-2) [    ] o.a.s.s.SolrDispatchFilter |___/\___/_|_|    Start time: 2018-09-20T10:44:16.757Z
   [junit4]   2> 1962896 INFO  (jetty-launcher-5313-thread-1) [    ] o.a.s.s.SolrDispatchFilter |___/\___/_|_|    Start time: 2018-09-20T10:44:16.757Z
   [junit4]   2> 1962906 INFO  (zkConnectionManagerCallback-5320-thread-1) [    ] o.a.s.c.c.ConnectionManager zkClient has connected
   [junit4]   2> 1962906 INFO  (zkConnectionManagerCallback-5319-thread-1) [    ] o.a.s.c.c.ConnectionManager zkClient has connected
   [junit4]   2> 1962907 INFO  (jetty-launcher-5313-thread-2) [    ] o.a.s.s.SolrDispatchFilter solr.xml found in ZooKeeper. Loading...
   [junit4]   2> 1962907 INFO  (jetty-launcher-5313-thread-1) [    ] o.a.s.s.SolrDispatchFilter solr.xml found in ZooKeeper. Loading...
   [junit4]   2> 1962976 INFO  (jetty-launcher-5313-thread-2) [    ] o.a.s.c.ZkContainer Zookeeper client=127.0.0.1:32899/solr
   [junit4]   2> 1962977 INFO  (zkConnectionManagerCallback-5324-thread-1) [    ] o.a.s.c.c.ConnectionManager zkClient has connected
   [junit4]   2> 1962978 INFO  (zkConnectionManagerCallback-5326-thread-1) [    ] o.a.s.c.c.ConnectionManager zkClient has connected
   [junit4]   2> 1963048 INFO  (jetty-launcher-5313-thread-1) [    ] o.a.s.c.ZkContainer Zookeeper client=127.0.0.1:32899/solr
   [junit4]   2> 1963053 INFO  (jetty-launcher-5313-thread-2) [n:127.0.0.1:43629_solr    ] o.a.s.c.OverseerElectionContext I am going to be the leader 127.0.0.1:43629_solr
   [junit4]   2> 1963054 INFO  (jetty-launcher-5313-thread-2) [n:127.0.0.1:43629_solr    ] o.a.s.c.Overseer Overseer (id=72256557024018436-127.0.0.1:43629_solr-n_0000000000) starting
   [junit4]   2> 1963058 INFO  (zkConnectionManagerCallback-5332-thread-1) [    ] o.a.s.c.c.ConnectionManager zkClient has connected
   [junit4]   2> 1963066 INFO  (zkConnectionManagerCallback-5334-thread-1) [    ] o.a.s.c.c.ConnectionManager zkClient has connected
   [junit4]   2> 1963071 INFO  (jetty-launcher-5313-thread-1) [n:127.0.0.1:44249_solr    ] o.a.s.c.ZkController Register node as live in ZooKeeper:/live_nodes/127.0.0.1:44249_solr
   [junit4]   2> 1963083 INFO  (zkCallback-5325-thread-1) [    ] o.a.s.c.c.ZkStateReader Updated live nodes from ZooKeeper... (0) -> (1)
   [junit4]   2> 1963085 INFO  (zkCallback-5333-thread-1) [    ] o.a.s.c.c.ZkStateReader Updated live nodes from ZooKeeper... (0) -> (1)
   [junit4]   2> 1963086 INFO  (zkConnectionManagerCallback-5339-thread-1) [    ] o.a.s.c.c.ConnectionManager zkClient has connected
   [junit4]   2> 1963087 INFO  (jetty-launcher-5313-thread-2) [n:127.0.0.1:43629_solr    ] o.a.s.c.c.ZkStateReader Updated live nodes from ZooKeeper... (0) -> (1)
   [junit4]   2> 1963088 INFO  (jetty-launcher-5313-thread-2) [n:127.0.0.1:43629_solr    ] o.a.s.c.s.i.ZkClientClusterStateProvider Cluster at 127.0.0.1:32899/solr ready
   [junit4]   2> 1963088 INFO  (OverseerStateUpdate-72256557024018436-127.0.0.1:43629_solr-n_0000000000) [n:127.0.0.1:43629_solr    ] o.a.s.c.Overseer Starting to work on the main queue : 127.0.0.1:43629_solr
   [junit4]   2> 1963090 DEBUG (OverseerAutoScalingTriggerThread-72256557024018436-127.0.0.1:43629_solr-n_0000000000) [    ] o.a.s.c.a.OverseerTriggerThread Adding .auto_add_replicas and .scheduled_maintenance triggers
   [junit4]   2> 1963090 DEBUG (OverseerAutoScalingTriggerThread-72256557024018436-127.0.0.1:43629_solr-n_0000000000) [    ] o.a.s.c.a.OverseerTriggerThread Refreshing /autoscaling.json with znode version 1
   [junit4]   2> 1963090 INFO  (jetty-launcher-5313-thread-2) [n:127.0.0.1:43629_solr    ] o.a.s.c.TransientSolrCoreCacheDefault Allocating transient cache for 2147483647 transient cores
   [junit4]   2> 1963090 DEBUG (OverseerAutoScalingTriggerThread-72256557024018436-127.0.0.1:43629_solr-n_0000000000) [    ] o.a.s.c.a.OverseerTriggerThread Current znodeVersion 1, lastZnodeVersion -1
   [junit4]   2> 1963090 INFO  (jetty-launcher-5313-thread-2) [n:127.0.0.1:43629_solr    ] o.a.s.c.ZkController Register node as live in ZooKeeper:/live_nodes/127.0.0.1:43629_solr
   [junit4]   2> 1963090 DEBUG (OverseerAutoScalingTriggerThread-72256557024018436-127.0.0.1:43629_solr-n_0000000000) [    ] o.a.s.c.a.OverseerTriggerThread Processed trigger updates upto znodeVersion 1
   [junit4]   2> 1963090 DEBUG (OverseerStateUpdate-72256557024018436-127.0.0.1:43629_solr-n_0000000000) [n:127.0.0.1:43629_solr    ] o.a.s.c.o.NodeMutator DownNode state invoked for node: 127.0.0.1:43629_solr
   [junit4]   2> 1963091 INFO  (zkCallback-5333-thread-1) [    ] o.a.s.c.c.ZkStateReader Updated live nodes from ZooKeeper... (1) -> (2)
   [junit4]   2> 1963091 INFO  (zkCallback-5325-thread-1) [    ] o.a.s.c.c.ZkStateReader Updated live nodes from ZooKeeper... (1) -> (2)
   [junit4]   2> 1963091 INFO  (zkCallback-5338-thread-1) [    ] o.a.s.c.c.ZkStateReader Updated live nodes from ZooKeeper... (1) -> (2)
   [junit4]   2> 1963092 DEBUG (OverseerAutoScalingTriggerThread-72256557024018436-127.0.0.1:43629_solr-n_0000000000) [    ] o.a.s.c.a.NodeLostTrigger NodeLostTrigger .auto_add_replicas - Initial livenodes: [127.0.0.1:43629_solr, 127.0.0.1:44249_solr]
   [junit4]   2> 1963092 DEBUG (OverseerAutoScalingTriggerThread-72256557024018436-127.0.0.1:43629_solr-n_0000000000) [    ] o.a.s.c.a.OverseerTriggerThread -- clean old nodeAdded markers
   [junit4]   2> 1963093 DEBUG (OverseerAutoScalingTriggerThread-72256557024018436-127.0.0.1:43629_solr-n_0000000000) [    ] o.a.s.c.a.OverseerTriggerThread Current znodeVersion 1, lastZnodeVersion 1
   [junit4]   2> 1963093 DEBUG (ScheduledTrigger-6541-thread-1) [    ] o.a.s.c.a.NodeLostTrigger Running NodeLostTrigger: .auto_add_replicas with currently live nodes: 2
   [junit4]   2> 1963102 INFO  (jetty-launcher-5313-thread-2) [n:127.0.0.1:43629_solr    ] o.a.s.h.a.MetricsHistoryHandler No .system collection, keeping metrics history in memory.
   [junit4]   2> 1963114 INFO  (zkConnectionManagerCallback-5347-thread-1) [    ] o.a.s.c.c.ConnectionManager zkClient has connected
   [junit4]   2> 1963115 INFO  (jetty-launcher-5313-thread-1) [n:127.0.0.1:44249_solr    ] o.a.s.c.c.ZkStateReader Updated live nodes from ZooKeeper... (0) -> (2)
   [junit4]   2> 1963115 INFO  (jetty-launcher-5313-thread-1) [n:127.0.0.1:44249_solr    ] o.a.s.c.s.i.ZkClientClusterStateProvider Cluster at 127.0.0.1:32899/solr ready
   [junit4]   2> 1963116 INFO  (jetty-launcher-5313-thread-1) [n:127.0.0.1:44249_solr    ] o.a.s.h.a.MetricsHistoryHandler No .system collection, keeping metrics history in memory.
   [junit4]   2> 1963122 INFO  (jetty-launcher-5313-thread-2) [n:127.0.0.1:43629_solr    ] o.a.s.m.r.SolrJmxReporter JMX monitoring for 'solr_43629.solr.node' (registry 'solr.node') enabled at server: com.sun.jmx.mbeanserver.JmxMBeanServer@4fa4c48d
   [junit4]   2> 1963125 INFO  (jetty-launcher-5313-thread-1) [n:127.0.0.1:44249_solr    ] o.a.s.m.r.SolrJmxReporter JMX monitoring for 'solr_44249.solr.node' (registry 'solr.node') enabled at server: com.sun.jmx.mbeanserver.JmxMBeanServer@4fa4c48d
   [junit4]   2> 1963139 INFO  (jetty-launcher-5313-thread-2) [n:127.0.0.1:43629_solr    ] o.a.s.m.r.SolrJmxReporter JMX monitoring for 'solr_43629.solr.jvm' (registry 'solr.jvm') enabled at server: com.sun.jmx.mbeanserver.JmxMBeanServer@4fa4c48d
   [junit4]   2> 1963139 INFO  (jetty-launcher-5313-thread-2) [n:127.0.0.1:43629_solr    ] o.a.s.m.r.SolrJmxReporter JMX monitoring for 'solr_43629.solr.jetty' (registry 'solr.jetty') enabled at server: com.sun.jmx.mbeanserver.JmxMBeanServer@4fa4c48d
   [junit4]   2> 1963140 INFO  (jetty-launcher-5313-thread-2) [n:127.0.0.1:43629_solr    ] o.a.s.c.CorePropertiesLocator Found 0 core definitions underneath /home/jenkins/workspace/Lucene-Solr-7.x-Linux/solr/build/solr-core/test/J0/temp/solr.cloud.TestWithCollection_AEBD9C0133E3AE84-001/tempDir-001/node2/.
   [junit4]   2> 1963140 INFO  (jetty-launcher-5313-thread-1) [n:127.0.0.1:44249_solr    ] o.a.s.m.r.SolrJmxReporter JMX monitoring for 'solr_44249.solr.jvm' (registry 'solr.jvm') enabled at server: com.sun.jmx.mbeanserver.JmxMBeanServer@4fa4c48d
   [junit4]   2> 1963140 INFO  (jetty-launcher-5313-thread-1) [n:127.0.0.1:44249_solr    ] o.a.s.m.r.SolrJmxReporter JMX monitoring for 'solr_44249.solr.jetty' (registry 'solr.jetty') enabled at server: com.sun.jmx.mbeanserver.JmxMBeanServer@4fa4c48d
   [junit4]   2> 1963141 INFO  (jetty-launcher-5313-thread-1) [n:127.0.0.1:44249_solr    ] o.a.s.c.CorePropertiesLocator Found 0 core definitions underneath /home/jenkins/workspace/Lucene-Solr-7.x-Linux/solr/build/solr-core/test/J0/temp/solr.cloud.TestWithCollection_AEBD9C0133E3AE84-001/tempDir-001/node1/.
   [junit4]   2> 1963193 INFO  (zkConnectionManagerCallback-5350-thread-1) [    ] o.a.s.c.c.ConnectionManager zkClient has connected
   [junit4]   2> 1963203 INFO  (zkConnectionManagerCallback-5355-thread-1) [    ] o.a.s.c.c.ConnectionManager zkClient has connected
   [junit4]   2> 1963204 INFO  (SUITE-TestWithCollection-seed#[AEBD9C0133E3AE84]-worker) [    ] o.a.s.c.c.ZkStateReader Updated live nodes from ZooKeeper... (0) -> (2)
   [junit4]   2> 1963204 INFO  (SUITE-TestWithCollection-seed#[AEBD9C0133E3AE84]-worker) [    ] o.a.s.c.s.i.ZkClientClusterStateProvider Cluster at 127.0.0.1:32899/solr ready
   [junit4]   2> 1963241 INFO  (TEST-TestWithCollection.testMultipleWithCollections-seed#[AEBD9C0133E3AE84]) [    ] o.a.s.SolrTestCaseJ4 ###Starting testMultipleWithCollections
   [junit4]   2> 1963241 DEBUG (zkCallback-5338-thread-1) [    ] o.a.s.c.a.OverseerTriggerThread Refreshing /autoscaling.json with znode version 2
   [junit4]   2> 1963241 DEBUG (OverseerAutoScalingTriggerThread-72256557024018436-127.0.0.1:43629_solr-n_0000000000) [    ] o.a.s.c.a.OverseerTriggerThread Processed trigger updates upto znodeVersion 2
   [junit4]   2> 1963242 INFO  (TEST-TestWithCollection.testMultipleWithCollections-seed#[AEBD9C0133E3AE84]) [    ] o.a.s.c.c.ZkStateReader Updated live nodes from ZooKeeper... (0) -> (2)
   [junit4]   2> 1963245 DEBUG (OverseerAutoScalingTriggerThread-72256557024018436-127.0.0.1:43629_solr-n_0000000000) [    ] o.a.s.c.a.OverseerTriggerThread -- clean old nodeLost markers
   [junit4]   2> 1963245 DEBUG (OverseerAutoScalingTriggerThread-72256557024018436-127.0.0.1:43629_solr-n_0000000000) [    ] o.a.s.c.a.OverseerTriggerThread -- clean old nodeAdded markers
   [junit4]   2> 1963245 DEBUG (OverseerAutoScalingTriggerThread-72256557024018436-127.0.0.1:43629_solr-n_0000000000) [    ] o.a.s.c.a.OverseerTriggerThread Current znodeVersion 2, lastZnodeVersion 2
   [junit4]   2> 1963246 INFO  (zkConnectionManagerCallback-5359-thread-1) [    ] o.a.s.c.c.ConnectionManager zkClient has connected
   [junit4]   2> 1963247 INFO  (TEST-TestWithCollection.testMultipleWithCollections-seed#[AEBD9C0133E3AE84]) [    ] o.e.j.s.Server jetty-9.4.11.v20180605; built: 2018-06-05T18:24:03.829Z; git: d5fc0523cfa96bfebfbda19606cad384d772f04c; jvm 1.8.0_172-b11
   [junit4]   2> 1963249 INFO  (TEST-TestWithCollection.testMultipleWithCollections-seed#[AEBD9C0133E3AE84]) [    ] o.e.j.s.session DefaultSessionIdManager workerName=node0
   [junit4]   2> 1963249 INFO  (TEST-TestWithCollection.testMultipleWithCollections-seed#[AEBD9C0133E3AE84]) [    ] o.e.j.s.session No SessionScavenger set, using defaults
   [junit4]   2> 1963249 INFO  (TEST-TestWithCollection.testMultipleWithCollections-seed#[AEBD9C0133E3AE84]) [    ] o.e.j.s.session node0 Scavenging every 660000ms
   [junit4]   2> 1963250 INFO  (TEST-TestWithCollection.testMultipleWithCollections-seed#[AEBD9C0133E3AE84]) [    ] o.e.j.s.h.ContextHandler Started o.e.j.s.ServletContextHandler@247fca36{/solr,null,AVAILABLE}
   [junit4]   2> 1963250 INFO  (TEST-TestWithCollection.testMultipleWithCollections-seed#[AEBD9C0133E3AE84]) [    ] o.e.j.s.AbstractConnector Started ServerConnector@106d8c1e{SSL,[ssl, http/1.1]}{127.0.0.1:41219}
   [junit4]   2> 1963250 INFO  (TEST-TestWithCollection.testMultipleWithCollections-seed#[AEBD9C0133E3AE84]) [    ] o.e.j.s.Server Started @1963285ms
   [junit4]   2> 1963250 INFO  (TEST-TestWithCollection.testMultipleWithCollections-seed#[AEBD9C0133E3AE84]) [    ] o.a.s.c.s.e.JettySolrRunner Jetty properties: {hostContext=/solr, hostPort=41219}
   [junit4]   2> 1963250 ERROR (TEST-TestWithCollection.testMultipleWithCollections-seed#[AEBD9C0133E3AE84]) [    ] o.a.s.u.StartupLoggingUtils Missing Java Option solr.log.dir. Logging may be missing or incomplete.
   [junit4]   2> 1963250 INFO  (TEST-TestWithCollection.testMultipleWithCollections-seed#[AEBD9C0133E3AE84]) [    ] o.a.s.s.SolrDispatchFilter Using logger factory org.apache.logging.slf4j.Log4jLoggerFactory
   [junit4]   2> 1963250 INFO  (TEST-TestWithCollection.testMultipleWithCollections-seed#[AEBD9C0133E3AE84]) [    ] o.a.s.s.SolrDispatchFilter  ___      _       Welcome to Apache Solr? version 7.6.0
   [junit4]   2> 1963250 INFO  (TEST-TestWithCollection.testMultipleWithCollections-seed#[AEBD9C0133E3AE84]) [    ] o.a.s.s.SolrDispatchFilter / __| ___| |_ _   Starting in cloud mode on port null
   [junit4]   2> 1963250 INFO  (TEST-TestWithCollection.testMultipleWithCollections-seed#[AEBD9C0133E3AE84]) [    ] o.a.s.s.SolrDispatchFilter \__ \/ _ \ | '_|  Install dir: null
   [junit4]   2> 1963250 INFO  (TEST-TestWithCollection.testMultipleWithCollections-seed#[AEBD9C0133E3AE84]) [    ] o.a.s.s.SolrDispatchFilter |___/\___/_|_|    Start time: 2018-09-20T10:44:17.111Z
   [junit4]   2> 1963252 INFO  (zkConnectionManagerCallback-5361-thread-1) [    ] o.a.s.c.c.ConnectionManager zkClient has connected
   [junit4]   2> 1963252 INFO  (TEST-TestWithCollection.testMultipleWithCollections-seed#[AEBD9C0133E3AE84]) [    ] o.a.s.s.SolrDispatchFilter solr.xml found in ZooKeeper. Loading...
   [junit4]   2> 1963366 INFO  (TEST-TestWithCollection.testMultipleWithCollections-seed#[AEBD9C0133E3AE84]) [    ] o.a.s.c.ZkContainer Zookeeper client=127.0.0.1:32899/solr
   [junit4]   2> 1963367 INFO  (zkConnectionManagerCallback-5365-thread-1) [    ] o.a.s.c.c.ConnectionManager zkClient has connected
   [junit4]   2> 1963368 INFO  (zkConnectionManagerCallback-5367-thread-1) [    ] o.a.s.c.c.ConnectionManager zkClient has connected
   [junit4]   2> 1963371 INFO  (TEST-TestWithCollection.testMultipleWithCollections-seed#[AEBD9C0133E3AE84]) [n:127.0.0.1:41219_solr    ] o.a.s.c.c.ZkStateReader Updated live nodes from ZooKeeper... (0) -> (2)
   [junit4]   2> 1963375 INFO  (TEST-TestWithCollection.testMultipleWithCollections-seed#[AEBD9C0133E3AE84]) [n:127.0.0.1:41219_solr    ] o.a.s.c.TransientSolrCoreCacheDefault Allocating transient cache for 2147483647 transient cores
   [junit4]   2> 1963375 INFO  (TEST-TestWithCollection.testMultipleWithCollections-seed#[AEBD9C0133E3AE84]) [n:127.0.0.1:41219_solr    ] o.a.s.c.ZkController Register node as live in ZooKeeper:/live_nodes/127.0.0.1:41219_solr
   [junit4]   2> 1963375 DEBUG (OverseerStateUpdate-72256557024018436-127.0.0.1:43629_solr-n_0000000000) [n:127.0.0.1:43629_solr    ] o.a.s.c.o.NodeMutator DownNode state invoked for node: 127.0.0.1:41219_solr
   [junit4]   2> 1963375 INFO  (zkCallback-5338-thread-1) [    ] o.a.s.c.c.ZkStateReader Updated live nodes from ZooKeeper... (2) -> (3)
   [junit4]   2> 1963375 INFO  (zkCallback-5333-thread-1) [    ] o.a.s.c.c.ZkStateReader Updated live nodes from ZooKeeper... (2) -> (3)
   [junit4]   2> 1963375 INFO  (zkCallback-5325-thread-1) [    ] o.a.s.c.c.ZkStateReader Updated live nodes from ZooKeeper... (2) -> (3)
   [junit4]   2> 1963375 INFO  (zkCallback-5366-thread-1) [    ] o.a.s.c.c.ZkStateReader Updated live nodes from ZooKeeper... (2) -> (3)
   [junit4]   2> 1963376 INFO  (zkCallback-5354-thread-2) [    ] o.a.s.c.c.ZkStateReader Updated live nodes from ZooKeeper... (2) -> (3)
   [junit4]   2> 1963376 INFO  (zkCallback-5354-thread-1) [    ] o.a.s.c.c.ZkStateReader Updated live nodes from ZooKeeper... (2) -> (3)
   [junit4]   2> 1963376 INFO  (zkCallback-5346-thread-1) [    ] o.a.s.c.c.ZkStateReader Updated live nodes from ZooKeeper... (2) -> (3)
   [junit4]   2> 1963390 INFO  (zkConnectionManagerCallback-5374-thread-1) [    ] o.a.s.c.c.ConnectionManager zkClient has connected
   [junit4]   2> 1963391 INFO  (TEST-TestWithCollection.testMultipleWithCollections-seed#[AEBD9C0133E3AE84]) [n:127.0.0.1:41219_solr    ] o.a.s.c.c.ZkStateReader Updated live nodes from ZooKeeper... (0) -> (3)
   [junit4]   2> 1963391 INFO  (TEST-TestWithCollection.testMultipleWithCollections-seed#[AEBD9C0133E3AE84]) [n:127.0.0.1:41219_solr    ] o.a.s.c.s.i.ZkClientClusterStateProvider Cluster at 127.0.0.1:32899/solr ready
   [junit4]   2> 1963391 INFO  (TEST-TestWithCollection.testMultipleWithCollections-seed#[AEBD9C0133E3AE84]) [n:127.0.0.1:41219_solr    ] o.a.s.h.a.MetricsHistoryHandler No .system collection, keeping metrics history in memory.
   [junit4]   2> 1963405 INFO  (TEST-TestWithCollection.testMultipleWithCollections-seed#[AEBD9C0133E3AE84]) [n:127.0.0.1:41219_solr    ] o.a.s.m.r.SolrJmxReporter JMX monitoring for 'solr_41219.solr.node' (registry 'solr.node') enabled at server: com.sun.jmx.mbeanserver.JmxMBeanServer@4fa4c48d
   [junit4]   2> 1963413 INFO  (TEST-TestWithCollection.testMultipleWithCollections-seed#[AEBD9C0133E3AE84]) [n:127.0.0.1:41219_solr    ] o.a.s.m.r.SolrJmxReporter JMX monitoring for 'solr_41219.solr.jvm' (registry 'solr.jvm') enabled at server: com.sun.jmx.mbeanserver.JmxMBeanServer@4fa4c48d
   [junit4]   2> 1963414 INFO  (TEST-TestWithCollection.testMultipleWithCollections-seed#[AEBD9C0133E3AE84]) [n:127.0.0.1:41219_solr    ] o.a.s.m.r.SolrJmxReporter JMX monitoring for 'solr_41219.solr.jetty' (registry 'solr.jetty') enabled at server: com.sun.jmx.mbeanserver.JmxMBeanServer@4fa4c48d
   [junit4]   2> 1963415 INFO  (TEST-TestWithCollection.testMultipleWithCollections-seed#[AEBD9C0133E3AE84]) [n:127.0.0.1:41219_solr    ] o.a.s.c.CorePropertiesLocator Found 0 core definitions underneath /home/jenkins/workspace/Lucene-Solr-7.x-Linux/solr/build/solr-core/test/J0/temp/solr.cloud.TestWithCollection_AEBD9C0133E3AE84-001/tempDir-001/node3/.
   [junit4]   2> 1963448 INFO  (TEST-TestWithCollection.testMultipleWithCollections-seed#[AEBD9C0133E3AE84]) [    ] o.e.j.s.Server jetty-9.4.11.v20180605; built: 2018-06-05T18:24:03.829Z; git: d5fc0523cfa96bfebfbda19606cad384d772f04c; jvm 1.8.0_172-b11
   [junit4]   2> 1963453 INFO  (TEST-TestWithCollection.testMultipleWithCollections-seed#[AEBD9C0133E3AE84]) [    ] o.e.j.s.session DefaultSessionIdManager workerName=node0
   [junit4]   2> 1963453 INFO  (TEST-TestWithCollection.testMultipleWithCollections-seed#[AEBD9C0133E3AE84]) [    ] o.e.j.s.session No SessionScavenger set, using defaults
   [junit4]   2> 1963453 INFO  (TEST-TestWithCollection.testMultipleWithCollections-seed#[AEBD9C0133E3AE84]) [    ] o.e.j.s.session node0 Scavenging every 660000ms
   [junit4]   2> 1963454 INFO  (TEST-TestWithCollection.testMultipleWithCollections-seed#[AEBD9C0133E3AE84]) [    ] o.e.j.s.h.ContextHandler Started o.e.j.s.ServletContextHandler@1be4065e{/solr,null,AVAILABLE}
   [junit4]   2> 1963454 INFO  (TEST-TestWithCollection.testMultipleWithCollections-seed#[AEBD9C0133E3AE84]) [    ] o.e.j.s.AbstractConnector Started ServerConnector@5c4f06b6{SSL,[ssl, http/1.1]}{127.0.0.1:37167}
   [junit4]   2> 1963455 INFO  (TEST-TestWithCollection.testMultipleWithCollections-seed#[AEBD9C0133E3AE84]) [    ] o.e.j.s.Server Started @1963489ms
   [junit4]   2> 1963455 INFO  (TEST-TestWithCollection.testMultipleWithCollections-seed#[AEBD9C0133E3AE84]) [    ] o.a.s.c.s.e.JettySolrRunner Jetty properties: {hostContext=/solr, hostPort=37167}
   [junit4]   2> 1963455 ERROR (TEST-TestWithCollection.testMultipleWithCollections-seed#[AEBD9C0133E3AE84]) [    ] o.a.s.u.StartupLoggingUtils Missing Java Option solr.log.dir. Logging may be missing or incomplete.
   [junit4]   2> 1963455 INFO  (TEST-TestWithCollection.testMultipleWithCollections-seed#[AEBD9C0133E3AE84]) [    ] o.a.s.s.SolrDispatchFilter Using logger factory org.apache.logging.slf4j.Log4jLoggerFactory
   [junit4]   2> 1963455 INFO  (TEST-TestWithCollection.testMultipleWithCollections-seed#[AEBD9C0133E3AE84]) [    ] o.a.s.s.SolrDispatchFilter  ___      _       Welcome to Apache Solr? version 7.6.0
   [junit4]   2> 1963455 INFO  (TEST-TestWithCollection.testMultipleWithCollections-seed#[AEBD9C0133E3AE84]) [    ] o.a.s.s.SolrDispatchFilter / __| ___| |_ _   Starting in cloud mode on port null
   [junit4]   2> 1963455 INFO  (TEST-TestWithCollection.testMultipleWithCollections-seed#[AEBD9C0133E3AE84]) [    ] o.a.s.s.SolrDispatchFilter \__ \/ _ \ | '_|  Install dir: null
   [junit4]   2> 1963455 INFO  (TEST-TestWithCollection.testMultipleWithCollections-seed#[AEBD9C0133E3AE84]) [    ] o.a.s.s.SolrDispatchFilter |___/\___/_|_|    Start time: 2018-09-20T10:44:17.316Z
   [junit4]   2> 1963456 INFO  (zkConnectionManagerCallback-5377-thread-1) [    ] o.a.s.c.c.ConnectionManager zkClient has connected
   [junit4]   2> 1963457 INFO  (TEST-TestWithCollection.testMultipleWithCollections-seed#[AEBD9C0133E3AE84]) [    ] o.a.s.s.SolrDispatchFilter solr.xml found in ZooKeeper. Loading...
   [junit4]   2> 1963576 INFO  (TEST-TestWithCollection.testMultipleWithCollections-seed#[AEBD9C0133E3AE84]) [    ] o.a.s.c.ZkContainer Zookeeper client=127.0.0.1:32899/solr
   [junit4]   2> 1963577 INFO  (zkConnectionManagerCallback-5381-thread-1) [    ] o.a.s.c.c.ConnectionManager zkClient has connected
   [junit4]   2> 1963582 INFO  (zkConnectionManagerCallback-5383-thread-1) [    ] o.a.s.c.c.ConnectionManager zkClient has connected
   [junit4]   2> 1963586 INFO  (TEST-TestWithCollection.testMultipleWithCollections-seed#[AEBD9C0133E3AE84]) [    ] o.a.s.c.c.ZkStateReader Updated live nodes from ZooKeeper... (0) -> (3)
   [junit4]   2> 1963589 INFO  (TEST-TestWithCollection.testMultipleWithCollections-seed#[AEBD9C0133E3AE84]) [    ] o.a.s.c.TransientSolrCoreCacheDefault Allocating transient cache for 2147483647 transient cores
   [junit4]   2> 1963589 INFO  (TEST-TestWithCollection.testMultipleWithCollections-seed#[AEBD9C0133E3AE84]) [    ] o.a.s.c.ZkController Register node as live in ZooKeeper:/live_nodes/127.0.0.1:37167_solr
   [junit4]   2> 1963589 DEBUG (OverseerStateUpdate-72256557024018436-127.0.0.1:43629_solr-n_0000000000) [n:127.0.0.1:43629_solr    ] o.a.s.c.o.NodeMutator DownNode state invoked for node: 127.0.0.1:37167_solr
   [junit4]   2> 1963589 INFO  (zkCallback-5338-thread-1) [    ] o.a.s.c.c.ZkStateReader Updated live nodes from ZooKeeper... (3) -> (4)
   [junit4]   2> 1963589 INFO  (zkCallback-5325-thread-1) [    ] o.a.s.c.c.ZkStateReader Updated live nodes from ZooKeeper... (3) -> (4)
   [junit4]   2> 1963589 INFO  (zkCallback-5346-thread-1) [    ] o.a.s.c.c.ZkStateReader Updated live nodes from ZooKeeper... (3) -> (4)
   [junit4]   2> 1963589 INFO  (zkCallback-5366-thread-1) [    ] o.a.s.c.c.ZkStateReader Updated live nodes from ZooKeeper... (3) -> (4)
   [junit4]   2> 1963590 INFO  (zkCallback-5373-thread-1) [    ] o.a.s.c.c.ZkStateReader Updated live nodes from ZooKeeper... (3) -> (4)
   [junit4]   2> 1963590 INFO  (zkCallback-5382-thread-1) [    ] o.a.s.c.c.ZkStateReader Updated live nodes from ZooKeeper... (3) -> (4)
   [junit4]   2> 1963590 INFO  (zkCallback-5333-thread-1) [    ] o.a.s.c.c.ZkStateReader Updated live nodes from ZooKeeper... (3) -> (4)
   [junit4]   2> 1963590 INFO  (zkCallback-5354-thread-2) [    ] o.a.s.c.c.ZkStateReader Updated live nodes from ZooKeeper... (3) -> (4)
   [junit4]   2> 1963590 INFO  (zkCallback-5354-thread-1) [    ] o.a.s.c.c.ZkStateReader Updated live nodes from ZooKeeper... (3) -> (4)
   [junit4]   2> 1963609 INFO  (zkConnectionManagerCallback-5390-thread-1) [    ] o.a.s.c.c.ConnectionManager zkClient has connected
   [junit4]   2> 1963610 INFO  (TEST-TestWithCollection.testMultipleWithCollections-seed#[AEBD9C0133E3AE84]) [    ] o.a.s.c.c.ZkStateReader Updated live nodes from ZooKeeper... (0) -> (4)
   [junit4]   2> 1963610 INFO  (TEST-TestWithCollection.testMultipleWithCollections-seed#[AEBD9C0133E3AE84]) [    ] o.a.s.c.s.i.ZkClientClusterStateProvider Cluster at 127.0.0.1:32899/solr ready
   [junit4]   2> 1963610 INFO  (TEST-TestWithCollection.testMultipleWithCollections-seed#[AEBD9C0133E3AE84]) [    ] o.a.s.h.a.MetricsHistoryHandler No .system collection, keeping metrics history in memory.
   [junit4]   2> 1963623 INFO  (TEST-TestWithCollection.testMultipleWithCollections-seed#[AEBD9C0133E3AE84]) [    ] o.a.s.m.r.SolrJmxReporter JMX monitoring for 'solr_37167.solr.node' (registry 'solr.node') enabled at server: com.sun.jmx.mbeanserver.JmxMBeanServer@4fa4c48d
   [junit4]   2> 1963631 INFO  (TEST-TestWithCollection.testMultipleWithCollections-seed#[AEBD9C0133E3AE84]) [    ] o.a.s.m.r.SolrJmxReporter JMX monitoring for 'solr_37167.solr.jvm' (registry 'solr.jvm') enabled at server: com.sun.jmx.mbeanserver.JmxMBeanServer@4fa4c48d
   [junit4]   2> 1963631 INFO  (TEST-TestWithCollection.testMultipleWithCollections-seed#[AEBD9C0133E3AE84]) [    ] o.a.s.m.r.SolrJmxReporter JMX monitoring for 'solr_37167.solr.jetty' (registry 'solr.jetty') enabled at server: com.sun.jmx.mbeanserver.JmxMBeanServer@4fa4c48d
   [junit4]   2> 1963632 INFO  (TEST-TestWithCollection.testMultipleWithCollections-seed#[AEBD9C0133E3AE84]) [    ] o.a.s.c.CorePropertiesLocator Found 0 core definitions underneath /home/jenkins/workspace/Lucene-Solr-7.x-Linux/solr/build/solr-core/test/J0/temp/solr.cloud.TestWithCollection_AEBD9C0133E3AE84-001/tempDir-001/node4/.
   [junit4]   2> 1963671 INFO  (zkConnectionManagerCallback-5393-thread-1) [    ] o.a.s.c.c.ConnectionManager zkClient has connected
   [junit4]   2> 1963703 INFO  (qtp1926775567-19357) [n:127.0.0.1:37167_solr    ] o.a.s.s.HttpSolrCall [admin] webapp=null path=/admin/metrics params={prefix=CONTAINER.fs.usableSpace,CORE.coreName&wt=javabin&version=2&group=solr.node,solr.core} status=0 QTime=0
   [junit4]   2> 1963718 INFO  (qtp739120267-19327) [n:127.0.0.1:41219_solr    ] o.a.s.s.HttpSolrCall [admin] webapp=null path=/admin/metrics params={prefix=CONTAINER.fs.usableSpace,CORE.coreName&wt=javabin&version=2&group=solr.node,solr.core} status=0 QTime=0
   [junit4]   2> 1963725 INFO  (qtp14897804-19257) [n:127.0.0.1:43629_solr    ] o.a.s.s.HttpSolrCall [admin] webapp=null path=/admin/metrics params={prefix=CONTAINER.fs.usableSpace,CORE.coreName&wt=javabin&version=2&group=solr.node,solr.core} status=0 QTime=0
   [junit4]   2> 1963738 INFO  (qtp543022447-19250) [n:127.0.0.1:44249_solr    ] o.a.s.s.HttpSolrCall [admin] webapp=null path=/admin/metrics params={prefix=CONTAINER.fs.usableSpace,CORE.coreName&wt=javabin&version=2&group=solr.node,solr.core} status=0 QTime=0
   [junit4]   2> 1963739 DEBUG (qtp14897804-19254) [n:127.0.0.1:43629_solr    ] o.a.s.c.a.AutoScalingHandler Verified autoscaling configuration
   [junit4]   2> 1963739 INFO  (qtp14897804-19254) [n:127.0.0.1:43629_solr    ] o.a.s.s.HttpSolrCall [admin] webapp=null path=/cluster/autoscaling params={wt=javabin&version=2} status=0 QTime=53
   [junit4]   2> 1963739 DEBUG (zkCallback-5338-thread-1) [    ] o.a.s.c.a.OverseerTriggerThread Refreshing /autoscaling.json with znode version 3
   [junit4]   2> 1963739 INFO  (TEST-TestWithCollection.testMultipleWithCollections-seed#[AEBD9C0133E3AE84]) [    ] o.a.s.c.TestWithCollection Chosen node 127.0.0.1:43629_solr for collection testMultipleWithCollections_abc
   [junit4]   2> 1963740 DEBUG (OverseerAutoScalingTriggerThread-72256557024018436-127.0.0.1:43629_solr-n_0000000000) [    ] o.a.s.c.a.OverseerTriggerThread Processed trigger updates upto znodeVersion 3
   [junit4]   2> 1963740 DEBUG (OverseerAutoScalingTriggerThread-72256557024018436-127.0.0.1:43629_solr-n_0000000000) [    ] o.a.s.c.a.OverseerTriggerThread -- clean old nodeLost markers
   [junit4]   2> 1963740 DEBUG (OverseerAutoScalingTriggerThread-72256557024018436-127.0.0.1:43629_solr-n_0000000000) [    ] o.a.s.c.a.OverseerTriggerThread -- clean old nodeAdded markers
   [junit4]   2> 1963740 DEBUG (OverseerAutoScalingTriggerThread-72256557024018436-127.0.0.1:43629_solr-n_0000000000) [    ] o.a.s.c.a.OverseerTriggerThread Current znodeVersion 3, lastZnodeVersion 3
   [junit4]   2> 1963741 INFO  (qtp1926775567-19357) [n:127.0.0.1:37167_solr    ] o.a.s.h.a.CollectionsHandler Invoked Collection Action :create with params pullReplicas=0&name=testMultipleWithCollections_abc&nrtReplicas=1&action=CREATE&numShards=1&tlogReplicas=0&createNodeSet=127.0.0.1:43629_solr&wt=javabin&version=2 and sendToOCPQueue=true
   [junit4]   2> 1963742 INFO  (OverseerThreadFactory-6543-thread-1-processing-n:127.0.0.1:43629_solr) [n:127.0.0.1:43629_solr    ] o.a.s.c.a.c.CreateCollectionCmd Create collection testMultipleWithCollections_abc
   [junit4]   2> 1963743 INFO  (OverseerThreadFactory-6543-thread-1-processing-n:127.0.0.1:43629_solr) [n:127.0.0.1:43629_solr    ] o.a.s.c.c.ZkConfigManager Copying zk node /configs/_default/protwords.txt to /configs/testMultipleWithCollections_abc.AUTOCREATED/protwords.txt
   [junit4]   2> 1963743 INFO  (OverseerThreadFactory-6543-thread-1-processing-n:127.0.0.1:43629_solr) [n:127.0.0.1:43629_solr    ] o.a.s.c.c.ZkConfigManager Copying zk node /configs/_default/managed-schema to /configs/testMultipleWithCollections_abc.AUTOCREATED/managed-schema
   [junit4]   2> 1963744 INFO  (OverseerThreadFactory-6543-thread-1-processing-n:127.0.0.1:43629_solr) [n:127.0.0.1:43629_solr    ] o.a.s.c.c.ZkConfigManager Copying zk node /configs/_default/solrconfig.xml to /configs/testMultipleWithCollections_abc.AUTOCREATED/solrconfig.xml
   [junit4]   2> 1963745 INFO  (OverseerThreadFactory-6543-thread-1-processing-n:127.0.0.1:43629_solr) [n:127.0.0.1:43629_solr    ] o.a.s.c.c.ZkConfigManager Copying zk node /configs/_default/synonyms.txt to /configs/testMultipleWithCollections_abc.AUTOCREATED/synonyms.txt
   [junit4]   2> 1963745 INFO  (OverseerThreadFactory-6543-thread-1-processing-n:127.0.0.1:43629_solr) [n:127.0.0.1:43629_solr    ] o.a.s.c.c.ZkConfigManager Copying zk node /configs/_default/stopwords.txt to /configs/testMultipleWithCollections_abc.AUTOCREATED/stopwords.txt
   [junit4]   2> 1963746 INFO  (OverseerThreadFactory-6543-thread-1-processing-n:127.0.0.1:43629_solr) [n:127.0.0.1:43629_solr    ] o.a.s.c.c.ZkConfigManager Copying zk node /configs/_default/lang/contractions_it.txt to /configs/testMultipleWithCollections_abc.AUTOCREATED/lang/contractions_it.txt
   [junit4]   2> 1963747 INFO  (OverseerThreadFactory-6543-thread-1-processing-n:127.0.0.1:43629_solr) [n:127.0.0.1:43629_solr    ] o.a.s.c.c.ZkConfigManager Copying zk node /configs/_default/lang/stemdict_nl.txt to /configs/testMultipleWithCollections_abc.AUTOCREATED/lang/stemdict_nl.txt
   [junit4]   2> 1963748 INFO  (OverseerThreadFactory-6543-thread-1-processing-n:127.0.0.1:43629_solr) [n:127.0.0.1:43629_solr    ] o.a.s.c.c.ZkConfigManager Copying zk node /configs/_default/lang/stopwords_hy.txt to /configs/testMultipleWithCollections_abc.AUTOCREATED/lang/stopwords_hy.txt
   [junit4]   2> 1963749 INFO  (OverseerThreadFactory-6543-thread-1-processing-n:127.0.0.1:43629_solr) [n:127.0.0.1:43629_solr    ] o.a.s.c.c.ZkConfigManager Copying zk node /configs/_default/lang/stopwords_no.txt to /configs/testMultipleWithCollections_abc.AUTOCREATED/lang/stopwords_no.txt
   [junit4]   2> 1963749 INFO  (OverseerThreadFactory-6543-thread-1-processing-n:127.0.0.1:43629_solr) [n:127.0.0.1:43629_solr    ] o.a.s.c.c.ZkConfigManager Copying zk node /configs/_default/lang/contractions_ca.txt to /configs/testMultipleWithCollections_abc.AUTOCREATED/lang/contractions_ca.txt
   [junit4]   2> 1963750 INFO  (OverseerThreadFactory-6543-thread-1-processing-n:127.0.0.1:43629_solr) [n:127.0.0.1:43629_solr    ] o.a.s.c.c.ZkConfigManager Copying zk node /configs/_default/lang/stopwords_id.txt to /configs/testMultipleWithCollections_abc.AUTOCREATED/lang/stopwords_id.txt
   [junit4]   2> 1963751 INFO  (OverseerThreadFactory-6543-thread-1-processing-n:127.0.0.1:43629_solr) [n:127.0.0.1:43629_solr    ] o.a.s.c.c.ZkConfigManager Copying zk node /configs/_default/lang/stopwords_ga.txt to /configs/testMultipleWithCollections_abc.AUTOCREATED/lang/stopwords_ga.txt
   [junit4]   2> 1963752 INFO  (OverseerThreadFactory-6543-thread-1-processing-n:127.0.0.1:43629_solr) [n:127.0.0.1:43629_solr    ] o.a.s.c.c.ZkConfigManager Copying zk node /configs/_default/lang/stopwords_hi.txt to /configs/testMultipleWithCollections_abc.AUTOCREATED/lang/stopwords_hi.txt
   [junit4]   2> 1963752 INFO  (OverseerThreadFactory-6543-thread-1-processing-n:127.0.0.1:43629_solr) [n:127.0.0.1:43629_solr    ] o.a.s.c.c.ZkConfigManager Copying zk node /configs/_default/lang/stopwords_da.txt to /configs/testMultipleWithCollections_abc.AUTOCREATED/lang/stopwords_da.txt
   [junit4]   2> 1963753 INFO  (OverseerThreadFactory-6543-thread-1-processing-n:127.0.0.1:43629_solr) [n:127.0.0.1:43629_solr    ] o.a.s.c.c.ZkConfigManager Copying zk node /configs/_default/lang/stopwords_ja.txt to /configs/testMultipleWithCollections_abc.AUTOCREATED/lang/stopwords_ja.txt
   [junit4]   2> 1963753 INFO  (OverseerThreadFactory-6543-thread-1-processing-n:127.0.0.1:43629_solr) [n:127.0.0.1:43629_solr    ] o.a.s.c.c.ZkConfigManager Copying zk node /configs/_default/lang/stopwords_pt.txt to /configs/testMultipleWithCollections_abc.AUTOCREATED/lang/stopwords_pt.txt
   [junit4]   2> 1963754 INFO  (OverseerThreadFactory-6543-thread-1-processing-n:127.0.0.1:43629_solr) [n:127.0.0.1:43629_solr    ] o.a.s.c.c.ZkConfigManager Copying zk node /configs/_default/lang/stopwords_hu.txt to /configs/testMultipleWithCollections_abc.AUTOCREATED/lang/stopwords_hu.txt
   [junit4]   2> 1963754 INFO  (OverseerThreadFactory-6543-thread-1-processing-n:127.0.0.1:43629_solr) [n:127.0.0.1:43629_solr    ] o.a.s.c.c.ZkConfigManager Copying zk node /configs/_default/lang/stopwords_el.txt to /configs/testMultipleWithCollections_abc.AUTOCREATED/lang/stopwords_el.txt
   [junit4]   2> 1963755 INFO  (OverseerThreadFactory-6543-thread-1-processing-n:127.0.0.1:43629_solr) [n:127.0.0.1:43629_solr    ] o.a.s.c.c.ZkConfigManager Copying zk node /configs/_default/lang/stopwords_ru.txt to /configs/testMultipleWithCollections_abc.AUTOCREATED/lang/stopwords_ru.txt
   [junit4]   2> 1963757 INFO  (OverseerThreadFactory-6543-thread-1-processing-n:127.0.0.1:43629_solr) [n:127.0.0.1:43629_solr    ] o.a.s.c.c.ZkConfigManager Copying zk node /configs/_default/lang/stopwords_tr.txt to /configs/testMultipleWithCollections_abc.AUTOCREATED/lang/stopwords_tr.txt
   [junit4]   2> 1963758 INFO  (OverseerThreadFactory-6543-thread-1-processing-n:127.0.0.1:43629_solr) [n:127.0.0.1:43629_solr    ] o.a.s.c.c.ZkConfigManager Copying zk node /configs/_default/lang/stopwords_ar.txt to /configs/testMultipleWithCollections_abc.AUTOCREATED/lang/stopwords_ar.txt
   [junit4]   2> 1963759 INFO  (OverseerThreadFactory-6543-thread-1-processing-n:127.0.0.1:43629_solr) [n:127.0.0.1:43629_solr    ] o.a.s.c.c.ZkConfigManager Copying zk node /configs/_default/lang/userdict_ja.txt to /configs/testMultipleWithCollections_abc.AUTOCREATED/lang/userdict_ja.txt
   [junit4]   2> 1963759 INFO  (OverseerThreadFactory-6543-thread-1-processing-n:127.0.0.1:43629_solr) [n:127.0.0.1:43629_solr    ] o.a.s.c.c.ZkConfigManager Copying zk node /configs/_default/lang/stopwords_eu.txt to /configs/testMultipleWithCollections_abc.AUTOCREATED/lang/stopwords_eu.txt
   [junit4]   2> 1963760 INFO  (OverseerThreadFactory-6543-thread-1-processing-n:127.0.0.1:43629_solr) [n:127.0.0.1:43629_solr    ] o.a.s.c.c.ZkConfigManager Copying zk node /configs/_default/lang/stopwords_it.txt to /configs/testMultipleWithCollections_abc.AUTOCREATED/lang/stopwords_it.txt
   [junit4]   2> 1963762 INFO  (OverseerThreadFactory-6543-thread-1-processing-n:127.0.0.1:43629_solr) [n:127.0.0.1:43629_solr    ] o.a.s.c.c.ZkConfigManager Copying zk node /configs/_default/lang/stopwords_cz.txt to /configs/testMultipleWithCollections_abc.AUTOCREATED/lang/stopwords_cz.txt
   [junit4]   2> 1963762 INFO  (OverseerThreadFactory-6543-thread-1-processing-n:127.0.0.1:43629_solr) [n:127.0.0.1:43629_solr    ] o.a.s.c.c.ZkConfigManager Copying zk node /configs/_default/lang/stoptags_ja.txt to /configs/testMultipleWithCollections_abc.AUTOCREATED/lang/stoptags_ja.txt
   [junit4]   2> 1963763 INFO  (OverseerThreadFactory-6543-thread-1-processing-n:127.0.0.1:43629_solr) [n:127.0.0.1:43629_solr    ] o.a.s.c.c.ZkConfigManager Copying zk node /configs/_default/lang/contractions_fr.txt to /configs/testMultipleWithCollections_abc.AUTOCREATED/lang/contractions_fr.txt
   [junit4]   2> 1963764 INFO  (OverseerThreadFactory-6543-thread-1-processing-n:127.0.0.1:43629_solr) [n:127.0.0.1:43629_solr    ] o.a.s.c.c.ZkConfigManager Copying zk node /configs/_default/lang/stopwords_de.txt to /configs/testMultipleWithCollections_abc.AUTOCREATED/lang/stopwords_de.txt
   [junit4]   2> 1963766 INFO  (OverseerThreadFactory-6543-thread-1-processing-n:127.0.0.1:43629_solr) [n:127.0.0.1:43629_solr    ] o.a.s.c.c.ZkConfigManager Copying zk node /configs/_default/lang/stopwords_fa.txt to /configs/testMultipleWithCollections_abc.AUTOCREATED/lang/stopwords_fa.txt
   [junit4]   2> 1963767 INFO  (OverseerThreadFactory-6543-thread-1-processing-n:127.0.0.1:43629_solr) [n:127.0.0.1:43629_solr    ] o.a.s.c.c.ZkConfigManager Copying zk node /configs/_default/lang/contractions_ga.txt to /configs/testMultipleWithCollections_abc.AUTOCREATED/lang/contractions_ga.txt
   [junit4]   2> 1963767 INFO  (OverseerThreadFactory-6543-thread-1-processing-n:127.0.0.1:43629_solr) [n:127.0.0.1:43629_solr    ] o.a.s.c.c.ZkConfigManager Copying zk node /configs/_default/lang/stopwords_ca.txt to /configs/testMultipleWithCollections_abc.AUTOCREATED/lang/stopwords_ca.txt
   [junit4]   2> 1963768 INFO  (OverseerThreadFactory-6543-thread-1-processing-n:127.0.0.1:43629_solr) [n:127.0.0.1:43629_solr    ] o.a.s.c.c.ZkConfigManager Copying zk node /configs/_default/lang/stopwords_nl.txt to /configs/testMultipleWithCollections_abc.AUTOCREATED/lang/stopwords_nl.txt
   [junit4]   2> 1963769 INFO  (OverseerThreadFactory-6543-thread-1-processing-n:127.0.0.1:43629_solr) [n:127.0.0.1:43629_solr    ] o.a.s.c.c.ZkConfigManager Copying zk node /configs/_default/lang/stopwords_bg.txt to /configs/testMultipleWithCollections_abc.AUTOCREATED/lang/stopwords_bg.txt
   [junit4]   2> 1963769 INFO  (OverseerThreadFactory-6543-thread-1-processing-n:127.0.0.1:43629_solr) [n:127.0.0.1:43629_solr    ] o.a.s.c.c.ZkConfigManager Copying zk node /configs/_default/lang/stopwords_lv.txt to /configs/testMultipleWithCollections_abc.AUTOCREATED/lang/stopwords_lv.txt
   [junit4]   2> 1963770 INFO  (OverseerThreadFactory-6543-thread-1-processing-n:127.0.0.1:43629_solr) [n:127.0.0.1:43629_solr    ] o.a.s.c.c.ZkConfigManager Copying zk node /configs/_default/lang/stopwords_en.txt to /configs/testMultipleWithCollections_abc.AUTOCREATED/lang/stopwords_en.txt
   [junit4]   2> 1963771 INFO  (OverseerThreadFactory-6543-thread-1-processing-n:127.0.0.1:43629_solr) [n:127.0.0.1:43629_solr    ] o.a.s.c.c.ZkConfigManager Copying zk node /configs/_default/lang/stopwords_es.txt to /configs/testMultipleWithCollections_abc.AUTOCREATED/lang/stopwords_es.txt
   [junit4]   2> 1963771 INFO  (OverseerThreadFactory-6543-thread-1-processing-n:127.0.0.1:43629_solr) [n:127.0.0.1:43629_solr    ] o.a.s.c.c.ZkConfigManager Copying zk node /configs/_default/lang/stopwords_th.txt to /configs/testMultipleWithCollections_abc.AUTOCREATED/lang/stopwords_th.txt
   [junit4]   2> 1963772 INFO  (OverseerThreadFactory-6543-thread-1-processing-n:127.0.0.1:43629_solr) [n:127.0.0.1:43629_solr    ] o.a.s.c.c.ZkConfigManager Copying zk node /configs/_default/lang/stopwords_ro.txt to /configs/testMultipleWithCollections_abc.AUTOCREATED/lang/stopwords_ro.txt
   [junit4]   2> 1963773 INFO  (OverseerThreadFactory-6543-thread-1-processing-n:127.0.0.1:43629_solr) [n:127.0.0.1:43629_solr    ] o.a.s.c.c.ZkConfigManager Copying zk node /configs/_default/lang/stopwords_fr.txt to /configs/testMultipleWithCollections_abc.AUTOCREATED/lang/stopwords_fr.txt
   [junit4]   2> 1963773 INFO  (OverseerThreadFactory-6543-thread-1-processing-n:127.0.0.1:43629_solr) [n:127.0.0.1:43629_solr    ] o.a.s.c.c.ZkConfigManager Copying zk node /configs/_default/lang/stopwords_sv.txt to /configs/testMultipleWithCollections_abc.AUTOCREATED/lang/stopwords_sv.txt
   [junit4]   2> 1963774 INFO  (OverseerThreadFactory-6543-thread-1-processing-n:127.0.0.1:43629_solr) [n:127.0.0.1:43629_solr    ] o.a.s.c.c.ZkConfigManager Copying zk node /configs/_default/lang/stopwords_fi.txt to /configs/testMultipleWithCollections_abc.AUTOCREATED/lang/stopwords_fi.txt
   [junit4]   2> 1963774 INFO  (OverseerThreadFactory-6543-thread-1-processing-n:127.0.0.1:43629_solr) [n:127.0.0.1:43629_solr    ] o.a.s.c.c.ZkConfigManager Copying zk node /configs/_default/lang/hyphenations_ga.txt to /configs/testMultipleWithCollections_abc.AUTOCREATED/lang/hyphenations_ga.txt
   [junit4]   2> 1963775 INFO  (OverseerThreadFactory-6543-thread-1-processing-n:127.0.0.1:43629_solr) [n:127.0.0.1:43629_solr    ] o.a.s.c.c.ZkConfigManager Copying zk node /configs/_default/lang/stopwords_gl.txt to /configs/testMultipleWithCollections_abc.AUTOCREATED/lang/stopwords_gl.txt
   [junit4]   2> 1963776 INFO  (OverseerThreadFactory-6543-thread-1-processing-n:127.0.0.1:43629_solr) [n:127.0.0.1:43629_solr    ] o.a.s.c.c.ZkConfigManager Copying zk node /configs/_default/params.json to /configs/testMultipleWithCollections_abc.AUTOCREATED/params.json
   [junit4]   2> 1963778 DEBUG (OverseerStateUpdate-72256557024018436-127.0.0.1:43629_solr-n_0000000000) [n:127.0.0.1:43629_solr    ] o.a.s.c.o.ClusterStateMutator building a new cName: testMultipleWithCollections_abc
   [junit4]   2> 1963778 DEBUG (OverseerStateUpdate-72256557024018436-127.0.0.1:43629_solr-n_0000000000) [n:127.0.0.1:43629_solr    ] o.a.s.c.o.ZkStateWriter going to create_collection /collections/testMultipleWithCollections_abc/state.json
   [junit4]   2> 1963879 DEBUG (OverseerThreadFactory-6543-thread-1-processing-n:127.0.0.1:43629_solr) [n:127.0.0.1:43629_solr    ] o.a.s.c.s.c.a.PolicyHelper Creating a new session
   [junit4]   2> 1963880 INFO  (qtp14897804-19389) [n:127.0.0.1:43629_solr    ] o.a.s.s.HttpSolrCall [admin] webapp=null path=/admin/metrics params={prefix=CONTAINER.fs.usableSpace,CONTAINER.fs.totalSpace,CORE.coreName&wt=javabin&version=2&group=solr.node,solr.core} status=0 QTime=0
   [junit4]   2> 1963882 INFO  (qtp1926775567-19359) [n:127.0.0.1:37167_solr    ] o.a.s.s.HttpSolrCall [admin] webapp=null path=/admin/metrics params={prefix=CONTAINER.fs.usableSpace,CONTAINER.fs.totalSpace,CORE.coreName&wt=javabin&version=2&group=solr.node,solr.core} status=0 QTime=0
   [junit4]   2> 1963883 INFO  (qtp543022447-19251) [n:127.0.0.1:44249_solr    ] o.a.s.s.HttpSolrCall [admin] webapp=null path=/admin/metrics params={prefix=CONTAINER.fs.usableSpace,CONTAINER.fs.totalSpace,CORE.coreName&wt=javabin&version=2&group=solr.node,solr.core} status=0 QTime=0
   [junit4]   2> 1963885 INFO  (qtp739120267-19328) [n:127.0.0.1:41219_solr    ] o.a.s.s.HttpSolrCall [admin] webapp=null path=/admin/metrics params={prefix=CONTAINER.fs.usableSpace,CONTAINER.fs.totalSpace,CORE.coreName&wt=javabin&version=2&group=solr.node,solr.core} status=0 QTime=0
   [junit4]   2> 1963885 DEBUG (OverseerThreadFactory-6543-thread-1-processing-n:127.0.0.1:43629_solr) [n:127.0.0.1:43629_solr    ] o.a.s.c.s.c.a.PolicyHelper New session created 
   [junit4]   2> 1963889 INFO  (OverseerThreadFactory-6543-thread-1-processing-n:127.0.0.1:43629_solr) [n:127.0.0.1:43629_solr    ] o.a.s.c.s.c.a.PolicyHelper returnSession, curr-time 3035935378 sessionWrapper.createTime 3035935374690959, this.sessionWrapper.createTime 3035935374690959 
   [junit4]   2> 1963892 INFO  (OverseerStateUpdate-72256557024018436-127.0.0.1:43629_solr-n_0000000000) [n:127.0.0.1:43629_solr    ] o.a.s.c.o.SliceMutator createReplica() {
   [junit4]   2>   "operation":"ADDREPLICA",
   [junit4]   2>   "collection":"testMultipleWithCollections_abc",
   [junit4]   2>   "shard":"shard1",
   [junit4]   2>   "core":"testMultipleWithCollections_abc_shard1_replica_n1",
   [junit4]   2>   "state":"down",
   [junit4]   2>   "base_url":"https://127.0.0.1:43629/solr",
   [junit4]   2>   "type":"NRT",
   [junit4]   2>   "waitForFinalState":"false"} 
   [junit4]   2> 1963892 DEBUG (OverseerStateUpdate-72256557024018436-127.0.0.1:43629_solr-n_0000000000) [n:127.0.0.1:43629_solr    ] o.a.s.c.o.SliceMutator Old Slice: shard1:{
   [junit4]   2>   "range":"80000000-7fffffff",
   [junit4]   2>   "state":"active",
   [junit4]   2>   "replicas":{}}
   [junit4]   2> 1963892 DEBUG (OverseerStateUpdate-72256557024018436-127.0.0.1:43629_solr-n_0000000000) [n:127.0.0.1:43629_solr    ] o.a.s.c.o.SliceMutator New Slice: shard1:{
   [junit4]   2>   "range":"80000000-7fffffff",
   [junit4]   2>   "state":"active",
   [junit4]   2>   "replicas":{"core_node2":{
   [junit4]   2>       "core":"testMultipleWithCollections_abc_shard1_replica_n1",
   [junit4]   2>       "base_url":"https://127.0.0.1:43629/solr",
   [junit4]   2>       "state":"down",
   [junit4]   2>       "node_name":null,
   [junit4]   2>       "type":"NRT"}}}
   [junit4]   2> 1963992 DEBUG (OverseerStateUpdate-72256557024018436-127.0.0.1:43629_solr-n_0000000000) [n:127.0.0.1:43629_solr    ] o.a.s.c.o.ZkStateWriter going to update_collection /collections/testMultipleWithCollections_abc/state.json version: 0
   [junit4]   2> 1964100 INFO  (qtp14897804-19257) [n:127.0.0.1:43629_solr    x:testMultipleWithCollections_abc_shard1_replica_n1] o.a.s.h.a.CoreAdminOperation core create command qt=/admin/cores&coreNodeName=core_node2&collection.configName=testMultipleWithCollections_abc.AUTOCREATED&newCollection=true&name=testMultipleWithCollections_abc_shard1_replica_n1&action=CREATE&numShards=1&collection=testMultipleWithCollections_abc&shard=shard1&wt=javabin&version=2&replicaType=NRT
   [junit4]   2> 1964104 DEBUG (OverseerStateUpdate-72256557024018436-127.0.0.1:43629_solr-n_0000000000) [n:127.0.0.1:43629_solr    ] o.a.s.c.o.ReplicaMutator Update state numShards=1 message={
   [junit4]   2>   "core":"testMultipleWithCollections_abc_shard1_replica_n1",
   [junit4]   2>   "core_node_name":"core_node2",
   [junit4]   2>   "roles":null,
   [junit4]   2>   "base_url":"https://127.0.0.1:43629/solr",
   [junit4]   2>   "node_name":"127.0.0.1:43629_solr",
   [junit4]   2>   "numShards":"1",
   [junit4]   2>   "state":"down",
   [junit4]   2>   "shard":"shard1",
   [junit4]   2>   "collection":"testMultipleWithCollections_abc",
   [junit4]   2>   "type":"NRT",
   [junit4]   2>   "force_set_state":"false",
   [junit4]   2>   "operation":"state"}
   [junit4]   2> 1964104 DEBUG (OverseerStateUpdate-72256557024018436-127.0.0.1:43629_solr-n_0000000000) [n:127.0.0.1:43629_solr    ] o.a.s.c.o.ReplicaMutator Will update state for replica: core_node2:{"core":"testMultipleWithCollections_abc_shard1_replica_n1","base_url":"https://127.0.0.1:43629/solr","node_name":"127.0.0.1:43629_solr","state":"down","type":"NRT","force_set_state":"false"}
   [junit4]   2> 1964104 DEBUG (OverseerStateUpdate-72256557024018436-127.0.0.1:43629_solr-n_0000000000) [n:127.0.0.1:43629_solr    ] o.a.s.c.o.ReplicaMutator Collection is now: DocCollection(testMultipleWithCollections_abc//collections/testMultipleWithCollections_abc/state.json/1)={
   [junit4]   2>   "pullReplicas":"0",
   [junit4]   2>   "replicationFactor":"1",
   [junit4]   2>   "router":{"name":"compositeId"},
   [junit4]   2>   "maxShardsPerNode":"1",
   [junit4]   2>   "autoAddReplicas":"false",
   [junit4]   2>   "nrtReplicas":"1",
   [junit4]   2>   "tlogReplicas":"0",
   [junit4]   2>   "shards":{"shard1":{
   [junit4]   2>       "range":"80000000-7fffffff",
   [junit4]   2>       "state":"active",
   [junit4]   2>       "replicas":{"core_node2":{
   [junit4]   2>           "core":"testMultipleWithCollections_abc_shard1_replica_n1",
   [junit4]   2>           "base_url":"https://127.0.0.1:43629/solr",
   [junit4]   2>           "node_name":"127.0.0.1:43629_solr",
   [junit4]   2>           "state":"down",
   [junit4]   2>           "type":"NRT",
   [junit4]   2>           "force_set_state":"false"}}}}}
   [junit4]   2> 1964205 DEBUG (OverseerStateUpdate-72256557024018436-127.0.0.1:43629_solr-n_0000000000) [n:127.0.0.1:43629_solr    ] o.a.s.c.o.ZkStateWriter going to update_collection /collections/testMultipleWithCollections_abc/state.json version: 1
   [junit4]   2> 1965112 INFO  (qtp14897804-19257) [n:127.0.0.1:43629_solr c:testMultipleWithCollections_abc s:shard1 r:core_node2 x:testMultipleWithCollections_abc_shard1_replica_n1] o.a.s.c.RequestParams conf resource params.json loaded . version : 0 
   [junit4]   2> 1965112 INFO  (qtp14897804-19257) [n:127.0.0.1:43629_solr c:testMultipleWithCollections_abc s:shard1 r:core_node2 x:testMultipleWithCollections_abc_shard1_replica_n1] o.a.s.c.RequestParams request params refreshed to version 0
   [junit4]   2> 1965112 WARN  (qtp14897804-19257) [n:127.0.0.1:43629_solr c:testMultipleWithCollections_abc s:shard1 r:core_node2 x:testMultipleWithCollections_abc_shard1_replica_n1] o.a.s.c.SolrConfig Couldn't add files from /home/jenkins/workspace/Lucene-Solr-7.x-Linux/solr/build/solr-core/test/J0/temp/solr.cloud.TestWithCollection_AEBD9C0133E3AE84-001/tempDir-001/node2/testMultipleWithCollections_abc_shard1_replica_n1/../../../../contrib/extraction/lib filtered by .*\.jar to classpath: /home/jenkins/workspace/Lucene-Solr-7.x-Linux/solr/build/solr-core/test/J0/temp/solr.cloud.TestWithCollection_AEBD9C0133E3AE84-001/tempDir-001/node2/testMultipleWithCollections_abc_shard1_replica_n1/../../../../contrib/extraction/lib
   [junit4]   2> 1965112 WARN  (qtp14897804-19257) [n:127.0.0.1:43629_solr c:testMultipleWithCollections_abc s:shard1 r:core_node2 x:testMultipleWithCollections_abc_shard1_replica_n1] o.a.s.c.SolrConfig Couldn't add files from /home/jenkins/workspace/Lucene-Solr-7.x-Linux/solr/build/solr-core/test/J0/temp/solr.cloud.TestWithCollection_AEBD9C0133E3AE84-001/tempDir-001/node2/testMultipleWithCollections_abc_shard1_replica_n1/../../../../dist filtered by solr-cell-\d.*\.jar to classpath: /home/jenkins/workspace/Lucene-Solr-7.x-Linux/solr/build/solr-core/test/J0/temp/solr.cloud.TestWithCollection_AEBD9C0133E3AE84-001/tempDir-001/node2/testMultipleWithCollections_abc_shard1_replica_n1/../../../../dist
   [junit4]   2> 1965113 WARN  (qtp14897804-19257) [n:127.0.0.1:43629_solr c:testMultipleWithCollections_abc s:shard1 r:core_node2 x:testMultipleWithCollections_abc_shard1_replica_n1] o.a.s.c.SolrConfig Couldn't add files from /home/jenkins/workspace/Lucene-Solr-7.x-Linux/solr/build/solr-core/test/J0/temp/solr.cloud.TestWithCollection_AEBD9C0133E3AE84-001/tempDir-001/node2/testMultipleWithCollections_abc_shard1_replica_n1/../../../../contrib/clustering/lib filtered by .*\.jar to classpath: /home/jenkins/workspace/Lucene-Solr-7.x-Linux/solr/build/solr-core/test/J0/temp/solr.cloud.TestWithCollection_AEBD9C0133E3AE84-001/tempDir-001/node2/testMultipleWithCollections_abc_shard1_replica_n1/../../../../contrib/clustering/lib
   [junit4]   2> 1965113 WARN  (qtp14897804-19257) [n:127.0.0.1:43629_solr c:testMultipleWithCollections_abc s:shard1 r:core_node2 x:testMultipleWithCollections_abc_shard1_replica_n1] o.a.s.c.SolrConfig Couldn't add files from /home/jenkins/workspace/Lucene-Solr-7.x-Linux/solr/build/solr-core/test/J0/temp/solr.cloud.TestWithCollection_AEBD9C0133E3AE84-001/tempDir-001/node2/testMultipleWithCollections_abc_shard1_replica_n1/../../../../dist filtered by solr-clustering-\d.*\.jar to classpath: /home/jenkins/workspace/Lucene-Solr-7.x-Linux/solr/build/solr-core/test/J0/temp/solr.cloud.TestWithCollection_AEBD9C0133E3AE84-001/tempDir-001/node2/testMultipleWithCollections_abc_shard1_replica_n1/../../../../dist
   [junit4]   2> 1965113 WARN  (qtp14897804-19257) [n:127.0.0.1:43629_solr c:testMultipleWithCollections_abc s:shard1 r:core_node2 x:testMultipleWithCollections_abc_shard1_replica_n1] o.a.s.c.SolrConfig Couldn't add files from /home/jenkins/workspace/Lucene-Solr-7.x-Linux/solr/build/solr-core/test/J0/temp/solr.cloud.TestWithCollection_AEBD9C0133E3AE84-001/tempDir-001/node2/testMultipleWithCollections_abc_shard1_replica_n1/../../../../contrib/langid/lib filtered by .*\.jar to classpath: /home/jenkins/workspace/Lucene-Solr-7.x-Linux/solr/build/solr-core/test/J0/temp/solr.cloud.TestWithCollection_AEBD9C0133E3AE84-001/tempDir-001/node2/testMultipleWithCollections_abc_shard1_replica_n1/../../../../contrib/langid/lib
   [junit4]   2> 1965113 WARN  (qtp14897804-19257) [n:127.0.0.1:43629_solr c:testMultipleWithCollections_abc s:shard1 r:core_node2 x:testMultipleWithCollections_abc_shard1_replica_n1] o.a.s.c.SolrConfig Couldn't add files from /home/jenkins/workspace/Lucene-Solr-7.x-Linux/solr/build/solr-core/test/J0/temp/solr.cloud.TestWithCollection_AEBD9C0133E3AE84-001/tempDir-001/node2/testMultipleWithCollections_abc_shard1_replica_n1/../../../../dist filtered by solr-langid-\d.*\.jar to classpath: /home/jenkins/workspace/Lucene-Solr-7.x-Linux/solr/build/solr-core/test/J0/temp/solr.cloud.TestWithCollection_AEBD9C0133E3AE84-001/tempDir-001/node2/testMultipleWithCollections_abc_shard1_replica_n1/../../../../dist
   [junit4]   2> 1965113 WARN  (qtp14897804-19257) [n:127.0.0.1:43629_solr c:testMultipleWithCollections_abc s:shard1 r:core_node2 x:testMultipleWithCollections_abc_shard1_replica_n1] o.a.s.c.SolrConfig Couldn't add files from /home/jenkins/workspace/Lucene-Solr-7.x-Linux/solr/build/solr-core/test/J0/temp/solr.cloud.TestWithCollection_AEBD9C0133E3AE84-001/tempDir-001/node2/testMultipleWithCollections_abc_shard1_replica_n1/../../../../contrib/velocity/lib filtered by .*\.jar to classpath: /home/jenkins/workspace/Lucene-Solr-7.x-Linux/solr/build/solr-core/test/J0/temp/solr.cloud.TestWithCollection_AEBD9C0133E3AE84-001/tempDir-001/node2/testMultipleWithCollections_abc_shard1_replica_n1/../../../../contrib/velocity/lib
   [junit4]   2> 1965113 WARN  (qtp14897804-19257) [n:127.0.0.1:43629_solr c:testMultipleWithCollections_abc s:shard1 r:core_node2 x:testMultipleWithCollections_abc_shard1_replica_n1] o.a.s.c.SolrConfig Couldn't add files from /home/jenkins/workspace/Lucene-Solr-7.x-Linux/solr/build/solr-core/test/J0/temp/solr.cloud.TestWithCollection_AEBD9C0133E3AE84-001/tempDir-001/node2/testMultipleWithCollections_abc_shard1_replica_n1/../../../../dist filtered by solr-velocity-\d.*\.jar to classpath: /home/jenkins/workspace/Lucene-Solr-7.x-Linux/solr/build/solr-core/test/J0/temp/solr.cloud.TestWithCollection_AEBD9C0133E3AE84-001/tempDir-001/node2/testMultipleWithCollections_abc_shard1_replica_n1/../../../../dist
   [junit4]   2> 1965121 INFO  (qtp14897804-19257) [n:127.0.0.1:43629_solr c:testMultipleWithCollections_abc s:shard1 r:core_node2 x:testMultipleWithCollections_abc_shard1_replica_n1] o.a.s.c.SolrConfig Using Lucene MatchVersion: 7.6.0
   [junit4]   2> 1965139 INFO  (qtp14897804-19257) [n:127.0.0.1:43629_solr c:testMultipleWithCollections_abc s:shard1 r:core_node2 x:testMultipleWithCollections_abc_shard1_replica_n1] o.a.s.s.IndexSchema [testMultipleWithCollections_abc_shard1_replica_n1] Schema name=default-config
   [junit4]   2> 1965283 INFO  (qtp14897804-19257) [n:127.0.0.1:43629_solr c:testMultipleWithCollections_abc s:shard1 r:core_node2 x:testMultipleWithCollections_abc_shard1_replica_n1] o.a.s.s.IndexSchema Loaded schema default-config/1.6 with uniqueid field id
   [junit4]   2> 1965296 INFO  (qtp14897804-19257) [n:127.0.0.1:43629_solr c:testMultipleWithCollections_abc s:shard1 r:core_node2 x:testMultipleWithCollections_abc_shard1_replica_n1] o.a.s.c.CoreContainer Creating SolrCore 'testMultipleWithCollections_abc_shard1_replica_n1' using configuration from collection testMultipleWithCollections_abc, trusted=true
   [junit4]   2> 1965297 INFO  (qtp14897804-19257) [n:127.0.0.1:43629_solr c:testMultipleWithCollections_abc s:shard1 r:core_node2 x:testMultipleWithCollections_abc_shard1_replica_n1] o.a.s.m.r.SolrJmxReporter JMX monitoring for 'solr_43629.solr.core.testMultipleWithCollections_abc.shard1.replica_n1' (registry 'solr.core.testMultipleWithCollections_abc.shard1.replica_n1') enabled at server: com.sun.jmx.mbeanserver.JmxMBeanServer@4fa4c48d
   [junit4]   2> 1965297 INFO  (qtp14897804-19257) [n:127.0.0.1:43629_solr c:testMultipleWithCollections_abc s:shard1 r:core_node2 x:testMultipleWithCollections_abc_shard1_replica_n1] o.a.s.c.SolrCore [[testMultipleWithCollections_abc_shard1_replica_n1] ] Opening new SolrCore at [/home/jenkins/workspace/Lucene-Solr-7.x-Linux/solr/build/solr-core/test/J0/temp/solr.cloud.TestWithCollection_AEBD9C0133E3AE84-001/tempDir-001/node2/testMultipleWithCollections_abc_shard1_replica_n1], dataDir=[/home/jenkins/workspace/Lucene-Solr-7.x-Linux/solr/build/solr-core/test/J0/temp/solr.cloud.TestWithCollection_AEBD9C0133E3AE84-001/tempDir-001/node2/./testMultipleWithCollections_abc_shard1_replica_n1/data/]
   [junit4]   2> 1965300 INFO  (qtp14897804-19257) [n:127.0.0.1:43629_solr c:testMultipleWithCollections_abc s:shard1 r:core_node2 x:testMultipleWithCollections_abc_shard1_replica_n1] o.a.s.r.XSLTResponseWriter xsltCacheLifetimeSeconds=5
   [junit4]   2> 1965340 INFO  (qtp14897804-19257) [n:127.0.0.1:43629_solr c:testMultipleWithCollections_abc s:shard1 r:core_node2 x:testMultipleWithCollections_abc_shard1_replica_n1] o.a.s.u.UpdateHandler Using UpdateLog implementation: org.apache.solr.update.UpdateLog
   [junit4]   2> 1965341 INFO  (qtp14897804-19257) [n:127.0.0.1:43629_solr c:testMultipleWithCollections_abc s:shard1 r:core_node2 x:testMultipleWithCollections_abc_shard1_replica_n1] o.a.s.u.UpdateLog Initializing UpdateLog: dataDir= defaultSyncLevel=FLUSH numRecordsToKeep=100 maxNumLogsToKeep=10 numVersionBuckets=65536
   [junit4]   2> 1965342 INFO  (qtp14897804-19257) [n:127.0.0.1:43629_solr c:testMultipleWithCollections_abc s:shard1 r:core_node2 x:testMultipleWithCollections_abc_shard1_replica_n1] o.a.s.u.CommitTracker Hard AutoCommit: if uncommitted for 15000ms; 
   [junit4]   2> 1965342 INFO  (qtp14897804-19257) [n:127.0.0.1:43629_solr c:testMultipleWithCollections_abc s:shard1 r:core_node2 x:testMultipleWithCollections_abc_shard1_replica_n1] o.a.s.u.CommitTracker Soft AutoCommit: disabled
   [junit4]   2> 1965343 INFO  (qtp14897804-19257) [n:127.0.0.1:43629_solr c:testMultipleWithCollections_abc s:shard1 r:core_node2 x:testMultipleWithCollections_abc_shard1_replica_n1] o.a.s.s.SolrIndexSearcher Opening [Searcher@7bbf171b[testMultipleWithCollections_abc_shard1_replica_n1] main]
   [junit4]   2> 1965343 INFO  (qtp14897804-19257) [n:127.0.0.1:43629_solr c:testMultipleWithCollections_abc s:shard1 r:core_node2 x:testMultipleWithCollections_abc_shard1_replica_n1] o.a.s.r.ManagedResourceStorage Configured ZooKeeperStorageIO with znodeBase: /configs/testMultipleWithCollections_abc.AUTOCREATED
   [junit4]   2> 1965344 INFO  (qtp14897804-19257) [n:127.0.0.1:43629_solr c:testMultipleWithCollections_abc s:shard1 r:core_node2 x:testMultipleWithCollections_abc_shard1_replica_n1] o.a.s.r.ManagedResourceStorage Loaded null at path _rest_managed.json using ZooKeeperStorageIO:path=/configs/testMultipleWithCollections_abc.AUTOCREATED
   [junit4]   2> 1965344 INFO  (qtp14897804-19257) [n:127.0.0.1:43629_solr c:testMultipleWithCollections_abc s:shard1 r:core_node2 x:testMultipleWithCollections_abc_shard1_replica_n1] o.a.s.s.ZkIndexSchemaReader Creating ZooKeeper watch for the managed schema at /configs/testMultipleWithCollections_abc.AUTOCREATED/managed-schema
   [junit4]   2> 1965344 INFO  (qtp14897804-19257) [n:127.0.0.1:43629_solr c:testMultipleWithCollections_abc s:shard1 r:core_node2 x:testMultipleWithCollections_abc_shard1_replica_n1] o.a.s.s.ZkIndexSchemaReader Current schema version 0 is already the latest
   [junit4]   2> 1965344 INFO  (qtp14897804-19257) [n:127.0.0.1:43629_solr c:testMultipleWithCollections_abc s:shard1 r:core_node2 x:testMultipleWithCollections_abc_shard1_replica_n1] o.a.s.h.c.SpellCheckComponent Initializing spell checkers
   [junit4]   2> 1965345 INFO  (qtp14897804-19257) [n:127.0.0.1:43629_solr c:testMultipleWithCollections_abc s:shard1 r:core_node2 x:testMultipleWithCollections_abc_shard1_replica_n1] o.a.s.s.DirectSolrSpellChecker init: {name=default,field=_text_,classname=solr.DirectSolrSpellChecker,distanceMeasure=internal,accuracy=0.5,maxEdits=2,minPrefix=1,maxInspections=5,minQueryLength=4,maxQueryFrequency=0.01}
   [junit4]   2> 1965346 INFO  (qtp14897804-19257) [n:127.0.0.1:43629_solr c:testMultipleWithCollections_abc s:shard1 r:core_node2 x:testMultipleWithCollections_abc_shard1_replica_n1] o.a.s.h.ReplicationHandler Commits will be reserved for 10000ms.
   [junit4]   2> 1965346 INFO  (qtp14897804-19257) [n:127.0.0.1:43629_solr c:testMultipleWithCollections_abc s:shard1 r:core_node2 x:testMultipleWithCollections_abc_shard1_replica_n1] o.a.s.u.UpdateLog Could not find max version in index or recent updates, using new clock 1612122957238239232
   [junit4]   2> 1965346 INFO  (searcherExecutor-6570-thread-1-processing-n:127.0.0.1:43629_solr x:testMultipleWithCollections_abc_shard1_replica_n1 c:testMultipleWithCollections_abc s:shard1 r:core_node2) [n:127.0.0.1:43629_solr c:testMultipleWithCollections_abc s:shard1 r:core_node2 x:testMultipleWithCollections_abc_shard1_replica_n1] o.a.s.c.QuerySenderListener QuerySenderListener sending requests to Searcher@7bbf171b[testMultipleWithCollections_abc_shard1_replica_n1] main{ExitableDirectoryReader(UninvertingDirectoryReader())}
   [junit4]   2> 1965346 INFO  (searcherExecutor-6570-thread-1-processing-n:127.0.0.1:43629_solr x:testMultipleWithCollections_abc_shard1_replica_n1 c:testMultipleWithCollections_abc s:shard1 r:core_node2) [n:127.0.0.1:43629_solr c:testMultipleWithCollections_abc s:shard1 r:core_node2 x:testMultipleWithCollections_abc_shard1_replica_n1] o.a.s.c.QuerySenderListener QuerySenderListener done.
   [junit4]   2> 1965346 INFO  (searcherExecutor-6570-thread-1-processing-n:127.0.0.1:43629_solr x:testMultipleWithCollections_abc_shard1_replica_n1 c:testMultipleWithCollections_abc s:shard1 r:core_node2) [n:127.0.0.1:43629_solr c:testMultipleWithCollections_abc s:shard1 r:core_node2 x:testMultipleWithCollections_abc_shard1_replica_n1] o.a.s.h.c.SpellCheckComponent Loading spell index for spellchecker: default
   [junit4]   2> 1965347 INFO  (searcherExecutor-6570-thread-1-processing-n:127.0.0.1:43629_solr x:testMultipleWithCollections_abc_shard1_replica_n1 c:testMultipleWithCollections_abc s:shard1 r:core_node2) [n:127.0.0.1:43629_solr c:testMultipleWithCollections_abc s:shard1 r:core_node2 x:testMultipleWithCollections_abc_shard1_replica_n1] o.a.s.c.SolrCore [testMultipleWithCollections_abc_shard1_replica_n1] Registered new searcher Searcher@7bbf171b[testMultipleWithCollections_abc_shard1_replica_n1] main{ExitableDirectoryReader(UninvertingDirectoryReader())}
   [junit4]   2> 1965350 INFO  (qtp14897804-19257) [n:127.0.0.1:43629_solr c:testMultipleWithCollections_abc s:shard1 r:core_node2 x:testMultipleWithCollections_abc_shard1_replica_n1] o.a.s.c.ZkShardTerms Successful update of terms at /collections/testMultipleWithCollections_abc/terms/shard1 to Terms{values={core_node2=0}, version=0}
   [junit4]   2> 1965352 INFO  (qtp14897804-19257) [n:127.0.0.1:43629_solr c:testMultipleWithCollections_abc s:shard1 r:core_node2 x:testMultipleWithCollections_abc_shard1_replica_n1] o.a.s.c.ShardLeaderElectionContext Enough replicas found to continue.
   [junit4]   2> 1965352 INFO  (qtp14897804-19257) [n:127.0.0.1:43629_solr c:testMultipleWithCollections_abc s:shard1 r:core_node2 x:testMultipleWithCollections_abc_shard1_replica_n1] o.a.s.c.ShardLeaderElectionContext I may be the new leader - try and sync
   [junit4]   2> 1965352 INFO  (qtp14897804-19257) [n:127.0.0.1:43629_solr c:testMultipleWithCollections_abc s:shard1 r:core_node2 x:testMultipleWithCollections_abc_shard1_replica_n1] o.a.s.c.SyncStrategy Sync replicas to https://127.0.0.1:43629/solr/testMultipleWithCollections_abc_shard1_replica_n1/
   [junit4]   2> 1965352 INFO  (qtp14897804-19257) [n:127.0.0.1:43629_solr c:testMultipleWithCollections_abc s:shard1 r:core_node2 x:testMultipleWithCollections_abc_shard1_replica_n1] o.a.s.c.SyncStrategy Sync Success - now sync replicas to me
   [junit4]   2> 1965352 INFO  (qtp14897804-19257) [n:127.0.0.1:43629_solr c:testMultipleWithCollections_abc s:shard1 r:core_node2 x:testMultipleWithCollections_abc_shard1_replica_n1] o.a.s.c.SyncStrategy https://127.0.0.1:43629/solr/testMultipleWithCollections_abc_shard1_replica_n1/ has no replicas
   [junit4]   2> 1965352 INFO  (qtp14897804-19257) [n:127.0.0.1:43629_solr c:testMultipleWithCollections_abc s:shard1 r:core_node2 x:testMultipleWithCollections_abc_shard1_replica_n1] o.a.s.c.ShardLeaderElectionContext Found all replicas participating in election, clear LIR
   [junit4]   2> 1965355 INFO  (qtp14897804-19257) [n:127.0.0.1:43629_solr c:testMultipleWithCollections_abc s:shard1 r:core_node2 x:testMultipleWithCollections_abc_shard1_replica_n1] o.a.s.c.ShardLeaderElectionContext I am the new leader: https://127.0.0.1:43629/solr/testMultipleWithCollections_abc_shard1_replica_n1/ shard1
   [junit4]   2> 1965455 DEBUG (OverseerStateUpdate-72256557024018436-127.0.0.1:43629_solr-n_0000000000) [n:127.0.0.1:43629_solr    ] o.a.s.c.o.ZkStateWriter going to update_collection /collections/testMultipleWithCollections_abc/state.json version: 2
   [junit4]   2> 1965456 INFO  (qtp14897804-19257) [n:127.0.0.1:43629_solr c:testMultipleWithCollections_abc s:shard1 r:core_node2 x:testMultipleWithCollections_abc_shard1_replica_n1] o.a.s.c.ZkController I am the leader, no recovery necessary
   [junit4]   2> 1965457 DEBUG (OverseerStateUpdate-72256557024018436-127.0.0.1:43629_solr-n_0000000000) [n:127.0.0.1:43629_solr    ] o.a.s.c.o.ReplicaMutator Update state numShards=1 message={
   [junit4]   2>   "core":"testMultipleWithCollections_abc_shard1_replica_n1",
   [junit4]   2>   "core_node_name":"core_node2",
   [junit4]   2>   "roles":null,
   [junit4]   2>   "base_url":"https://127.0.0.1:43629/solr",
   [junit4]   2>   "node_name":"127.0.0.1:43629_solr",
   [junit4]   2>   "numShards":"1",
   [junit4]   2>   "state":"active",
   [junit4]   2>   "shard":"shard1",
   [junit4]   2>   "collection":"testMultipleWithCollections_abc",
   [junit4]   2>   "type":"NRT",
   [junit4]   2>   "force_set_state":"false",
   [junit4]   2>   "operation":"state"}
   [junit4]   2> 1965457 DEBUG (OverseerStateUpdate-72256557024018436-127.0.0.1:43629_solr-n_0000000000) [n:127.0.0.1:43629_solr    ] o.a.s.c.o.ReplicaMutator Will update state for replica: core_node2:{"core":"testMultipleWithCollections_abc_shard1_replica_n1","base_url":"https://127.0.0.1:43629/solr","node_name":"127.0.0.1:43629_solr","state":"active","type":"NRT","force_set_state":"false","leader":"true"}
   [junit4]   2> 1965457 DEBUG (OverseerStateUpdate-72256557024018436-127.0.0.1:43629_solr-n_0000000000) [n:127.0.0.1:43629_solr    ] o.a.s.c.o.ReplicaMutator Collection is now: DocCollection(testMultipleWithCollections_abc//collections/testMultipleWithCollections_abc/state.json/3)={
   [junit4]   2>   "pullReplicas":"0",
   [junit4]   2>   "replicationFactor":"1",
   [junit4]   2>   "router":{"name":"compositeId"},
   [junit4]   2>   "maxShardsPerNode":"1",
   [junit4]   2>   "autoAddReplicas":"false",
   [junit4]   2>   "nrtReplicas":"1",
   [junit4]   2>   "tlogReplicas":"0",
   [junit4]   2>   "shards":{"shard1":{
   [junit4]   2>       "range":"80000000-7fffffff",
   [junit4]   2>       "state":"active",
   [junit4]   2>       "replicas":{"core_node2":{
   [junit4]   2>           "core":"testMultipleWithCollections_abc_shard1_replica_n1",
   [junit4]   2>           "base_url":"https://127.0.0.1:43629/solr",
   [junit4]   2>           "node_name":"127.0.0.1:43629_solr",
   [junit4]   2>           "state":"active",
   [junit4]   2>           "type":"NRT",
   [junit4]   2>           "force_set_state":"false",
   [junit4]   2>           "leader":"true"}}}}}
   [junit4]   2> 1965493 INFO  (qtp14897804-19257) [n:127.0.0.1:43629_solr c:testMultipleWithCollections_abc s:shard1 r:core_node2 x:testMultipleWithCollections_abc_shard1_replica_n1] o.a.s.s.HttpSolrCall [admin] webapp=null path=/admin/cores params={qt=/admin/cores&coreNodeName=core_node2&collection.configName=testMultipleWithCollections_abc.AUTOCREATED&newCollection=true&name=testMultipleWithCollections_abc_shard1_replica_n1&action=CREATE&numShards=1&collection=testMultipleWithCollections_abc&shard=shard1&wt=javabin&version=2&replicaType=NRT} status=0 QTime=1393
   [junit4]   2> 1965494 DEBUG (OverseerThreadFactory-6543-thread-1-processing-n:127.0.0.1:43629_solr) [n:127.0.0.1:43629_solr    ] o.a.s.c.s.c.a.PolicyHelper session set to NULL
   [junit4]   2> 1965495 INFO  (qtp1926775567-19357) [n:127.0.0.1:37167_solr    ] o.a.s.h.a.CollectionsHandler Wait for new collection to be active for at most 30 seconds. Check all shard replicas
   [junit4]   2> 1965558 DEBUG (OverseerStateUpdate-72256557024018436-127.0.0.1:43629_solr-n_0000000000) [n:127.0.0.1:43629_solr    ] o.a.s.c.o.ZkStateWriter going to update_collection /collections/testMultipleWithCollections_abc/state.json version: 3
   [junit4]   2> 1965558 INFO  (zkCallback-5325-thread-1) [    ] o.a.s.c.c.ZkStateReader A cluster state change: [WatchedEvent state:SyncConnected type:NodeDataChanged path:/collections/testMultipleWithCollections_abc/state.json] for collection [testMultipleWithCollections_abc] has occurred - updating... (live nodes size: [4])
   [junit4]   2> 1965744 INFO  (OverseerCollectionConfigSetProcessor-72256557024018436-127.0.0.1:43629_solr-n_0000000000) [n:127.0.0.1:43629_solr    ] o.a.s.c.OverseerTaskQueue Response ZK path: /overseer/collection-queue-work/qnr-0000000000 doesn't exist.  Requestor may have disconnected from ZooKeeper
   [junit4]   2> 1966496 INFO  (qtp1926775567-19357) [n:127.0.0.1:37167_solr    ] o.a.s.s.HttpSolrCall [admin] webapp=null path=/admin/collections params={pullReplicas=0&name=testMultipleWithCollections_abc&nrtReplicas=1&action=CREATE&numShards=1&tlogReplicas=0&createNodeSet=127.0.0.1:43629_solr&wt=javabin&version=2} status=0 QTime=2754
   [junit4]   2> 1966497 INFO  (qtp14897804-19255) [n:127.0.0.1:43629_solr    ] o.a.s.h.a.CollectionsHandler Invoked Collection Action :create with params pullReplicas=0&withCollection=testMultipleWithCollections_abc&name=testMultipleWithCollections_xyz&nrtReplicas=1&action=CREATE&numShards=1&tlogReplicas=0&wt=javabin&version=2 and sendToOCPQueue=true
   [junit4]   2> 1966498 INFO  (OverseerThreadFactory-6543-thread-2-processing-n:127.0.0.1:43629_solr) [n:127.0.0.1:43629_solr    ] o.a.s.c.a.c.CreateCollectionCmd Create collection testMultipleWithCollections_xyz
   [junit4]   2> 1966500 INFO  (OverseerThreadFactory-6543-thread-2-processing-n:127.0.0.1:43629_solr) [n:127.0.0.1:43629_solr    ] o.a.s.c.c.ZkConfigManager Copying zk node /configs/_default/protwords.txt to /configs/testMultipleWithCollections_xyz.AUTOCREATED/protwords.txt
   [junit4]   2> 1966500 INFO  (OverseerThreadFactory-6543-thread-2-processing-n:127.0.0.1:43629_solr) [n:127.0.0.1:43629_solr    ] o.a.s.c.c.ZkConfigManager Copying zk node /configs/_default/managed-schema to /configs/testMultipleWithCollections_xyz.AUTOCREATED/managed-schema
   [junit4]   2> 1966501 INFO  (OverseerThreadFactory-6543-thread-2-processing-n:127.0.0.1:43629_solr) [n:127.0.0.1:43629_solr    ] o.a.s.c.c.ZkConfigManager Copying zk node /configs/_default/solrconfig.xml to /configs/testMultipleWithCollections_xyz.AUTOCREATED/solrconfig.xml
   [junit4]   2> 1966502 INFO  (OverseerThreadFactory-6543-thread-2-processing-n:127.0.0.1:43629_solr) [n:127.0.0.1:43629_solr    ] o.a.s.c.c.ZkConfigManager Copying zk node /configs/_default/synonyms.txt to /configs/testMultipleWithCollections_xyz.AUTOCREATED/synonyms.txt
   [junit4]   2> 1966503 INFO  (OverseerThreadFactory-6543-thread-2-processing-n:127.0.0.1:43629_solr) [n:127.0.0.1:43629_solr    ] o.a.s.c.c.ZkConfigManager Copying zk node /configs/_default/stopwords.txt to /configs/testMultipleWithCollections_xyz.AUTOCREATED/stopwords.txt
   [junit4]   2> 1966503 INFO  (OverseerThreadFactory-6543-thread-2-processing-n:127.0.0.1:43629_solr) [n:127.0.0.1:43629_solr    ] o.a.s.c.c.ZkConfigManager Copying zk node /configs/_default/lang/contractions_it.txt to /configs/testMultipleWithCollections_xyz.AUTOCREATED/lang/contractions_it.txt
   [junit4]   2> 1966504 INFO  (OverseerThreadFactory-6543-thread-2-processing-n:127.0.0.1:43629_solr) [n:127.0.0.1:43629_solr    ] o.a.s.c.c.ZkConfigManager Copying zk node /configs/_default/lang/stemdict_nl.txt to /configs/testMultipleWithCollections_xyz.AUTOCREATED/lang/stemdict_nl.txt
   [junit4]   2> 1966505 INFO  (OverseerThreadFactory-6543-thread-2-processing-n:127.0.0.1:43629_solr) [n:127.0.0.1:43629_solr    ] o.a.s.c.c.ZkConfigManager Copying zk node /configs/_default/lang/stopwords_hy.txt to /configs/testMultipleWithCollections_xyz.AUTOCREATED/lang/stopwords_hy.txt
   [junit4]   2> 1966506 INFO  (OverseerThreadFactory-6543-thread-2-processing-n:127.0.0.1:43629_solr) [n:127.0.0.1:43629_solr    ] o.a.s.c.c.ZkConfigManager Copying zk node /configs/_default/lang/stopwords_no.txt to /configs/testMultipleWithCollections_xyz.AUTOCREATED/lang/stopwords_no.txt
   [junit4]   2> 1966507 INFO  (OverseerThreadFactory-6543-thread-2-processing-n:127.0.0.1:43629_solr) [n:127.0.0.1:43629_solr    ] o.a.s.c.c.ZkConfigManager Copying zk node /configs/_default/lang/contractions_ca.txt to /configs/testMultipleWithCollections_xyz.AUTOCREATED/lang/contractions_ca.txt
   [junit4]   2> 1966508 INFO  (OverseerThreadFactory-6543-thread-2-processing-n:127.0.0.1:43629_solr) [n:127.0.0.1:43629_solr    ] o.a.s.c.c.ZkConfigManager Copying zk node /configs/_default/lang/stopwords_id.txt to /configs/testMultipleWithCollections_xyz.AUTOCREATED/lang/stopwords_id.txt
   [junit4]   2> 1966508 INFO  (OverseerThreadFactory-6543-thread-2-processing-n:127.0.0.1:43629_solr) [n:127.0.0.1:43629_solr    ] o.a.s.c.c.ZkConfigManager Copying zk node /configs/_default/lang/stopwords_ga.txt to /configs/testMultipleWithCollections_xyz.AUTOCREATED/lang/stopwords_ga.txt
   [junit4]   2> 1966509 INFO  (OverseerThreadFactory-6543-thread-2-processing-n:127.0.0.1:43629_solr) [n:127.0.0.1:43629_solr    ] o.a.s.c.c.ZkConfigManager Copying zk node /configs/_default/lang/stopwords_hi.txt to /configs/testMultipleWithCollections_xyz.AUTOCREATED/lang/stopwords_hi.txt
   [junit4]   2> 1966510 INFO  (OverseerThreadFactory-6543-thread-2-processing-n:127.0.0.1:43629_solr) [n:127.0.0.1:43629_solr    ] o.a.s.c.c.ZkConfigManager Copying zk node /configs/_default/lang/stopwords_da.txt to /configs/testMultipleWithCollections_xyz.AUTOCREATED/lang/stopwords_da.txt
   [junit4]   2> 1966510 INFO  (OverseerThreadFactory-6543-thread-2-processing-n:127.0.0.1:43629_solr) [n:127.0.0.1:43629_solr    ] o.a.s.c.c.ZkConfigManager Copying zk node /configs/_default/lang/stopwords_ja.txt to /configs/testMultipleWithCollections_xyz.AUTOCREATED/lang/stopwords_ja.txt
   [junit4]   2> 1966511 INFO  (OverseerThreadFactory-6543-thread-2-processing-n:127.0.0.1:43629_solr) [n:127.0.0.1:43629_solr    ] o.a.s.c.c.ZkConfigManager Copying zk node /configs/_default/lang/stopwords_pt.txt to /configs/testMultipleWithCollections_xyz.AUTOCREATED/lang/stopwords_pt.txt
   [junit4]   2> 1966511 INFO  (OverseerThreadFactory-6543-thread-2-processing-n:127.0.0.1:43629_solr) [n:127.0.0.1:43629_solr    ] o.a.s.c.c.ZkConfigManager Copying zk node /configs/_default/lang/stopwords_hu.txt to /configs/testMultipleWithCollections_xyz.AUTOCREATED/lang/stopwords_hu.txt
   [junit4]   2> 1966512 INFO  (OverseerThreadFactory-6543-thread-2-processing-n:127.0.0.1:43629_solr) [n:127.0.0.1:43629_solr    ] o.a.s.c.c.ZkConfigManager Copying zk node /configs/_default/lang/stopwords_el.txt to /configs/testMultipleWithCollections_xyz.AUTOCREATED/lang/stopwords_el.txt
   [junit4]   2> 1966513 INFO  (OverseerThreadFactory-6543-thread-2-processing-n:127.0.0.1:43629_solr) [n:127.0.0.1:43629_solr    ] o.a.s.c.c.ZkConfigManager Copying zk node /configs/_default/lang/stopwords_ru.txt to /configs/testMultipleWithCollections_xyz.AUTOCREATED/lang/stopwords_ru.txt
   [junit4]   2> 1966514 INFO  (OverseerThreadFactory-6543-thread-2-processing-n:127.0.0.1:43629_solr) [n:127.0.0.1:43629_solr    ] o.a.s.c.c.ZkConfigManager Copying zk node /configs/_default/lang/stopwords_tr.txt to /configs/testMultipleWithCollections_xyz.AUTOCREATED/lang/stopwords_tr.txt
   [junit4]   2> 1966514 INFO  (OverseerThreadFactory-6543-thread-2-processing-n:127.0.0.1:43629_solr) [n:127.0.0.1:43629_solr    ] o.a.s.c.c.ZkConfigManager Copying zk node /configs/_default/lang/stopwords_ar.txt to /configs/testMultipleWithCollections_xyz.AUTOCREATED/lang/stopwords_ar.txt
   [junit4]   2> 1966515 INFO  (OverseerThreadFactory-6543-thread-2-processing-n:127.0.0.1:43629_solr) [n:127.0.0.1:43629_solr    ] o.a.s.c.c.ZkConfigManager Copying zk node /configs/_default/lang/userdict_ja.txt to /configs/testMultipleWithCollections_xyz.AUTOCREATED/lang/userdict_ja.txt
   [junit4]   2> 1966516 INFO  (OverseerThreadFactory-6543-thread-2-processing-n:127.0.0.1:43629_solr) [n:127.0.0.1:43629_solr    ] o.a.s.c.c.ZkConfigManager Copying zk node /configs/_default/lang/stopwords_eu.txt to /configs/testMultipleWithCollections_xyz.AUTOCREATED/lang/stopwords_eu.txt
   [junit4]   2> 1966516 INFO  (OverseerThreadFactory-6543-thread-2-processing-n:127.0.0.1:43629_solr) [n:127.0.0.1:43629_solr    ] o.a.s.c.c.ZkConfigManager Copying zk node /configs/_default/lang/stopwords_it.txt to /configs/testMultipleWithCollections_xyz.AUTOCREATED/lang/stopwords_it.txt
   [junit4]   2> 1966517 INFO  (OverseerThreadFactory-6543-thread-2-processing-n:127.0.0.1:43629_solr) [n:127.0.0.1:43629_solr    ] o.a.s.c.c.ZkConfigManager Copying zk node /configs/_default/lang/stopwords_cz.txt to /configs/testMultipleWithCollections_xyz.AUTOCREATED/lang/stopwords_cz.txt
   [junit4]   2> 1966518 INFO  (OverseerThreadFactory-6543-thread-2-processing-n:127.0.0.1:43629_solr) [n:127.0.0.1:43629_solr    ] o.a.s.c.c.ZkConfigManager Copying zk node /configs/_default/lang/stoptags_ja.txt to /configs/testMultipleWithCollections_xyz.AUTOCREATED/lang/

[...truncated too long message...]

ength is 0.

-ivy-fail-disallowed-ivy-version:

ivy-fail:

resolve-groovy:
[ivy:cachepath] :: resolving dependencies :: org.codehaus.groovy#groovy-all-caller;working
[ivy:cachepath] 	confs: [default]
[ivy:cachepath] 	found org.codehaus.groovy#groovy-all;2.4.15 in public
[ivy:cachepath] :: resolution report :: resolve 13ms :: artifacts dl 0ms
	---------------------------------------------------------------------
	|                  |            modules            ||   artifacts   |
	|       conf       | number| search|dwnlded|evicted|| number|dwnlded|
	---------------------------------------------------------------------
	|      default     |   1   |   0   |   0   |   0   ||   1   |   0   |
	---------------------------------------------------------------------

-init-totals:

-test:
    [mkdir] Created dir: /home/jenkins/workspace/Lucene-Solr-7.x-Linux/solr/build/solr-core/test
[junit4:pickseed] Seed property 'tests.seed' already defined: AEBD9C0133E3AE84
    [mkdir] Created dir: /home/jenkins/workspace/Lucene-Solr-7.x-Linux/solr/build/solr-core/test/temp
   [junit4] <JUnit4> says नमस्ते! Master seed: AEBD9C0133E3AE84
   [junit4] Executing 5 suites with 3 JVMs.
   [junit4] 
   [junit4] Started J0 PID(10166@serv1.sd-datasolutions.de).
   [junit4] Started J2 PID(10165@serv1.sd-datasolutions.de).
   [junit4] Started J1 PID(10164@serv1.sd-datasolutions.de).
   [junit4] Suite: org.apache.solr.cloud.TestWithCollection
   [junit4] OK      20.4s J0 | TestWithCollection.testMultipleWithCollections
   [junit4] OK      16.4s J0 | TestWithCollection.testDeleteWithCollection
   [junit4] OK      7.94s J0 | TestWithCollection.testAddReplicaSimple
   [junit4] OK      4.43s J0 | TestWithCollection.testCreateCollectionNoWithCollection
   [junit4] OK      5.57s J0 | TestWithCollection.testCreateCollection
   [junit4] OK      15.5s J0 | TestWithCollection.testNodeAdded
   [junit4] OK      10.5s J0 | TestWithCollection.testMoveReplicaMainCollection
   [junit4] OK      11.0s J0 | TestWithCollection.testAddReplicaWithPolicy
   [junit4] OK      6.33s J0 | TestWithCollection.testMoveReplicaWithCollection
   [junit4] Completed [1/5] on J0 in 104.67s, 9 tests
   [junit4] 
   [junit4] Suite: org.apache.solr.cloud.TestWithCollection
   [junit4] OK      19.7s J1 | TestWithCollection.testMultipleWithCollections
   [junit4] OK      19.2s J1 | TestWithCollection.testDeleteWithCollection
   [junit4] OK      7.88s J1 | TestWithCollection.testAddReplicaSimple
   [junit4] OK      4.52s J1 | TestWithCollection.testCreateCollectionNoWithCollection
   [junit4] OK      5.50s J1 | TestWithCollection.testCreateCollection
   [junit4] OK      15.7s J1 | TestWithCollection.testNodeAdded
   [junit4] OK      10.6s J1 | TestWithCollection.testMoveReplicaMainCollection
   [junit4] OK      11.0s J1 | TestWithCollection.testAddReplicaWithPolicy
   [junit4] OK      6.46s J1 | TestWithCollection.testMoveReplicaWithCollection
   [junit4] Completed [2/5] on J1 in 107.12s, 9 tests
   [junit4] 
   [junit4] Duplicate suite name used with XML reports: org.apache.solr.cloud.TestWithCollection. This may confuse tools that process XML reports. Set 'ignoreDuplicateSuites' to true to skip this message.
   [junit4] Suite: org.apache.solr.cloud.TestWithCollection
   [junit4] OK      20.6s J2 | TestWithCollection.testMultipleWithCollections
   [junit4] OK      18.5s J2 | TestWithCollection.testDeleteWithCollection
   [junit4] OK      7.94s J2 | TestWithCollection.testAddReplicaSimple
   [junit4] OK      4.56s J2 | TestWithCollection.testCreateCollectionNoWithCollection
   [junit4] OK      5.49s J2 | TestWithCollection.testCreateCollection
   [junit4] OK      15.7s J2 | TestWithCollection.testNodeAdded
   [junit4] OK      10.6s J2 | TestWithCollection.testMoveReplicaMainCollection
   [junit4] OK      11.0s J2 | TestWithCollection.testAddReplicaWithPolicy
   [junit4] OK      6.37s J2 | TestWithCollection.testMoveReplicaWithCollection
   [junit4] Completed [3/5] on J2 in 108.70s, 9 tests
   [junit4] 
   [junit4] Suite: org.apache.solr.cloud.TestWithCollection
   [junit4] OK      14.7s J0 | TestWithCollection.testMultipleWithCollections
   [junit4] OK      18.8s J0 | TestWithCollection.testDeleteWithCollection
   [junit4] OK      7.83s J0 | TestWithCollection.testAddReplicaSimple
   [junit4] OK      4.36s J0 | TestWithCollection.testCreateCollectionNoWithCollection
   [junit4] OK      5.42s J0 | TestWithCollection.testCreateCollection
   [junit4] OK      15.4s J0 | TestWithCollection.testNodeAdded
   [junit4] OK      10.4s J0 | TestWithCollection.testMoveReplicaMainCollection
   [junit4] OK      10.9s J0 | TestWithCollection.testAddReplicaWithPolicy
   [junit4] OK      6.22s J0 | TestWithCollection.testMoveReplicaWithCollection
   [junit4] Completed [4/5] on J0 in 96.03s, 9 tests
   [junit4] 
   [junit4] Suite: org.apache.solr.cloud.TestWithCollection
   [junit4] OK      14.8s J1 | TestWithCollection.testMultipleWithCollections
   [junit4] OK      18.8s J1 | TestWithCollection.testDeleteWithCollection
   [junit4] OK      7.81s J1 | TestWithCollection.testAddReplicaSimple
   [junit4] OK      4.43s J1 | TestWithCollection.testCreateCollectionNoWithCollection
   [junit4] OK      5.56s J1 | TestWithCollection.testCreateCollection
   [junit4] OK      15.2s J1 | TestWithCollection.testNodeAdded
   [junit4] OK      10.4s J1 | TestWithCollection.testMoveReplicaMainCollection
   [junit4] OK      10.9s J1 | TestWithCollection.testAddReplicaWithPolicy
   [junit4] OK      6.19s J1 | TestWithCollection.testMoveReplicaWithCollection
   [junit4] Completed [5/5] on J1 in 95.92s, 9 tests
   [junit4] 
   [junit4] JVM J0:     0.39 ..   202.05 =   201.66s
   [junit4] JVM J1:     0.40 ..   204.48 =   204.08s
   [junit4] JVM J2:     0.40 ..   109.84 =   109.44s
   [junit4] Execution time total: 3 minutes 24 seconds
   [junit4] Tests summary: 5 suites, 45 tests
   [junit4] Could not remove temporary path: /home/jenkins/workspace/Lucene-Solr-7.x-Linux/solr/build/solr-core/test/J2 (java.nio.file.DirectoryNotEmptyException: Remaining files: [/home/jenkins/workspace/Lucene-Solr-7.x-Linux/solr/build/solr-core/test/J2/temp])
   [junit4] Could not remove temporary path: /home/jenkins/workspace/Lucene-Solr-7.x-Linux/solr/build/solr-core/test/J0 (java.nio.file.DirectoryNotEmptyException: Remaining files: [/home/jenkins/workspace/Lucene-Solr-7.x-Linux/solr/build/solr-core/test/J0/temp])
   [junit4] Could not remove temporary path: /home/jenkins/workspace/Lucene-Solr-7.x-Linux/solr/build/solr-core/test/J1 (java.nio.file.DirectoryNotEmptyException: Remaining files: [/home/jenkins/workspace/Lucene-Solr-7.x-Linux/solr/build/solr-core/test/J1/temp])
     [echo] 5 slowest tests:
[junit4:tophints] 691.78s | org.apache.solr.cloud.cdcr.CdcrWithNodesRestartsTest
[junit4:tophints] 567.98s | org.apache.solr.cloud.cdcr.CdcrOpsAndBoundariesTest
[junit4:tophints] 460.74s | org.apache.solr.cloud.api.collections.ShardSplitTest
[junit4:tophints] 116.41s | org.apache.solr.update.SoftAutoCommitTest
[junit4:tophints] 115.10s | org.apache.solr.cloud.ZkFailoverTest

-check-totals:

test-nocompile:

BUILD SUCCESSFUL
Total time: 3 minutes 26 seconds
[repro] Failures:
[repro]   0/5 failed: org.apache.solr.cloud.TestWithCollection
[repro] Exiting with code 0
+ mv lucene/build lucene/build.repro
+ mv solr/build solr/build.repro
+ mv lucene/build.orig lucene/build
+ mv solr/build.orig solr/build
Archiving artifacts
Setting ANT_1_8_2_HOME=/var/lib/jenkins/tools/hudson.tasks.Ant_AntInstallation/ANT_1.8.2
java.lang.InterruptedException: no matches found within 10000
	at hudson.FilePath$ValidateAntFileMask.hasMatch(FilePath.java:2845)
	at hudson.FilePath$ValidateAntFileMask.invoke(FilePath.java:2724)
	at hudson.FilePath$ValidateAntFileMask.invoke(FilePath.java:2705)
	at hudson.FilePath.act(FilePath.java:1076)
	at hudson.FilePath.act(FilePath.java:1059)
	at hudson.FilePath.validateAntFileMask(FilePath.java:2703)
	at hudson.tasks.ArtifactArchiver.perform(ArtifactArchiver.java:243)
	at hudson.tasks.BuildStepCompatibilityLayer.perform(BuildStepCompatibilityLayer.java:81)
	at hudson.tasks.BuildStepMonitor$1.perform(BuildStepMonitor.java:20)
	at hudson.model.AbstractBuild$AbstractBuildExecution.perform(AbstractBuild.java:744)
	at hudson.model.AbstractBuild$AbstractBuildExecution.performAllBuildSteps(AbstractBuild.java:690)
	at hudson.model.Build$BuildExecution.post2(Build.java:186)
	at hudson.model.AbstractBuild$AbstractBuildExecution.post(AbstractBuild.java:635)
	at hudson.model.Run.execute(Run.java:1840)
	at hudson.model.FreeStyleBuild.run(FreeStyleBuild.java:43)
	at hudson.model.ResourceController.execute(ResourceController.java:97)
	at hudson.model.Executor.run(Executor.java:429)
No artifacts found that match the file pattern "**/*.events,heapdumps/**,**/*_pid*.log". Configuration error?
[WARNINGS] Parsing warnings in console log with parser Java Compiler (javac)
Setting ANT_1_8_2_HOME=/var/lib/jenkins/tools/hudson.tasks.Ant_AntInstallation/ANT_1.8.2
Setting ANT_1_8_2_HOME=/var/lib/jenkins/tools/hudson.tasks.Ant_AntInstallation/ANT_1.8.2
<Git Blamer> Using GitBlamer to create author and commit information for all warnings.
<Git Blamer> GIT_COMMIT=26f6956cd3ebe71bfa04fa1d3e9fd22c9bc03559, workspace=/var/lib/jenkins/workspace/Lucene-Solr-7.x-Linux
[WARNINGS] Computing warning deltas based on reference build #2775
Recording test results
Setting ANT_1_8_2_HOME=/var/lib/jenkins/tools/hudson.tasks.Ant_AntInstallation/ANT_1.8.2
Build step 'Publish JUnit test result report' changed build result to UNSTABLE
Email was triggered for: Unstable (Test Failures)
Sending email for trigger: Unstable (Test Failures)
Setting ANT_1_8_2_HOME=/var/lib/jenkins/tools/hudson.tasks.Ant_AntInstallation/ANT_1.8.2
Setting ANT_1_8_2_HOME=/var/lib/jenkins/tools/hudson.tasks.Ant_AntInstallation/ANT_1.8.2
Setting ANT_1_8_2_HOME=/var/lib/jenkins/tools/hudson.tasks.Ant_AntInstallation/ANT_1.8.2
Setting ANT_1_8_2_HOME=/var/lib/jenkins/tools/hudson.tasks.Ant_AntInstallation/ANT_1.8.2

Mime
View raw message