lucene-dev mailing list archives

Site index · List index
Message view « Date » · « Thread »
Top « Date » · « Thread »
From Policeman Jenkins Server <jenk...@thetaphi.de>
Subject [JENKINS] Lucene-Solr-7.x-Linux (64bit/jdk-9.0.4) - Build # 2667 - Unstable!
Date Sat, 01 Sep 2018 08:39:39 GMT
Build: https://jenkins.thetaphi.de/job/Lucene-Solr-7.x-Linux/2667/
Java: 64bit/jdk-9.0.4 -XX:+UseCompressedOops -XX:+UseConcMarkSweepGC

3 tests failed.
FAILED:  junit.framework.TestSuite.org.apache.solr.util.TestSystemIdResolver

Error Message:
1 thread leaked from SUITE scope at org.apache.solr.util.TestSystemIdResolver:     1) Thread[id=16, name=Log4j2-TF-1-AsyncLoggerConfig--1, state=TIMED_WAITING, group=TGRP-TestSystemIdResolver]         at java.base@9.0.4/jdk.internal.misc.Unsafe.park(Native Method)         at java.base@9.0.4/java.util.concurrent.locks.LockSupport.parkNanos(LockSupport.java:234)         at java.base@9.0.4/java.util.concurrent.locks.AbstractQueuedSynchronizer$ConditionObject.awaitNanos(AbstractQueuedSynchronizer.java:2104)         at app//com.lmax.disruptor.TimeoutBlockingWaitStrategy.waitFor(TimeoutBlockingWaitStrategy.java:38)         at app//com.lmax.disruptor.ProcessingSequenceBarrier.waitFor(ProcessingSequenceBarrier.java:56)         at app//com.lmax.disruptor.BatchEventProcessor.run(BatchEventProcessor.java:128)         at java.base@9.0.4/java.lang.Thread.run(Thread.java:844)

Stack Trace:
com.carrotsearch.randomizedtesting.ThreadLeakError: 1 thread leaked from SUITE scope at org.apache.solr.util.TestSystemIdResolver: 
   1) Thread[id=16, name=Log4j2-TF-1-AsyncLoggerConfig--1, state=TIMED_WAITING, group=TGRP-TestSystemIdResolver]
        at java.base@9.0.4/jdk.internal.misc.Unsafe.park(Native Method)
        at java.base@9.0.4/java.util.concurrent.locks.LockSupport.parkNanos(LockSupport.java:234)
        at java.base@9.0.4/java.util.concurrent.locks.AbstractQueuedSynchronizer$ConditionObject.awaitNanos(AbstractQueuedSynchronizer.java:2104)
        at app//com.lmax.disruptor.TimeoutBlockingWaitStrategy.waitFor(TimeoutBlockingWaitStrategy.java:38)
        at app//com.lmax.disruptor.ProcessingSequenceBarrier.waitFor(ProcessingSequenceBarrier.java:56)
        at app//com.lmax.disruptor.BatchEventProcessor.run(BatchEventProcessor.java:128)
        at java.base@9.0.4/java.lang.Thread.run(Thread.java:844)
	at __randomizedtesting.SeedInfo.seed([61923FEDA2C704C5]:0)


FAILED:  junit.framework.TestSuite.org.apache.solr.util.TestSystemIdResolver

Error Message:
There are still zombie threads that couldn't be terminated:    1) Thread[id=16, name=Log4j2-TF-1-AsyncLoggerConfig--1, state=TIMED_WAITING, group=TGRP-TestSystemIdResolver]         at java.base@9.0.4/jdk.internal.misc.Unsafe.park(Native Method)         at java.base@9.0.4/java.util.concurrent.locks.LockSupport.parkNanos(LockSupport.java:234)         at java.base@9.0.4/java.util.concurrent.locks.AbstractQueuedSynchronizer$ConditionObject.awaitNanos(AbstractQueuedSynchronizer.java:2104)         at app//com.lmax.disruptor.TimeoutBlockingWaitStrategy.waitFor(TimeoutBlockingWaitStrategy.java:38)         at app//com.lmax.disruptor.ProcessingSequenceBarrier.waitFor(ProcessingSequenceBarrier.java:56)         at app//com.lmax.disruptor.BatchEventProcessor.run(BatchEventProcessor.java:128)         at java.base@9.0.4/java.lang.Thread.run(Thread.java:844)

Stack Trace:
com.carrotsearch.randomizedtesting.ThreadLeakError: There are still zombie threads that couldn't be terminated:
   1) Thread[id=16, name=Log4j2-TF-1-AsyncLoggerConfig--1, state=TIMED_WAITING, group=TGRP-TestSystemIdResolver]
        at java.base@9.0.4/jdk.internal.misc.Unsafe.park(Native Method)
        at java.base@9.0.4/java.util.concurrent.locks.LockSupport.parkNanos(LockSupport.java:234)
        at java.base@9.0.4/java.util.concurrent.locks.AbstractQueuedSynchronizer$ConditionObject.awaitNanos(AbstractQueuedSynchronizer.java:2104)
        at app//com.lmax.disruptor.TimeoutBlockingWaitStrategy.waitFor(TimeoutBlockingWaitStrategy.java:38)
        at app//com.lmax.disruptor.ProcessingSequenceBarrier.waitFor(ProcessingSequenceBarrier.java:56)
        at app//com.lmax.disruptor.BatchEventProcessor.run(BatchEventProcessor.java:128)
        at java.base@9.0.4/java.lang.Thread.run(Thread.java:844)
	at __randomizedtesting.SeedInfo.seed([61923FEDA2C704C5]:0)


FAILED:  junit.framework.TestSuite.org.apache.solr.util.TestSystemIdResolver

Error Message:
The test or suite printed 8216 bytes to stdout and stderr, even though the limit was set to 8192 bytes. Increase the limit with @Limit, ignore it completely with @SuppressSysoutChecks or run with -Dtests.verbose=true

Stack Trace:
java.lang.AssertionError: The test or suite printed 8216 bytes to stdout and stderr, even though the limit was set to 8192 bytes. Increase the limit with @Limit, ignore it completely with @SuppressSysoutChecks or run with -Dtests.verbose=true
	at __randomizedtesting.SeedInfo.seed([61923FEDA2C704C5]:0)
	at org.apache.lucene.util.TestRuleLimitSysouts.afterIfSuccessful(TestRuleLimitSysouts.java:211)
	at com.carrotsearch.randomizedtesting.rules.TestRuleAdapter$1.afterIfSuccessful(TestRuleAdapter.java:36)
	at com.carrotsearch.randomizedtesting.rules.StatementAdapter.evaluate(StatementAdapter.java:37)
	at org.apache.lucene.util.TestRuleAssertionsRequired$1.evaluate(TestRuleAssertionsRequired.java:53)
	at org.apache.lucene.util.TestRuleMarkFailure$1.evaluate(TestRuleMarkFailure.java:47)
	at org.apache.lucene.util.TestRuleIgnoreAfterMaxFailures$1.evaluate(TestRuleIgnoreAfterMaxFailures.java:64)
	at org.apache.lucene.util.TestRuleIgnoreTestSuites$1.evaluate(TestRuleIgnoreTestSuites.java:54)
	at com.carrotsearch.randomizedtesting.rules.StatementAdapter.evaluate(StatementAdapter.java:36)
	at com.carrotsearch.randomizedtesting.ThreadLeakControl$StatementRunner.run(ThreadLeakControl.java:368)
	at java.base/java.lang.Thread.run(Thread.java:844)




Build Log:
[...truncated 1919 lines...]
   [junit4] JVM J1: stderr was not empty, see: /home/jenkins/workspace/Lucene-Solr-7.x-Linux/lucene/build/core/test/temp/junit4-J1-20180901_070847_5477872045780925412313.syserr
   [junit4] >>> JVM J1 emitted unexpected output (verbatim) ----
   [junit4] Java HotSpot(TM) 64-Bit Server VM warning: Option UseConcMarkSweepGC was deprecated in version 9.0 and will likely be removed in a future release.
   [junit4] <<< JVM J1: EOF ----

[...truncated 5 lines...]
   [junit4] JVM J2: stderr was not empty, see: /home/jenkins/workspace/Lucene-Solr-7.x-Linux/lucene/build/core/test/temp/junit4-J2-20180901_070847_5474769910496593276616.syserr
   [junit4] >>> JVM J2 emitted unexpected output (verbatim) ----
   [junit4] Java HotSpot(TM) 64-Bit Server VM warning: Option UseConcMarkSweepGC was deprecated in version 9.0 and will likely be removed in a future release.
   [junit4] <<< JVM J2: EOF ----

[...truncated 5 lines...]
   [junit4] JVM J0: stderr was not empty, see: /home/jenkins/workspace/Lucene-Solr-7.x-Linux/lucene/build/core/test/temp/junit4-J0-20180901_070847_54716759678023156503402.syserr
   [junit4] >>> JVM J0 emitted unexpected output (verbatim) ----
   [junit4] Java HotSpot(TM) 64-Bit Server VM warning: Option UseConcMarkSweepGC was deprecated in version 9.0 and will likely be removed in a future release.
   [junit4] <<< JVM J0: EOF ----

[...truncated 304 lines...]
   [junit4] JVM J1: stderr was not empty, see: /home/jenkins/workspace/Lucene-Solr-7.x-Linux/lucene/build/test-framework/test/temp/junit4-J1-20180901_071544_9905582000931468953315.syserr
   [junit4] >>> JVM J1 emitted unexpected output (verbatim) ----
   [junit4] Java HotSpot(TM) 64-Bit Server VM warning: Option UseConcMarkSweepGC was deprecated in version 9.0 and will likely be removed in a future release.
   [junit4] <<< JVM J1: EOF ----

[...truncated 3 lines...]
   [junit4] JVM J2: stderr was not empty, see: /home/jenkins/workspace/Lucene-Solr-7.x-Linux/lucene/build/test-framework/test/temp/junit4-J2-20180901_071544_9905641975253588030651.syserr
   [junit4] >>> JVM J2 emitted unexpected output (verbatim) ----
   [junit4] Java HotSpot(TM) 64-Bit Server VM warning: Option UseConcMarkSweepGC was deprecated in version 9.0 and will likely be removed in a future release.
   [junit4] <<< JVM J2: EOF ----

   [junit4] JVM J0: stderr was not empty, see: /home/jenkins/workspace/Lucene-Solr-7.x-Linux/lucene/build/test-framework/test/temp/junit4-J0-20180901_071544_9904417205498311976037.syserr
   [junit4] >>> JVM J0 emitted unexpected output (verbatim) ----
   [junit4] Java HotSpot(TM) 64-Bit Server VM warning: Option UseConcMarkSweepGC was deprecated in version 9.0 and will likely be removed in a future release.
   [junit4] <<< JVM J0: EOF ----

[...truncated 1080 lines...]
   [junit4] JVM J2: stderr was not empty, see: /home/jenkins/workspace/Lucene-Solr-7.x-Linux/lucene/build/analysis/common/test/temp/junit4-J2-20180901_071708_21110836411216159192947.syserr
   [junit4] >>> JVM J2 emitted unexpected output (verbatim) ----
   [junit4] Java HotSpot(TM) 64-Bit Server VM warning: Option UseConcMarkSweepGC was deprecated in version 9.0 and will likely be removed in a future release.
   [junit4] <<< JVM J2: EOF ----

[...truncated 3 lines...]
   [junit4] JVM J1: stderr was not empty, see: /home/jenkins/workspace/Lucene-Solr-7.x-Linux/lucene/build/analysis/common/test/temp/junit4-J1-20180901_071708_2112638916433240004757.syserr
   [junit4] >>> JVM J1 emitted unexpected output (verbatim) ----
   [junit4] Java HotSpot(TM) 64-Bit Server VM warning: Option UseConcMarkSweepGC was deprecated in version 9.0 and will likely be removed in a future release.
   [junit4] <<< JVM J1: EOF ----

[...truncated 3 lines...]
   [junit4] JVM J0: stderr was not empty, see: /home/jenkins/workspace/Lucene-Solr-7.x-Linux/lucene/build/analysis/common/test/temp/junit4-J0-20180901_071708_2112611927964342751359.syserr
   [junit4] >>> JVM J0 emitted unexpected output (verbatim) ----
   [junit4] Java HotSpot(TM) 64-Bit Server VM warning: Option UseConcMarkSweepGC was deprecated in version 9.0 and will likely be removed in a future release.
   [junit4] <<< JVM J0: EOF ----

[...truncated 258 lines...]
   [junit4] JVM J2: stderr was not empty, see: /home/jenkins/workspace/Lucene-Solr-7.x-Linux/lucene/build/analysis/icu/test/temp/junit4-J2-20180901_071856_75416123103259208971466.syserr
   [junit4] >>> JVM J2 emitted unexpected output (verbatim) ----
   [junit4] Java HotSpot(TM) 64-Bit Server VM warning: Option UseConcMarkSweepGC was deprecated in version 9.0 and will likely be removed in a future release.
   [junit4] <<< JVM J2: EOF ----

   [junit4] JVM J0: stderr was not empty, see: /home/jenkins/workspace/Lucene-Solr-7.x-Linux/lucene/build/analysis/icu/test/temp/junit4-J0-20180901_071856_7547703010799965899727.syserr
   [junit4] >>> JVM J0 emitted unexpected output (verbatim) ----
   [junit4] Java HotSpot(TM) 64-Bit Server VM warning: Option UseConcMarkSweepGC was deprecated in version 9.0 and will likely be removed in a future release.
   [junit4] <<< JVM J0: EOF ----

[...truncated 3 lines...]
   [junit4] JVM J1: stderr was not empty, see: /home/jenkins/workspace/Lucene-Solr-7.x-Linux/lucene/build/analysis/icu/test/temp/junit4-J1-20180901_071856_7544314284642249928485.syserr
   [junit4] >>> JVM J1 emitted unexpected output (verbatim) ----
   [junit4] Java HotSpot(TM) 64-Bit Server VM warning: Option UseConcMarkSweepGC was deprecated in version 9.0 and will likely be removed in a future release.
   [junit4] <<< JVM J1: EOF ----

[...truncated 251 lines...]
   [junit4] JVM J1: stderr was not empty, see: /home/jenkins/workspace/Lucene-Solr-7.x-Linux/lucene/build/analysis/kuromoji/test/temp/junit4-J1-20180901_071908_5068588931884837873791.syserr
   [junit4] >>> JVM J1 emitted unexpected output (verbatim) ----
   [junit4] Java HotSpot(TM) 64-Bit Server VM warning: Option UseConcMarkSweepGC was deprecated in version 9.0 and will likely be removed in a future release.
   [junit4] <<< JVM J1: EOF ----

[...truncated 5 lines...]
   [junit4] JVM J2: stderr was not empty, see: /home/jenkins/workspace/Lucene-Solr-7.x-Linux/lucene/build/analysis/kuromoji/test/temp/junit4-J2-20180901_071908_5062181229972111057889.syserr
   [junit4] >>> JVM J2 emitted unexpected output (verbatim) ----
   [junit4] Java HotSpot(TM) 64-Bit Server VM warning: Option UseConcMarkSweepGC was deprecated in version 9.0 and will likely be removed in a future release.
   [junit4] <<< JVM J2: EOF ----

[...truncated 3 lines...]
   [junit4] JVM J0: stderr was not empty, see: /home/jenkins/workspace/Lucene-Solr-7.x-Linux/lucene/build/analysis/kuromoji/test/temp/junit4-J0-20180901_071908_50617681103524196273752.syserr
   [junit4] >>> JVM J0 emitted unexpected output (verbatim) ----
   [junit4] Java HotSpot(TM) 64-Bit Server VM warning: Option UseConcMarkSweepGC was deprecated in version 9.0 and will likely be removed in a future release.
   [junit4] <<< JVM J0: EOF ----

[...truncated 162 lines...]
   [junit4] JVM J1: stderr was not empty, see: /home/jenkins/workspace/Lucene-Solr-7.x-Linux/lucene/build/analysis/morfologik/test/temp/junit4-J1-20180901_071937_75212501729318271567582.syserr
   [junit4] >>> JVM J1 emitted unexpected output (verbatim) ----
   [junit4] Java HotSpot(TM) 64-Bit Server VM warning: Option UseConcMarkSweepGC was deprecated in version 9.0 and will likely be removed in a future release.
   [junit4] <<< JVM J1: EOF ----

[...truncated 3 lines...]
   [junit4] JVM J0: stderr was not empty, see: /home/jenkins/workspace/Lucene-Solr-7.x-Linux/lucene/build/analysis/morfologik/test/temp/junit4-J0-20180901_071937_752586939772870058372.syserr
   [junit4] >>> JVM J0 emitted unexpected output (verbatim) ----
   [junit4] Java HotSpot(TM) 64-Bit Server VM warning: Option UseConcMarkSweepGC was deprecated in version 9.0 and will likely be removed in a future release.
   [junit4] <<< JVM J0: EOF ----

[...truncated 3 lines...]
   [junit4] JVM J2: stderr was not empty, see: /home/jenkins/workspace/Lucene-Solr-7.x-Linux/lucene/build/analysis/morfologik/test/temp/junit4-J2-20180901_071937_752573766898522201121.syserr
   [junit4] >>> JVM J2 emitted unexpected output (verbatim) ----
   [junit4] Java HotSpot(TM) 64-Bit Server VM warning: Option UseConcMarkSweepGC was deprecated in version 9.0 and will likely be removed in a future release.
   [junit4] <<< JVM J2: EOF ----

[...truncated 204 lines...]
   [junit4] JVM J2: stderr was not empty, see: /home/jenkins/workspace/Lucene-Solr-7.x-Linux/lucene/build/analysis/nori/test/temp/junit4-J2-20180901_071941_9904478737632479762498.syserr
   [junit4] >>> JVM J2 emitted unexpected output (verbatim) ----
   [junit4] Java HotSpot(TM) 64-Bit Server VM warning: Option UseConcMarkSweepGC was deprecated in version 9.0 and will likely be removed in a future release.
   [junit4] <<< JVM J2: EOF ----

[...truncated 3 lines...]
   [junit4] JVM J0: stderr was not empty, see: /home/jenkins/workspace/Lucene-Solr-7.x-Linux/lucene/build/analysis/nori/test/temp/junit4-J0-20180901_071941_9903326560649271941681.syserr
   [junit4] >>> JVM J0 emitted unexpected output (verbatim) ----
   [junit4] Java HotSpot(TM) 64-Bit Server VM warning: Option UseConcMarkSweepGC was deprecated in version 9.0 and will likely be removed in a future release.
   [junit4] <<< JVM J0: EOF ----

[...truncated 6 lines...]
   [junit4] JVM J1: stderr was not empty, see: /home/jenkins/workspace/Lucene-Solr-7.x-Linux/lucene/build/analysis/nori/test/temp/junit4-J1-20180901_071941_9909329208078228517926.syserr
   [junit4] >>> JVM J1 emitted unexpected output (verbatim) ----
   [junit4] Java HotSpot(TM) 64-Bit Server VM warning: Option UseConcMarkSweepGC was deprecated in version 9.0 and will likely be removed in a future release.
   [junit4] <<< JVM J1: EOF ----

[...truncated 174 lines...]
   [junit4] JVM J1: stderr was not empty, see: /home/jenkins/workspace/Lucene-Solr-7.x-Linux/lucene/build/analysis/opennlp/test/temp/junit4-J1-20180901_071951_06613222875059834600586.syserr
   [junit4] >>> JVM J1 emitted unexpected output (verbatim) ----
   [junit4] Java HotSpot(TM) 64-Bit Server VM warning: Option UseConcMarkSweepGC was deprecated in version 9.0 and will likely be removed in a future release.
   [junit4] <<< JVM J1: EOF ----

   [junit4] JVM J0: stderr was not empty, see: /home/jenkins/workspace/Lucene-Solr-7.x-Linux/lucene/build/analysis/opennlp/test/temp/junit4-J0-20180901_071951_06815558357119525955738.syserr
   [junit4] >>> JVM J0 emitted unexpected output (verbatim) ----
   [junit4] Java HotSpot(TM) 64-Bit Server VM warning: Option UseConcMarkSweepGC was deprecated in version 9.0 and will likely be removed in a future release.
   [junit4] <<< JVM J0: EOF ----

   [junit4] JVM J2: stderr was not empty, see: /home/jenkins/workspace/Lucene-Solr-7.x-Linux/lucene/build/analysis/opennlp/test/temp/junit4-J2-20180901_071951_0686565594661508322474.syserr
   [junit4] >>> JVM J2 emitted unexpected output (verbatim) ----
   [junit4] Java HotSpot(TM) 64-Bit Server VM warning: Option UseConcMarkSweepGC was deprecated in version 9.0 and will likely be removed in a future release.
   [junit4] <<< JVM J2: EOF ----

[...truncated 173 lines...]
   [junit4] JVM J2: stderr was not empty, see: /home/jenkins/workspace/Lucene-Solr-7.x-Linux/lucene/build/analysis/phonetic/test/temp/junit4-J2-20180901_071954_03917401659347550102389.syserr
   [junit4] >>> JVM J2 emitted unexpected output (verbatim) ----
   [junit4] Java HotSpot(TM) 64-Bit Server VM warning: Option UseConcMarkSweepGC was deprecated in version 9.0 and will likely be removed in a future release.
   [junit4] <<< JVM J2: EOF ----

[...truncated 3 lines...]
   [junit4] JVM J1: stderr was not empty, see: /home/jenkins/workspace/Lucene-Solr-7.x-Linux/lucene/build/analysis/phonetic/test/temp/junit4-J1-20180901_071954_0392346080836222458451.syserr
   [junit4] >>> JVM J1 emitted unexpected output (verbatim) ----
   [junit4] Java HotSpot(TM) 64-Bit Server VM warning: Option UseConcMarkSweepGC was deprecated in version 9.0 and will likely be removed in a future release.
   [junit4] <<< JVM J1: EOF ----

[...truncated 6 lines...]
   [junit4] JVM J0: stderr was not empty, see: /home/jenkins/workspace/Lucene-Solr-7.x-Linux/lucene/build/analysis/phonetic/test/temp/junit4-J0-20180901_071954_03916011663476336383626.syserr
   [junit4] >>> JVM J0 emitted unexpected output (verbatim) ----
   [junit4] Java HotSpot(TM) 64-Bit Server VM warning: Option UseConcMarkSweepGC was deprecated in version 9.0 and will likely be removed in a future release.
   [junit4] <<< JVM J0: EOF ----

[...truncated 161 lines...]
   [junit4] JVM J0: stderr was not empty, see: /home/jenkins/workspace/Lucene-Solr-7.x-Linux/lucene/build/analysis/smartcn/test/temp/junit4-J0-20180901_072007_9762200981869777237621.syserr
   [junit4] >>> JVM J0 emitted unexpected output (verbatim) ----
   [junit4] Java HotSpot(TM) 64-Bit Server VM warning: Option UseConcMarkSweepGC was deprecated in version 9.0 and will likely be removed in a future release.
   [junit4] <<< JVM J0: EOF ----

[...truncated 3 lines...]
   [junit4] JVM J1: stderr was not empty, see: /home/jenkins/workspace/Lucene-Solr-7.x-Linux/lucene/build/analysis/smartcn/test/temp/junit4-J1-20180901_072007_9769353799526225019119.syserr
   [junit4] >>> JVM J1 emitted unexpected output (verbatim) ----
   [junit4] Java HotSpot(TM) 64-Bit Server VM warning: Option UseConcMarkSweepGC was deprecated in version 9.0 and will likely be removed in a future release.
   [junit4] <<< JVM J1: EOF ----

[...truncated 165 lines...]
   [junit4] JVM J2: stderr was not empty, see: /home/jenkins/workspace/Lucene-Solr-7.x-Linux/lucene/build/analysis/stempel/test/temp/junit4-J2-20180901_072015_5908841086414721677685.syserr
   [junit4] >>> JVM J2 emitted unexpected output (verbatim) ----
   [junit4] Java HotSpot(TM) 64-Bit Server VM warning: Option UseConcMarkSweepGC was deprecated in version 9.0 and will likely be removed in a future release.
   [junit4] <<< JVM J2: EOF ----

   [junit4] JVM J1: stderr was not empty, see: /home/jenkins/workspace/Lucene-Solr-7.x-Linux/lucene/build/analysis/stempel/test/temp/junit4-J1-20180901_072015_59018428393309368248650.syserr
   [junit4] >>> JVM J1 emitted unexpected output (verbatim) ----
   [junit4] Java HotSpot(TM) 64-Bit Server VM warning: Option UseConcMarkSweepGC was deprecated in version 9.0 and will likely be removed in a future release.
   [junit4] <<< JVM J1: EOF ----

[...truncated 3 lines...]
   [junit4] JVM J0: stderr was not empty, see: /home/jenkins/workspace/Lucene-Solr-7.x-Linux/lucene/build/analysis/stempel/test/temp/junit4-J0-20180901_072015_5902392783488695727784.syserr
   [junit4] >>> JVM J0 emitted unexpected output (verbatim) ----
   [junit4] Java HotSpot(TM) 64-Bit Server VM warning: Option UseConcMarkSweepGC was deprecated in version 9.0 and will likely be removed in a future release.
   [junit4] <<< JVM J0: EOF ----

[...truncated 200 lines...]
   [junit4] JVM J1: stderr was not empty, see: /home/jenkins/workspace/Lucene-Solr-7.x-Linux/lucene/build/backward-codecs/test/temp/junit4-J1-20180901_072018_59516428650475670672823.syserr
   [junit4] >>> JVM J1 emitted unexpected output (verbatim) ----
   [junit4] Java HotSpot(TM) 64-Bit Server VM warning: Option UseConcMarkSweepGC was deprecated in version 9.0 and will likely be removed in a future release.
   [junit4] <<< JVM J1: EOF ----

[...truncated 22 lines...]
   [junit4] JVM J2: stderr was not empty, see: /home/jenkins/workspace/Lucene-Solr-7.x-Linux/lucene/build/backward-codecs/test/temp/junit4-J2-20180901_072018_59517430356751051993829.syserr
   [junit4] >>> JVM J2 emitted unexpected output (verbatim) ----
   [junit4] Java HotSpot(TM) 64-Bit Server VM warning: Option UseConcMarkSweepGC was deprecated in version 9.0 and will likely be removed in a future release.
   [junit4] <<< JVM J2: EOF ----

[...truncated 12 lines...]
   [junit4] JVM J0: stderr was not empty, see: /home/jenkins/workspace/Lucene-Solr-7.x-Linux/lucene/build/backward-codecs/test/temp/junit4-J0-20180901_072018_59518396281814972827438.syserr
   [junit4] >>> JVM J0 emitted unexpected output (verbatim) ----
   [junit4] Java HotSpot(TM) 64-Bit Server VM warning: Option UseConcMarkSweepGC was deprecated in version 9.0 and will likely be removed in a future release.
   [junit4] <<< JVM J0: EOF ----

[...truncated 1411 lines...]
   [junit4] JVM J2: stderr was not empty, see: /home/jenkins/workspace/Lucene-Solr-7.x-Linux/lucene/build/benchmark/test/temp/junit4-J2-20180901_072222_22916542372501446896200.syserr
   [junit4] >>> JVM J2 emitted unexpected output (verbatim) ----
   [junit4] Java HotSpot(TM) 64-Bit Server VM warning: Option UseConcMarkSweepGC was deprecated in version 9.0 and will likely be removed in a future release.
   [junit4] <<< JVM J2: EOF ----

   [junit4] JVM J1: stderr was not empty, see: /home/jenkins/workspace/Lucene-Solr-7.x-Linux/lucene/build/benchmark/test/temp/junit4-J1-20180901_072222_2248332630301197509973.syserr
   [junit4] >>> JVM J1 emitted unexpected output (verbatim) ----
   [junit4] Java HotSpot(TM) 64-Bit Server VM warning: Option UseConcMarkSweepGC was deprecated in version 9.0 and will likely be removed in a future release.
   [junit4] <<< JVM J1: EOF ----

[...truncated 3 lines...]
   [junit4] JVM J0: stderr was not empty, see: /home/jenkins/workspace/Lucene-Solr-7.x-Linux/lucene/build/benchmark/test/temp/junit4-J0-20180901_072222_21910697189969709459741.syserr
   [junit4] >>> JVM J0 emitted unexpected output (verbatim) ----
   [junit4] Java HotSpot(TM) 64-Bit Server VM warning: Option UseConcMarkSweepGC was deprecated in version 9.0 and will likely be removed in a future release.
   [junit4] <<< JVM J0: EOF ----

[...truncated 247 lines...]
   [junit4] JVM J2: stderr was not empty, see: /home/jenkins/workspace/Lucene-Solr-7.x-Linux/lucene/build/classification/test/temp/junit4-J2-20180901_072233_46216720425984029664444.syserr
   [junit4] >>> JVM J2 emitted unexpected output (verbatim) ----
   [junit4] Java HotSpot(TM) 64-Bit Server VM warning: Option UseConcMarkSweepGC was deprecated in version 9.0 and will likely be removed in a future release.
   [junit4] <<< JVM J2: EOF ----

[...truncated 3 lines...]
   [junit4] JVM J1: stderr was not empty, see: /home/jenkins/workspace/Lucene-Solr-7.x-Linux/lucene/build/classification/test/temp/junit4-J1-20180901_072233_4598400790544927246693.syserr
   [junit4] >>> JVM J1 emitted unexpected output (verbatim) ----
   [junit4] Java HotSpot(TM) 64-Bit Server VM warning: Option UseConcMarkSweepGC was deprecated in version 9.0 and will likely be removed in a future release.
   [junit4] <<< JVM J1: EOF ----

[...truncated 6 lines...]
   [junit4] JVM J0: stderr was not empty, see: /home/jenkins/workspace/Lucene-Solr-7.x-Linux/lucene/build/classification/test/temp/junit4-J0-20180901_072233_4592760772334009451103.syserr
   [junit4] >>> JVM J0 emitted unexpected output (verbatim) ----
   [junit4] Java HotSpot(TM) 64-Bit Server VM warning: Option UseConcMarkSweepGC was deprecated in version 9.0 and will likely be removed in a future release.
   [junit4] <<< JVM J0: EOF ----

[...truncated 260 lines...]
   [junit4] JVM J0: stderr was not empty, see: /home/jenkins/workspace/Lucene-Solr-7.x-Linux/lucene/build/codecs/test/temp/junit4-J0-20180901_072312_55715575832596008553259.syserr
   [junit4] >>> JVM J0 emitted unexpected output (verbatim) ----
   [junit4] Java HotSpot(TM) 64-Bit Server VM warning: Option UseConcMarkSweepGC was deprecated in version 9.0 and will likely be removed in a future release.
   [junit4] <<< JVM J0: EOF ----

[...truncated 11 lines...]
   [junit4] JVM J2: stderr was not empty, see: /home/jenkins/workspace/Lucene-Solr-7.x-Linux/lucene/build/codecs/test/temp/junit4-J2-20180901_072312_56316959735606319852600.syserr
   [junit4] >>> JVM J2 emitted unexpected output (verbatim) ----
   [junit4] Java HotSpot(TM) 64-Bit Server VM warning: Option UseConcMarkSweepGC was deprecated in version 9.0 and will likely be removed in a future release.
   [junit4] <<< JVM J2: EOF ----

[...truncated 3 lines...]
   [junit4] JVM J1: stderr was not empty, see: /home/jenkins/workspace/Lucene-Solr-7.x-Linux/lucene/build/codecs/test/temp/junit4-J1-20180901_072312_55918356123820004551821.syserr
   [junit4] >>> JVM J1 emitted unexpected output (verbatim) ----
   [junit4] Java HotSpot(TM) 64-Bit Server VM warning: Option UseConcMarkSweepGC was deprecated in version 9.0 and will likely be removed in a future release.
   [junit4] <<< JVM J1: EOF ----

[...truncated 236 lines...]
   [junit4] JVM J0: stderr was not empty, see: /home/jenkins/workspace/Lucene-Solr-7.x-Linux/lucene/build/demo/test/temp/junit4-J0-20180901_072521_1953250868762316876097.syserr
   [junit4] JVM J1: stderr was not empty, see: /home/jenkins/workspace/Lucene-Solr-7.x-Linux/lucene/build/demo/test/temp/junit4-J1-20180901_072521_1952114288396911238615.syserr
   [junit4] >>> JVM J0 emitted unexpected output (verbatim) ----
   [junit4] Java HotSpot(TM) 64-Bit Server VM warning: Option UseConcMarkSweepGC was deprecated in version 9.0 and will likely be removed in a future release.
   [junit4] <<< JVM J0: EOF ----

[...truncated 3 lines...]
   [junit4] JVM J2: stderr was not empty, see: /home/jenkins/workspace/Lucene-Solr-7.x-Linux/lucene/build/demo/test/temp/junit4-J2-20180901_072521_1958821497159883304376.syserr
   [junit4] >>> JVM J2 emitted unexpected output (verbatim) ----
   [junit4] Java HotSpot(TM) 64-Bit Server VM warning: Option UseConcMarkSweepGC was deprecated in version 9.0 and will likely be removed in a future release.
   [junit4] <<< JVM J2: EOF ----

[...truncated 176 lines...]
   [junit4] JVM J1: stderr was not empty, see: /home/jenkins/workspace/Lucene-Solr-7.x-Linux/lucene/build/expressions/test/temp/junit4-J1-20180901_072525_4996588346486487870235.syserr
   [junit4] >>> JVM J1 emitted unexpected output (verbatim) ----
   [junit4] Java HotSpot(TM) 64-Bit Server VM warning: Option UseConcMarkSweepGC was deprecated in version 9.0 and will likely be removed in a future release.
   [junit4] <<< JVM J1: EOF ----

   [junit4] JVM J2: stderr was not empty, see: /home/jenkins/workspace/Lucene-Solr-7.x-Linux/lucene/build/expressions/test/temp/junit4-J2-20180901_072525_49910714039083050704800.syserr
   [junit4] >>> JVM J2 emitted unexpected output (verbatim) ----
   [junit4] Java HotSpot(TM) 64-Bit Server VM warning: Option UseConcMarkSweepGC was deprecated in version 9.0 and will likely be removed in a future release.
   [junit4] <<< JVM J2: EOF ----

[...truncated 3 lines...]
   [junit4] JVM J0: stderr was not empty, see: /home/jenkins/workspace/Lucene-Solr-7.x-Linux/lucene/build/expressions/test/temp/junit4-J0-20180901_072525_499621574090579651934.syserr
   [junit4] >>> JVM J0 emitted unexpected output (verbatim) ----
   [junit4] Java HotSpot(TM) 64-Bit Server VM warning: Option UseConcMarkSweepGC was deprecated in version 9.0 and will likely be removed in a future release.
   [junit4] <<< JVM J0: EOF ----

[...truncated 237 lines...]
   [junit4] JVM J0: stderr was not empty, see: /home/jenkins/workspace/Lucene-Solr-7.x-Linux/lucene/build/facet/test/temp/junit4-J0-20180901_072530_8428423229067038669750.syserr
   [junit4] >>> JVM J0 emitted unexpected output (verbatim) ----
   [junit4] Java HotSpot(TM) 64-Bit Server VM warning: Option UseConcMarkSweepGC was deprecated in version 9.0 and will likely be removed in a future release.
   [junit4] <<< JVM J0: EOF ----

   [junit4] JVM J1: stderr was not empty, see: /home/jenkins/workspace/Lucene-Solr-7.x-Linux/lucene/build/facet/test/temp/junit4-J1-20180901_072530_8428732971448344298094.syserr
   [junit4] >>> JVM J1 emitted unexpected output (verbatim) ----
   [junit4] Java HotSpot(TM) 64-Bit Server VM warning: Option UseConcMarkSweepGC was deprecated in version 9.0 and will likely be removed in a future release.
   [junit4] <<< JVM J1: EOF ----

[...truncated 3 lines...]
   [junit4] JVM J2: stderr was not empty, see: /home/jenkins/workspace/Lucene-Solr-7.x-Linux/lucene/build/facet/test/temp/junit4-J2-20180901_072530_84216005640109634106748.syserr
   [junit4] >>> JVM J2 emitted unexpected output (verbatim) ----
   [junit4] Java HotSpot(TM) 64-Bit Server VM warning: Option UseConcMarkSweepGC was deprecated in version 9.0 and will likely be removed in a future release.
   [junit4] <<< JVM J2: EOF ----

[...truncated 185 lines...]
   [junit4] JVM J0: stderr was not empty, see: /home/jenkins/workspace/Lucene-Solr-7.x-Linux/lucene/build/grouping/test/temp/junit4-J0-20180901_072609_7056805916370291865540.syserr
   [junit4] >>> JVM J0 emitted unexpected output (verbatim) ----
   [junit4] Java HotSpot(TM) 64-Bit Server VM warning: Option UseConcMarkSweepGC was deprecated in version 9.0 and will likely be removed in a future release.
   [junit4] <<< JVM J0: EOF ----

   [junit4] JVM J2: stderr was not empty, see: /home/jenkins/workspace/Lucene-Solr-7.x-Linux/lucene/build/grouping/test/temp/junit4-J2-20180901_072609_7052589236198598089587.syserr
   [junit4] >>> JVM J2 emitted unexpected output (verbatim) ----
   [junit4] Java HotSpot(TM) 64-Bit Server VM warning: Option UseConcMarkSweepGC was deprecated in version 9.0 and will likely be removed in a future release.
   [junit4] <<< JVM J2: EOF ----

[...truncated 3 lines...]
   [junit4] JVM J1: stderr was not empty, see: /home/jenkins/workspace/Lucene-Solr-7.x-Linux/lucene/build/grouping/test/temp/junit4-J1-20180901_072609_70516599740872472097416.syserr
   [junit4] >>> JVM J1 emitted unexpected output (verbatim) ----
   [junit4] Java HotSpot(TM) 64-Bit Server VM warning: Option UseConcMarkSweepGC was deprecated in version 9.0 and will likely be removed in a future release.
   [junit4] <<< JVM J1: EOF ----

[...truncated 242 lines...]
   [junit4] JVM J1: stderr was not empty, see: /home/jenkins/workspace/Lucene-Solr-7.x-Linux/lucene/build/highlighter/test/temp/junit4-J1-20180901_072622_66811149593262259376917.syserr
   [junit4] >>> JVM J1 emitted unexpected output (verbatim) ----
   [junit4] Java HotSpot(TM) 64-Bit Server VM warning: Option UseConcMarkSweepGC was deprecated in version 9.0 and will likely be removed in a future release.
   [junit4] <<< JVM J1: EOF ----

   [junit4] JVM J0: stderr was not empty, see: /home/jenkins/workspace/Lucene-Solr-7.x-Linux/lucene/build/highlighter/test/temp/junit4-J0-20180901_072622_66818206094861270632973.syserr
   [junit4] >>> JVM J0 emitted unexpected output (verbatim) ----
   [junit4] Java HotSpot(TM) 64-Bit Server VM warning: Option UseConcMarkSweepGC was deprecated in version 9.0 and will likely be removed in a future release.
   [junit4] <<< JVM J0: EOF ----

[...truncated 12 lines...]
   [junit4] JVM J2: stderr was not empty, see: /home/jenkins/workspace/Lucene-Solr-7.x-Linux/lucene/build/highlighter/test/temp/junit4-J2-20180901_072622_66815976803882164011006.syserr
   [junit4] >>> JVM J2 emitted unexpected output (verbatim) ----
   [junit4] Java HotSpot(TM) 64-Bit Server VM warning: Option UseConcMarkSweepGC was deprecated in version 9.0 and will likely be removed in a future release.
   [junit4] <<< JVM J2: EOF ----

[...truncated 163 lines...]
   [junit4] JVM J1: stderr was not empty, see: /home/jenkins/workspace/Lucene-Solr-7.x-Linux/lucene/build/join/test/temp/junit4-J1-20180901_072644_91416157053847931979477.syserr
   [junit4] >>> JVM J1 emitted unexpected output (verbatim) ----
   [junit4] Java HotSpot(TM) 64-Bit Server VM warning: Option UseConcMarkSweepGC was deprecated in version 9.0 and will likely be removed in a future release.
   [junit4] <<< JVM J1: EOF ----

[...truncated 3 lines...]
   [junit4] JVM J2: stderr was not empty, see: /home/jenkins/workspace/Lucene-Solr-7.x-Linux/lucene/build/join/test/temp/junit4-J2-20180901_072644_91416377553128853522650.syserr
   [junit4] >>> JVM J2 emitted unexpected output (verbatim) ----
   [junit4] Java HotSpot(TM) 64-Bit Server VM warning: Option UseConcMarkSweepGC was deprecated in version 9.0 and will likely be removed in a future release.
   [junit4] <<< JVM J2: EOF ----

[...truncated 6 lines...]
   [junit4] JVM J0: stderr was not empty, see: /home/jenkins/workspace/Lucene-Solr-7.x-Linux/lucene/build/join/test/temp/junit4-J0-20180901_072644_9149372526859954241802.syserr
   [junit4] >>> JVM J0 emitted unexpected output (verbatim) ----
   [junit4] Java HotSpot(TM) 64-Bit Server VM warning: Option UseConcMarkSweepGC was deprecated in version 9.0 and will likely be removed in a future release.
   [junit4] <<< JVM J0: EOF ----

[...truncated 157 lines...]
   [junit4] JVM J0: stderr was not empty, see: /home/jenkins/workspace/Lucene-Solr-7.x-Linux/lucene/build/memory/test/temp/junit4-J0-20180901_072706_7598731222084469438925.syserr
   [junit4] >>> JVM J0 emitted unexpected output (verbatim) ----
   [junit4] Java HotSpot(TM) 64-Bit Server VM warning: Option UseConcMarkSweepGC was deprecated in version 9.0 and will likely be removed in a future release.
   [junit4] <<< JVM J0: EOF ----

[...truncated 3 lines...]
   [junit4] JVM J1: stderr was not empty, see: /home/jenkins/workspace/Lucene-Solr-7.x-Linux/lucene/build/memory/test/temp/junit4-J1-20180901_072706_7594141000280172779796.syserr
   [junit4] >>> JVM J1 emitted unexpected output (verbatim) ----
   [junit4] Java HotSpot(TM) 64-Bit Server VM warning: Option UseConcMarkSweepGC was deprecated in version 9.0 and will likely be removed in a future release.
   [junit4] <<< JVM J1: EOF ----

[...truncated 187 lines...]
   [junit4] JVM J1: stderr was not empty, see: /home/jenkins/workspace/Lucene-Solr-7.x-Linux/lucene/build/misc/test/temp/junit4-J1-20180901_072716_6248698224021646448490.syserr
   [junit4] >>> JVM J1 emitted unexpected output (verbatim) ----
   [junit4] Java HotSpot(TM) 64-Bit Server VM warning: Option UseConcMarkSweepGC was deprecated in version 9.0 and will likely be removed in a future release.
   [junit4] <<< JVM J1: EOF ----

[...truncated 5 lines...]
   [junit4] JVM J0: stderr was not empty, see: /home/jenkins/workspace/Lucene-Solr-7.x-Linux/lucene/build/misc/test/temp/junit4-J0-20180901_072716_62414429695952774501872.syserr
   [junit4] >>> JVM J0 emitted unexpected output (verbatim) ----
   [junit4] Java HotSpot(TM) 64-Bit Server VM warning: Option UseConcMarkSweepGC was deprecated in version 9.0 and will likely be removed in a future release.
   [junit4] <<< JVM J0: EOF ----

[...truncated 3 lines...]
   [junit4] JVM J2: stderr was not empty, see: /home/jenkins/workspace/Lucene-Solr-7.x-Linux/lucene/build/misc/test/temp/junit4-J2-20180901_072716_62413891737341711608160.syserr
   [junit4] >>> JVM J2 emitted unexpected output (verbatim) ----
   [junit4] Java HotSpot(TM) 64-Bit Server VM warning: Option UseConcMarkSweepGC was deprecated in version 9.0 and will likely be removed in a future release.
   [junit4] <<< JVM J2: EOF ----

[...truncated 338 lines...]
   [junit4] JVM J1: stderr was not empty, see: /home/jenkins/workspace/Lucene-Solr-7.x-Linux/lucene/build/queries/test/temp/junit4-J1-20180901_072731_8794875641813050837329.syserr
   [junit4] >>> JVM J1 emitted unexpected output (verbatim) ----
   [junit4] Java HotSpot(TM) 64-Bit Server VM warning: Option UseConcMarkSweepGC was deprecated in version 9.0 and will likely be removed in a future release.
   [junit4] <<< JVM J1: EOF ----

[...truncated 3 lines...]
   [junit4] JVM J0: stderr was not empty, see: /home/jenkins/workspace/Lucene-Solr-7.x-Linux/lucene/build/queries/test/temp/junit4-J0-20180901_072731_8794094067191114372188.syserr
   [junit4] >>> JVM J0 emitted unexpected output (verbatim) ----
   [junit4] Java HotSpot(TM) 64-Bit Server VM warning: Option UseConcMarkSweepGC was deprecated in version 9.0 and will likely be removed in a future release.
   [junit4] <<< JVM J0: EOF ----

[...truncated 3 lines...]
   [junit4] JVM J2: stderr was not empty, see: /home/jenkins/workspace/Lucene-Solr-7.x-Linux/lucene/build/queries/test/temp/junit4-J2-20180901_072731_8794513091171918064455.syserr
   [junit4] >>> JVM J2 emitted unexpected output (verbatim) ----
   [junit4] Java HotSpot(TM) 64-Bit Server VM warning: Option UseConcMarkSweepGC was deprecated in version 9.0 and will likely be removed in a future release.
   [junit4] <<< JVM J2: EOF ----

[...truncated 234 lines...]
   [junit4] JVM J2: stderr was not empty, see: /home/jenkins/workspace/Lucene-Solr-7.x-Linux/lucene/build/queryparser/test/temp/junit4-J2-20180901_072740_03916195394443204560150.syserr
   [junit4] >>> JVM J2 emitted unexpected output (verbatim) ----
   [junit4] Java HotSpot(TM) 64-Bit Server VM warning: Option UseConcMarkSweepGC was deprecated in version 9.0 and will likely be removed in a future release.
   [junit4] <<< JVM J2: EOF ----

[...truncated 3 lines...]
   [junit4] JVM J1: stderr was not empty, see: /home/jenkins/workspace/Lucene-Solr-7.x-Linux/lucene/build/queryparser/test/temp/junit4-J1-20180901_072740_0395007565083764196771.syserr
   [junit4] >>> JVM J1 emitted unexpected output (verbatim) ----
   [junit4] Java HotSpot(TM) 64-Bit Server VM warning: Option UseConcMarkSweepGC was deprecated in version 9.0 and will likely be removed in a future release.
   [junit4] <<< JVM J1: EOF ----

   [junit4] JVM J0: stderr was not empty, see: /home/jenkins/workspace/Lucene-Solr-7.x-Linux/lucene/build/queryparser/test/temp/junit4-J0-20180901_072740_039820215590715202678.syserr
   [junit4] >>> JVM J0 emitted unexpected output (verbatim) ----
   [junit4] Java HotSpot(TM) 64-Bit Server VM warning: Option UseConcMarkSweepGC was deprecated in version 9.0 and will likely be removed in a future release.
   [junit4] <<< JVM J0: EOF ----

[...truncated 216 lines...]
   [junit4] JVM J1: stderr was not empty, see: /home/jenkins/workspace/Lucene-Solr-7.x-Linux/lucene/build/replicator/test/temp/junit4-J1-20180901_072747_4351359416061866904709.syserr
   [junit4] >>> JVM J1 emitted unexpected output (verbatim) ----
   [junit4] Java HotSpot(TM) 64-Bit Server VM warning: Option UseConcMarkSweepGC was deprecated in version 9.0 and will likely be removed in a future release.
   [junit4] <<< JVM J1: EOF ----

[...truncated 3 lines...]
   [junit4] JVM J2: stderr was not empty, see: /home/jenkins/workspace/Lucene-Solr-7.x-Linux/lucene/build/replicator/test/temp/junit4-J2-20180901_072747_4353662691529845422348.syserr
   [junit4] >>> JVM J2 emitted unexpected output (verbatim) ----
   [junit4] Java HotSpot(TM) 64-Bit Server VM warning: Option UseConcMarkSweepGC was deprecated in version 9.0 and will likely be removed in a future release.
   [junit4] <<< JVM J2: EOF ----

[...truncated 3 lines...]
   [junit4] JVM J0: stderr was not empty, see: /home/jenkins/workspace/Lucene-Solr-7.x-Linux/lucene/build/replicator/test/temp/junit4-J0-20180901_072747_43510292161391834043593.syserr
   [junit4] >>> JVM J0 emitted unexpected output (verbatim) ----
   [junit4] Java HotSpot(TM) 64-Bit Server VM warning: Option UseConcMarkSweepGC was deprecated in version 9.0 and will likely be removed in a future release.
   [junit4] <<< JVM J0: EOF ----

[...truncated 196 lines...]
   [junit4] JVM J0: stderr was not empty, see: /home/jenkins/workspace/Lucene-Solr-7.x-Linux/lucene/build/sandbox/test/temp/junit4-J0-20180901_072758_66116600134339082791657.syserr
   [junit4] >>> JVM J0 emitted unexpected output (verbatim) ----
   [junit4] Java HotSpot(TM) 64-Bit Server VM warning: Option UseConcMarkSweepGC was deprecated in version 9.0 and will likely be removed in a future release.
   [junit4] <<< JVM J0: EOF ----

[...truncated 7 lines...]
   [junit4] JVM J2: stderr was not empty, see: /home/jenkins/workspace/Lucene-Solr-7.x-Linux/lucene/build/sandbox/test/temp/junit4-J2-20180901_072758_6615902766659964437633.syserr
   [junit4] >>> JVM J2 emitted unexpected output (verbatim) ----
   [junit4] Java HotSpot(TM) 64-Bit Server VM warning: Option UseConcMarkSweepGC was deprecated in version 9.0 and will likely be removed in a future release.
   [junit4] <<< JVM J2: EOF ----

[...truncated 16 lines...]
   [junit4] JVM J1: stderr was not empty, see: /home/jenkins/workspace/Lucene-Solr-7.x-Linux/lucene/build/sandbox/test/temp/junit4-J1-20180901_072758_66117203496835864610312.syserr
   [junit4] >>> JVM J1 emitted unexpected output (verbatim) ----
   [junit4] Java HotSpot(TM) 64-Bit Server VM warning: Option UseConcMarkSweepGC was deprecated in version 9.0 and will likely be removed in a future release.
   [junit4] <<< JVM J1: EOF ----

[...truncated 293 lines...]
   [junit4] JVM J0: stderr was not empty, see: /home/jenkins/workspace/Lucene-Solr-7.x-Linux/lucene/build/spatial-extras/test/temp/junit4-J0-20180901_072954_12817114517834384021259.syserr
   [junit4] >>> JVM J0 emitted unexpected output (verbatim) ----
   [junit4] Java HotSpot(TM) 64-Bit Server VM warning: Option UseConcMarkSweepGC was deprecated in version 9.0 and will likely be removed in a future release.
   [junit4] <<< JVM J0: EOF ----

[...truncated 3 lines...]
   [junit4] JVM J2: stderr was not empty, see: /home/jenkins/workspace/Lucene-Solr-7.x-Linux/lucene/build/spatial-extras/test/temp/junit4-J2-20180901_072954_1288654959983122401860.syserr
   [junit4] >>> JVM J2 emitted unexpected output (verbatim) ----
   [junit4] Java HotSpot(TM) 64-Bit Server VM warning: Option UseConcMarkSweepGC was deprecated in version 9.0 and will likely be removed in a future release.
   [junit4] <<< JVM J2: EOF ----

[...truncated 6 lines...]
   [junit4] JVM J1: stderr was not empty, see: /home/jenkins/workspace/Lucene-Solr-7.x-Linux/lucene/build/spatial-extras/test/temp/junit4-J1-20180901_072954_12810514066705908754979.syserr
   [junit4] >>> JVM J1 emitted unexpected output (verbatim) ----
   [junit4] Java HotSpot(TM) 64-Bit Server VM warning: Option UseConcMarkSweepGC was deprecated in version 9.0 and will likely be removed in a future release.
   [junit4] <<< JVM J1: EOF ----

[...truncated 153 lines...]
   [junit4] JVM J0: stderr was not empty, see: /home/jenkins/workspace/Lucene-Solr-7.x-Linux/lucene/build/spatial/test/temp/junit4-J0-20180901_073037_72794767036388335000.syserr
   [junit4] >>> JVM J0 emitted unexpected output (verbatim) ----
   [junit4] Java HotSpot(TM) 64-Bit Server VM warning: Option UseConcMarkSweepGC was deprecated in version 9.0 and will likely be removed in a future release.
   [junit4] <<< JVM J0: EOF ----

[...truncated 184 lines...]
   [junit4] JVM J1: stderr was not empty, see: /home/jenkins/workspace/Lucene-Solr-7.x-Linux/lucene/build/spatial3d/test/temp/junit4-J1-20180901_073039_5098321178653740456765.syserr
   [junit4] >>> JVM J1 emitted unexpected output (verbatim) ----
   [junit4] Java HotSpot(TM) 64-Bit Server VM warning: Option UseConcMarkSweepGC was deprecated in version 9.0 and will likely be removed in a future release.
   [junit4] <<< JVM J1: EOF ----

[...truncated 3 lines...]
   [junit4] JVM J0: stderr was not empty, see: /home/jenkins/workspace/Lucene-Solr-7.x-Linux/lucene/build/spatial3d/test/temp/junit4-J0-20180901_073039_5092852985957577672169.syserr
   [junit4] >>> JVM J0 emitted unexpected output (verbatim) ----
   [junit4] Java HotSpot(TM) 64-Bit Server VM warning: Option UseConcMarkSweepGC was deprecated in version 9.0 and will likely be removed in a future release.
   [junit4] <<< JVM J0: EOF ----

[...truncated 6 lines...]
   [junit4] JVM J2: stderr was not empty, see: /home/jenkins/workspace/Lucene-Solr-7.x-Linux/lucene/build/spatial3d/test/temp/junit4-J2-20180901_073039_5092546205953627757396.syserr
   [junit4] >>> JVM J2 emitted unexpected output (verbatim) ----
   [junit4] Java HotSpot(TM) 64-Bit Server VM warning: Option UseConcMarkSweepGC was deprecated in version 9.0 and will likely be removed in a future release.
   [junit4] <<< JVM J2: EOF ----

[...truncated 249 lines...]
   [junit4] JVM J2: stderr was not empty, see: /home/jenkins/workspace/Lucene-Solr-7.x-Linux/lucene/build/suggest/test/temp/junit4-J2-20180901_073212_98311627004595526361081.syserr
   [junit4] >>> JVM J2 emitted unexpected output (verbatim) ----
   [junit4] Java HotSpot(TM) 64-Bit Server VM warning: Option UseConcMarkSweepGC was deprecated in version 9.0 and will likely be removed in a future release.
   [junit4] <<< JVM J2: EOF ----

[...truncated 3 lines...]
   [junit4] JVM J1: stderr was not empty, see: /home/jenkins/workspace/Lucene-Solr-7.x-Linux/lucene/build/suggest/test/temp/junit4-J1-20180901_073212_9838579109753640366238.syserr
   [junit4] >>> JVM J1 emitted unexpected output (verbatim) ----
   [junit4] Java HotSpot(TM) 64-Bit Server VM warning: Option UseConcMarkSweepGC was deprecated in version 9.0 and will likely be removed in a future release.
   [junit4] <<< JVM J1: EOF ----

[...truncated 15 lines...]
   [junit4] JVM J0: stderr was not empty, see: /home/jenkins/workspace/Lucene-Solr-7.x-Linux/lucene/build/suggest/test/temp/junit4-J0-20180901_073212_98314352861167253834329.syserr
   [junit4] >>> JVM J0 emitted unexpected output (verbatim) ----
   [junit4] Java HotSpot(TM) 64-Bit Server VM warning: Option UseConcMarkSweepGC was deprecated in version 9.0 and will likely be removed in a future release.
   [junit4] <<< JVM J0: EOF ----

[...truncated 2621 lines...]
   [junit4] Suite: org.apache.solr.util.TestSystemIdResolver
   [junit4]   2> 1052147 INFO  (TEST-TestSystemIdResolver.testUnsafeResolving-seed#[61923FEDA2C704C5]) [    ] o.a.s.c.SolrResourceLoader [null] Added 2 libs to classloader, from paths: [/home/jenkins/workspace/Lucene-Solr-7.x-Linux/solr/core/src/test-files/solr/collection1/lib, /home/jenkins/workspace/Lucene-Solr-7.x-Linux/solr/core/src/test-files/solr/collection1/lib/classes]
   [junit4]   2> 1052147 ERROR (Finalizer) [    ] o.a.s.c.CoreContainer CoreContainer was not close prior to finalize(), indicates a bug -- POSSIBLE RESOURCE LEAK!!!  instance=1878341785
   [junit4]   2> 1052148 ERROR (Finalizer) [    ] o.a.s.c.CoreContainer CoreContainer was not close prior to finalize(), indicates a bug -- POSSIBLE RESOURCE LEAK!!!  instance=475521640
   [junit4]   2> 1052148 ERROR (Finalizer) [    ] o.a.s.c.CoreContainer CoreContainer was not close prior to finalize(), indicates a bug -- POSSIBLE RESOURCE LEAK!!!  instance=1582089602
   [junit4]   2> 1052148 ERROR (Finalizer) [    ] o.a.s.c.CoreContainer CoreContainer was not close prior to finalize(), indicates a bug -- POSSIBLE RESOURCE LEAK!!!  instance=2068706800
   [junit4]   2> 1052148 ERROR (Finalizer) [    ] o.a.s.c.CoreContainer CoreContainer was not close prior to finalize(), indicates a bug -- POSSIBLE RESOURCE LEAK!!!  instance=1035611120
   [junit4]   2> 1052148 ERROR (Finalizer) [    ] o.a.s.c.CoreContainer CoreContainer was not close prior to finalize(), indicates a bug -- POSSIBLE RESOURCE LEAK!!!  instance=509463181
   [junit4]   2> 1052148 ERROR (Finalizer) [    ] o.a.s.c.CoreContainer CoreContainer was not close prior to finalize(), indicates a bug -- POSSIBLE RESOURCE LEAK!!!  instance=637889553
   [junit4]   2> 1052148 ERROR (Finalizer) [    ] o.a.s.c.CoreContainer CoreContainer was not close prior to finalize(), indicates a bug -- POSSIBLE RESOURCE LEAK!!!  instance=846458708
   [junit4]   2> 1052148 ERROR (Finalizer) [    ] o.a.s.c.CoreContainer CoreContainer was not close prior to finalize(), indicates a bug -- POSSIBLE RESOURCE LEAK!!!  instance=1585096513
   [junit4]   2> 1052148 ERROR (Finalizer) [    ] o.a.s.c.CoreContainer CoreContainer was not close prior to finalize(), indicates a bug -- POSSIBLE RESOURCE LEAK!!!  instance=771954593
   [junit4]   2> 1052148 ERROR (Finalizer) [    ] o.a.s.c.CoreContainer CoreContainer was not close prior to finalize(), indicates a bug -- POSSIBLE RESOURCE LEAK!!!  instance=602637204
   [junit4]   2> 1052148 ERROR (Finalizer) [    ] o.a.s.c.CoreContainer CoreContainer was not close prior to finalize(), indicates a bug -- POSSIBLE RESOURCE LEAK!!!  instance=240108018
   [junit4]   2> 1052148 ERROR (Finalizer) [    ] o.a.s.c.CoreContainer CoreContainer was not close prior to finalize(), indicates a bug -- POSSIBLE RESOURCE LEAK!!!  instance=84164565
   [junit4]   2> 1052148 ERROR (Finalizer) [    ] o.a.s.c.CoreContainer CoreContainer was not close prior to finalize(), indicates a bug -- POSSIBLE RESOURCE LEAK!!!  instance=856461003
   [junit4]   2> 1052148 ERROR (Finalizer) [    ] o.a.s.c.CoreContainer CoreContainer was not close prior to finalize(), indicates a bug -- POSSIBLE RESOURCE LEAK!!!  instance=1283742749
   [junit4]   2> 1052148 ERROR (Finalizer) [    ] o.a.s.c.CoreContainer CoreContainer was not close prior to finalize(), indicates a bug -- POSSIBLE RESOURCE LEAK!!!  instance=1010058286
   [junit4]   2> 1052148 ERROR (Finalizer) [    ] o.a.s.c.CoreContainer CoreContainer was not close prior to finalize(), indicates a bug -- POSSIBLE RESOURCE LEAK!!!  instance=409616106
   [junit4]   2> 1052149 ERROR (Finalizer) [    ] o.a.s.c.CoreContainer CoreContainer was not close prior to finalize(), indicates a bug -- POSSIBLE RESOURCE LEAK!!!  instance=1330090490
   [junit4]   2> 1052149 ERROR (Finalizer) [    ] o.a.s.c.CoreContainer CoreContainer was not close prior to finalize(), indicates a bug -- POSSIBLE RESOURCE LEAK!!!  instance=558713019
   [junit4]   2> 1052149 ERROR (Finalizer) [    ] o.a.s.c.CoreContainer CoreContainer was not close prior to finalize(), indicates a bug -- POSSIBLE RESOURCE LEAK!!!  instance=1061580168
   [junit4]   2> 1052155 INFO  (TEST-TestSystemIdResolver.testResolving-seed#[61923FEDA2C704C5]) [    ] o.a.s.c.SolrResourceLoader [null] Added 2 libs to classloader, from paths: [/home/jenkins/workspace/Lucene-Solr-7.x-Linux/solr/core/src/test-files/solr/collection1/lib, /home/jenkins/workspace/Lucene-Solr-7.x-Linux/solr/core/src/test-files/solr/collection1/lib/classes]
   [junit4]   2> NOTE: test params are: codec=Asserting(Lucene70), sim=RandomSimilarity(queryNorm=true): {}, locale=en-JM, timezone=PST8PDT
   [junit4]   2> NOTE: Linux 4.15.0-32-generic amd64/Oracle Corporation 9.0.4 (64-bit)/cpus=8,threads=1,free=242485784,total=518979584
   [junit4]   2> NOTE: All tests run in this JVM: [TestHalfAndHalfDocValues, TestSolrCoreSnapshots, TestSolrXml, MetricTriggerIntegrationTest, JSONWriterTest, TestCloudSchemaless, SolrMetricsIntegrationTest, ShowFileRequestHandlerTest, TestSSLRandomization, AsyncCallRequestStatusResponseTest, MBeansHandlerTest, MoreLikeThisHandlerTest, TestReqParamsAPI, SolrIndexMetricsTest, DeleteReplicaTest, BufferStoreTest, NumericFieldsTest, TestRTimerTree, TestFieldCacheReopen, CdcrOpsAndBoundariesTest, IndexBasedSpellCheckerTest, RegexBoostProcessorTest, SpellPossibilityIteratorTest, LeaderElectionContextKeyTest, SpellCheckComponentTest, CustomCollectionTest, SuggesterTest, TestMultiWordSynonyms, SimpleCollectionCreateDeleteTest, CdcrVersionReplicationTest, TestRandomRequestDistribution, PropertiesRequestHandlerTest, TestScoreJoinQPNoScore, SolrXmlInZkTest, TestClusterProperties, NoCacheHeaderTest, TestGraphTermsQParserPlugin, TestStressUserVersions, BlobRepositoryCloudTest, TestLogWatcher, BasicZkTest, RequiredFieldsTest, RequestHandlersTest, TestSolrCloudWithKerberosAlt, TestPullReplica, TestNumericRangeQuery32, CursorMarkTest, DocumentAnalysisRequestHandlerTest, TestWordDelimiterFilterFactory, TestQueryTypes, TestSolrDeletionPolicy1, TestLRUStatsCache, TestCSVResponseWriter, AssignTest, ResponseBuilderTest, TestSmileRequest, TestFunctionQuery, CustomHighlightComponentTest, RegexBytesRefFilterTest, AddBlockUpdateTest, ScheduledTriggerIntegrationTest, TestHttpShardHandlerFactory, TestSystemCollAutoCreate, TestDynamicFieldCollectionResource, BadCopyFieldTest, DataDrivenBlockJoinTest, ResponseLogComponentTest, RandomizedTaggerTest, DistributedFacetPivotWhiteBoxTest, TestSweetSpotSimilarityFactory, DocValuesMultiTest, ChaosMonkeySafeLeaderTest, HdfsAutoAddReplicasIntegrationTest, TestSimNodeLostTrigger, TestManagedSchemaThreadSafety, TestNestedUpdateProcessor, TestCloudPseudoReturnFields, ConjunctionSolrSpellCheckerTest, TestSearchPerf, HighlighterConfigTest, DistributedQueueTest, CleanupOldIndexTest, NodeAddedTriggerTest, TestSimDistribStateManager, TestInitQParser, OverseerTest, BitVectorTest, TestSystemIdResolver]
   [junit4]   2> NOTE: reproduce with: ant test  -Dtestcase=TestSystemIdResolver -Dtests.seed=61923FEDA2C704C5 -Dtests.multiplier=3 -Dtests.slow=true -Dtests.locale=en-JM -Dtests.timezone=PST8PDT -Dtests.asserts=true -Dtests.file.encoding=UTF-8
   [junit4] ERROR   0.00s J2 | TestSystemIdResolver (suite) <<<
   [junit4]    > Throwable #1: java.lang.AssertionError: The test or suite printed 8216 bytes to stdout and stderr, even though the limit was set to 8192 bytes. Increase the limit with @Limit, ignore it completely with @SuppressSysoutChecks or run with -Dtests.verbose=true
   [junit4]    > 	at __randomizedtesting.SeedInfo.seed([61923FEDA2C704C5]:0)
   [junit4]    > 	at java.base/java.lang.Thread.run(Thread.java:844)
   [junit4] Completed [239/831 (1!)] on J2 in 0.03s, 2 tests, 1 failure <<< FAILURES!

[...truncated 2081 lines...]
   [junit4] JVM J0: stderr was not empty, see: /home/jenkins/workspace/Lucene-Solr-7.x-Linux/solr/build/solr-core/test/temp/junit4-J0-20180901_073328_47210667306058297608112.syserr
   [junit4] >>> JVM J0 emitted unexpected output (verbatim) ----
   [junit4] Java HotSpot(TM) 64-Bit Server VM warning: Option UseConcMarkSweepGC was deprecated in version 9.0 and will likely be removed in a future release.
   [junit4] <<< JVM J0: EOF ----

[...truncated 20 lines...]
   [junit4] JVM J2: stderr was not empty, see: /home/jenkins/workspace/Lucene-Solr-7.x-Linux/solr/build/solr-core/test/temp/junit4-J2-20180901_073328_4724779107227537548451.syserr
   [junit4] >>> JVM J2 emitted unexpected output (verbatim) ----
   [junit4] Java HotSpot(TM) 64-Bit Server VM warning: Option UseConcMarkSweepGC was deprecated in version 9.0 and will likely be removed in a future release.
   [junit4] <<< JVM J2: EOF ----

[...truncated 39 lines...]
   [junit4] JVM J1: stderr was not empty, see: /home/jenkins/workspace/Lucene-Solr-7.x-Linux/solr/build/solr-core/test/temp/junit4-J1-20180901_073328_47215894345478101435648.syserr
   [junit4] >>> JVM J1 emitted unexpected output (verbatim) ----
   [junit4] Java HotSpot(TM) 64-Bit Server VM warning: Option UseConcMarkSweepGC was deprecated in version 9.0 and will likely be removed in a future release.
   [junit4] <<< JVM J1: EOF ----

[...truncated 976 lines...]
   [junit4] JVM J0: stderr was not empty, see: /home/jenkins/workspace/Lucene-Solr-7.x-Linux/solr/build/solr-solrj/test/temp/junit4-J0-20180901_082701_03715545674706286362851.syserr
   [junit4] >>> JVM J0 emitted unexpected output (verbatim) ----
   [junit4] Java HotSpot(TM) 64-Bit Server VM warning: Option UseConcMarkSweepGC was deprecated in version 9.0 and will likely be removed in a future release.
   [junit4] <<< JVM J0: EOF ----

[...truncated 3 lines...]
   [junit4] JVM J2: stderr was not empty, see: /home/jenkins/workspace/Lucene-Solr-7.x-Linux/solr/build/solr-solrj/test/temp/junit4-J2-20180901_082701_03711478757889828090775.syserr
   [junit4] >>> JVM J2 emitted unexpected output (verbatim) ----
   [junit4] Java HotSpot(TM) 64-Bit Server VM warning: Option UseConcMarkSweepGC was deprecated in version 9.0 and will likely be removed in a future release.
   [junit4] <<< JVM J2: EOF ----

[...truncated 9 lines...]
   [junit4] JVM J1: stderr was not empty, see: /home/jenkins/workspace/Lucene-Solr-7.x-Linux/solr/build/solr-solrj/test/temp/junit4-J1-20180901_082701_03717516113900106355986.syserr
   [junit4] >>> JVM J1 emitted unexpected output (verbatim) ----
   [junit4] Java HotSpot(TM) 64-Bit Server VM warning: Option UseConcMarkSweepGC was deprecated in version 9.0 and will likely be removed in a future release.
   [junit4] <<< JVM J1: EOF ----

[...truncated 1512 lines...]
   [junit4] JVM J2: stderr was not empty, see: /home/jenkins/workspace/Lucene-Solr-7.x-Linux/solr/build/contrib/solr-analysis-extras/test/temp/junit4-J2-20180901_082855_9374788942826887095541.syserr
   [junit4] >>> JVM J2 emitted unexpected output (verbatim) ----
   [junit4] Java HotSpot(TM) 64-Bit Server VM warning: Option UseConcMarkSweepGC was deprecated in version 9.0 and will likely be removed in a future release.
   [junit4] <<< JVM J2: EOF ----

[...truncated 6 lines...]
   [junit4] JVM J0: stderr was not empty, see: /home/jenkins/workspace/Lucene-Solr-7.x-Linux/solr/build/contrib/solr-analysis-extras/test/temp/junit4-J0-20180901_082855_9378582286250070403000.syserr
   [junit4] >>> JVM J0 emitted unexpected output (verbatim) ----
   [junit4] Java HotSpot(TM) 64-Bit Server VM warning: Option UseConcMarkSweepGC was deprecated in version 9.0 and will likely be removed in a future release.
   [junit4] <<< JVM J0: EOF ----

   [junit4] JVM J1: stderr was not empty, see: /home/jenkins/workspace/Lucene-Solr-7.x-Linux/solr/build/contrib/solr-analysis-extras/test/temp/junit4-J1-20180901_082855_93712271128451125171594.syserr
   [junit4] >>> JVM J1 emitted unexpected output (verbatim) ----
   [junit4] Java HotSpot(TM) 64-Bit Server VM warning: Option UseConcMarkSweepGC was deprecated in version 9.0 and will likely be removed in a future release.
   [junit4] <<< JVM J1: EOF ----

[...truncated 803 lines...]
   [junit4] JVM J0: stderr was not empty, see: /home/jenkins/workspace/Lucene-Solr-7.x-Linux/solr/build/contrib/solr-analytics/test/temp/junit4-J0-20180901_082906_2165450018291639435500.syserr
   [junit4] >>> JVM J0 emitted unexpected output (verbatim) ----
   [junit4] Java HotSpot(TM) 64-Bit Server VM warning: Option UseConcMarkSweepGC was deprecated in version 9.0 and will likely be removed in a future release.
   [junit4] <<< JVM J0: EOF ----

   [junit4] JVM J2: stderr was not empty, see: /home/jenkins/workspace/Lucene-Solr-7.x-Linux/solr/build/contrib/solr-analytics/test/temp/junit4-J2-20180901_082906_21716945606978509123335.syserr
   [junit4] >>> JVM J2 emitted unexpected output (verbatim) ----
   [junit4] Java HotSpot(TM) 64-Bit Server VM warning: Option UseConcMarkSweepGC was deprecated in version 9.0 and will likely be removed in a future release.
   [junit4] <<< JVM J2: EOF ----

[...truncated 3 lines...]
   [junit4] JVM J1: stderr was not empty, see: /home/jenkins/workspace/Lucene-Solr-7.x-Linux/solr/build/contrib/solr-analytics/test/temp/junit4-J1-20180901_082906_2165366531224564613571.syserr
   [junit4] >>> JVM J1 emitted unexpected output (verbatim) ----
   [junit4] Java HotSpot(TM) 64-Bit Server VM warning: Option UseConcMarkSweepGC was deprecated in version 9.0 and will likely be removed in a future release.
   [junit4] <<< JVM J1: EOF ----

[...truncated 571 lines...]
   [junit4] JVM J0: stderr was not empty, see: /home/jenkins/workspace/Lucene-Solr-7.x-Linux/solr/build/contrib/solr-clustering/test/temp/junit4-J0-20180901_082944_7225850042831102836974.syserr
   [junit4] >>> JVM J0 emitted unexpected output (verbatim) ----
   [junit4] Java HotSpot(TM) 64-Bit Server VM warning: Option UseConcMarkSweepGC was deprecated in version 9.0 and will likely be removed in a future release.
   [junit4] <<< JVM J0: EOF ----

[...truncated 3 lines...]
   [junit4] JVM J2: stderr was not empty, see: /home/jenkins/workspace/Lucene-Solr-7.x-Linux/solr/build/contrib/solr-clustering/test/temp/junit4-J2-20180901_082944_7225603294397862978833.syserr
   [junit4] >>> JVM J2 emitted unexpected output (verbatim) ----
   [junit4] Java HotSpot(TM) 64-Bit Server VM warning: Option UseConcMarkSweepGC was deprecated in version 9.0 and will likely be removed in a future release.
   [junit4] <<< JVM J2: EOF ----

[...truncated 3 lines...]
   [junit4] JVM J1: stderr was not empty, see: /home/jenkins/workspace/Lucene-Solr-7.x-Linux/solr/build/contrib/solr-clustering/test/temp/junit4-J1-20180901_082944_7227696541634020644377.syserr
   [junit4] >>> JVM J1 emitted unexpected output (verbatim) ----
   [junit4] Java HotSpot(TM) 64-Bit Server VM warning: Option UseConcMarkSweepGC was deprecated in version 9.0 and will likely be removed in a future release.
   [junit4] <<< JVM J1: EOF ----

[...truncated 1302 lines...]
   [junit4] JVM J0: stderr was not empty, see: /home/jenkins/workspace/Lucene-Solr-7.x-Linux/solr/build/contrib/solr-dataimporthandler-extras/test/temp/junit4-J0-20180901_083000_72310776868998485313825.syserr
   [junit4] >>> JVM J0 emitted unexpected output (verbatim) ----
   [junit4] Java HotSpot(TM) 64-Bit Server VM warning: Option UseConcMarkSweepGC was deprecated in version 9.0 and will likely be removed in a future release.
   [junit4] <<< JVM J0: EOF ----

[...truncated 3 lines...]
   [junit4] JVM J1: stderr was not empty, see: /home/jenkins/workspace/Lucene-Solr-7.x-Linux/solr/build/contrib/solr-dataimporthandler-extras/test/temp/junit4-J1-20180901_083000_7233531095058610080109.syserr
   [junit4] >>> JVM J1 emitted unexpected output (verbatim) ----
   [junit4] Java HotSpot(TM) 64-Bit Server VM warning: Option UseConcMarkSweepGC was deprecated in version 9.0 and will likely be removed in a future release.
   [junit4] <<< JVM J1: EOF ----

[...truncated 650 lines...]
   [junit4] JVM J0: stderr was not empty, see: /home/jenkins/workspace/Lucene-Solr-7.x-Linux/solr/build/contrib/solr-dataimporthandler/test/temp/junit4-J0-20180901_083008_46214949404478274606450.syserr
   [junit4] >>> JVM J0 emitted unexpected output (verbatim) ----
   [junit4] Java HotSpot(TM) 64-Bit Server VM warning: Option UseConcMarkSweepGC was deprecated in version 9.0 and will likely be removed in a future release.
   [junit4] <<< JVM J0: EOF ----

[...truncated 3 lines...]
   [junit4] JVM J2: stderr was not empty, see: /home/jenkins/workspace/Lucene-Solr-7.x-Linux/solr/build/contrib/solr-dataimporthandler/test/temp/junit4-J2-20180901_083008_46210275917313539698870.syserr
   [junit4] >>> JVM J2 emitted unexpected output (verbatim) ----
   [junit4] Java HotSpot(TM) 64-Bit Server VM warning: Option UseConcMarkSweepGC was deprecated in version 9.0 and will likely be removed in a future release.
   [junit4] <<< JVM J2: EOF ----

[...truncated 15 lines...]
   [junit4] JVM J1: stderr was not empty, see: /home/jenkins/workspace/Lucene-Solr-7.x-Linux/solr/build/contrib/solr-dataimporthandler/test/temp/junit4-J1-20180901_083008_46213106417827760926679.syserr
   [junit4] >>> JVM J1 emitted unexpected output (verbatim) ----
   [junit4] Java HotSpot(TM) 64-Bit Server VM warning: Option UseConcMarkSweepGC was deprecated in version 9.0 and will likely be removed in a future release.
   [junit4] <<< JVM J1: EOF ----

[...truncated 578 lines...]
   [junit4] JVM J1: stderr was not empty, see: /home/jenkins/workspace/Lucene-Solr-7.x-Linux/solr/build/contrib/solr-cell/test/temp/junit4-J1-20180901_083030_2509518362168686252111.syserr
   [junit4] >>> JVM J1 emitted unexpected output (verbatim) ----
   [junit4] Java HotSpot(TM) 64-Bit Server VM warning: Option UseConcMarkSweepGC was deprecated in version 9.0 and will likely be removed in a future release.
   [junit4] <<< JVM J1: EOF ----

[...truncated 3 lines...]
   [junit4] JVM J2: stderr was not empty, see: /home/jenkins/workspace/Lucene-Solr-7.x-Linux/solr/build/contrib/solr-cell/test/temp/junit4-J2-20180901_083030_2504452587634572554734.syserr
   [junit4] >>> JVM J2 emitted unexpected output (verbatim) ----
   [junit4] Java HotSpot(TM) 64-Bit Server VM warning: Option UseConcMarkSweepGC was deprecated in version 9.0 and will likely be removed in a future release.
   [junit4] <<< JVM J2: EOF ----

[...truncated 3 lines...]
   [junit4] JVM J0: stderr was not empty, see: /home/jenkins/workspace/Lucene-Solr-7.x-Linux/solr/build/contrib/solr-cell/test/temp/junit4-J0-20180901_083030_250179534516691693774.syserr
   [junit4] >>> JVM J0 emitted unexpected output (verbatim) ----
   [junit4] Java HotSpot(TM) 64-Bit Server VM warning: Option UseConcMarkSweepGC was deprecated in version 9.0 and will likely be removed in a future release.
   [junit4] <<< JVM J0: EOF ----

[...truncated 585 lines...]
   [junit4] JVM J1: stderr was not empty, see: /home/jenkins/workspace/Lucene-Solr-7.x-Linux/solr/build/contrib/solr-langid/test/temp/junit4-J1-20180901_083041_00616095795021913801953.syserr
   [junit4] >>> JVM J1 emitted unexpected output (verbatim) ----
   [junit4] Java HotSpot(TM) 64-Bit Server VM warning: Option UseConcMarkSweepGC was deprecated in version 9.0 and will likely be removed in a future release.
   [junit4] <<< JVM J1: EOF ----

   [junit4] JVM J2: stderr was not empty, see: /home/jenkins/workspace/Lucene-Solr-7.x-Linux/solr/build/contrib/solr-langid/test/temp/junit4-J2-20180901_083041_0065722554198012741055.syserr
   [junit4] >>> JVM J2 emitted unexpected output (verbatim) ----
   [junit4] Java HotSpot(TM) 64-Bit Server VM warning: Option UseConcMarkSweepGC was deprecated in version 9.0 and will likely be removed in a future release.
   [junit4] <<< JVM J2: EOF ----

   [junit4] JVM J0: stderr was not empty, see: /home/jenkins/workspace/Lucene-Solr-7.x-Linux/solr/build/contrib/solr-langid/test/temp/junit4-J0-20180901_083041_00610834638724575654994.syserr
   [junit4] >>> JVM J0 emitted unexpected output (verbatim) ----
   [junit4] Java HotSpot(TM) 64-Bit Server VM warning: Option UseConcMarkSweepGC was deprecated in version 9.0 and will likely be removed in a future release.
   [junit4] <<< JVM J0: EOF ----

[...truncated 675 lines...]
   [junit4] JVM J2: stderr was not empty, see: /home/jenkins/workspace/Lucene-Solr-7.x-Linux/solr/build/contrib/solr-ltr/test/temp/junit4-J2-20180901_083049_8673878459965661490467.syserr
   [junit4] >>> JVM J2 emitted unexpected output (verbatim) ----
   [junit4] Java HotSpot(TM) 64-Bit Server VM warning: Option UseConcMarkSweepGC was deprecated in version 9.0 and will likely be removed in a future release.
   [junit4] <<< JVM J2: EOF ----

   [junit4] JVM J0: stderr was not empty, see: /home/jenkins/workspace/Lucene-Solr-7.x-Linux/solr/build/contrib/solr-ltr/test/temp/junit4-J0-20180901_083049_8672096822277762753340.syserr
   [junit4] >>> JVM J0 emitted unexpected output (verbatim) ----
   [junit4] Java HotSpot(TM) 64-Bit Server VM warning: Option UseConcMarkSweepGC was deprecated in version 9.0 and will likely be removed in a future release.
   [junit4] <<< JVM J0: EOF ----

[...truncated 12 lines...]
   [junit4] JVM J1: stderr was not empty, see: /home/jenkins/workspace/Lucene-Solr-7.x-Linux/solr/build/contrib/solr-ltr/test/temp/junit4-J1-20180901_083049_86714348289423050360149.syserr
   [junit4] >>> JVM J1 emitted unexpected output (verbatim) ----
   [junit4] Java HotSpot(TM) 64-Bit Server VM warning: Option UseConcMarkSweepGC was deprecated in version 9.0 and will likely be removed in a future release.
   [junit4] <<< JVM J1: EOF ----

[...truncated 576 lines...]
   [junit4] JVM J1: stderr was not empty, see: /home/jenkins/workspace/Lucene-Solr-7.x-Linux/solr/build/contrib/solr-prometheus-exporter/test/temp/junit4-J1-20180901_083115_017303290426405614983.syserr
   [junit4] >>> JVM J1 emitted unexpected output (verbatim) ----
   [junit4] Java HotSpot(TM) 64-Bit Server VM warning: Option UseConcMarkSweepGC was deprecated in version 9.0 and will likely be removed in a future release.
   [junit4] <<< JVM J1: EOF ----

[...truncated 3 lines...]
   [junit4] JVM J0: stderr was not empty, see: /home/jenkins/workspace/Lucene-Solr-7.x-Linux/solr/build/contrib/solr-prometheus-exporter/test/temp/junit4-J0-20180901_083115_01717543228492161936040.syserr
   [junit4] >>> JVM J0 emitted unexpected output (verbatim) ----
   [junit4] Java HotSpot(TM) 64-Bit Server VM warning: Option UseConcMarkSweepGC was deprecated in version 9.0 and will likely be removed in a future release.
   [junit4] <<< JVM J0: EOF ----

[...truncated 566 lines...]
   [junit4] JVM J0: stderr was not empty, see: /home/jenkins/workspace/Lucene-Solr-7.x-Linux/solr/build/contrib/solr-velocity/test/temp/junit4-J0-20180901_083132_09212339830458975232350.syserr
   [junit4] >>> JVM J0 emitted unexpected output (verbatim) ----
   [junit4] Java HotSpot(TM) 64-Bit Server VM warning: Option UseConcMarkSweepGC was deprecated in version 9.0 and will likely be removed in a future release.
   [junit4] <<< JVM J0: EOF ----

[...truncated 33343 lines...]
[repro] Jenkins log URL: https://jenkins.thetaphi.de/job/Lucene-Solr-7.x-Linux/2667/consoleText

[repro] Revision: 63d4ecd216b8fe21c094a1e4c7da9065569e5077

[repro] Ant options: "-Dargs=-XX:+UseCompressedOops -XX:+UseConcMarkSweepGC"
[repro] Repro line:  ant test  -Dtestcase=TestSystemIdResolver -Dtests.seed=61923FEDA2C704C5 -Dtests.multiplier=3 -Dtests.slow=true -Dtests.locale=en-JM -Dtests.timezone=PST8PDT -Dtests.asserts=true -Dtests.file.encoding=UTF-8

[repro] ant clean

[...truncated 6 lines...]
[repro] Test suites by module:
[repro]    solr/core
[repro]       TestSystemIdResolver
[repro] ant compile-test

[...truncated 3438 lines...]
[repro] ant test-nocompile -Dtests.dups=5 -Dtests.maxfailures=5 -Dtests.class="*.TestSystemIdResolver" -Dtests.showOutput=onerror "-Dargs=-XX:+UseCompressedOops -XX:+UseConcMarkSweepGC" -Dtests.seed=61923FEDA2C704C5 -Dtests.multiplier=3 -Dtests.slow=true -Dtests.locale=en-JM -Dtests.timezone=PST8PDT -Dtests.asserts=true -Dtests.file.encoding=UTF-8

[...truncated 32 lines...]
   [junit4] Suite: org.apache.solr.util.TestSystemIdResolver
   [junit4]   2> 1917 INFO  (TEST-TestSystemIdResolver.testUnsafeResolving-seed#[61923FEDA2C704C5]) [    ] o.a.s.c.SolrResourceLoader solr home defaulted to 'solr/' (could not find system property or JNDI)
   [junit4]   2> 1928 INFO  (TEST-TestSystemIdResolver.testUnsafeResolving-seed#[61923FEDA2C704C5]) [    ] o.a.s.c.SolrResourceLoader [null] Added 2 libs to classloader, from paths: [/home/jenkins/workspace/Lucene-Solr-7.x-Linux/solr/core/src/test-files/solr/collection1/lib, /home/jenkins/workspace/Lucene-Solr-7.x-Linux/solr/core/src/test-files/solr/collection1/lib/classes]
   [junit4] OK      0.98s J2 | TestSystemIdResolver.testUnsafeResolving
   [junit4]   2> 2030 INFO  (TEST-TestSystemIdResolver.testResolving-seed#[61923FEDA2C704C5]) [    ] o.a.s.c.SolrResourceLoader [null] Added 2 libs to classloader, from paths: [/home/jenkins/workspace/Lucene-Solr-7.x-Linux/solr/core/src/test-files/solr/collection1/lib, /home/jenkins/workspace/Lucene-Solr-7.x-Linux/solr/core/src/test-files/solr/collection1/lib/classes]
   [junit4] OK      0.05s J2 | TestSystemIdResolver.testResolving
   [junit4]   2> Sep 01, 2018 8:34:09 AM com.carrotsearch.randomizedtesting.ThreadLeakControl checkThreadLeaks
   [junit4]   2> WARNING: Will linger awaiting termination of 1 leaked thread(s).
   [junit4]   2> Sep 01, 2018 8:34:29 AM com.carrotsearch.randomizedtesting.ThreadLeakControl checkThreadLeaks
   [junit4]   2> SEVERE: 1 thread leaked from SUITE scope at org.apache.solr.util.TestSystemIdResolver: 
   [junit4]   2>    1) Thread[id=16, name=Log4j2-TF-1-AsyncLoggerConfig--1, state=TIMED_WAITING, group=TGRP-TestSystemIdResolver]
   [junit4]   2>         at java.base@9.0.4/jdk.internal.misc.Unsafe.park(Native Method)
   [junit4]   2>         at java.base@9.0.4/java.util.concurrent.locks.LockSupport.parkNanos(LockSupport.java:234)
   [junit4]   2>         at java.base@9.0.4/java.util.concurrent.locks.AbstractQueuedSynchronizer$ConditionObject.awaitNanos(AbstractQueuedSynchronizer.java:2104)
   [junit4]   2>         at app//com.lmax.disruptor.TimeoutBlockingWaitStrategy.waitFor(TimeoutBlockingWaitStrategy.java:38)
   [junit4]   2>         at app//com.lmax.disruptor.ProcessingSequenceBarrier.waitFor(ProcessingSequenceBarrier.java:56)
   [junit4]   2>         at app//com.lmax.disruptor.BatchEventProcessor.run(BatchEventProcessor.java:128)
   [junit4]   2>         at java.base@9.0.4/java.lang.Thread.run(Thread.java:844)
   [junit4]   2> Sep 01, 2018 8:34:29 AM com.carrotsearch.randomizedtesting.ThreadLeakControl tryToInterruptAll
   [junit4]   2> INFO: Starting to interrupt leaked threads:
   [junit4]   2>    1) Thread[id=16, name=Log4j2-TF-1-AsyncLoggerConfig--1, state=TIMED_WAITING, group=TGRP-TestSystemIdResolver]
   [junit4]   2> AsyncLogger error handling event seq=3, value='null':
   [junit4]   2> java.lang.InterruptedException
   [junit4]   2> 	at java.base/java.util.concurrent.locks.AbstractQueuedSynchronizer$ConditionObject.reportInterruptAfterWait(AbstractQueuedSynchronizer.java:2037)
   [junit4]   2> 	at java.base/java.util.concurrent.locks.AbstractQueuedSynchronizer$ConditionObject.awaitNanos(AbstractQueuedSynchronizer.java:2114)
   [junit4]   2> 	at com.lmax.disruptor.TimeoutBlockingWaitStrategy.waitFor(TimeoutBlockingWaitStrategy.java:38)
   [junit4]   2> 	at com.lmax.disruptor.ProcessingSequenceBarrier.waitFor(ProcessingSequenceBarrier.java:56)
   [junit4]   2> 	at com.lmax.disruptor.BatchEventProcessor.run(BatchEventProcessor.java:128)
   [junit4]   2> 	at java.base/java.lang.Thread.run(Thread.java:844)
   [junit4]   2> AsyncLogger error handling event seq=4, value='null':
   [junit4]   2> java.lang.InterruptedException
   [junit4]   2> 	at java.base/java.util.concurrent.locks.AbstractQueuedSynchronizer$ConditionObject.reportInterruptAfterWait(AbstractQueuedSynchronizer.java:2037)
   [junit4]   2> 	at java.base/java.util.concurrent.locks.AbstractQueuedSynchronizer$ConditionObject.awaitNanos(AbstractQueuedSynchronizer.java:2114)
   [junit4]   2> 	at com.lmax.disruptor.TimeoutBlockingWaitStrategy.waitFor(TimeoutBlockingWaitStrategy.java:38)
   [junit4]   2> 	at com.lmax.disruptor.ProcessingSequenceBarrier.waitFor(ProcessingSequenceBarrier.java:56)
   [junit4]   2> 	at com.lmax.disruptor.BatchEventProcessor.run(BatchEventProcessor.java:128)
   [junit4]   2> 	at java.base/java.lang.Thread.run(Thread.java:844)
   [junit4]   2> AsyncLogger error handling event seq=5, value='null':
   [junit4]   2> java.lang.InterruptedException
   [junit4]   2> 	at java.base/java.util.concurrent.locks.AbstractQueuedSynchronizer$ConditionObject.reportInterruptAfterWait(AbstractQueuedSynchronizer.java:2037)
   [junit4]   2> 	at java.base/java.util.concurrent.locks.AbstractQueuedSynchronizer$ConditionObject.awaitNanos(AbstractQueuedSynchronizer.java:2114)
   [junit4]   2> 	at com.lmax.disruptor.TimeoutBlockingWaitStrategy.waitFor(TimeoutBlockingWaitStrategy.java:38)
   [junit4]   2> 	at com.lmax.disruptor.ProcessingSequenceBarrier.waitFor(ProcessingSequenceBarrier.java:56)
   [junit4]   2> 	at com.lmax.disruptor.BatchEventProcessor.run(BatchEventProcessor.java:128)
   [junit4]   2> 	at java.base/java.lang.Thread.run(Thread.java:844)
   [junit4]   2> AsyncLogger error handling event seq=6, value='null':
   [junit4]   2> java.lang.InterruptedException
   [junit4]   2> 	at java.base/java.util.concurrent.locks.AbstractQueuedSynchronizer$ConditionObject.reportInterruptAfterWait(AbstractQueuedSynchronizer.java:2037)
   [junit4]   2> 	at java.base/java.util.concurrent.locks.AbstractQueuedSynchronizer$ConditionObject.awaitNanos(AbstractQueuedSynchronizer.java:2114)
   [junit4]   2> 	at com.lmax.disruptor.TimeoutBlockingWaitStrategy.waitFor(TimeoutBlockingWaitStrategy.java:38)
   [junit4]   2> 	at com.lmax.disruptor.ProcessingSequenceBarrier.waitFor(ProcessingSequenceBarrier.java:56)
   [junit4]   2> 	at com.lmax.disruptor.BatchEventProcessor.run(BatchEventProcessor.java:128)
   [junit4]   2> 	at java.base/java.lang.Thread.run(Thread.java:844)
   [junit4]   2> AsyncLogger error handling event seq=7, value='null':
   [junit4]   2> java.lang.InterruptedException
   [junit4]   2> 	at java.base/java.util.concurrent.locks.AbstractQueuedSynchronizer$ConditionObject.reportInterruptAfterWait(AbstractQueuedSynchronizer.java:2037)
   [junit4]   2> 	at java.base/java.util.concurrent.locks.AbstractQueuedSynchronizer$ConditionObject.awaitNanos(AbstractQueuedSynchronizer.java:2114)
   [junit4]   2> 	at com.lmax.disruptor.TimeoutBlockingWaitStrategy.waitFor(TimeoutBlockingWaitStrategy.java:38)
   [junit4]   2> 	at com.lmax.disruptor.ProcessingSequenceBarrier.waitFor(ProcessingSequenceBarrier.java:56)
   [junit4]   2> 	at com.lmax.disruptor.BatchEventProcessor.run(BatchEventProcessor.java:128)
   [junit4]   2> 	at java.base/java.lang.Thread.run(Thread.java:844)
   [junit4]   2> AsyncLogger error handling event seq=8, value='null':
   [junit4]   2> java.lang.InterruptedException
   [junit4]   2> 	at java.base/java.util.concurrent.locks.AbstractQueuedSynchronizer$ConditionObject.reportInterruptAfterWait(AbstractQueuedSynchronizer.java:2037)
   [junit4]   2> 	at java.base/java.util.concurrent.locks.AbstractQueuedSynchronizer$ConditionObject.awaitNanos(AbstractQueuedSynchronizer.java:2114)
   [junit4]   2> 	at com.lmax.disruptor.TimeoutBlockingWaitStrategy.waitFor(TimeoutBlockingWaitStrategy.java:38)
   [junit4]   2> 	at com.lmax.disruptor.ProcessingSequenceBarrier.waitFor(ProcessingSequenceBarrier.java:56)
   [junit4]   2> 	at com.lmax.disruptor.BatchEventProcessor.run(BatchEventProcessor.java:128)
   [junit4]   2> 	at java.base/java.lang.Thread.run(Thread.java:844)
   [junit4]   2> Sep 01, 2018 8:34:32 AM com.carrotsearch.randomizedtesting.ThreadLeakControl tryToInterruptAll
   [junit4]   2> SEVERE: There are still zombie threads that couldn't be terminated:
   [junit4]   2>    1) Thread[id=16, name=Log4j2-TF-1-AsyncLoggerConfig--1, state=TIMED_WAITING, group=TGRP-TestSystemIdResolver]
   [junit4]   2>         at java.base@9.0.4/jdk.internal.misc.Unsafe.park(Native Method)
   [junit4]   2>         at java.base@9.0.4/java.util.concurrent.locks.LockSupport.parkNanos(LockSupport.java:234)
   [junit4]   2>         at java.base@9.0.4/java.util.concurrent.locks.AbstractQueuedSynchronizer$ConditionObject.awaitNanos(AbstractQueuedSynchronizer.java:2104)
   [junit4]   2>         at app//com.lmax.disruptor.TimeoutBlockingWaitStrategy.waitFor(TimeoutBlockingWaitStrategy.java:38)
   [junit4]   2>         at app//com.lmax.disruptor.ProcessingSequenceBarrier.waitFor(ProcessingSequenceBarrier.java:56)
   [junit4]   2>         at app//com.lmax.disruptor.BatchEventProcessor.run(BatchEventProcessor.java:128)
   [junit4]   2>         at java.base@9.0.4/java.lang.Thread.run(Thread.java:844)
   [junit4]   2> NOTE: test params are: codec=Asserting(Lucene70), sim=RandomSimilarity(queryNorm=true): {}, locale=en-JM, timezone=PST8PDT
   [junit4]   2> NOTE: Linux 4.15.0-32-generic amd64/Oracle Corporation 9.0.4 (64-bit)/cpus=8,threads=2,free=424193648,total=518979584
   [junit4]   2> NOTE: All tests run in this JVM: [TestSystemIdResolver]
   [junit4]   2> NOTE: reproduce with: ant test  -Dtestcase=TestSystemIdResolver -Dtests.seed=61923FEDA2C704C5 -Dtests.multiplier=3 -Dtests.slow=true -Dtests.badapples=true -Dtests.locale=en-JM -Dtests.timezone=PST8PDT -Dtests.asserts=true -Dtests.file.encoding=UTF-8
   [junit4] ERROR   0.00s J2 | TestSystemIdResolver (suite) <<<
   [junit4]    > Throwable #1: com.carrotsearch.randomizedtesting.ThreadLeakError: 1 thread leaked from SUITE scope at org.apache.solr.util.TestSystemIdResolver: 
   [junit4]    >    1) Thread[id=16, name=Log4j2-TF-1-AsyncLoggerConfig--1, state=TIMED_WAITING, group=TGRP-TestSystemIdResolver]
   [junit4]    >         at java.base@9.0.4/jdk.internal.misc.Unsafe.park(Native Method)
   [junit4]    >         at java.base@9.0.4/java.util.concurrent.locks.LockSupport.parkNanos(LockSupport.java:234)
   [junit4]    >         at java.base@9.0.4/java.util.concurrent.locks.AbstractQueuedSynchronizer$ConditionObject.awaitNanos(AbstractQueuedSynchronizer.java:2104)
   [junit4]    >         at app//com.lmax.disruptor.TimeoutBlockingWaitStrategy.waitFor(TimeoutBlockingWaitStrategy.java:38)
   [junit4]    >         at app//com.lmax.disruptor.ProcessingSequenceBarrier.waitFor(ProcessingSequenceBarrier.java:56)
   [junit4]    >         at app//com.lmax.disruptor.BatchEventProcessor.run(BatchEventProcessor.java:128)
   [junit4]    >         at java.base@9.0.4/java.lang.Thread.run(Thread.java:844)
   [junit4]    > 	at __randomizedtesting.SeedInfo.seed([61923FEDA2C704C5]:0)Throwable #2: com.carrotsearch.randomizedtesting.ThreadLeakError: There are still zombie threads that couldn't be terminated:
   [junit4]    >    1) Thread[id=16, name=Log4j2-TF-1-AsyncLoggerConfig--1, state=TIMED_WAITING, group=TGRP-TestSystemIdResolver]
   [junit4]    >         at java.base@9.0.4/jdk.internal.misc.Unsafe.park(Native Method)
   [junit4]    >         at java.base@9.0.4/java.util.concurrent.locks.LockSupport.parkNanos(LockSupport.java:234)
   [junit4]    >         at java.base@9.0.4/java.util.concurrent.locks.AbstractQueuedSynchronizer$ConditionObject.awaitNanos(AbstractQueuedSynchronizer.java:2104)
   [junit4]    >         at app//com.lmax.disruptor.TimeoutBlockingWaitStrategy.waitFor(TimeoutBlockingWaitStrategy.java:38)
   [junit4]    >         at app//com.lmax.disruptor.ProcessingSequenceBarrier.waitFor(ProcessingSequenceBarrier.java:56)
   [junit4]    >         at app//com.lmax.disruptor.BatchEventProcessor.run(BatchEventProcessor.java:128)
   [junit4]    >         at java.base@9.0.4/java.lang.Thread.run(Thread.java:844)
   [junit4]    > 	at __randomizedtesting.SeedInfo.seed([61923FEDA2C704C5]:0)
   [junit4] Completed [1/5 (1!)] on J2 in 24.52s, 2 tests, 2 errors <<< FAILURES!

[...truncated 1 lines...]
   [junit4] Suite: org.apache.solr.util.TestSystemIdResolver
   [junit4]   2> 2297 INFO  (TEST-TestSystemIdResolver.testUnsafeResolving-seed#[61923FEDA2C704C5]) [    ] o.a.s.c.SolrResourceLoader solr home defaulted to 'solr/' (could not find system property or JNDI)
   [junit4]   2> 2305 INFO  (TEST-TestSystemIdResolver.testUnsafeResolving-seed#[61923FEDA2C704C5]) [    ] o.a.s.c.SolrResourceLoader [null] Added 2 libs to classloader, from paths: [/home/jenkins/workspace/Lucene-Solr-7.x-Linux/solr/core/src/test-files/solr/collection1/lib, /home/jenkins/workspace/Lucene-Solr-7.x-Linux/solr/core/src/test-files/solr/collection1/lib/classes]
   [junit4] OK      1.12s J0 | TestSystemIdResolver.testUnsafeResolving
   [junit4]   2> 2373 INFO  (TEST-TestSystemIdResolver.testResolving-seed#[61923FEDA2C704C5]) [    ] o.a.s.c.SolrResourceLoader [null] Added 2 libs to classloader, from paths: [/home/jenkins/workspace/Lucene-Solr-7.x-Linux/solr/core/src/test-files/solr/collection1/lib, /home/jenkins/workspace/Lucene-Solr-7.x-Linux/solr/core/src/test-files/solr/collection1/lib/classes]
   [junit4] OK      0.02s J0 | TestSystemIdResolver.testResolving
   [junit4]   2> Sep 01, 2018 8:34:09 AM com.carrotsearch.randomizedtesting.ThreadLeakControl checkThreadLeaks
   [junit4]   2> WARNING: Will linger awaiting termination of 1 leaked thread(s).
   [junit4]   2> Sep 01, 2018 8:34:29 AM com.carrotsearch.randomizedtesting.ThreadLeakControl checkThreadLeaks
   [junit4]   2> SEVERE: 1 thread leaked from SUITE scope at org.apache.solr.util.TestSystemIdResolver: 
   [junit4]   2>    1) Thread[id=16, name=Log4j2-TF-1-AsyncLoggerConfig--1, state=TIMED_WAITING, group=TGRP-TestSystemIdResolver]
   [junit4]   2>         at java.base@9.0.4/jdk.internal.misc.Unsafe.park(Native Method)
   [junit4]   2>         at java.base@9.0.4/java.util.concurrent.locks.LockSupport.parkNanos(LockSupport.java:234)
   [junit4]   2>         at java.base@9.0.4/java.util.concurrent.locks.AbstractQueuedSynchronizer$ConditionObject.awaitNanos(AbstractQueuedSynchronizer.java:2104)
   [junit4]   2>         at app//com.lmax.disruptor.TimeoutBlockingWaitStrategy.waitFor(TimeoutBlockingWaitStrategy.java:38)
   [junit4]   2>         at app//com.lmax.disruptor.ProcessingSequenceBarrier.waitFor(ProcessingSequenceBarrier.java:56)
   [junit4]   2>         at app//com.lmax.disruptor.BatchEventProcessor.run(BatchEventProcessor.java:128)
   [junit4]   2>         at java.base@9.0.4/java.lang.Thread.run(Thread.java:844)
   [junit4]   2> Sep 01, 2018 8:34:29 AM com.carrotsearch.randomizedtesting.ThreadLeakControl tryToInterruptAll
   [junit4]   2> INFO: Starting to interrupt leaked threads:
   [junit4]   2>    1) Thread[id=16, name=Log4j2-TF-1-AsyncLoggerConfig--1, state=TIMED_WAITING, group=TGRP-TestSystemIdResolver]
   [junit4]   2> AsyncLogger error handling event seq=3, value='null':
   [junit4]   2> java.lang.InterruptedException
   [junit4]   2> 	at java.base/java.util.concurrent.locks.AbstractQueuedSynchronizer$ConditionObject.reportInterruptAfterWait(AbstractQueuedSynchronizer.java:2037)
   [junit4]   2> 	at java.base/java.util.concurrent.locks.AbstractQueuedSynchronizer$ConditionObject.awaitNanos(AbstractQueuedSynchronizer.java:2114)
   [junit4]   2> 	at com.lmax.disruptor.TimeoutBlockingWaitStrategy.waitFor(TimeoutBlockingWaitStrategy.java:38)
   [junit4]   2> 	at com.lmax.disruptor.ProcessingSequenceBarrier.waitFor(ProcessingSequenceBarrier.java:56)
   [junit4]   2> 	at com.lmax.disruptor.BatchEventProcessor.run(BatchEventProcessor.java:128)
   [junit4]   2> 	at java.base/java.lang.Thread.run(Thread.java:844)
   [junit4]   2> AsyncLogger error handling event seq=4, value='null':
   [junit4]   2> java.lang.InterruptedException
   [junit4]   2> 	at java.base/java.util.concurrent.locks.AbstractQueuedSynchronizer$ConditionObject.reportInterruptAfterWait(AbstractQueuedSynchronizer.java:2037)
   [junit4]   2> 	at java.base/java.util.concurrent.locks.AbstractQueuedSynchronizer$ConditionObject.awaitNanos(AbstractQueuedSynchronizer.java:2114)
   [junit4]   2> 	at com.lmax.disruptor.TimeoutBlockingWaitStrategy.waitFor(TimeoutBlockingWaitStrategy.java:38)
   [junit4]   2> 	at com.lmax.disruptor.ProcessingSequenceBarrier.waitFor(ProcessingSequenceBarrier.java:56)
   [junit4]   2> 	at com.lmax.disruptor.BatchEventProcessor.run(BatchEventProcessor.java:128)
   [junit4]   2> 	at java.base/java.lang.Thread.run(Thread.java:844)
   [junit4]   2> AsyncLogger error handling event seq=5, value='null':
   [junit4]   2> java.lang.InterruptedException
   [junit4]   2> 	at java.base/java.util.concurrent.locks.AbstractQueuedSynchronizer$ConditionObject.reportInterruptAfterWait(AbstractQueuedSynchronizer.java:2037)
   [junit4]   2> 	at java.base/java.util.concurrent.locks.AbstractQueuedSynchronizer$ConditionObject.awaitNanos(AbstractQueuedSynchronizer.java:2114)
   [junit4]   2> 	at com.lmax.disruptor.TimeoutBlockingWaitStrategy.waitFor(TimeoutBlockingWaitStrategy.java:38)
   [junit4]   2> 	at com.lmax.disruptor.ProcessingSequenceBarrier.waitFor(ProcessingSequenceBarrier.java:56)
   [junit4]   2> 	at com.lmax.disruptor.BatchEventProcessor.run(BatchEventProcessor.java:128)
   [junit4]   2> 	at java.base/java.lang.Thread.run(Thread.java:844)
   [junit4]   2> AsyncLogger error handling event seq=6, value='null':
   [junit4]   2> java.lang.InterruptedException
   [junit4]   2> 	at java.base/java.util.concurrent.locks.AbstractQueuedSynchronizer$ConditionObject.reportInterruptAfterWait(AbstractQueuedSynchronizer.java:2037)
   [junit4]   2> 	at java.base/java.util.concurrent.locks.AbstractQueuedSynchronizer$ConditionObject.awaitNanos(AbstractQueuedSynchronizer.java:2114)
   [junit4]   2> 	at com.lmax.disruptor.TimeoutBlockingWaitStrategy.waitFor(TimeoutBlockingWaitStrategy.java:38)
   [junit4]   2> 	at com.lmax.disruptor.ProcessingSequenceBarrier.waitFor(ProcessingSequenceBarrier.java:56)
   [junit4]   2> 	at com.lmax.disruptor.BatchEventProcessor.run(BatchEventProcessor.java:128)
   [junit4]   2> 	at java.base/java.lang.Thread.run(Thread.java:844)
   [junit4]   2> AsyncLogger error handling event seq=7, value='null':
   [junit4]   2> java.lang.InterruptedException
   [junit4]   2> 	at java.base/java.util.concurrent.locks.AbstractQueuedSynchronizer$ConditionObject.reportInterruptAfterWait(AbstractQueuedSynchronizer.java:2037)
   [junit4]   2> 	at java.base/java.util.concurrent.locks.AbstractQueuedSynchronizer$ConditionObject.awaitNanos(AbstractQueuedSynchronizer.java:2114)
   [junit4]   2> 	at com.lmax.disruptor.TimeoutBlockingWaitStrategy.waitFor(TimeoutBlockingWaitStrategy.java:38)
   [junit4]   2> 	at com.lmax.disruptor.ProcessingSequenceBarrier.waitFor(ProcessingSequenceBarrier.java:56)
   [junit4]   2> 	at com.lmax.disruptor.BatchEventProcessor.run(BatchEventProcessor.java:128)
   [junit4]   2> 	at java.base/java.lang.Thread.run(Thread.java:844)
   [junit4]   2> AsyncLogger error handling event seq=8, value='null':
   [junit4]   2> java.lang.InterruptedException
   [junit4]   2> 	at java.base/java.util.concurrent.locks.AbstractQueuedSynchronizer$ConditionObject.reportInterruptAfterWait(AbstractQueuedSynchronizer.java:2037)
   [junit4]   2> 	at java.base/java.util.concurrent.locks.AbstractQueuedSynchronizer

[...truncated too long message...]

til.concurrent.locks.AbstractQueuedSynchronizer$ConditionObject.reportInterruptAfterWait(AbstractQueuedSynchronizer.java:2037)
   [junit4]   2> 	at java.base/java.util.concurrent.locks.AbstractQueuedSynchronizer$ConditionObject.awaitNanos(AbstractQueuedSynchronizer.java:2114)
   [junit4]   2> 	at com.lmax.disruptor.TimeoutBlockingWaitStrategy.waitFor(TimeoutBlockingWaitStrategy.java:38)
   [junit4]   2> 	at com.lmax.disruptor.ProcessingSequenceBarrier.waitFor(ProcessingSequenceBarrier.java:56)
   [junit4]   2> 	at com.lmax.disruptor.BatchEventProcessor.run(BatchEventProcessor.java:128)
   [junit4]   2> 	at java.base/java.lang.Thread.run(Thread.java:844)
   [junit4]   2> AsyncLogger error handling event seq=7, value='null':
   [junit4]   2> java.lang.InterruptedException
   [junit4]   2> 	at java.base/java.util.concurrent.locks.AbstractQueuedSynchronizer$ConditionObject.reportInterruptAfterWait(AbstractQueuedSynchronizer.java:2037)
   [junit4]   2> 	at java.base/java.util.concurrent.locks.AbstractQueuedSynchronizer$ConditionObject.awaitNanos(AbstractQueuedSynchronizer.java:2114)
   [junit4]   2> 	at com.lmax.disruptor.TimeoutBlockingWaitStrategy.waitFor(TimeoutBlockingWaitStrategy.java:38)
   [junit4]   2> 	at com.lmax.disruptor.ProcessingSequenceBarrier.waitFor(ProcessingSequenceBarrier.java:56)
   [junit4]   2> 	at com.lmax.disruptor.BatchEventProcessor.run(BatchEventProcessor.java:128)
   [junit4]   2> 	at java.base/java.lang.Thread.run(Thread.java:844)
   [junit4]   2> AsyncLogger error handling event seq=8, value='null':
   [junit4]   2> java.lang.InterruptedException
   [junit4]   2> 	at java.base/java.util.concurrent.locks.AbstractQueuedSynchronizer$ConditionObject.reportInterruptAfterWait(AbstractQueuedSynchronizer.java:2037)
   [junit4]   2> 	at java.base/java.util.concurrent.locks.AbstractQueuedSynchronizer$ConditionObject.awaitNanos(AbstractQueuedSynchronizer.java:2114)
   [junit4]   2> 	at com.lmax.disruptor.TimeoutBlockingWaitStrategy.waitFor(TimeoutBlockingWaitStrategy.java:38)
   [junit4]   2> 	at com.lmax.disruptor.ProcessingSequenceBarrier.waitFor(ProcessingSequenceBarrier.java:56)
   [junit4]   2> 	at com.lmax.disruptor.BatchEventProcessor.run(BatchEventProcessor.java:128)
   [junit4]   2> 	at java.base/java.lang.Thread.run(Thread.java:844)
   [junit4]   2> Sep 01, 2018 8:34:32 AM com.carrotsearch.randomizedtesting.ThreadLeakControl tryToInterruptAll
   [junit4]   2> SEVERE: There are still zombie threads that couldn't be terminated:
   [junit4]   2>    1) Thread[id=16, name=Log4j2-TF-1-AsyncLoggerConfig--1, state=TIMED_WAITING, group=TGRP-TestSystemIdResolver]
   [junit4]   2>         at java.base@9.0.4/jdk.internal.misc.Unsafe.park(Native Method)
   [junit4]   2>         at java.base@9.0.4/java.util.concurrent.locks.LockSupport.parkNanos(LockSupport.java:234)
   [junit4]   2>         at java.base@9.0.4/java.util.concurrent.locks.AbstractQueuedSynchronizer$ConditionObject.awaitNanos(AbstractQueuedSynchronizer.java:2104)
   [junit4]   2>         at app//com.lmax.disruptor.TimeoutBlockingWaitStrategy.waitFor(TimeoutBlockingWaitStrategy.java:38)
   [junit4]   2>         at app//com.lmax.disruptor.ProcessingSequenceBarrier.waitFor(ProcessingSequenceBarrier.java:56)
   [junit4]   2>         at app//com.lmax.disruptor.BatchEventProcessor.run(BatchEventProcessor.java:128)
   [junit4]   2>         at java.base@9.0.4/java.lang.Thread.run(Thread.java:844)
   [junit4]   2> NOTE: test params are: codec=Asserting(Lucene70), sim=RandomSimilarity(queryNorm=true): {}, locale=en-JM, timezone=PST8PDT
   [junit4]   2> NOTE: Linux 4.15.0-32-generic amd64/Oracle Corporation 9.0.4 (64-bit)/cpus=8,threads=2,free=422148704,total=518979584
   [junit4]   2> NOTE: All tests run in this JVM: [TestSystemIdResolver]
   [junit4]   2> NOTE: reproduce with: ant test  -Dtestcase=TestSystemIdResolver -Dtests.seed=61923FEDA2C704C5 -Dtests.multiplier=3 -Dtests.slow=true -Dtests.badapples=true -Dtests.locale=en-JM -Dtests.timezone=PST8PDT -Dtests.asserts=true -Dtests.file.encoding=UTF-8
   [junit4] ERROR   0.00s J1 | TestSystemIdResolver (suite) <<<
   [junit4]    > Throwable #1: com.carrotsearch.randomizedtesting.ThreadLeakError: 1 thread leaked from SUITE scope at org.apache.solr.util.TestSystemIdResolver: 
   [junit4]    >    1) Thread[id=16, name=Log4j2-TF-1-AsyncLoggerConfig--1, state=TIMED_WAITING, group=TGRP-TestSystemIdResolver]
   [junit4] Duplicate suite name used with XML reports: org.apache.solr.util.TestSystemIdResolver. This may confuse tools that process XML reports. Set 'ignoreDuplicateSuites' to true to skip this message.
   [junit4]    >         at java.base@9.0.4/jdk.internal.misc.Unsafe.park(Native Method)
   [junit4]    >         at java.base@9.0.4/java.util.concurrent.locks.LockSupport.parkNanos(LockSupport.java:234)
   [junit4]    >         at java.base@9.0.4/java.util.concurrent.locks.AbstractQueuedSynchronizer$ConditionObject.awaitNanos(AbstractQueuedSynchronizer.java:2104)
   [junit4]    >         at app//com.lmax.disruptor.TimeoutBlockingWaitStrategy.waitFor(TimeoutBlockingWaitStrategy.java:38)
   [junit4]    >         at app//com.lmax.disruptor.ProcessingSequenceBarrier.waitFor(ProcessingSequenceBarrier.java:56)
   [junit4]    >         at app//com.lmax.disruptor.BatchEventProcessor.run(BatchEventProcessor.java:128)
   [junit4]    >         at java.base@9.0.4/java.lang.Thread.run(Thread.java:844)
   [junit4]    > 	at __randomizedtesting.SeedInfo.seed([61923FEDA2C704C5]:0)Throwable #2: com.carrotsearch.randomizedtesting.ThreadLeakError: There are still zombie threads that couldn't be terminated:
   [junit4]    >    1) Thread[id=16, name=Log4j2-TF-1-AsyncLoggerConfig--1, state=TIMED_WAITING, group=TGRP-TestSystemIdResolver]
   [junit4]    >         at java.base@9.0.4/jdk.internal.misc.Unsafe.park(Native Method)
   [junit4]    >         at java.base@9.0.4/java.util.concurrent.locks.LockSupport.parkNanos(LockSupport.java:234)
   [junit4]    >         at java.base@9.0.4/java.util.concurrent.locks.AbstractQueuedSynchronizer$ConditionObject.awaitNanos(AbstractQueuedSynchronizer.java:2104)
   [junit4]    >         at app//com.lmax.disruptor.TimeoutBlockingWaitStrategy.waitFor(TimeoutBlockingWaitStrategy.java:38)
   [junit4]    >         at app//com.lmax.disruptor.ProcessingSequenceBarrier.waitFor(ProcessingSequenceBarrier.java:56)
   [junit4]    >         at app//com.lmax.disruptor.BatchEventProcessor.run(BatchEventProcessor.java:128)
   [junit4]    >         at java.base@9.0.4/java.lang.Thread.run(Thread.java:844)
   [junit4]    > 	at __randomizedtesting.SeedInfo.seed([61923FEDA2C704C5]:0)
   [junit4] Completed [3/5 (3!)] on J1 in 24.64s, 2 tests, 2 errors <<< FAILURES!

[...truncated 7 lines...]
   [junit4] JVM J1: stderr was not empty, see: /home/jenkins/workspace/Lucene-Solr-7.x-Linux/solr/build/solr-core/test/temp/junit4-J1-20180901_083406_79212398953095195230638.syserr
   [junit4] >>> JVM J1 emitted unexpected output (verbatim) ----
   [junit4] Java HotSpot(TM) 64-Bit Server VM warning: Option UseConcMarkSweepGC was deprecated in version 9.0 and will likely be removed in a future release.
   [junit4] <<< JVM J1: EOF ----

   [junit4] JVM J2: stderr was not empty, see: /home/jenkins/workspace/Lucene-Solr-7.x-Linux/solr/build/solr-core/test/temp/junit4-J2-20180901_083406_7929321853063760473850.syserr
   [junit4] >>> JVM J2 emitted unexpected output (verbatim) ----
   [junit4] Java HotSpot(TM) 64-Bit Server VM warning: Option UseConcMarkSweepGC was deprecated in version 9.0 and will likely be removed in a future release.
   [junit4] <<< JVM J2: EOF ----

   [junit4] JVM J0: stderr was not empty, see: /home/jenkins/workspace/Lucene-Solr-7.x-Linux/solr/build/solr-core/test/temp/junit4-J0-20180901_083406_79211416521120519632163.syserr
   [junit4] >>> JVM J0 emitted unexpected output (verbatim) ----
   [junit4] Java HotSpot(TM) 64-Bit Server VM warning: Option UseConcMarkSweepGC was deprecated in version 9.0 and will likely be removed in a future release.
   [junit4] <<< JVM J0: EOF ----

[...truncated 12 lines...]
BUILD FAILED
/home/jenkins/workspace/Lucene-Solr-7.x-Linux/lucene/common-build.xml:1568: The following error occurred while executing this line:
/home/jenkins/workspace/Lucene-Solr-7.x-Linux/lucene/common-build.xml:1092: There were test failures: 5 suites, 10 tests, 6 suite-level errors, 4 ignored [seed: 61923FEDA2C704C5]

Total time: 27 seconds

[repro] Setting last failure code to 256

[repro] Failures:
[repro]   3/5 failed: org.apache.solr.util.TestSystemIdResolver
[repro] Exiting with code 256
+ mv lucene/build lucene/build.repro
+ mv solr/build solr/build.repro
+ mv lucene/build.orig lucene/build
+ mv solr/build.orig solr/build
Archiving artifacts
Setting ANT_1_8_2_HOME=/var/lib/jenkins/tools/hudson.tasks.Ant_AntInstallation/ANT_1.8.2
[WARNINGS] Parsing warnings in console log with parser Java Compiler (javac)
Setting ANT_1_8_2_HOME=/var/lib/jenkins/tools/hudson.tasks.Ant_AntInstallation/ANT_1.8.2
Setting ANT_1_8_2_HOME=/var/lib/jenkins/tools/hudson.tasks.Ant_AntInstallation/ANT_1.8.2
<Git Blamer> Using GitBlamer to create author and commit information for all warnings.
<Git Blamer> GIT_COMMIT=63d4ecd216b8fe21c094a1e4c7da9065569e5077, workspace=/var/lib/jenkins/workspace/Lucene-Solr-7.x-Linux
[WARNINGS] Computing warning deltas based on reference build #2666
Recording test results
Setting ANT_1_8_2_HOME=/var/lib/jenkins/tools/hudson.tasks.Ant_AntInstallation/ANT_1.8.2
Build step 'Publish JUnit test result report' changed build result to UNSTABLE
Email was triggered for: Unstable (Test Failures)
Sending email for trigger: Unstable (Test Failures)
Setting ANT_1_8_2_HOME=/var/lib/jenkins/tools/hudson.tasks.Ant_AntInstallation/ANT_1.8.2
Setting ANT_1_8_2_HOME=/var/lib/jenkins/tools/hudson.tasks.Ant_AntInstallation/ANT_1.8.2
Setting ANT_1_8_2_HOME=/var/lib/jenkins/tools/hudson.tasks.Ant_AntInstallation/ANT_1.8.2
Setting ANT_1_8_2_HOME=/var/lib/jenkins/tools/hudson.tasks.Ant_AntInstallation/ANT_1.8.2

Mime
View raw message