lucene-dev mailing list archives

Site index · List index
Message view « Date » · « Thread »
Top « Date » · « Thread »
From Policeman Jenkins Server <jenk...@thetaphi.de>
Subject [JENKINS] Lucene-Solr-master-Linux (64bit/jdk-11) - Build # 22956 - Failure!
Date Mon, 01 Oct 2018 14:48:30 GMT
Build: https://jenkins.thetaphi.de/job/Lucene-Solr-master-Linux/22956/
Java: 64bit/jdk-11 -XX:-UseCompressedOops -XX:+UseConcMarkSweepGC

6 tests failed.
FAILED:  org.apache.solr.cloud.TestDeleteCollectionOnDownNodes.deleteCollectionWithDownNodes

Error Message:
Timed out waiting for leader elections null Live Nodes: [127.0.0.1:35785_solr, 127.0.0.1:44803_solr] Last available state: null

Stack Trace:
java.lang.AssertionError: Timed out waiting for leader elections
null
Live Nodes: [127.0.0.1:35785_solr, 127.0.0.1:44803_solr]
Last available state: null
	at __randomizedtesting.SeedInfo.seed([9E009FB53AA44C7A:35FB4D1C8700F2]:0)
	at org.junit.Assert.fail(Assert.java:93)
	at org.apache.solr.cloud.SolrCloudTestCase.waitForState(SolrCloudTestCase.java:280)
	at org.apache.solr.cloud.TestDeleteCollectionOnDownNodes.deleteCollectionWithDownNodes(TestDeleteCollectionOnDownNodes.java:47)
	at java.base/jdk.internal.reflect.NativeMethodAccessorImpl.invoke0(Native Method)
	at java.base/jdk.internal.reflect.NativeMethodAccessorImpl.invoke(NativeMethodAccessorImpl.java:62)
	at java.base/jdk.internal.reflect.DelegatingMethodAccessorImpl.invoke(DelegatingMethodAccessorImpl.java:43)
	at java.base/java.lang.reflect.Method.invoke(Method.java:566)
	at com.carrotsearch.randomizedtesting.RandomizedRunner.invoke(RandomizedRunner.java:1742)
	at com.carrotsearch.randomizedtesting.RandomizedRunner$8.evaluate(RandomizedRunner.java:935)
	at com.carrotsearch.randomizedtesting.RandomizedRunner$9.evaluate(RandomizedRunner.java:971)
	at com.carrotsearch.randomizedtesting.RandomizedRunner$10.evaluate(RandomizedRunner.java:985)
	at com.carrotsearch.randomizedtesting.rules.SystemPropertiesRestoreRule$1.evaluate(SystemPropertiesRestoreRule.java:57)
	at org.apache.lucene.util.TestRuleSetupTeardownChained$1.evaluate(TestRuleSetupTeardownChained.java:49)
	at org.apache.lucene.util.AbstractBeforeAfterRule$1.evaluate(AbstractBeforeAfterRule.java:45)
	at org.apache.lucene.util.TestRuleThreadAndTestName$1.evaluate(TestRuleThreadAndTestName.java:48)
	at org.apache.lucene.util.TestRuleIgnoreAfterMaxFailures$1.evaluate(TestRuleIgnoreAfterMaxFailures.java:64)
	at org.apache.lucene.util.TestRuleMarkFailure$1.evaluate(TestRuleMarkFailure.java:47)
	at com.carrotsearch.randomizedtesting.rules.StatementAdapter.evaluate(StatementAdapter.java:36)
	at com.carrotsearch.randomizedtesting.ThreadLeakControl$StatementRunner.run(ThreadLeakControl.java:368)
	at com.carrotsearch.randomizedtesting.ThreadLeakControl.forkTimeoutingTask(ThreadLeakControl.java:817)
	at com.carrotsearch.randomizedtesting.ThreadLeakControl$3.evaluate(ThreadLeakControl.java:468)
	at com.carrotsearch.randomizedtesting.RandomizedRunner.runSingleTest(RandomizedRunner.java:944)
	at com.carrotsearch.randomizedtesting.RandomizedRunner$5.evaluate(RandomizedRunner.java:830)
	at com.carrotsearch.randomizedtesting.RandomizedRunner$6.evaluate(RandomizedRunner.java:880)
	at com.carrotsearch.randomizedtesting.RandomizedRunner$7.evaluate(RandomizedRunner.java:891)
	at com.carrotsearch.randomizedtesting.rules.StatementAdapter.evaluate(StatementAdapter.java:36)
	at com.carrotsearch.randomizedtesting.rules.SystemPropertiesRestoreRule$1.evaluate(SystemPropertiesRestoreRule.java:57)
	at org.apache.lucene.util.AbstractBeforeAfterRule$1.evaluate(AbstractBeforeAfterRule.java:45)
	at com.carrotsearch.randomizedtesting.rules.StatementAdapter.evaluate(StatementAdapter.java:36)
	at org.apache.lucene.util.TestRuleStoreClassName$1.evaluate(TestRuleStoreClassName.java:41)
	at com.carrotsearch.randomizedtesting.rules.NoShadowingOrOverridesOnMethodsRule$1.evaluate(NoShadowingOrOverridesOnMethodsRule.java:40)
	at com.carrotsearch.randomizedtesting.rules.NoShadowingOrOverridesOnMethodsRule$1.evaluate(NoShadowingOrOverridesOnMethodsRule.java:40)
	at com.carrotsearch.randomizedtesting.rules.StatementAdapter.evaluate(StatementAdapter.java:36)
	at com.carrotsearch.randomizedtesting.rules.StatementAdapter.evaluate(StatementAdapter.java:36)
	at org.apache.lucene.util.TestRuleAssertionsRequired$1.evaluate(TestRuleAssertionsRequired.java:53)
	at org.apache.lucene.util.TestRuleMarkFailure$1.evaluate(TestRuleMarkFailure.java:47)
	at org.apache.lucene.util.TestRuleIgnoreAfterMaxFailures$1.evaluate(TestRuleIgnoreAfterMaxFailures.java:64)
	at org.apache.lucene.util.TestRuleIgnoreTestSuites$1.evaluate(TestRuleIgnoreTestSuites.java:54)
	at com.carrotsearch.randomizedtesting.rules.StatementAdapter.evaluate(StatementAdapter.java:36)
	at com.carrotsearch.randomizedtesting.ThreadLeakControl$StatementRunner.run(ThreadLeakControl.java:368)
	at java.base/java.lang.Thread.run(Thread.java:834)


FAILED:  org.apache.solr.cloud.api.collections.CollectionsAPIAsyncDistributedZkTest.testAsyncIdRaceCondition

Error Message:
expected:<9> but was:<8>

Stack Trace:
java.lang.AssertionError: expected:<9> but was:<8>
	at __randomizedtesting.SeedInfo.seed([9E009FB53AA44C7A:CB8DF25856CAB5D1]:0)
	at org.junit.Assert.fail(Assert.java:93)
	at org.junit.Assert.failNotEquals(Assert.java:647)
	at org.junit.Assert.assertEquals(Assert.java:128)
	at org.junit.Assert.assertEquals(Assert.java:472)
	at org.junit.Assert.assertEquals(Assert.java:456)
	at org.apache.solr.cloud.api.collections.CollectionsAPIAsyncDistributedZkTest.testAsyncIdRaceCondition(CollectionsAPIAsyncDistributedZkTest.java:244)
	at java.base/jdk.internal.reflect.NativeMethodAccessorImpl.invoke0(Native Method)
	at java.base/jdk.internal.reflect.NativeMethodAccessorImpl.invoke(NativeMethodAccessorImpl.java:62)
	at java.base/jdk.internal.reflect.DelegatingMethodAccessorImpl.invoke(DelegatingMethodAccessorImpl.java:43)
	at java.base/java.lang.reflect.Method.invoke(Method.java:566)
	at com.carrotsearch.randomizedtesting.RandomizedRunner.invoke(RandomizedRunner.java:1742)
	at com.carrotsearch.randomizedtesting.RandomizedRunner$8.evaluate(RandomizedRunner.java:935)
	at com.carrotsearch.randomizedtesting.RandomizedRunner$9.evaluate(RandomizedRunner.java:971)
	at com.carrotsearch.randomizedtesting.RandomizedRunner$10.evaluate(RandomizedRunner.java:985)
	at com.carrotsearch.randomizedtesting.rules.SystemPropertiesRestoreRule$1.evaluate(SystemPropertiesRestoreRule.java:57)
	at org.apache.lucene.util.TestRuleSetupTeardownChained$1.evaluate(TestRuleSetupTeardownChained.java:49)
	at org.apache.lucene.util.AbstractBeforeAfterRule$1.evaluate(AbstractBeforeAfterRule.java:45)
	at org.apache.lucene.util.TestRuleThreadAndTestName$1.evaluate(TestRuleThreadAndTestName.java:48)
	at org.apache.lucene.util.TestRuleIgnoreAfterMaxFailures$1.evaluate(TestRuleIgnoreAfterMaxFailures.java:64)
	at org.apache.lucene.util.TestRuleMarkFailure$1.evaluate(TestRuleMarkFailure.java:47)
	at com.carrotsearch.randomizedtesting.rules.StatementAdapter.evaluate(StatementAdapter.java:36)
	at com.carrotsearch.randomizedtesting.ThreadLeakControl$StatementRunner.run(ThreadLeakControl.java:368)
	at com.carrotsearch.randomizedtesting.ThreadLeakControl.forkTimeoutingTask(ThreadLeakControl.java:817)
	at com.carrotsearch.randomizedtesting.ThreadLeakControl$3.evaluate(ThreadLeakControl.java:468)
	at com.carrotsearch.randomizedtesting.RandomizedRunner.runSingleTest(RandomizedRunner.java:944)
	at com.carrotsearch.randomizedtesting.RandomizedRunner$5.evaluate(RandomizedRunner.java:830)
	at com.carrotsearch.randomizedtesting.RandomizedRunner$6.evaluate(RandomizedRunner.java:880)
	at com.carrotsearch.randomizedtesting.RandomizedRunner$7.evaluate(RandomizedRunner.java:891)
	at com.carrotsearch.randomizedtesting.rules.StatementAdapter.evaluate(StatementAdapter.java:36)
	at com.carrotsearch.randomizedtesting.rules.SystemPropertiesRestoreRule$1.evaluate(SystemPropertiesRestoreRule.java:57)
	at org.apache.lucene.util.AbstractBeforeAfterRule$1.evaluate(AbstractBeforeAfterRule.java:45)
	at com.carrotsearch.randomizedtesting.rules.StatementAdapter.evaluate(StatementAdapter.java:36)
	at org.apache.lucene.util.TestRuleStoreClassName$1.evaluate(TestRuleStoreClassName.java:41)
	at com.carrotsearch.randomizedtesting.rules.NoShadowingOrOverridesOnMethodsRule$1.evaluate(NoShadowingOrOverridesOnMethodsRule.java:40)
	at com.carrotsearch.randomizedtesting.rules.NoShadowingOrOverridesOnMethodsRule$1.evaluate(NoShadowingOrOverridesOnMethodsRule.java:40)
	at com.carrotsearch.randomizedtesting.rules.StatementAdapter.evaluate(StatementAdapter.java:36)
	at com.carrotsearch.randomizedtesting.rules.StatementAdapter.evaluate(StatementAdapter.java:36)
	at org.apache.lucene.util.TestRuleAssertionsRequired$1.evaluate(TestRuleAssertionsRequired.java:53)
	at org.apache.lucene.util.TestRuleMarkFailure$1.evaluate(TestRuleMarkFailure.java:47)
	at org.apache.lucene.util.TestRuleIgnoreAfterMaxFailures$1.evaluate(TestRuleIgnoreAfterMaxFailures.java:64)
	at org.apache.lucene.util.TestRuleIgnoreTestSuites$1.evaluate(TestRuleIgnoreTestSuites.java:54)
	at com.carrotsearch.randomizedtesting.rules.StatementAdapter.evaluate(StatementAdapter.java:36)
	at com.carrotsearch.randomizedtesting.ThreadLeakControl$StatementRunner.run(ThreadLeakControl.java:368)
	at java.base/java.lang.Thread.run(Thread.java:834)


FAILED:  org.apache.solr.cloud.autoscaling.IndexSizeTriggerTest.testMergeIntegration

Error Message:
failed to create testMergeIntegration_collection Live Nodes: null Last available state: null

Stack Trace:
java.lang.AssertionError: failed to create testMergeIntegration_collection
Live Nodes: null
Last available state: null
	at __randomizedtesting.SeedInfo.seed([9E009FB53AA44C7A:CDB9DD05D8B5D980]:0)
	at org.apache.solr.cloud.CloudTestUtils.waitForState(CloudTestUtils.java:70)
	at org.apache.solr.cloud.autoscaling.IndexSizeTriggerTest.testMergeIntegration(IndexSizeTriggerTest.java:361)
	at java.base/jdk.internal.reflect.NativeMethodAccessorImpl.invoke0(Native Method)
	at java.base/jdk.internal.reflect.NativeMethodAccessorImpl.invoke(NativeMethodAccessorImpl.java:62)
	at java.base/jdk.internal.reflect.DelegatingMethodAccessorImpl.invoke(DelegatingMethodAccessorImpl.java:43)
	at java.base/java.lang.reflect.Method.invoke(Method.java:566)
	at com.carrotsearch.randomizedtesting.RandomizedRunner.invoke(RandomizedRunner.java:1742)
	at com.carrotsearch.randomizedtesting.RandomizedRunner$8.evaluate(RandomizedRunner.java:935)
	at com.carrotsearch.randomizedtesting.RandomizedRunner$9.evaluate(RandomizedRunner.java:971)
	at com.carrotsearch.randomizedtesting.RandomizedRunner$10.evaluate(RandomizedRunner.java:985)
	at com.carrotsearch.randomizedtesting.rules.SystemPropertiesRestoreRule$1.evaluate(SystemPropertiesRestoreRule.java:57)
	at org.apache.lucene.util.TestRuleSetupTeardownChained$1.evaluate(TestRuleSetupTeardownChained.java:49)
	at org.apache.lucene.util.AbstractBeforeAfterRule$1.evaluate(AbstractBeforeAfterRule.java:45)
	at org.apache.lucene.util.TestRuleThreadAndTestName$1.evaluate(TestRuleThreadAndTestName.java:48)
	at org.apache.lucene.util.TestRuleIgnoreAfterMaxFailures$1.evaluate(TestRuleIgnoreAfterMaxFailures.java:64)
	at org.apache.lucene.util.TestRuleMarkFailure$1.evaluate(TestRuleMarkFailure.java:47)
	at com.carrotsearch.randomizedtesting.rules.StatementAdapter.evaluate(StatementAdapter.java:36)
	at com.carrotsearch.randomizedtesting.ThreadLeakControl$StatementRunner.run(ThreadLeakControl.java:368)
	at com.carrotsearch.randomizedtesting.ThreadLeakControl.forkTimeoutingTask(ThreadLeakControl.java:817)
	at com.carrotsearch.randomizedtesting.ThreadLeakControl$3.evaluate(ThreadLeakControl.java:468)
	at com.carrotsearch.randomizedtesting.RandomizedRunner.runSingleTest(RandomizedRunner.java:944)
	at com.carrotsearch.randomizedtesting.RandomizedRunner$5.evaluate(RandomizedRunner.java:830)
	at com.carrotsearch.randomizedtesting.RandomizedRunner$6.evaluate(RandomizedRunner.java:880)
	at com.carrotsearch.randomizedtesting.RandomizedRunner$7.evaluate(RandomizedRunner.java:891)
	at com.carrotsearch.randomizedtesting.rules.StatementAdapter.evaluate(StatementAdapter.java:36)
	at com.carrotsearch.randomizedtesting.rules.SystemPropertiesRestoreRule$1.evaluate(SystemPropertiesRestoreRule.java:57)
	at org.apache.lucene.util.AbstractBeforeAfterRule$1.evaluate(AbstractBeforeAfterRule.java:45)
	at com.carrotsearch.randomizedtesting.rules.StatementAdapter.evaluate(StatementAdapter.java:36)
	at org.apache.lucene.util.TestRuleStoreClassName$1.evaluate(TestRuleStoreClassName.java:41)
	at com.carrotsearch.randomizedtesting.rules.NoShadowingOrOverridesOnMethodsRule$1.evaluate(NoShadowingOrOverridesOnMethodsRule.java:40)
	at com.carrotsearch.randomizedtesting.rules.NoShadowingOrOverridesOnMethodsRule$1.evaluate(NoShadowingOrOverridesOnMethodsRule.java:40)
	at com.carrotsearch.randomizedtesting.rules.StatementAdapter.evaluate(StatementAdapter.java:36)
	at com.carrotsearch.randomizedtesting.rules.StatementAdapter.evaluate(StatementAdapter.java:36)
	at org.apache.lucene.util.TestRuleAssertionsRequired$1.evaluate(TestRuleAssertionsRequired.java:53)
	at org.apache.lucene.util.TestRuleMarkFailure$1.evaluate(TestRuleMarkFailure.java:47)
	at org.apache.lucene.util.TestRuleIgnoreAfterMaxFailures$1.evaluate(TestRuleIgnoreAfterMaxFailures.java:64)
	at org.apache.lucene.util.TestRuleIgnoreTestSuites$1.evaluate(TestRuleIgnoreTestSuites.java:54)
	at com.carrotsearch.randomizedtesting.rules.StatementAdapter.evaluate(StatementAdapter.java:36)
	at com.carrotsearch.randomizedtesting.ThreadLeakControl$StatementRunner.run(ThreadLeakControl.java:368)
	at java.base/java.lang.Thread.run(Thread.java:834)
Caused by: java.util.concurrent.TimeoutException: last ClusterState: znodeVersion: 0
live nodes:[127.0.0.1:33575_solr, 127.0.0.1:34549_solr]
collections:{}, last coll state: null
	at org.apache.solr.cloud.CloudTestUtils.waitForState(CloudTestUtils.java:112)
	at org.apache.solr.cloud.CloudTestUtils.waitForState(CloudTestUtils.java:64)
	... 39 more


FAILED:  org.apache.solr.cloud.autoscaling.IndexSizeTriggerTest.testTrigger

Error Message:
failed to create testTrigger_collection Live Nodes: null Last available state: null

Stack Trace:
java.lang.AssertionError: failed to create testTrigger_collection
Live Nodes: null
Last available state: null
	at __randomizedtesting.SeedInfo.seed([9E009FB53AA44C7A:FDCBA937A36B3F57]:0)
	at org.apache.solr.cloud.CloudTestUtils.waitForState(CloudTestUtils.java:70)
	at org.apache.solr.cloud.autoscaling.IndexSizeTriggerTest.testTrigger(IndexSizeTriggerTest.java:150)
	at java.base/jdk.internal.reflect.NativeMethodAccessorImpl.invoke0(Native Method)
	at java.base/jdk.internal.reflect.NativeMethodAccessorImpl.invoke(NativeMethodAccessorImpl.java:62)
	at java.base/jdk.internal.reflect.DelegatingMethodAccessorImpl.invoke(DelegatingMethodAccessorImpl.java:43)
	at java.base/java.lang.reflect.Method.invoke(Method.java:566)
	at com.carrotsearch.randomizedtesting.RandomizedRunner.invoke(RandomizedRunner.java:1742)
	at com.carrotsearch.randomizedtesting.RandomizedRunner$8.evaluate(RandomizedRunner.java:935)
	at com.carrotsearch.randomizedtesting.RandomizedRunner$9.evaluate(RandomizedRunner.java:971)
	at com.carrotsearch.randomizedtesting.RandomizedRunner$10.evaluate(RandomizedRunner.java:985)
	at com.carrotsearch.randomizedtesting.rules.SystemPropertiesRestoreRule$1.evaluate(SystemPropertiesRestoreRule.java:57)
	at org.apache.lucene.util.TestRuleSetupTeardownChained$1.evaluate(TestRuleSetupTeardownChained.java:49)
	at org.apache.lucene.util.AbstractBeforeAfterRule$1.evaluate(AbstractBeforeAfterRule.java:45)
	at org.apache.lucene.util.TestRuleThreadAndTestName$1.evaluate(TestRuleThreadAndTestName.java:48)
	at org.apache.lucene.util.TestRuleIgnoreAfterMaxFailures$1.evaluate(TestRuleIgnoreAfterMaxFailures.java:64)
	at org.apache.lucene.util.TestRuleMarkFailure$1.evaluate(TestRuleMarkFailure.java:47)
	at com.carrotsearch.randomizedtesting.rules.StatementAdapter.evaluate(StatementAdapter.java:36)
	at com.carrotsearch.randomizedtesting.ThreadLeakControl$StatementRunner.run(ThreadLeakControl.java:368)
	at com.carrotsearch.randomizedtesting.ThreadLeakControl.forkTimeoutingTask(ThreadLeakControl.java:817)
	at com.carrotsearch.randomizedtesting.ThreadLeakControl$3.evaluate(ThreadLeakControl.java:468)
	at com.carrotsearch.randomizedtesting.RandomizedRunner.runSingleTest(RandomizedRunner.java:944)
	at com.carrotsearch.randomizedtesting.RandomizedRunner$5.evaluate(RandomizedRunner.java:830)
	at com.carrotsearch.randomizedtesting.RandomizedRunner$6.evaluate(RandomizedRunner.java:880)
	at com.carrotsearch.randomizedtesting.RandomizedRunner$7.evaluate(RandomizedRunner.java:891)
	at com.carrotsearch.randomizedtesting.rules.StatementAdapter.evaluate(StatementAdapter.java:36)
	at com.carrotsearch.randomizedtesting.rules.SystemPropertiesRestoreRule$1.evaluate(SystemPropertiesRestoreRule.java:57)
	at org.apache.lucene.util.AbstractBeforeAfterRule$1.evaluate(AbstractBeforeAfterRule.java:45)
	at com.carrotsearch.randomizedtesting.rules.StatementAdapter.evaluate(StatementAdapter.java:36)
	at org.apache.lucene.util.TestRuleStoreClassName$1.evaluate(TestRuleStoreClassName.java:41)
	at com.carrotsearch.randomizedtesting.rules.NoShadowingOrOverridesOnMethodsRule$1.evaluate(NoShadowingOrOverridesOnMethodsRule.java:40)
	at com.carrotsearch.randomizedtesting.rules.NoShadowingOrOverridesOnMethodsRule$1.evaluate(NoShadowingOrOverridesOnMethodsRule.java:40)
	at com.carrotsearch.randomizedtesting.rules.StatementAdapter.evaluate(StatementAdapter.java:36)
	at com.carrotsearch.randomizedtesting.rules.StatementAdapter.evaluate(StatementAdapter.java:36)
	at org.apache.lucene.util.TestRuleAssertionsRequired$1.evaluate(TestRuleAssertionsRequired.java:53)
	at org.apache.lucene.util.TestRuleMarkFailure$1.evaluate(TestRuleMarkFailure.java:47)
	at org.apache.lucene.util.TestRuleIgnoreAfterMaxFailures$1.evaluate(TestRuleIgnoreAfterMaxFailures.java:64)
	at org.apache.lucene.util.TestRuleIgnoreTestSuites$1.evaluate(TestRuleIgnoreTestSuites.java:54)
	at com.carrotsearch.randomizedtesting.rules.StatementAdapter.evaluate(StatementAdapter.java:36)
	at com.carrotsearch.randomizedtesting.ThreadLeakControl$StatementRunner.run(ThreadLeakControl.java:368)
	at java.base/java.lang.Thread.run(Thread.java:834)
Caused by: java.util.concurrent.TimeoutException: last ClusterState: znodeVersion: 0
live nodes:[127.0.0.1:33575_solr, 127.0.0.1:34549_solr]
collections:{}, last coll state: null
	at org.apache.solr.cloud.CloudTestUtils.waitForState(CloudTestUtils.java:112)
	at org.apache.solr.cloud.CloudTestUtils.waitForState(CloudTestUtils.java:64)
	... 39 more


FAILED:  org.apache.solr.cloud.autoscaling.IndexSizeTriggerTest.testMixedBounds

Error Message:
failed to create testMixedBounds_collection Live Nodes: null Last available state: null

Stack Trace:
java.lang.AssertionError: failed to create testMixedBounds_collection
Live Nodes: null
Last available state: null
	at __randomizedtesting.SeedInfo.seed([9E009FB53AA44C7A:94832018771F4720]:0)
	at org.apache.solr.cloud.CloudTestUtils.waitForState(CloudTestUtils.java:70)
	at org.apache.solr.cloud.autoscaling.IndexSizeTriggerTest.testMixedBounds(IndexSizeTriggerTest.java:472)
	at java.base/jdk.internal.reflect.NativeMethodAccessorImpl.invoke0(Native Method)
	at java.base/jdk.internal.reflect.NativeMethodAccessorImpl.invoke(NativeMethodAccessorImpl.java:62)
	at java.base/jdk.internal.reflect.DelegatingMethodAccessorImpl.invoke(DelegatingMethodAccessorImpl.java:43)
	at java.base/java.lang.reflect.Method.invoke(Method.java:566)
	at com.carrotsearch.randomizedtesting.RandomizedRunner.invoke(RandomizedRunner.java:1742)
	at com.carrotsearch.randomizedtesting.RandomizedRunner$8.evaluate(RandomizedRunner.java:935)
	at com.carrotsearch.randomizedtesting.RandomizedRunner$9.evaluate(RandomizedRunner.java:971)
	at com.carrotsearch.randomizedtesting.RandomizedRunner$10.evaluate(RandomizedRunner.java:985)
	at com.carrotsearch.randomizedtesting.rules.SystemPropertiesRestoreRule$1.evaluate(SystemPropertiesRestoreRule.java:57)
	at org.apache.lucene.util.TestRuleSetupTeardownChained$1.evaluate(TestRuleSetupTeardownChained.java:49)
	at org.apache.lucene.util.AbstractBeforeAfterRule$1.evaluate(AbstractBeforeAfterRule.java:45)
	at org.apache.lucene.util.TestRuleThreadAndTestName$1.evaluate(TestRuleThreadAndTestName.java:48)
	at org.apache.lucene.util.TestRuleIgnoreAfterMaxFailures$1.evaluate(TestRuleIgnoreAfterMaxFailures.java:64)
	at org.apache.lucene.util.TestRuleMarkFailure$1.evaluate(TestRuleMarkFailure.java:47)
	at com.carrotsearch.randomizedtesting.rules.StatementAdapter.evaluate(StatementAdapter.java:36)
	at com.carrotsearch.randomizedtesting.ThreadLeakControl$StatementRunner.run(ThreadLeakControl.java:368)
	at com.carrotsearch.randomizedtesting.ThreadLeakControl.forkTimeoutingTask(ThreadLeakControl.java:817)
	at com.carrotsearch.randomizedtesting.ThreadLeakControl$3.evaluate(ThreadLeakControl.java:468)
	at com.carrotsearch.randomizedtesting.RandomizedRunner.runSingleTest(RandomizedRunner.java:944)
	at com.carrotsearch.randomizedtesting.RandomizedRunner$5.evaluate(RandomizedRunner.java:830)
	at com.carrotsearch.randomizedtesting.RandomizedRunner$6.evaluate(RandomizedRunner.java:880)
	at com.carrotsearch.randomizedtesting.RandomizedRunner$7.evaluate(RandomizedRunner.java:891)
	at com.carrotsearch.randomizedtesting.rules.StatementAdapter.evaluate(StatementAdapter.java:36)
	at com.carrotsearch.randomizedtesting.rules.SystemPropertiesRestoreRule$1.evaluate(SystemPropertiesRestoreRule.java:57)
	at org.apache.lucene.util.AbstractBeforeAfterRule$1.evaluate(AbstractBeforeAfterRule.java:45)
	at com.carrotsearch.randomizedtesting.rules.StatementAdapter.evaluate(StatementAdapter.java:36)
	at org.apache.lucene.util.TestRuleStoreClassName$1.evaluate(TestRuleStoreClassName.java:41)
	at com.carrotsearch.randomizedtesting.rules.NoShadowingOrOverridesOnMethodsRule$1.evaluate(NoShadowingOrOverridesOnMethodsRule.java:40)
	at com.carrotsearch.randomizedtesting.rules.NoShadowingOrOverridesOnMethodsRule$1.evaluate(NoShadowingOrOverridesOnMethodsRule.java:40)
	at com.carrotsearch.randomizedtesting.rules.StatementAdapter.evaluate(StatementAdapter.java:36)
	at com.carrotsearch.randomizedtesting.rules.StatementAdapter.evaluate(StatementAdapter.java:36)
	at org.apache.lucene.util.TestRuleAssertionsRequired$1.evaluate(TestRuleAssertionsRequired.java:53)
	at org.apache.lucene.util.TestRuleMarkFailure$1.evaluate(TestRuleMarkFailure.java:47)
	at org.apache.lucene.util.TestRuleIgnoreAfterMaxFailures$1.evaluate(TestRuleIgnoreAfterMaxFailures.java:64)
	at org.apache.lucene.util.TestRuleIgnoreTestSuites$1.evaluate(TestRuleIgnoreTestSuites.java:54)
	at com.carrotsearch.randomizedtesting.rules.StatementAdapter.evaluate(StatementAdapter.java:36)
	at com.carrotsearch.randomizedtesting.ThreadLeakControl$StatementRunner.run(ThreadLeakControl.java:368)
	at java.base/java.lang.Thread.run(Thread.java:834)
Caused by: java.util.concurrent.TimeoutException: last ClusterState: znodeVersion: 0
live nodes:[127.0.0.1:33575_solr, 127.0.0.1:34549_solr]
collections:{}, last coll state: null
	at org.apache.solr.cloud.CloudTestUtils.waitForState(CloudTestUtils.java:112)
	at org.apache.solr.cloud.CloudTestUtils.waitForState(CloudTestUtils.java:64)
	... 39 more


FAILED:  org.apache.solr.cloud.autoscaling.IndexSizeTriggerTest.testSplitIntegration

Error Message:
events: [CapturedEvent{timestamp=4000134962087597, stage=STARTED, actionName='null', event={   "id":"e3618d4628b81Tf3j4h1mxu21atalqk5ejd7f96",   "source":"index_size_trigger2",   "eventTime":4000129944292225,   "eventType":"INDEXSIZE",   "properties":{     "__start__":1,     "aboveSize":{"testSplitIntegration_collection_shard2_replica_n6":"docs=25, bytes=3063"},     "belowSize":{"testSplitIntegration_collection_shard1_replica_n1":"docs=0, bytes=69"},     "_enqueue_time_":4000134961216270,     "requestedOps":[{         "action":"SPLITSHARD",         "hints":{"COLL_SHARD":[{               "first":"testSplitIntegration_collection",               "second":"shard2"}]}}]}}, context={}, config={   "trigger":"index_size_trigger2",   "stage":[     "STARTED",     "ABORTED",     "SUCCEEDED",     "FAILED"],   "beforeAction":[     "compute_plan",     "execute_plan"],   "afterAction":[     "compute_plan",     "execute_plan"],   "class":"org.apache.solr.cloud.autoscaling.IndexSizeTriggerTest$CapturingTriggerListener"}, message='null'}, CapturedEvent{timestamp=4000134963027949, stage=BEFORE_ACTION, actionName='compute_plan', event={   "id":"e3618d4628b81Tf3j4h1mxu21atalqk5ejd7f96",   "source":"index_size_trigger2",   "eventTime":4000129944292225,   "eventType":"INDEXSIZE",   "properties":{     "__start__":1,     "aboveSize":{"testSplitIntegration_collection_shard2_replica_n6":"docs=25, bytes=3063"},     "belowSize":{"testSplitIntegration_collection_shard1_replica_n1":"docs=0, bytes=69"},     "_enqueue_time_":4000134961216270,     "requestedOps":[{         "action":"SPLITSHARD",         "hints":{"COLL_SHARD":[{               "first":"testSplitIntegration_collection",               "second":"shard2"}]}}]}}, context={properties.BEFORE_ACTION=[compute_plan], source=index_size_trigger2}, config={   "trigger":"index_size_trigger2",   "stage":[     "STARTED",     "ABORTED",     "SUCCEEDED",     "FAILED"],   "beforeAction":[     "compute_plan",     "execute_plan"],   "afterAction":[     "compute_plan",     "execute_plan"],   "class":"org.apache.solr.cloud.autoscaling.IndexSizeTriggerTest$CapturingTriggerListener"}, message='null'}, CapturedEvent{timestamp=4000134967973743, stage=AFTER_ACTION, actionName='compute_plan', event={   "id":"e3618d4628b81Tf3j4h1mxu21atalqk5ejd7f96",   "source":"index_size_trigger2",   "eventTime":4000129944292225,   "eventType":"INDEXSIZE",   "properties":{     "__start__":1,     "aboveSize":{"testSplitIntegration_collection_shard2_replica_n6":"docs=25, bytes=3063"},     "belowSize":{"testSplitIntegration_collection_shard1_replica_n1":"docs=0, bytes=69"},     "_enqueue_time_":4000134961216270,     "requestedOps":[{         "action":"SPLITSHARD",         "hints":{"COLL_SHARD":[{               "first":"testSplitIntegration_collection",               "second":"shard2"}]}}]}}, context={properties.operations=[{class=org.apache.solr.client.solrj.request.CollectionAdminRequest$SplitShard, method=GET, params.action=SPLITSHARD, params.collection=testSplitIntegration_collection, params.shard=shard2}], properties.BEFORE_ACTION=[compute_plan], source=index_size_trigger2, properties.AFTER_ACTION=[compute_plan]}, config={   "trigger":"index_size_trigger2",   "stage":[     "STARTED",     "ABORTED",     "SUCCEEDED",     "FAILED"],   "beforeAction":[     "compute_plan",     "execute_plan"],   "afterAction":[     "compute_plan",     "execute_plan"],   "class":"org.apache.solr.cloud.autoscaling.IndexSizeTriggerTest$CapturingTriggerListener"}, message='null'}, CapturedEvent{timestamp=4000134968182632, stage=BEFORE_ACTION, actionName='execute_plan', event={   "id":"e3618d4628b81Tf3j4h1mxu21atalqk5ejd7f96",   "source":"index_size_trigger2",   "eventTime":4000129944292225,   "eventType":"INDEXSIZE",   "properties":{     "__start__":1,     "aboveSize":{"testSplitIntegration_collection_shard2_replica_n6":"docs=25, bytes=3063"},     "belowSize":{"testSplitIntegration_collection_shard1_replica_n1":"docs=0, bytes=69"},     "_enqueue_time_":4000134961216270,     "requestedOps":[{         "action":"SPLITSHARD",         "hints":{"COLL_SHARD":[{               "first":"testSplitIntegration_collection",               "second":"shard2"}]}}]}}, context={properties.operations=[{class=org.apache.solr.client.solrj.request.CollectionAdminRequest$SplitShard, method=GET, params.action=SPLITSHARD, params.collection=testSplitIntegration_collection, params.shard=shard2}], properties.BEFORE_ACTION=[compute_plan, execute_plan], source=index_size_trigger2, properties.AFTER_ACTION=[compute_plan]}, config={   "trigger":"index_size_trigger2",   "stage":[     "STARTED",     "ABORTED",     "SUCCEEDED",     "FAILED"],   "beforeAction":[     "compute_plan",     "execute_plan"],   "afterAction":[     "compute_plan",     "execute_plan"],   "class":"org.apache.solr.cloud.autoscaling.IndexSizeTriggerTest$CapturingTriggerListener"}, message='null'}, CapturedEvent{timestamp=4000144978621844, stage=AFTER_ACTION, actionName='execute_plan', event={   "id":"e3618d4628b81Tf3j4h1mxu21atalqk5ejd7f96",   "source":"index_size_trigger2",   "eventTime":4000129944292225,   "eventType":"INDEXSIZE",   "properties":{     "__start__":1,     "aboveSize":{"testSplitIntegration_collection_shard2_replica_n6":"docs=25, bytes=3063"},     "belowSize":{"testSplitIntegration_collection_shard1_replica_n1":"docs=0, bytes=69"},     "_enqueue_time_":4000134961216270,     "requestedOps":[{         "action":"SPLITSHARD",         "hints":{"COLL_SHARD":[{               "first":"testSplitIntegration_collection",               "second":"shard2"}]}}]}}, context={properties.operations=[{class=org.apache.solr.client.solrj.request.CollectionAdminRequest$SplitShard, method=GET, params.action=SPLITSHARD, params.async=index_size_trigger2/e3618d4628b81Tf3j4h1mxu21atalqk5ejd7f96/0, params.waitForFinalState=true, params.collection=testSplitIntegration_collection, params.shard=shard2}], properties.BEFORE_ACTION=[compute_plan, execute_plan], properties.responses=[{responseHeader={status=0, QTime=1}, success={127.0.0.1:33575_solr={responseHeader={status=0, QTime=0}}, 127.0.0.1:34549_solr={responseHeader={status=0, QTime=0}}, https://127.0.0.1:33575/solr/testSplitIntegration_collection_shard2_replica_n6/={responseHeader={status=0, QTime=22}}}, index_size_trigger2/e3618d4628b81Tf3j4h1mxu21atalqk5ejd7f96/04000136177067872={responseHeader={status=0, QTime=0}, STATUS=completed, Response=TaskId: index_size_trigger2/e3618d4628b81Tf3j4h1mxu21atalqk5ejd7f96/04000136177067872 webapp=null path=/admin/cores params={async=index_size_trigger2/e3618d4628b81Tf3j4h1mxu21atalqk5ejd7f96/04000136177067872&qt=/admin/cores&coreNodeName=core_node11&collection.configName=conf&name=testSplitIntegration_collection_shard2_0_replica_n9&action=CREATE&collection=testSplitIntegration_collection&shard=shard2_0&wt=javabin&version=2&replicaType=NRT} status=0 QTime=0}, index_size_trigger2/e3618d4628b81Tf3j4h1mxu21atalqk5ejd7f96/04000138385213896={responseHeader={status=0, QTime=0}, STATUS=completed, Response=TaskId: index_size_trigger2/e3618d4628b81Tf3j4h1mxu21atalqk5ejd7f96/04000138385213896 webapp=null path=/admin/cores params={async=index_size_trigger2/e3618d4628b81Tf3j4h1mxu21atalqk5ejd7f96/04000138385213896&qt=/admin/cores&coreNodeName=core_node12&collection.configName=conf&name=testSplitIntegration_collection_shard2_1_replica_n10&action=CREATE&collection=testSplitIntegration_collection&shard=shard2_1&wt=javabin&version=2&replicaType=NRT} status=0 QTime=0}, index_size_trigger2/e3618d4628b81Tf3j4h1mxu21atalqk5ejd7f96/04000139387965486={responseHeader={status=0, QTime=0}, STATUS=completed, Response=TaskId: index_size_trigger2/e3618d4628b81Tf3j4h1mxu21atalqk5ejd7f96/04000139387965486 webapp=null path=/admin/cores params={nodeName=127.0.0.1:33575_solr&core=testSplitIntegration_collection_shard2_1_replica_n10&async=index_size_trigger2/e3618d4628b81Tf3j4h1mxu21atalqk5ejd7f96/04000139387965486&qt=/admin/cores&coreNodeName=core_node12&action=PREPRECOVERY&checkLive=true&state=active&onlyIfLeader=true&wt=javabin&version=2} status=0 QTime=0}, index_size_trigger2/e3618d4628b81Tf3j4h1mxu21atalqk5ejd7f96/04000139391285148={responseHeader={status=0, QTime=0}, STATUS=completed, Response=TaskId: index_size_trigger2/e3618d4628b81Tf3j4h1mxu21atalqk5ejd7f96/04000139391285148 webapp=null path=/admin/cores params={core=testSplitIntegration_collection_shard2_replica_n6&async=index_size_trigger2/e3618d4628b81Tf3j4h1mxu21atalqk5ejd7f96/04000139391285148&qt=/admin/cores&action=SPLIT&targetCore=testSplitIntegration_collection_shard2_0_replica_n9&targetCore=testSplitIntegration_collection_shard2_1_replica_n10&wt=javabin&version=2&splitMethod=rewrite} status=0 QTime=0}, index_size_trigger2/e3618d4628b81Tf3j4h1mxu21atalqk5ejd7f96/04000140394356432={responseHeader={status=0, QTime=0}, STATUS=completed, Response=TaskId: index_size_trigger2/e3618d4628b81Tf3j4h1mxu21atalqk5ejd7f96/04000140394356432 webapp=null path=/admin/cores params={async=index_size_trigger2/e3618d4628b81Tf3j4h1mxu21atalqk5ejd7f96/04000140394356432&qt=/admin/cores&name=testSplitIntegration_collection_shard2_1_replica_n10&action=REQUESTAPPLYUPDATES&wt=javabin&version=2} status=0 QTime=0}, index_size_trigger2/e3618d4628b81Tf3j4h1mxu21atalqk5ejd7f96/04000140600799532={responseHeader={status=0, QTime=0}, STATUS=completed, Response=TaskId: index_size_trigger2/e3618d4628b81Tf3j4h1mxu21atalqk5ejd7f96/04000140600799532 webapp=null path=/admin/cores params={async=index_size_trigger2/e3618d4628b81Tf3j4h1mxu21atalqk5ejd7f96/04000140600799532&qt=/admin/cores&coreNodeName=core_node13&collection.configName=conf&name=testSplitIntegration_collection_shard2_0_replica_n0&action=CREATE&collection=testSplitIntegration_collection&shard=shard2_0&wt=javabin&version=2&replicaType=NRT} status=0 QTime=0}, index_size_trigger2/e3618d4628b81Tf3j4h1mxu21atalqk5ejd7f96/04000142306115812={responseHeader={status=0, QTime=0}, STATUS=completed, Response=TaskId: index_size_trigger2/e3618d4628b81Tf3j4h1mxu21atalqk5ejd7f96/04000142306115812 webapp=null path=/admin/cores params={async=index_size_trigger2/e3618d4628b81Tf3j4h1mxu21atalqk5ejd7f96/04000142306115812&qt=/admin/cores&coreNodeName=core_node14&collection.configName=conf&name=testSplitIntegration_collection_shard2_1_replica_n0&action=CREATE&collection=testSplitIntegration_collection&shard=shard2_1&wt=javabin&version=2&replicaType=NRT} status=0 QTime=0}, status={state=completed, msg=found [index_size_trigger2/e3618d4628b81Tf3j4h1mxu21atalqk5ejd7f96/0] in completed tasks}}], source=index_size_trigger2, properties.AFTER_ACTION=[compute_plan, execute_plan]}, config={   "trigger":"index_size_trigger2",   "stage":[     "STARTED",     "ABORTED",     "SUCCEEDED",     "FAILED"],   "beforeAction":[     "compute_plan",     "execute_plan"],   "afterAction":[     "compute_plan",     "execute_plan"],   "class":"org.apache.solr.cloud.autoscaling.IndexSizeTriggerTest$CapturingTriggerListener"}, message='null'}, CapturedEvent{timestamp=4000144979978362, stage=SUCCEEDED, actionName='null', event={   "id":"e3618d4628b81Tf3j4h1mxu21atalqk5ejd7f96",   "source":"index_size_trigger2",   "eventTime":4000129944292225,   "eventType":"INDEXSIZE",   "properties":{     "__start__":1,     "aboveSize":{"testSplitIntegration_collection_shard2_replica_n6":"docs=25, bytes=3063"},     "belowSize":{"testSplitIntegration_collection_shard1_replica_n1":"docs=0, bytes=69"},     "_enqueue_time_":4000134961216270,     "requestedOps":[{         "action":"SPLITSHARD",         "hints":{"COLL_SHARD":[{               "first":"testSplitIntegration_collection",               "second":"shard2"}]}}]}}, context={}, config={   "trigger":"index_size_trigger2",   "stage":[     "STARTED",     "ABORTED",     "SUCCEEDED",     "FAILED"],   "beforeAction":[     "compute_plan",     "execute_plan"],   "afterAction":[     "compute_plan",     "execute_plan"],   "class":"org.apache.solr.cloud.autoscaling.IndexSizeTriggerTest$CapturingTriggerListener"}, message='null'}, CapturedEvent{timestamp=4000154998567832, stage=STARTED, actionName='null', event={   "id":"e361d7eec6351Tf3j4h1mxu21atalqk5ejd7f9g",   "source":"index_size_trigger2",   "eventTime":4000149985321809,   "eventType":"INDEXSIZE",   "properties":{     "__start__":2,     "aboveSize":{       "testSplitIntegration_collection_shard1_replica_n1":"docs=25, bytes=2931",       "testSplitIntegration_collection_shard2_1_replica_n10":"docs=11, bytes=2856"},     "belowSize":{"testSplitIntegration_collection_shard2_0_replica_n9":"docs=0, bytes=2963"},     "_enqueue_time_":4000154998273786,     "requestedOps":[       {         "action":"SPLITSHARD",         "hints":{"COLL_SHARD":[{               "first":"testSplitIntegration_collection",               "second":"shard1"}]}},       {         "action":"SPLITSHARD",         "hints":{"COLL_SHARD":[{               "first":"testSplitIntegration_collection",               "second":"shard2_1"}]}}]}}, context={}, config={   "trigger":"index_size_trigger2",   "stage":[     "STARTED",     "ABORTED",     "SUCCEEDED",     "FAILED"],   "beforeAction":[     "compute_plan",     "execute_plan"],   "afterAction":[     "compute_plan",     "execute_plan"],   "class":"org.apache.solr.cloud.autoscaling.IndexSizeTriggerTest$CapturingTriggerListener"}, message='null'}, CapturedEvent{timestamp=4000154999029152, stage=BEFORE_ACTION, actionName='compute_plan', event={   "id":"e361d7eec6351Tf3j4h1mxu21atalqk5ejd7f9g",   "source":"index_size_trigger2",   "eventTime":4000149985321809,   "eventType":"INDEXSIZE",   "properties":{     "__start__":2,     "aboveSize":{       "testSplitIntegration_collection_shard1_replica_n1":"docs=25, bytes=2931",       "testSplitIntegration_collection_shard2_1_replica_n10":"docs=11, bytes=2856"},     "belowSize":{"testSplitIntegration_collection_shard2_0_replica_n9":"docs=0, bytes=2963"},     "_enqueue_time_":4000154998273786,     "requestedOps":[       {         "action":"SPLITSHARD",         "hints":{"COLL_SHARD":[{               "first":"testSplitIntegration_collection",               "second":"shard1"}]}},       {         "action":"SPLITSHARD",         "hints":{"COLL_SHARD":[{               "first":"testSplitIntegration_collection",               "second":"shard2_1"}]}}]}}, context={properties.BEFORE_ACTION=[compute_plan], source=index_size_trigger2}, config={   "trigger":"index_size_trigger2",   "stage":[     "STARTED",     "ABORTED",     "SUCCEEDED",     "FAILED"],   "beforeAction":[     "compute_plan",     "execute_plan"],   "afterAction":[     "compute_plan",     "execute_plan"],   "class":"org.apache.solr.cloud.autoscaling.IndexSizeTriggerTest$CapturingTriggerListener"}, message='null'}, CapturedEvent{timestamp=4000155003655382, stage=AFTER_ACTION, actionName='compute_plan', event={   "id":"e361d7eec6351Tf3j4h1mxu21atalqk5ejd7f9g",   "source":"index_size_trigger2",   "eventTime":4000149985321809,   "eventType":"INDEXSIZE",   "properties":{     "__start__":2,     "aboveSize":{       "testSplitIntegration_collection_shard1_replica_n1":"docs=25, bytes=2931",       "testSplitIntegration_collection_shard2_1_replica_n10":"docs=11, bytes=2856"},     "belowSize":{"testSplitIntegration_collection_shard2_0_replica_n9":"docs=0, bytes=2963"},     "_enqueue_time_":4000154998273786,     "requestedOps":[       {         "action":"SPLITSHARD",         "hints":{"COLL_SHARD":[{               "first":"testSplitIntegration_collection",               "second":"shard1"}]}},       {         "action":"SPLITSHARD",         "hints":{"COLL_SHARD":[{               "first":"testSplitIntegration_collection",               "second":"shard2_1"}]}}]}}, context={properties.operations=[{class=org.apache.solr.client.solrj.request.CollectionAdminRequest$SplitShard, method=GET, params.action=SPLITSHARD, params.collection=testSplitIntegration_collection, params.shard=shard1}, {class=org.apache.solr.client.solrj.request.CollectionAdminRequest$SplitShard, method=GET, params.action=SPLITSHARD, params.collection=testSplitIntegration_collection, params.shard=shard2_1}], properties.BEFORE_ACTION=[compute_plan], source=index_size_trigger2, properties.AFTER_ACTION=[compute_plan]}, config={   "trigger":"index_size_trigger2",   "stage":[     "STARTED",     "ABORTED",     "SUCCEEDED",     "FAILED"],   "beforeAction":[     "compute_plan",     "execute_plan"],   "afterAction":[     "compute_plan",     "execute_plan"],   "class":"org.apache.solr.cloud.autoscaling.IndexSizeTriggerTest$CapturingTriggerListener"}, message='null'}, CapturedEvent{timestamp=4000155003843499, stage=BEFORE_ACTION, actionName='execute_plan', event={   "id":"e361d7eec6351Tf3j4h1mxu21atalqk5ejd7f9g",   "source":"index_size_trigger2",   "eventTime":4000149985321809,   "eventType":"INDEXSIZE",   "properties":{     "__start__":2,     "aboveSize":{       "testSplitIntegration_collection_shard1_replica_n1":"docs=25, bytes=2931",       "testSplitIntegration_collection_shard2_1_replica_n10":"docs=11, bytes=2856"},     "belowSize":{"testSplitIntegration_collection_shard2_0_replica_n9":"docs=0, bytes=2963"},     "_enqueue_time_":4000154998273786,     "requestedOps":[       {         "action":"SPLITSHARD",         "hints":{"COLL_SHARD":[{               "first":"testSplitIntegration_collection",               "second":"shard1"}]}},       {         "action":"SPLITSHARD",         "hints":{"COLL_SHARD":[{               "first":"testSplitIntegration_collection",               "second":"shard2_1"}]}}]}}, context={properties.operations=[{class=org.apache.solr.client.solrj.request.CollectionAdminRequest$SplitShard, method=GET, params.action=SPLITSHARD, params.collection=testSplitIntegration_collection, params.shard=shard1}, {class=org.apache.solr.client.solrj.request.CollectionAdminRequest$SplitShard, method=GET, params.action=SPLITSHARD, params.collection=testSplitIntegration_collection, params.shard=shard2_1}], properties.BEFORE_ACTION=[compute_plan, execute_plan], source=index_size_trigger2, properties.AFTER_ACTION=[compute_plan]}, config={   "trigger":"index_size_trigger2",   "stage":[     "STARTED",     "ABORTED",     "SUCCEEDED",     "FAILED"],   "beforeAction":[     "compute_plan",     "execute_plan"],   "afterAction":[     "compute_plan",     "execute_plan"],   "class":"org.apache.solr.cloud.autoscaling.IndexSizeTriggerTest$CapturingTriggerListener"}, message='null'}] expected:<6> but was:<10>

Stack Trace:
java.lang.AssertionError: events: [CapturedEvent{timestamp=4000134962087597, stage=STARTED, actionName='null', event={
  "id":"e3618d4628b81Tf3j4h1mxu21atalqk5ejd7f96",
  "source":"index_size_trigger2",
  "eventTime":4000129944292225,
  "eventType":"INDEXSIZE",
  "properties":{
    "__start__":1,
    "aboveSize":{"testSplitIntegration_collection_shard2_replica_n6":"docs=25, bytes=3063"},
    "belowSize":{"testSplitIntegration_collection_shard1_replica_n1":"docs=0, bytes=69"},
    "_enqueue_time_":4000134961216270,
    "requestedOps":[{
        "action":"SPLITSHARD",
        "hints":{"COLL_SHARD":[{
              "first":"testSplitIntegration_collection",
              "second":"shard2"}]}}]}}, context={}, config={
  "trigger":"index_size_trigger2",
  "stage":[
    "STARTED",
    "ABORTED",
    "SUCCEEDED",
    "FAILED"],
  "beforeAction":[
    "compute_plan",
    "execute_plan"],
  "afterAction":[
    "compute_plan",
    "execute_plan"],
  "class":"org.apache.solr.cloud.autoscaling.IndexSizeTriggerTest$CapturingTriggerListener"}, message='null'}, CapturedEvent{timestamp=4000134963027949, stage=BEFORE_ACTION, actionName='compute_plan', event={
  "id":"e3618d4628b81Tf3j4h1mxu21atalqk5ejd7f96",
  "source":"index_size_trigger2",
  "eventTime":4000129944292225,
  "eventType":"INDEXSIZE",
  "properties":{
    "__start__":1,
    "aboveSize":{"testSplitIntegration_collection_shard2_replica_n6":"docs=25, bytes=3063"},
    "belowSize":{"testSplitIntegration_collection_shard1_replica_n1":"docs=0, bytes=69"},
    "_enqueue_time_":4000134961216270,
    "requestedOps":[{
        "action":"SPLITSHARD",
        "hints":{"COLL_SHARD":[{
              "first":"testSplitIntegration_collection",
              "second":"shard2"}]}}]}}, context={properties.BEFORE_ACTION=[compute_plan], source=index_size_trigger2}, config={
  "trigger":"index_size_trigger2",
  "stage":[
    "STARTED",
    "ABORTED",
    "SUCCEEDED",
    "FAILED"],
  "beforeAction":[
    "compute_plan",
    "execute_plan"],
  "afterAction":[
    "compute_plan",
    "execute_plan"],
  "class":"org.apache.solr.cloud.autoscaling.IndexSizeTriggerTest$CapturingTriggerListener"}, message='null'}, CapturedEvent{timestamp=4000134967973743, stage=AFTER_ACTION, actionName='compute_plan', event={
  "id":"e3618d4628b81Tf3j4h1mxu21atalqk5ejd7f96",
  "source":"index_size_trigger2",
  "eventTime":4000129944292225,
  "eventType":"INDEXSIZE",
  "properties":{
    "__start__":1,
    "aboveSize":{"testSplitIntegration_collection_shard2_replica_n6":"docs=25, bytes=3063"},
    "belowSize":{"testSplitIntegration_collection_shard1_replica_n1":"docs=0, bytes=69"},
    "_enqueue_time_":4000134961216270,
    "requestedOps":[{
        "action":"SPLITSHARD",
        "hints":{"COLL_SHARD":[{
              "first":"testSplitIntegration_collection",
              "second":"shard2"}]}}]}}, context={properties.operations=[{class=org.apache.solr.client.solrj.request.CollectionAdminRequest$SplitShard, method=GET, params.action=SPLITSHARD, params.collection=testSplitIntegration_collection, params.shard=shard2}], properties.BEFORE_ACTION=[compute_plan], source=index_size_trigger2, properties.AFTER_ACTION=[compute_plan]}, config={
  "trigger":"index_size_trigger2",
  "stage":[
    "STARTED",
    "ABORTED",
    "SUCCEEDED",
    "FAILED"],
  "beforeAction":[
    "compute_plan",
    "execute_plan"],
  "afterAction":[
    "compute_plan",
    "execute_plan"],
  "class":"org.apache.solr.cloud.autoscaling.IndexSizeTriggerTest$CapturingTriggerListener"}, message='null'}, CapturedEvent{timestamp=4000134968182632, stage=BEFORE_ACTION, actionName='execute_plan', event={
  "id":"e3618d4628b81Tf3j4h1mxu21atalqk5ejd7f96",
  "source":"index_size_trigger2",
  "eventTime":4000129944292225,
  "eventType":"INDEXSIZE",
  "properties":{
    "__start__":1,
    "aboveSize":{"testSplitIntegration_collection_shard2_replica_n6":"docs=25, bytes=3063"},
    "belowSize":{"testSplitIntegration_collection_shard1_replica_n1":"docs=0, bytes=69"},
    "_enqueue_time_":4000134961216270,
    "requestedOps":[{
        "action":"SPLITSHARD",
        "hints":{"COLL_SHARD":[{
              "first":"testSplitIntegration_collection",
              "second":"shard2"}]}}]}}, context={properties.operations=[{class=org.apache.solr.client.solrj.request.CollectionAdminRequest$SplitShard, method=GET, params.action=SPLITSHARD, params.collection=testSplitIntegration_collection, params.shard=shard2}], properties.BEFORE_ACTION=[compute_plan, execute_plan], source=index_size_trigger2, properties.AFTER_ACTION=[compute_plan]}, config={
  "trigger":"index_size_trigger2",
  "stage":[
    "STARTED",
    "ABORTED",
    "SUCCEEDED",
    "FAILED"],
  "beforeAction":[
    "compute_plan",
    "execute_plan"],
  "afterAction":[
    "compute_plan",
    "execute_plan"],
  "class":"org.apache.solr.cloud.autoscaling.IndexSizeTriggerTest$CapturingTriggerListener"}, message='null'}, CapturedEvent{timestamp=4000144978621844, stage=AFTER_ACTION, actionName='execute_plan', event={
  "id":"e3618d4628b81Tf3j4h1mxu21atalqk5ejd7f96",
  "source":"index_size_trigger2",
  "eventTime":4000129944292225,
  "eventType":"INDEXSIZE",
  "properties":{
    "__start__":1,
    "aboveSize":{"testSplitIntegration_collection_shard2_replica_n6":"docs=25, bytes=3063"},
    "belowSize":{"testSplitIntegration_collection_shard1_replica_n1":"docs=0, bytes=69"},
    "_enqueue_time_":4000134961216270,
    "requestedOps":[{
        "action":"SPLITSHARD",
        "hints":{"COLL_SHARD":[{
              "first":"testSplitIntegration_collection",
              "second":"shard2"}]}}]}}, context={properties.operations=[{class=org.apache.solr.client.solrj.request.CollectionAdminRequest$SplitShard, method=GET, params.action=SPLITSHARD, params.async=index_size_trigger2/e3618d4628b81Tf3j4h1mxu21atalqk5ejd7f96/0, params.waitForFinalState=true, params.collection=testSplitIntegration_collection, params.shard=shard2}], properties.BEFORE_ACTION=[compute_plan, execute_plan], properties.responses=[{responseHeader={status=0, QTime=1}, success={127.0.0.1:33575_solr={responseHeader={status=0, QTime=0}}, 127.0.0.1:34549_solr={responseHeader={status=0, QTime=0}}, https://127.0.0.1:33575/solr/testSplitIntegration_collection_shard2_replica_n6/={responseHeader={status=0, QTime=22}}}, index_size_trigger2/e3618d4628b81Tf3j4h1mxu21atalqk5ejd7f96/04000136177067872={responseHeader={status=0, QTime=0}, STATUS=completed, Response=TaskId: index_size_trigger2/e3618d4628b81Tf3j4h1mxu21atalqk5ejd7f96/04000136177067872 webapp=null path=/admin/cores params={async=index_size_trigger2/e3618d4628b81Tf3j4h1mxu21atalqk5ejd7f96/04000136177067872&qt=/admin/cores&coreNodeName=core_node11&collection.configName=conf&name=testSplitIntegration_collection_shard2_0_replica_n9&action=CREATE&collection=testSplitIntegration_collection&shard=shard2_0&wt=javabin&version=2&replicaType=NRT} status=0 QTime=0}, index_size_trigger2/e3618d4628b81Tf3j4h1mxu21atalqk5ejd7f96/04000138385213896={responseHeader={status=0, QTime=0}, STATUS=completed, Response=TaskId: index_size_trigger2/e3618d4628b81Tf3j4h1mxu21atalqk5ejd7f96/04000138385213896 webapp=null path=/admin/cores params={async=index_size_trigger2/e3618d4628b81Tf3j4h1mxu21atalqk5ejd7f96/04000138385213896&qt=/admin/cores&coreNodeName=core_node12&collection.configName=conf&name=testSplitIntegration_collection_shard2_1_replica_n10&action=CREATE&collection=testSplitIntegration_collection&shard=shard2_1&wt=javabin&version=2&replicaType=NRT} status=0 QTime=0}, index_size_trigger2/e3618d4628b81Tf3j4h1mxu21atalqk5ejd7f96/04000139387965486={responseHeader={status=0, QTime=0}, STATUS=completed, Response=TaskId: index_size_trigger2/e3618d4628b81Tf3j4h1mxu21atalqk5ejd7f96/04000139387965486 webapp=null path=/admin/cores params={nodeName=127.0.0.1:33575_solr&core=testSplitIntegration_collection_shard2_1_replica_n10&async=index_size_trigger2/e3618d4628b81Tf3j4h1mxu21atalqk5ejd7f96/04000139387965486&qt=/admin/cores&coreNodeName=core_node12&action=PREPRECOVERY&checkLive=true&state=active&onlyIfLeader=true&wt=javabin&version=2} status=0 QTime=0}, index_size_trigger2/e3618d4628b81Tf3j4h1mxu21atalqk5ejd7f96/04000139391285148={responseHeader={status=0, QTime=0}, STATUS=completed, Response=TaskId: index_size_trigger2/e3618d4628b81Tf3j4h1mxu21atalqk5ejd7f96/04000139391285148 webapp=null path=/admin/cores params={core=testSplitIntegration_collection_shard2_replica_n6&async=index_size_trigger2/e3618d4628b81Tf3j4h1mxu21atalqk5ejd7f96/04000139391285148&qt=/admin/cores&action=SPLIT&targetCore=testSplitIntegration_collection_shard2_0_replica_n9&targetCore=testSplitIntegration_collection_shard2_1_replica_n10&wt=javabin&version=2&splitMethod=rewrite} status=0 QTime=0}, index_size_trigger2/e3618d4628b81Tf3j4h1mxu21atalqk5ejd7f96/04000140394356432={responseHeader={status=0, QTime=0}, STATUS=completed, Response=TaskId: index_size_trigger2/e3618d4628b81Tf3j4h1mxu21atalqk5ejd7f96/04000140394356432 webapp=null path=/admin/cores params={async=index_size_trigger2/e3618d4628b81Tf3j4h1mxu21atalqk5ejd7f96/04000140394356432&qt=/admin/cores&name=testSplitIntegration_collection_shard2_1_replica_n10&action=REQUESTAPPLYUPDATES&wt=javabin&version=2} status=0 QTime=0}, index_size_trigger2/e3618d4628b81Tf3j4h1mxu21atalqk5ejd7f96/04000140600799532={responseHeader={status=0, QTime=0}, STATUS=completed, Response=TaskId: index_size_trigger2/e3618d4628b81Tf3j4h1mxu21atalqk5ejd7f96/04000140600799532 webapp=null path=/admin/cores params={async=index_size_trigger2/e3618d4628b81Tf3j4h1mxu21atalqk5ejd7f96/04000140600799532&qt=/admin/cores&coreNodeName=core_node13&collection.configName=conf&name=testSplitIntegration_collection_shard2_0_replica_n0&action=CREATE&collection=testSplitIntegration_collection&shard=shard2_0&wt=javabin&version=2&replicaType=NRT} status=0 QTime=0}, index_size_trigger2/e3618d4628b81Tf3j4h1mxu21atalqk5ejd7f96/04000142306115812={responseHeader={status=0, QTime=0}, STATUS=completed, Response=TaskId: index_size_trigger2/e3618d4628b81Tf3j4h1mxu21atalqk5ejd7f96/04000142306115812 webapp=null path=/admin/cores params={async=index_size_trigger2/e3618d4628b81Tf3j4h1mxu21atalqk5ejd7f96/04000142306115812&qt=/admin/cores&coreNodeName=core_node14&collection.configName=conf&name=testSplitIntegration_collection_shard2_1_replica_n0&action=CREATE&collection=testSplitIntegration_collection&shard=shard2_1&wt=javabin&version=2&replicaType=NRT} status=0 QTime=0}, status={state=completed, msg=found [index_size_trigger2/e3618d4628b81Tf3j4h1mxu21atalqk5ejd7f96/0] in completed tasks}}], source=index_size_trigger2, properties.AFTER_ACTION=[compute_plan, execute_plan]}, config={
  "trigger":"index_size_trigger2",
  "stage":[
    "STARTED",
    "ABORTED",
    "SUCCEEDED",
    "FAILED"],
  "beforeAction":[
    "compute_plan",
    "execute_plan"],
  "afterAction":[
    "compute_plan",
    "execute_plan"],
  "class":"org.apache.solr.cloud.autoscaling.IndexSizeTriggerTest$CapturingTriggerListener"}, message='null'}, CapturedEvent{timestamp=4000144979978362, stage=SUCCEEDED, actionName='null', event={
  "id":"e3618d4628b81Tf3j4h1mxu21atalqk5ejd7f96",
  "source":"index_size_trigger2",
  "eventTime":4000129944292225,
  "eventType":"INDEXSIZE",
  "properties":{
    "__start__":1,
    "aboveSize":{"testSplitIntegration_collection_shard2_replica_n6":"docs=25, bytes=3063"},
    "belowSize":{"testSplitIntegration_collection_shard1_replica_n1":"docs=0, bytes=69"},
    "_enqueue_time_":4000134961216270,
    "requestedOps":[{
        "action":"SPLITSHARD",
        "hints":{"COLL_SHARD":[{
              "first":"testSplitIntegration_collection",
              "second":"shard2"}]}}]}}, context={}, config={
  "trigger":"index_size_trigger2",
  "stage":[
    "STARTED",
    "ABORTED",
    "SUCCEEDED",
    "FAILED"],
  "beforeAction":[
    "compute_plan",
    "execute_plan"],
  "afterAction":[
    "compute_plan",
    "execute_plan"],
  "class":"org.apache.solr.cloud.autoscaling.IndexSizeTriggerTest$CapturingTriggerListener"}, message='null'}, CapturedEvent{timestamp=4000154998567832, stage=STARTED, actionName='null', event={
  "id":"e361d7eec6351Tf3j4h1mxu21atalqk5ejd7f9g",
  "source":"index_size_trigger2",
  "eventTime":4000149985321809,
  "eventType":"INDEXSIZE",
  "properties":{
    "__start__":2,
    "aboveSize":{
      "testSplitIntegration_collection_shard1_replica_n1":"docs=25, bytes=2931",
      "testSplitIntegration_collection_shard2_1_replica_n10":"docs=11, bytes=2856"},
    "belowSize":{"testSplitIntegration_collection_shard2_0_replica_n9":"docs=0, bytes=2963"},
    "_enqueue_time_":4000154998273786,
    "requestedOps":[
      {
        "action":"SPLITSHARD",
        "hints":{"COLL_SHARD":[{
              "first":"testSplitIntegration_collection",
              "second":"shard1"}]}},
      {
        "action":"SPLITSHARD",
        "hints":{"COLL_SHARD":[{
              "first":"testSplitIntegration_collection",
              "second":"shard2_1"}]}}]}}, context={}, config={
  "trigger":"index_size_trigger2",
  "stage":[
    "STARTED",
    "ABORTED",
    "SUCCEEDED",
    "FAILED"],
  "beforeAction":[
    "compute_plan",
    "execute_plan"],
  "afterAction":[
    "compute_plan",
    "execute_plan"],
  "class":"org.apache.solr.cloud.autoscaling.IndexSizeTriggerTest$CapturingTriggerListener"}, message='null'}, CapturedEvent{timestamp=4000154999029152, stage=BEFORE_ACTION, actionName='compute_plan', event={
  "id":"e361d7eec6351Tf3j4h1mxu21atalqk5ejd7f9g",
  "source":"index_size_trigger2",
  "eventTime":4000149985321809,
  "eventType":"INDEXSIZE",
  "properties":{
    "__start__":2,
    "aboveSize":{
      "testSplitIntegration_collection_shard1_replica_n1":"docs=25, bytes=2931",
      "testSplitIntegration_collection_shard2_1_replica_n10":"docs=11, bytes=2856"},
    "belowSize":{"testSplitIntegration_collection_shard2_0_replica_n9":"docs=0, bytes=2963"},
    "_enqueue_time_":4000154998273786,
    "requestedOps":[
      {
        "action":"SPLITSHARD",
        "hints":{"COLL_SHARD":[{
              "first":"testSplitIntegration_collection",
              "second":"shard1"}]}},
      {
        "action":"SPLITSHARD",
        "hints":{"COLL_SHARD":[{
              "first":"testSplitIntegration_collection",
              "second":"shard2_1"}]}}]}}, context={properties.BEFORE_ACTION=[compute_plan], source=index_size_trigger2}, config={
  "trigger":"index_size_trigger2",
  "stage":[
    "STARTED",
    "ABORTED",
    "SUCCEEDED",
    "FAILED"],
  "beforeAction":[
    "compute_plan",
    "execute_plan"],
  "afterAction":[
    "compute_plan",
    "execute_plan"],
  "class":"org.apache.solr.cloud.autoscaling.IndexSizeTriggerTest$CapturingTriggerListener"}, message='null'}, CapturedEvent{timestamp=4000155003655382, stage=AFTER_ACTION, actionName='compute_plan', event={
  "id":"e361d7eec6351Tf3j4h1mxu21atalqk5ejd7f9g",
  "source":"index_size_trigger2",
  "eventTime":4000149985321809,
  "eventType":"INDEXSIZE",
  "properties":{
    "__start__":2,
    "aboveSize":{
      "testSplitIntegration_collection_shard1_replica_n1":"docs=25, bytes=2931",
      "testSplitIntegration_collection_shard2_1_replica_n10":"docs=11, bytes=2856"},
    "belowSize":{"testSplitIntegration_collection_shard2_0_replica_n9":"docs=0, bytes=2963"},
    "_enqueue_time_":4000154998273786,
    "requestedOps":[
      {
        "action":"SPLITSHARD",
        "hints":{"COLL_SHARD":[{
              "first":"testSplitIntegration_collection",
              "second":"shard1"}]}},
      {
        "action":"SPLITSHARD",
        "hints":{"COLL_SHARD":[{
              "first":"testSplitIntegration_collection",
              "second":"shard2_1"}]}}]}}, context={properties.operations=[{class=org.apache.solr.client.solrj.request.CollectionAdminRequest$SplitShard, method=GET, params.action=SPLITSHARD, params.collection=testSplitIntegration_collection, params.shard=shard1}, {class=org.apache.solr.client.solrj.request.CollectionAdminRequest$SplitShard, method=GET, params.action=SPLITSHARD, params.collection=testSplitIntegration_collection, params.shard=shard2_1}], properties.BEFORE_ACTION=[compute_plan], source=index_size_trigger2, properties.AFTER_ACTION=[compute_plan]}, config={
  "trigger":"index_size_trigger2",
  "stage":[
    "STARTED",
    "ABORTED",
    "SUCCEEDED",
    "FAILED"],
  "beforeAction":[
    "compute_plan",
    "execute_plan"],
  "afterAction":[
    "compute_plan",
    "execute_plan"],
  "class":"org.apache.solr.cloud.autoscaling.IndexSizeTriggerTest$CapturingTriggerListener"}, message='null'}, CapturedEvent{timestamp=4000155003843499, stage=BEFORE_ACTION, actionName='execute_plan', event={
  "id":"e361d7eec6351Tf3j4h1mxu21atalqk5ejd7f9g",
  "source":"index_size_trigger2",
  "eventTime":4000149985321809,
  "eventType":"INDEXSIZE",
  "properties":{
    "__start__":2,
    "aboveSize":{
      "testSplitIntegration_collection_shard1_replica_n1":"docs=25, bytes=2931",
      "testSplitIntegration_collection_shard2_1_replica_n10":"docs=11, bytes=2856"},
    "belowSize":{"testSplitIntegration_collection_shard2_0_replica_n9":"docs=0, bytes=2963"},
    "_enqueue_time_":4000154998273786,
    "requestedOps":[
      {
        "action":"SPLITSHARD",
        "hints":{"COLL_SHARD":[{
              "first":"testSplitIntegration_collection",
              "second":"shard1"}]}},
      {
        "action":"SPLITSHARD",
        "hints":{"COLL_SHARD":[{
              "first":"testSplitIntegration_collection",
              "second":"shard2_1"}]}}]}}, context={properties.operations=[{class=org.apache.solr.client.solrj.request.CollectionAdminRequest$SplitShard, method=GET, params.action=SPLITSHARD, params.collection=testSplitIntegration_collection, params.shard=shard1}, {class=org.apache.solr.client.solrj.request.CollectionAdminRequest$SplitShard, method=GET, params.action=SPLITSHARD, params.collection=testSplitIntegration_collection, params.shard=shard2_1}], properties.BEFORE_ACTION=[compute_plan, execute_plan], source=index_size_trigger2, properties.AFTER_ACTION=[compute_plan]}, config={
  "trigger":"index_size_trigger2",
  "stage":[
    "STARTED",
    "ABORTED",
    "SUCCEEDED",
    "FAILED"],
  "beforeAction":[
    "compute_plan",
    "execute_plan"],
  "afterAction":[
    "compute_plan",
    "execute_plan"],
  "class":"org.apache.solr.cloud.autoscaling.IndexSizeTriggerTest$CapturingTriggerListener"}, message='null'}] expected:<6> but was:<10>
	at __randomizedtesting.SeedInfo.seed([9E009FB53AA44C7A:A78E26F5155B8584]:0)
	at org.junit.Assert.fail(Assert.java:93)
	at org.junit.Assert.failNotEquals(Assert.java:647)
	at org.junit.Assert.assertEquals(Assert.java:128)
	at org.junit.Assert.assertEquals(Assert.java:472)
	at org.apache.solr.cloud.autoscaling.IndexSizeTriggerTest.testSplitIntegration(IndexSizeTriggerTest.java:321)
	at java.base/jdk.internal.reflect.NativeMethodAccessorImpl.invoke0(Native Method)
	at java.base/jdk.internal.reflect.NativeMethodAccessorImpl.invoke(NativeMethodAccessorImpl.java:62)
	at java.base/jdk.internal.reflect.DelegatingMethodAccessorImpl.invoke(DelegatingMethodAccessorImpl.java:43)
	at java.base/java.lang.reflect.Method.invoke(Method.java:566)
	at com.carrotsearch.randomizedtesting.RandomizedRunner.invoke(RandomizedRunner.java:1742)
	at com.carrotsearch.randomizedtesting.RandomizedRunner$8.evaluate(RandomizedRunner.java:935)
	at com.carrotsearch.randomizedtesting.RandomizedRunner$9.evaluate(RandomizedRunner.java:971)
	at com.carrotsearch.randomizedtesting.RandomizedRunner$10.evaluate(RandomizedRunner.java:985)
	at com.carrotsearch.randomizedtesting.rules.SystemPropertiesRestoreRule$1.evaluate(SystemPropertiesRestoreRule.java:57)
	at org.apache.lucene.util.TestRuleSetupTeardownChained$1.evaluate(TestRuleSetupTeardownChained.java:49)
	at org.apache.lucene.util.AbstractBeforeAfterRule$1.evaluate(AbstractBeforeAfterRule.java:45)
	at org.apache.lucene.util.TestRuleThreadAndTestName$1.evaluate(TestRuleThreadAndTestName.java:48)
	at org.apache.lucene.util.TestRuleIgnoreAfterMaxFailures$1.evaluate(TestRuleIgnoreAfterMaxFailures.java:64)
	at org.apache.lucene.util.TestRuleMarkFailure$1.evaluate(TestRuleMarkFailure.java:47)
	at com.carrotsearch.randomizedtesting.rules.StatementAdapter.evaluate(StatementAdapter.java:36)
	at com.carrotsearch.randomizedtesting.ThreadLeakControl$StatementRunner.run(ThreadLeakControl.java:368)
	at com.carrotsearch.randomizedtesting.ThreadLeakControl.forkTimeoutingTask(ThreadLeakControl.java:817)
	at com.carrotsearch.randomizedtesting.ThreadLeakControl$3.evaluate(ThreadLeakControl.java:468)
	at com.carrotsearch.randomizedtesting.RandomizedRunner.runSingleTest(RandomizedRunner.java:944)
	at com.carrotsearch.randomizedtesting.RandomizedRunner$5.evaluate(RandomizedRunner.java:830)
	at com.carrotsearch.randomizedtesting.RandomizedRunner$6.evaluate(RandomizedRunner.java:880)
	at com.carrotsearch.randomizedtesting.RandomizedRunner$7.evaluate(RandomizedRunner.java:891)
	at com.carrotsearch.randomizedtesting.rules.StatementAdapter.evaluate(StatementAdapter.java:36)
	at com.carrotsearch.randomizedtesting.rules.SystemPropertiesRestoreRule$1.evaluate(SystemPropertiesRestoreRule.java:57)
	at org.apache.lucene.util.AbstractBeforeAfterRule$1.evaluate(AbstractBeforeAfterRule.java:45)
	at com.carrotsearch.randomizedtesting.rules.StatementAdapter.evaluate(StatementAdapter.java:36)
	at org.apache.lucene.util.TestRuleStoreClassName$1.evaluate(TestRuleStoreClassName.java:41)
	at com.carrotsearch.randomizedtesting.rules.NoShadowingOrOverridesOnMethodsRule$1.evaluate(NoShadowingOrOverridesOnMethodsRule.java:40)
	at com.carrotsearch.randomizedtesting.rules.NoShadowingOrOverridesOnMethodsRule$1.evaluate(NoShadowingOrOverridesOnMethodsRule.java:40)
	at com.carrotsearch.randomizedtesting.rules.StatementAdapter.evaluate(StatementAdapter.java:36)
	at com.carrotsearch.randomizedtesting.rules.StatementAdapter.evaluate(StatementAdapter.java:36)
	at org.apache.lucene.util.TestRuleAssertionsRequired$1.evaluate(TestRuleAssertionsRequired.java:53)
	at org.apache.lucene.util.TestRuleMarkFailure$1.evaluate(TestRuleMarkFailure.java:47)
	at org.apache.lucene.util.TestRuleIgnoreAfterMaxFailures$1.evaluate(TestRuleIgnoreAfterMaxFailures.java:64)
	at org.apache.lucene.util.TestRuleIgnoreTestSuites$1.evaluate(TestRuleIgnoreTestSuites.java:54)
	at com.carrotsearch.randomizedtesting.rules.StatementAdapter.evaluate(StatementAdapter.java:36)
	at com.carrotsearch.randomizedtesting.ThreadLeakControl$StatementRunner.run(ThreadLeakControl.java:368)
	at java.base/java.lang.Thread.run(Thread.java:834)




Build Log:
[...truncated 1991 lines...]
   [junit4] JVM J0: stderr was not empty, see: /home/jenkins/workspace/Lucene-Solr-master-Linux/lucene/build/core/test/temp/junit4-J0-20181001_133126_8405158716157629677367.syserr
   [junit4] >>> JVM J0 emitted unexpected output (verbatim) ----
   [junit4] OpenJDK 64-Bit Server VM warning: Option UseConcMarkSweepGC was deprecated in version 9.0 and will likely be removed in a future release.
   [junit4] <<< JVM J0: EOF ----

[...truncated 10 lines...]
   [junit4] JVM J2: stderr was not empty, see: /home/jenkins/workspace/Lucene-Solr-master-Linux/lucene/build/core/test/temp/junit4-J2-20181001_133126_8408875432686923363081.syserr
   [junit4] >>> JVM J2 emitted unexpected output (verbatim) ----
   [junit4] OpenJDK 64-Bit Server VM warning: Option UseConcMarkSweepGC was deprecated in version 9.0 and will likely be removed in a future release.
   [junit4] <<< JVM J2: EOF ----

   [junit4] JVM J1: stderr was not empty, see: /home/jenkins/workspace/Lucene-Solr-master-Linux/lucene/build/core/test/temp/junit4-J1-20181001_133126_84012674784920025196624.syserr
   [junit4] >>> JVM J1 emitted unexpected output (verbatim) ----
   [junit4] OpenJDK 64-Bit Server VM warning: Option UseConcMarkSweepGC was deprecated in version 9.0 and will likely be removed in a future release.
   [junit4] <<< JVM J1: EOF ----

[...truncated 299 lines...]
   [junit4] JVM J0: stderr was not empty, see: /home/jenkins/workspace/Lucene-Solr-master-Linux/lucene/build/test-framework/test/temp/junit4-J0-20181001_133954_60415780164283221041695.syserr
   [junit4] >>> JVM J0 emitted unexpected output (verbatim) ----
   [junit4] OpenJDK 64-Bit Server VM warning: Option UseConcMarkSweepGC was deprecated in version 9.0 and will likely be removed in a future release.
   [junit4] <<< JVM J0: EOF ----

   [junit4] JVM J1: stderr was not empty, see: /home/jenkins/workspace/Lucene-Solr-master-Linux/lucene/build/test-framework/test/temp/junit4-J1-20181001_133954_604898143276999361894.syserr
   [junit4] >>> JVM J1 emitted unexpected output (verbatim) ----
   [junit4] OpenJDK 64-Bit Server VM warning: Option UseConcMarkSweepGC was deprecated in version 9.0 and will likely be removed in a future release.
   [junit4] <<< JVM J1: EOF ----

[...truncated 8 lines...]
   [junit4] JVM J2: stderr was not empty, see: /home/jenkins/workspace/Lucene-Solr-master-Linux/lucene/build/test-framework/test/temp/junit4-J2-20181001_133954_6041944467453063549355.syserr
   [junit4] >>> JVM J2 emitted unexpected output (verbatim) ----
   [junit4] OpenJDK 64-Bit Server VM warning: Option UseConcMarkSweepGC was deprecated in version 9.0 and will likely be removed in a future release.
   [junit4] <<< JVM J2: EOF ----

[...truncated 1080 lines...]
   [junit4] JVM J0: stderr was not empty, see: /home/jenkins/workspace/Lucene-Solr-master-Linux/lucene/build/analysis/common/test/temp/junit4-J0-20181001_134131_57918059973663522024762.syserr
   [junit4] >>> JVM J0 emitted unexpected output (verbatim) ----
   [junit4] OpenJDK 64-Bit Server VM warning: Option UseConcMarkSweepGC was deprecated in version 9.0 and will likely be removed in a future release.
   [junit4] <<< JVM J0: EOF ----

[...truncated 3 lines...]
   [junit4] JVM J1: stderr was not empty, see: /home/jenkins/workspace/Lucene-Solr-master-Linux/lucene/build/analysis/common/test/temp/junit4-J1-20181001_134131_57946287233123406323.syserr
   [junit4] >>> JVM J1 emitted unexpected output (verbatim) ----
   [junit4] OpenJDK 64-Bit Server VM warning: Option UseConcMarkSweepGC was deprecated in version 9.0 and will likely be removed in a future release.
   [junit4] <<< JVM J1: EOF ----

[...truncated 3 lines...]
   [junit4] JVM J2: stderr was not empty, see: /home/jenkins/workspace/Lucene-Solr-master-Linux/lucene/build/analysis/common/test/temp/junit4-J2-20181001_134131_5798967640826013084200.syserr
   [junit4] >>> JVM J2 emitted unexpected output (verbatim) ----
   [junit4] OpenJDK 64-Bit Server VM warning: Option UseConcMarkSweepGC was deprecated in version 9.0 and will likely be removed in a future release.
   [junit4] <<< JVM J2: EOF ----

[...truncated 247 lines...]
   [junit4] JVM J1: stderr was not empty, see: /home/jenkins/workspace/Lucene-Solr-master-Linux/lucene/build/analysis/icu/test/temp/junit4-J1-20181001_134332_3579594618407919450234.syserr
   [junit4] >>> JVM J1 emitted unexpected output (verbatim) ----
   [junit4] OpenJDK 64-Bit Server VM warning: Option UseConcMarkSweepGC was deprecated in version 9.0 and will likely be removed in a future release.
   [junit4] <<< JVM J1: EOF ----

[...truncated 11 lines...]
   [junit4] JVM J2: stderr was not empty, see: /home/jenkins/workspace/Lucene-Solr-master-Linux/lucene/build/analysis/icu/test/temp/junit4-J2-20181001_134332_35713024015541317128910.syserr
   [junit4] >>> JVM J2 emitted unexpected output (verbatim) ----
   [junit4] OpenJDK 64-Bit Server VM warning: Option UseConcMarkSweepGC was deprecated in version 9.0 and will likely be removed in a future release.
   [junit4] <<< JVM J2: EOF ----

[...truncated 3 lines...]
   [junit4] JVM J0: stderr was not empty, see: /home/jenkins/workspace/Lucene-Solr-master-Linux/lucene/build/analysis/icu/test/temp/junit4-J0-20181001_134332_35717340448980665161812.syserr
   [junit4] >>> JVM J0 emitted unexpected output (verbatim) ----
   [junit4] OpenJDK 64-Bit Server VM warning: Option UseConcMarkSweepGC was deprecated in version 9.0 and will likely be removed in a future release.
   [junit4] <<< JVM J0: EOF ----

[...truncated 251 lines...]
   [junit4] JVM J1: stderr was not empty, see: /home/jenkins/workspace/Lucene-Solr-master-Linux/lucene/build/analysis/kuromoji/test/temp/junit4-J1-20181001_134349_0324119409334187061009.syserr
   [junit4] >>> JVM J1 emitted unexpected output (verbatim) ----
   [junit4] OpenJDK 64-Bit Server VM warning: Option UseConcMarkSweepGC was deprecated in version 9.0 and will likely be removed in a future release.
   [junit4] <<< JVM J1: EOF ----

[...truncated 5 lines...]
   [junit4] JVM J2: stderr was not empty, see: /home/jenkins/workspace/Lucene-Solr-master-Linux/lucene/build/analysis/kuromoji/test/temp/junit4-J2-20181001_134349_03216340273317992791028.syserr
   [junit4] >>> JVM J2 emitted unexpected output (verbatim) ----
   [junit4] OpenJDK 64-Bit Server VM warning: Option UseConcMarkSweepGC was deprecated in version 9.0 and will likely be removed in a future release.
   [junit4] <<< JVM J2: EOF ----

[...truncated 3 lines...]
   [junit4] JVM J0: stderr was not empty, see: /home/jenkins/workspace/Lucene-Solr-master-Linux/lucene/build/analysis/kuromoji/test/temp/junit4-J0-20181001_134349_03210859502664611134473.syserr
   [junit4] >>> JVM J0 emitted unexpected output (verbatim) ----
   [junit4] OpenJDK 64-Bit Server VM warning: Option UseConcMarkSweepGC was deprecated in version 9.0 and will likely be removed in a future release.
   [junit4] <<< JVM J0: EOF ----

[...truncated 162 lines...]
   [junit4] JVM J1: stderr was not empty, see: /home/jenkins/workspace/Lucene-Solr-master-Linux/lucene/build/analysis/morfologik/test/temp/junit4-J1-20181001_134411_15013520965693576858685.syserr
   [junit4] >>> JVM J1 emitted unexpected output (verbatim) ----
   [junit4] OpenJDK 64-Bit Server VM warning: Option UseConcMarkSweepGC was deprecated in version 9.0 and will likely be removed in a future release.
   [junit4] <<< JVM J1: EOF ----

[...truncated 3 lines...]
   [junit4] JVM J0: stderr was not empty, see: /home/jenkins/workspace/Lucene-Solr-master-Linux/lucene/build/analysis/morfologik/test/temp/junit4-J0-20181001_134411_1502563352344304880663.syserr
   [junit4] >>> JVM J0 emitted unexpected output (verbatim) ----
   [junit4] OpenJDK 64-Bit Server VM warning: Option UseConcMarkSweepGC was deprecated in version 9.0 and will likely be removed in a future release.
   [junit4] <<< JVM J0: EOF ----

[...truncated 3 lines...]
   [junit4] JVM J2: stderr was not empty, see: /home/jenkins/workspace/Lucene-Solr-master-Linux/lucene/build/analysis/morfologik/test/temp/junit4-J2-20181001_134411_15017424083485557653350.syserr
   [junit4] >>> JVM J2 emitted unexpected output (verbatim) ----
   [junit4] OpenJDK 64-Bit Server VM warning: Option UseConcMarkSweepGC was deprecated in version 9.0 and will likely be removed in a future release.
   [junit4] <<< JVM J2: EOF ----

[...truncated 207 lines...]
   [junit4] JVM J0: stderr was not empty, see: /home/jenkins/workspace/Lucene-Solr-master-Linux/lucene/build/analysis/nori/test/temp/junit4-J0-20181001_134418_1596913533368013192776.syserr
   [junit4] >>> JVM J0 emitted unexpected output (verbatim) ----
   [junit4] OpenJDK 64-Bit Server VM warning: Option UseConcMarkSweepGC was deprecated in version 9.0 and will likely be removed in a future release.
   [junit4] <<< JVM J0: EOF ----

[...truncated 3 lines...]
   [junit4] JVM J2: stderr was not empty, see: /home/jenkins/workspace/Lucene-Solr-master-Linux/lucene/build/analysis/nori/test/temp/junit4-J2-20181001_134418_1646259021343192965765.syserr
   [junit4] >>> JVM J2 emitted unexpected output (verbatim) ----
   [junit4] OpenJDK 64-Bit Server VM warning: Option UseConcMarkSweepGC was deprecated in version 9.0 and will likely be removed in a future release.
   [junit4] <<< JVM J2: EOF ----

[...truncated 3 lines...]
   [junit4] JVM J1: stderr was not empty, see: /home/jenkins/workspace/Lucene-Solr-master-Linux/lucene/build/analysis/nori/test/temp/junit4-J1-20181001_134418_15914473485081948043991.syserr
   [junit4] >>> JVM J1 emitted unexpected output (verbatim) ----
   [junit4] OpenJDK 64-Bit Server VM warning: Option UseConcMarkSweepGC was deprecated in version 9.0 and will likely be removed in a future release.
   [junit4] <<< JVM J1: EOF ----

[...truncated 168 lines...]
   [junit4] JVM J2: stderr was not empty, see: /home/jenkins/workspace/Lucene-Solr-master-Linux/lucene/build/analysis/opennlp/test/temp/junit4-J2-20181001_134427_9029015129959869374721.syserr
   [junit4] >>> JVM J2 emitted unexpected output (verbatim) ----
   [junit4] OpenJDK 64-Bit Server VM warning: Option UseConcMarkSweepGC was deprecated in version 9.0 and will likely be removed in a future release.
   [junit4] <<< JVM J2: EOF ----

[...truncated 6 lines...]
   [junit4] JVM J0: stderr was not empty, see: /home/jenkins/workspace/Lucene-Solr-master-Linux/lucene/build/analysis/opennlp/test/temp/junit4-J0-20181001_134427_90286422981682725665.syserr
   [junit4] >>> JVM J0 emitted unexpected output (verbatim) ----
   [junit4] OpenJDK 64-Bit Server VM warning: Option UseConcMarkSweepGC was deprecated in version 9.0 and will likely be removed in a future release.
   [junit4] <<< JVM J0: EOF ----

   [junit4] JVM J1: stderr was not empty, see: /home/jenkins/workspace/Lucene-Solr-master-Linux/lucene/build/analysis/opennlp/test/temp/junit4-J1-20181001_134427_9027987531595049611308.syserr
   [junit4] >>> JVM J1 emitted unexpected output (verbatim) ----
   [junit4] OpenJDK 64-Bit Server VM warning: Option UseConcMarkSweepGC was deprecated in version 9.0 and will likely be removed in a future release.
   [junit4] <<< JVM J1: EOF ----

[...truncated 173 lines...]
   [junit4] JVM J2: stderr was not empty, see: /home/jenkins/workspace/Lucene-Solr-master-Linux/lucene/build/analysis/phonetic/test/temp/junit4-J2-20181001_134430_31016217419021268011334.syserr
   [junit4] >>> JVM J2 emitted unexpected output (verbatim) ----
   [junit4] OpenJDK 64-Bit Server VM warning: Option UseConcMarkSweepGC was deprecated in version 9.0 and will likely be removed in a future release.
   [junit4] <<< JVM J2: EOF ----

[...truncated 3 lines...]
   [junit4] JVM J1: stderr was not empty, see: /home/jenkins/workspace/Lucene-Solr-master-Linux/lucene/build/analysis/phonetic/test/temp/junit4-J1-20181001_134430_3105611899282655493864.syserr
   [junit4] >>> JVM J1 emitted unexpected output (verbatim) ----
   [junit4] OpenJDK 64-Bit Server VM warning: Option UseConcMarkSweepGC was deprecated in version 9.0 and will likely be removed in a future release.
   [junit4] <<< JVM J1: EOF ----

[...truncated 6 lines...]
   [junit4] JVM J0: stderr was not empty, see: /home/jenkins/workspace/Lucene-Solr-master-Linux/lucene/build/analysis/phonetic/test/temp/junit4-J0-20181001_134430_30917459435810348086718.syserr
   [junit4] >>> JVM J0 emitted unexpected output (verbatim) ----
   [junit4] OpenJDK 64-Bit Server VM warning: Option UseConcMarkSweepGC was deprecated in version 9.0 and will likely be removed in a future release.
   [junit4] <<< JVM J0: EOF ----

[...truncated 161 lines...]
   [junit4] JVM J0: stderr was not empty, see: /home/jenkins/workspace/Lucene-Solr-master-Linux/lucene/build/analysis/smartcn/test/temp/junit4-J0-20181001_134439_4337317476724901765781.syserr
   [junit4] >>> JVM J0 emitted unexpected output (verbatim) ----
   [junit4] OpenJDK 64-Bit Server VM warning: Option UseConcMarkSweepGC was deprecated in version 9.0 and will likely be removed in a future release.
   [junit4] <<< JVM J0: EOF ----

[...truncated 3 lines...]
   [junit4] JVM J1: stderr was not empty, see: /home/jenkins/workspace/Lucene-Solr-master-Linux/lucene/build/analysis/smartcn/test/temp/junit4-J1-20181001_134439_43310666003177905508653.syserr
   [junit4] >>> JVM J1 emitted unexpected output (verbatim) ----
   [junit4] OpenJDK 64-Bit Server VM warning: Option UseConcMarkSweepGC was deprecated in version 9.0 and will likely be removed in a future release.
   [junit4] <<< JVM J1: EOF ----

[...truncated 162 lines...]
   [junit4] JVM J2: stderr was not empty, see: /home/jenkins/workspace/Lucene-Solr-master-Linux/lucene/build/analysis/stempel/test/temp/junit4-J2-20181001_134446_7929006752409545265680.syserr
   [junit4] >>> JVM J2 emitted unexpected output (verbatim) ----
   [junit4] OpenJDK 64-Bit Server VM warning: Option UseConcMarkSweepGC was deprecated in version 9.0 and will likely be removed in a future release.
   [junit4] <<< JVM J2: EOF ----

[...truncated 6 lines...]
   [junit4] JVM J0: stderr was not empty, see: /home/jenkins/workspace/Lucene-Solr-master-Linux/lucene/build/analysis/stempel/test/temp/junit4-J0-20181001_134446_792324442536124416562.syserr
   [junit4] >>> JVM J0 emitted unexpected output (verbatim) ----
   [junit4] OpenJDK 64-Bit Server VM warning: Option UseConcMarkSweepGC was deprecated in version 9.0 and will likely be removed in a future release.
   [junit4] <<< JVM J0: EOF ----

   [junit4] JVM J1: stderr was not empty, see: /home/jenkins/workspace/Lucene-Solr-master-Linux/lucene/build/analysis/stempel/test/temp/junit4-J1-20181001_134446_79213887947217214523191.syserr
   [junit4] >>> JVM J1 emitted unexpected output (verbatim) ----
   [junit4] OpenJDK 64-Bit Server VM warning: Option UseConcMarkSweepGC was deprecated in version 9.0 and will likely be removed in a future release.
   [junit4] <<< JVM J1: EOF ----

[...truncated 163 lines...]
   [junit4] JVM J2: stderr was not empty, see: /home/jenkins/workspace/Lucene-Solr-master-Linux/lucene/build/backward-codecs/test/temp/junit4-J2-20181001_134449_1727276121528974880670.syserr
   [junit4] >>> JVM J2 emitted unexpected output (verbatim) ----
   [junit4] OpenJDK 64-Bit Server VM warning: Option UseConcMarkSweepGC was deprecated in version 9.0 and will likely be removed in a future release.
   [junit4] <<< JVM J2: EOF ----

   [junit4] JVM J1: stderr was not empty, see: /home/jenkins/workspace/Lucene-Solr-master-Linux/lucene/build/backward-codecs/test/temp/junit4-J1-20181001_134449_172282512986122967575.syserr
   [junit4] >>> JVM J1 emitted unexpected output (verbatim) ----
   [junit4] OpenJDK 64-Bit Server VM warning: Option UseConcMarkSweepGC was deprecated in version 9.0 and will likely be removed in a future release.
   [junit4] <<< JVM J1: EOF ----

[...truncated 19 lines...]
   [junit4] JVM J0: stderr was not empty, see: /home/jenkins/workspace/Lucene-Solr-master-Linux/lucene/build/backward-codecs/test/temp/junit4-J0-20181001_134449_17211754779201254052331.syserr
   [junit4] >>> JVM J0 emitted unexpected output (verbatim) ----
   [junit4] OpenJDK 64-Bit Server VM warning: Option UseConcMarkSweepGC was deprecated in version 9.0 and will likely be removed in a future release.
   [junit4] <<< JVM J0: EOF ----

[...truncated 1393 lines...]
   [junit4] JVM J1: stderr was not empty, see: /home/jenkins/workspace/Lucene-Solr-master-Linux/lucene/build/benchmark/test/temp/junit4-J1-20181001_134515_8598519569855541018777.syserr
   [junit4] >>> JVM J1 emitted unexpected output (verbatim) ----
   [junit4] OpenJDK 64-Bit Server VM warning: Option UseConcMarkSweepGC was deprecated in version 9.0 and will likely be removed in a future release.
   [junit4] <<< JVM J1: EOF ----

   [junit4] JVM J2: stderr was not empty, see: /home/jenkins/workspace/Lucene-Solr-master-Linux/lucene/build/benchmark/test/temp/junit4-J2-20181001_134515_86010043035524493856057.syserr
   [junit4] >>> JVM J2 emitted unexpected output (verbatim) ----
   [junit4] OpenJDK 64-Bit Server VM warning: Option UseConcMarkSweepGC was deprecated in version 9.0 and will likely be removed in a future release.
   [junit4] <<< JVM J2: EOF ----

[...truncated 9 lines...]
   [junit4] JVM J0: stderr was not empty, see: /home/jenkins/workspace/Lucene-Solr-master-Linux/lucene/build/benchmark/test/temp/junit4-J0-20181001_134515_85911674149540346807658.syserr
   [junit4] >>> JVM J0 emitted unexpected output (verbatim) ----
   [junit4] OpenJDK 64-Bit Server VM warning: Option UseConcMarkSweepGC was deprecated in version 9.0 and will likely be removed in a future release.
   [junit4] <<< JVM J0: EOF ----

[...truncated 253 lines...]
   [junit4] JVM J1: stderr was not empty, see: /home/jenkins/workspace/Lucene-Solr-master-Linux/lucene/build/classification/test/temp/junit4-J1-20181001_134524_4732014295682305454737.syserr
   [junit4] >>> JVM J1 emitted unexpected output (verbatim) ----
   [junit4] OpenJDK 64-Bit Server VM warning: Option UseConcMarkSweepGC was deprecated in version 9.0 and will likely be removed in a future release.
   [junit4] <<< JVM J1: EOF ----

[...truncated 3 lines...]
   [junit4] JVM J2: stderr was not empty, see: /home/jenkins/workspace/Lucene-Solr-master-Linux/lucene/build/classification/test/temp/junit4-J2-20181001_134524_47311515882280439522124.syserr
   [junit4] >>> JVM J2 emitted unexpected output (verbatim) ----
   [junit4] OpenJDK 64-Bit Server VM warning: Option UseConcMarkSweepGC was deprecated in version 9.0 and will likely be removed in a future release.
   [junit4] <<< JVM J2: EOF ----

   [junit4] JVM J0: stderr was not empty, see: /home/jenkins/workspace/Lucene-Solr-master-Linux/lucene/build/classification/test/temp/junit4-J0-20181001_134524_4737663846754918680449.syserr
   [junit4] >>> JVM J0 emitted unexpected output (verbatim) ----
   [junit4] OpenJDK 64-Bit Server VM warning: Option UseConcMarkSweepGC was deprecated in version 9.0 and will likely be removed in a future release.
   [junit4] <<< JVM J0: EOF ----

[...truncated 260 lines...]
   [junit4] JVM J2: stderr was not empty, see: /home/jenkins/workspace/Lucene-Solr-master-Linux/lucene/build/codecs/test/temp/junit4-J2-20181001_134536_46517770912010351888968.syserr
   [junit4] >>> JVM J2 emitted unexpected output (verbatim) ----
   [junit4] OpenJDK 64-Bit Server VM warning: Option UseConcMarkSweepGC was deprecated in version 9.0 and will likely be removed in a future release.
   [junit4] <<< JVM J2: EOF ----

[...truncated 5 lines...]
   [junit4] JVM J0: stderr was not empty, see: /home/jenkins/workspace/Lucene-Solr-master-Linux/lucene/build/codecs/test/temp/junit4-J0-20181001_134536_4656876969246424460645.syserr
   [junit4] >>> JVM J0 emitted unexpected output (verbatim) ----
   [junit4] OpenJDK 64-Bit Server VM warning: Option UseConcMarkSweepGC was deprecated in version 9.0 and will likely be removed in a future release.
   [junit4] <<< JVM J0: EOF ----

[...truncated 3 lines...]
   [junit4] JVM J1: stderr was not empty, see: /home/jenkins/workspace/Lucene-Solr-master-Linux/lucene/build/codecs/test/temp/junit4-J1-20181001_134536_465226685757583918926.syserr
   [junit4] >>> JVM J1 emitted unexpected output (verbatim) ----
   [junit4] OpenJDK 64-Bit Server VM warning: Option UseConcMarkSweepGC was deprecated in version 9.0 and will likely be removed in a future release.
   [junit4] <<< JVM J1: EOF ----

[...truncated 233 lines...]
   [junit4] JVM J1: stderr was not empty, see: /home/jenkins/workspace/Lucene-Solr-master-Linux/lucene/build/demo/test/temp/junit4-J1-20181001_134818_2056278593649562229831.syserr
   [junit4] >>> JVM J1 emitted unexpected output (verbatim) ----
   [junit4] OpenJDK 64-Bit Server VM warning: Option UseConcMarkSweepGC was deprecated in version 9.0 and will likely be removed in a future release.
   [junit4] <<< JVM J1: EOF ----

   [junit4] JVM J2: stderr was not empty, see: /home/jenkins/workspace/Lucene-Solr-master-Linux/lucene/build/demo/test/temp/junit4-J2-20181001_134818_2058683965085965978273.syserr
   [junit4] >>> JVM J2 emitted unexpected output (verbatim) ----
   [junit4] OpenJDK 64-Bit Server VM warning: Option UseConcMarkSweepGC was deprecated in version 9.0 and will likely be removed in a future release.
   [junit4] <<< JVM J2: EOF ----

[...truncated 3 lines...]
   [junit4] JVM J0: stderr was not empty, see: /home/jenkins/workspace/Lucene-Solr-master-Linux/lucene/build/demo/test/temp/junit4-J0-20181001_134818_20410421752592975563966.syserr
   [junit4] >>> JVM J0 emitted unexpected output (verbatim) ----
   [junit4] OpenJDK 64-Bit Server VM warning: Option UseConcMarkSweepGC was deprecated in version 9.0 and will likely be removed in a future release.
   [junit4] <<< JVM J0: EOF ----

[...truncated 176 lines...]
   [junit4] JVM J0: stderr was not empty, see: /home/jenkins/workspace/Lucene-Solr-master-Linux/lucene/build/expressions/test/temp/junit4-J0-20181001_134821_3249719051187165234083.syserr
   [junit4] >>> JVM J0 emitted unexpected output (verbatim) ----
   [junit4] OpenJDK 64-Bit Server VM warning: Option UseConcMarkSweepGC was deprecated in version 9.0 and will likely be removed in a future release.
   [junit4] <<< JVM J0: EOF ----

   [junit4] JVM J1: stderr was not empty, see: /home/jenkins/workspace/Lucene-Solr-master-Linux/lucene/build/expressions/test/temp/junit4-J1-20181001_134821_3245452565015225494909.syserr
   [junit4] >>> JVM J1 emitted unexpected output (verbatim) ----
   [junit4] OpenJDK 64-Bit Server VM warning: Option UseConcMarkSweepGC was deprecated in version 9.0 and will likely be removed in a future release.
   [junit4] <<< JVM J1: EOF ----

[...truncated 3 lines...]
   [junit4] JVM J2: stderr was not empty, see: /home/jenkins/workspace/Lucene-Solr-master-Linux/lucene/build/expressions/test/temp/junit4-J2-20181001_134821_3242015268349558562343.syserr
   [junit4] >>> JVM J2 emitted unexpected output (verbatim) ----
   [junit4] OpenJDK 64-Bit Server VM warning: Option UseConcMarkSweepGC was deprecated in version 9.0 and will likely be removed in a future release.
   [junit4] <<< JVM J2: EOF ----

[...truncated 237 lines...]
   [junit4] JVM J1: stderr was not empty, see: /home/jenkins/workspace/Lucene-Solr-master-Linux/lucene/build/facet/test/temp/junit4-J1-20181001_134827_662636688791939077599.syserr
   [junit4] >>> JVM J1 emitted unexpected output (verbatim) ----
   [junit4] OpenJDK 64-Bit Server VM warning: Option UseConcMarkSweepGC was deprecated in version 9.0 and will likely be removed in a future release.
   [junit4] <<< JVM J1: EOF ----

   [junit4] JVM J2: stderr was not empty, see: /home/jenkins/workspace/Lucene-Solr-master-Linux/lucene/build/facet/test/temp/junit4-J2-20181001_134827_662116755777374694016.syserr
   [junit4] >>> JVM J2 emitted unexpected output (verbatim) ----
   [junit4] OpenJDK 64-Bit Server VM warning: Option UseConcMarkSweepGC was deprecated in version 9.0 and will likely be removed in a future release.
   [junit4] <<< JVM J2: EOF ----

[...truncated 3 lines...]
   [junit4] JVM J0: stderr was not empty, see: /home/jenkins/workspace/Lucene-Solr-master-Linux/lucene/build/facet/test/temp/junit4-J0-20181001_134827_6621464604374576911805.syserr
   [junit4] >>> JVM J0 emitted unexpected output (verbatim) ----
   [junit4] OpenJDK 64-Bit Server VM warning: Option UseConcMarkSweepGC was deprecated in version 9.0 and will likely be removed in a future release.
   [junit4] <<< JVM J0: EOF ----

[...truncated 182 lines...]
   [junit4] JVM J0: stderr was not empty, see: /home/jenkins/workspace/Lucene-Solr-master-Linux/lucene/build/grouping/test/temp/junit4-J0-20181001_134910_89413020491756949719103.syserr
   [junit4] >>> JVM J0 emitted unexpected output (verbatim) ----
   [junit4] OpenJDK 64-Bit Server VM warning: Option UseConcMarkSweepGC was deprecated in version 9.0 and will likely be removed in a future release.
   [junit4] <<< JVM J0: EOF ----

[...truncated 6 lines...]
   [junit4] JVM J1: stderr was not empty, see: /home/jenkins/workspace/Lucene-Solr-master-Linux/lucene/build/grouping/test/temp/junit4-J1-20181001_134910_894335645329257307192.syserr
   [junit4] >>> JVM J1 emitted unexpected output (verbatim) ----
   [junit4] OpenJDK 64-Bit Server VM warning: Option UseConcMarkSweepGC was deprecated in version 9.0 and will likely be removed in a future release.
   [junit4] <<< JVM J1: EOF ----

   [junit4] JVM J2: stderr was not empty, see: /home/jenkins/workspace/Lucene-Solr-master-Linux/lucene/build/grouping/test/temp/junit4-J2-20181001_134910_89416833680763403199246.syserr
   [junit4] >>> JVM J2 emitted unexpected output (verbatim) ----
   [junit4] OpenJDK 64-Bit Server VM warning: Option UseConcMarkSweepGC was deprecated in version 9.0 and will likely be removed in a future release.
   [junit4] <<< JVM J2: EOF ----

[...truncated 249 lines...]
   [junit4] JVM J1: stderr was not empty, see: /home/jenkins/workspace/Lucene-Solr-master-Linux/lucene/build/highlighter/test/temp/junit4-J1-20181001_134924_81012279919749851272822.syserr
   [junit4] >>> JVM J1 emitted unexpected output (verb

[...truncated too long message...]

ds-interceptors-authz-2.0.0-M15.jar:/home/jenkins/workspace/Lucene-Solr-master-Linux/solr/core/test-lib/apacheds-interceptors-changelog-2.0.0-M15.jar:/home/jenkins/workspace/Lucene-Solr-master-Linux/solr/core/test-lib/apacheds-interceptors-collective-2.0.0-M15.jar:/home/jenkins/workspace/Lucene-Solr-master-Linux/solr/core/test-lib/apacheds-interceptors-event-2.0.0-M15.jar:/home/jenkins/workspace/Lucene-Solr-master-Linux/solr/core/test-lib/apacheds-interceptors-exception-2.0.0-M15.jar:/home/jenkins/workspace/Lucene-Solr-master-Linux/solr/core/test-lib/apacheds-interceptors-journal-2.0.0-M15.jar:/home/jenkins/workspace/Lucene-Solr-master-Linux/solr/core/test-lib/apacheds-interceptors-normalization-2.0.0-M15.jar:/home/jenkins/workspace/Lucene-Solr-master-Linux/solr/core/test-lib/apacheds-interceptors-operational-2.0.0-M15.jar:/home/jenkins/workspace/Lucene-Solr-master-Linux/solr/core/test-lib/apacheds-interceptors-referral-2.0.0-M15.jar:/home/jenkins/workspace/Lucene-Solr-master-Linux/solr/core/test-lib/apacheds-interceptors-schema-2.0.0-M15.jar:/home/jenkins/workspace/Lucene-Solr-master-Linux/solr/core/test-lib/apacheds-interceptors-subtree-2.0.0-M15.jar:/home/jenkins/workspace/Lucene-Solr-master-Linux/solr/core/test-lib/apacheds-interceptors-trigger-2.0.0-M15.jar:/home/jenkins/workspace/Lucene-Solr-master-Linux/solr/core/test-lib/apacheds-jdbm-partition-2.0.0-M15.jar:/home/jenkins/workspace/Lucene-Solr-master-Linux/solr/core/test-lib/apacheds-jdbm1-2.0.0-M2.jar:/home/jenkins/workspace/Lucene-Solr-master-Linux/solr/core/test-lib/apacheds-kerberos-codec-2.0.0-M15.jar:/home/jenkins/workspace/Lucene-Solr-master-Linux/solr/core/test-lib/apacheds-ldif-partition-2.0.0-M15.jar:/home/jenkins/workspace/Lucene-Solr-master-Linux/solr/core/test-lib/apacheds-mavibot-partition-2.0.0-M15.jar:/home/jenkins/workspace/Lucene-Solr-master-Linux/solr/core/test-lib/apacheds-protocol-kerberos-2.0.0-M15.jar:/home/jenkins/workspace/Lucene-Solr-master-Linux/solr/core/test-lib/apacheds-protocol-ldap-2.0.0-M15.jar:/home/jenkins/workspace/Lucene-Solr-master-Linux/solr/core/test-lib/apacheds-protocol-shared-2.0.0-M15.jar:/home/jenkins/workspace/Lucene-Solr-master-Linux/solr/core/test-lib/apacheds-xdbm-partition-2.0.0-M15.jar:/home/jenkins/workspace/Lucene-Solr-master-Linux/solr/core/test-lib/api-all-1.0.0-M20.jar:/home/jenkins/workspace/Lucene-Solr-master-Linux/solr/core/test-lib/bcprov-jdk15on-1.54.jar:/home/jenkins/workspace/Lucene-Solr-master-Linux/solr/core/test-lib/byte-buddy-1.6.2.jar:/home/jenkins/workspace/Lucene-Solr-master-Linux/solr/core/test-lib/commons-collections-3.2.2.jar:/home/jenkins/workspace/Lucene-Solr-master-Linux/solr/core/test-lib/ehcache-core-2.4.4.jar:/home/jenkins/workspace/Lucene-Solr-master-Linux/solr/core/test-lib/hadoop-common-2.7.4-tests.jar:/home/jenkins/workspace/Lucene-Solr-master-Linux/solr/core/test-lib/hadoop-hdfs-2.7.4-tests.jar:/home/jenkins/workspace/Lucene-Solr-master-Linux/solr/core/test-lib/hadoop-minikdc-2.7.4.jar:/home/jenkins/workspace/Lucene-Solr-master-Linux/solr/core/test-lib/htrace-core-3.2.0-incubating.jar:/home/jenkins/workspace/Lucene-Solr-master-Linux/solr/core/test-lib/jersey-core-1.9.jar:/home/jenkins/workspace/Lucene-Solr-master-Linux/solr/core/test-lib/jersey-server-1.9.jar:/home/jenkins/workspace/Lucene-Solr-master-Linux/solr/core/test-lib/jetty-6.1.26.jar:/home/jenkins/workspace/Lucene-Solr-master-Linux/solr/core/test-lib/jetty-sslengine-6.1.26.jar:/home/jenkins/workspace/Lucene-Solr-master-Linux/solr/core/test-lib/jetty-util-6.1.26.jar:/home/jenkins/workspace/Lucene-Solr-master-Linux/solr/core/test-lib/mina-core-2.0.0-M5.jar:/home/jenkins/workspace/Lucene-Solr-master-Linux/solr/core/test-lib/mockito-core-2.6.2.jar:/home/jenkins/workspace/Lucene-Solr-master-Linux/solr/core/test-lib/netty-all-4.0.36.Final.jar:/home/jenkins/workspace/Lucene-Solr-master-Linux/solr/core/test-lib/objenesis-2.5.jar:/home/jenkins/workspace/Lucene-Solr-master-Linux/lucene/build/analysis/icu/lucene-analyzers-icu-8.0.0-SNAPSHOT.jar:/home/jenkins/workspace/Lucene-Solr-master-Linux/solr/build/contrib/solr-analysis-extras/classes/java:/home/jenkins/workspace/Lucene-Solr-master-Linux/lucene/build/queryparser/classes/test:/home/jenkins/workspace/Lucene-Solr-master-Linux/lucene/build/backward-codecs/classes/test:/home/jenkins/workspace/Lucene-Solr-master-Linux/solr/contrib/analysis-extras/lib/icu4j-62.1.jar:/var/lib/jenkins/tools/hudson.tasks.Ant_AntInstallation/ANT_1.8.2/lib/ant-launcher.jar:/home/jenkins/.ant/lib/ivy-2.4.0.jar:/var/lib/jenkins/tools/hudson.tasks.Ant_AntInstallation/ANT_1.8.2/lib/ant-netrexx.jar:/var/lib/jenkins/tools/hudson.tasks.Ant_AntInstallation/ANT_1.8.2/lib/ant-apache-xalan2.jar:/var/lib/jenkins/tools/hudson.tasks.Ant_AntInstallation/ANT_1.8.2/lib/ant.jar:/var/lib/jenkins/tools/hudson.tasks.Ant_AntInstallation/ANT_1.8.2/lib/ant-javamail.jar:/var/lib/jenkins/tools/hudson.tasks.Ant_AntInstallation/ANT_1.8.2/lib/ant-commons-net.jar:/var/lib/jenkins/tools/hudson.tasks.Ant_AntInstallation/ANT_1.8.2/lib/ant-apache-regexp.jar:/var/lib/jenkins/tools/hudson.tasks.Ant_AntInstallation/ANT_1.8.2/lib/ant-apache-oro.jar:/var/lib/jenkins/tools/hudson.tasks.Ant_AntInstallation/ANT_1.8.2/lib/ant-jmf.jar:/var/lib/jenkins/tools/hudson.tasks.Ant_AntInstallation/ANT_1.8.2/lib/ant-apache-log4j.jar:/var/lib/jenkins/tools/hudson.tasks.Ant_AntInstallation/ANT_1.8.2/lib/ant-jsch.jar:/var/lib/jenkins/tools/hudson.tasks.Ant_AntInstallation/ANT_1.8.2/lib/ant-jai.jar:/var/lib/jenkins/tools/hudson.tasks.Ant_AntInstallation/ANT_1.8.2/lib/ant-apache-bsf.jar:/var/lib/jenkins/tools/hudson.tasks.Ant_AntInstallation/ANT_1.8.2/lib/ant-junit4.jar:/var/lib/jenkins/tools/hudson.tasks.Ant_AntInstallation/ANT_1.8.2/lib/ant-apache-resolver.jar:/var/lib/jenkins/tools/hudson.tasks.Ant_AntInstallation/ANT_1.8.2/lib/ant-apache-bcel.jar:/var/lib/jenkins/tools/hudson.tasks.Ant_AntInstallation/ANT_1.8.2/lib/ant-junit.jar:/var/lib/jenkins/tools/hudson.tasks.Ant_AntInstallation/ANT_1.8.2/lib/ant-jdepend.jar:/var/lib/jenkins/tools/hudson.tasks.Ant_AntInstallation/ANT_1.8.2/lib/ant-testutil.jar:/var/lib/jenkins/tools/hudson.tasks.Ant_AntInstallation/ANT_1.8.2/lib/ant-antlr.jar:/var/lib/jenkins/tools/hudson.tasks.Ant_AntInstallation/ANT_1.8.2/lib/ant-swing.jar:/var/lib/jenkins/tools/hudson.tasks.Ant_AntInstallation/ANT_1.8.2/lib/ant-commons-logging.jar:/home/jenkins/.ivy2/cache/com.carrotsearch.randomizedtesting/junit4-ant/jars/junit4-ant-2.6.4.jar com.carrotsearch.ant.tasks.junit4.slave.SlaveMainSafe -eventsfile /home/jenkins/workspace/Lucene-Solr-master-Linux/solr/build/solr-core/test/temp/junit4-J1-20181001_135717_5825033744348172587340.events @/home/jenkins/workspace/Lucene-Solr-master-Linux/solr/build/solr-core/test/temp/junit4-J1-20181001_135717_582208322996327531906.suites -stdin
   [junit4] ERROR: JVM J1 ended with an exception: Forked process returned with error code: 134. Very likely a JVM crash.  See process stdout at: /home/jenkins/workspace/Lucene-Solr-master-Linux/solr/build/solr-core/test/temp/junit4-J1-20181001_135717_582966145669418575991.sysout See process stderr at: /home/jenkins/workspace/Lucene-Solr-master-Linux/solr/build/solr-core/test/temp/junit4-J1-20181001_135717_5826841440418226725158.syserr
   [junit4] 	at com.carrotsearch.ant.tasks.junit4.JUnit4.executeSlave(JUnit4.java:1542)
   [junit4] 	at com.carrotsearch.ant.tasks.junit4.JUnit4.access$000(JUnit4.java:123)
   [junit4] 	at com.carrotsearch.ant.tasks.junit4.JUnit4$2.call(JUnit4.java:997)
   [junit4] 	at com.carrotsearch.ant.tasks.junit4.JUnit4$2.call(JUnit4.java:994)
   [junit4] 	at java.base/java.util.concurrent.FutureTask.run(FutureTask.java:264)
   [junit4] 	at java.base/java.util.concurrent.ThreadPoolExecutor.runWorker(ThreadPoolExecutor.java:1128)
   [junit4] 	at java.base/java.util.concurrent.ThreadPoolExecutor$Worker.run(ThreadPoolExecutor.java:628)
   [junit4] 	at java.base/java.lang.Thread.run(Thread.java:834)

BUILD FAILED
/home/jenkins/workspace/Lucene-Solr-master-Linux/build.xml:633: The following error occurred while executing this line:
/home/jenkins/workspace/Lucene-Solr-master-Linux/build.xml:577: The following error occurred while executing this line:
/home/jenkins/workspace/Lucene-Solr-master-Linux/build.xml:59: The following error occurred while executing this line:
/home/jenkins/workspace/Lucene-Solr-master-Linux/solr/build.xml:267: The following error occurred while executing this line:
/home/jenkins/workspace/Lucene-Solr-master-Linux/solr/common-build.xml:558: The following error occurred while executing this line:
/home/jenkins/workspace/Lucene-Solr-master-Linux/lucene/common-build.xml:1567: The following error occurred while executing this line:
/home/jenkins/workspace/Lucene-Solr-master-Linux/lucene/common-build.xml:1092: At least one slave process threw an exception, first: Forked process returned with error code: 134. Very likely a JVM crash.  See process stdout at: /home/jenkins/workspace/Lucene-Solr-master-Linux/solr/build/solr-core/test/temp/junit4-J1-20181001_135717_582966145669418575991.sysout See process stderr at: /home/jenkins/workspace/Lucene-Solr-master-Linux/solr/build/solr-core/test/temp/junit4-J1-20181001_135717_5826841440418226725158.syserr

Total time: 77 minutes 20 seconds
Build step 'Invoke Ant' marked build as failure
Archiving artifacts
Setting ANT_1_8_2_HOME=/var/lib/jenkins/tools/hudson.tasks.Ant_AntInstallation/ANT_1.8.2
[WARNINGS] Skipping publisher since build result is FAILURE
Recording test results
Setting ANT_1_8_2_HOME=/var/lib/jenkins/tools/hudson.tasks.Ant_AntInstallation/ANT_1.8.2
Email was triggered for: Failure - Any
Sending email for trigger: Failure - Any
Setting ANT_1_8_2_HOME=/var/lib/jenkins/tools/hudson.tasks.Ant_AntInstallation/ANT_1.8.2
Setting ANT_1_8_2_HOME=/var/lib/jenkins/tools/hudson.tasks.Ant_AntInstallation/ANT_1.8.2
Setting ANT_1_8_2_HOME=/var/lib/jenkins/tools/hudson.tasks.Ant_AntInstallation/ANT_1.8.2
Setting ANT_1_8_2_HOME=/var/lib/jenkins/tools/hudson.tasks.Ant_AntInstallation/ANT_1.8.2

Mime
View raw message