lucene-dev mailing list archives

Site index · List index
Message view « Date » · « Thread »
Top « Date » · « Thread »
From Policeman Jenkins Server <jenk...@thetaphi.de>
Subject [JENKINS] Lucene-Solr-master-Solaris (64bit/jdk1.8.0) - Build # 2090 - Still Unstable!
Date Thu, 04 Oct 2018 02:39:42 GMT
Build: https://jenkins.thetaphi.de/job/Lucene-Solr-master-Solaris/2090/
Java: 64bit/jdk1.8.0 -XX:-UseCompressedOops -XX:+UseConcMarkSweepGC

4 tests failed.
FAILED:  org.apache.lucene.index.TestIndexWriterWithThreads.testIOExceptionDuringAbortWithThreadsOnlyOnce

Error Message:
MockDirectoryWrapper: cannot close: there are still 29 open files: {_m.cfs=1, _7.cfs=1, _c.cfs=1, _2.cfs=1, _h.cfs=1, _l.cfs=1, _1.cfs=1, _6.cfs=1, _d.cfs=1, _i.cfs=1, _q.cfs=1, _5.fdx=1, _5.fdt=1, _5.tvx=1, _0.cfs=1, _j.cfs=1, _9.cfs=1, _e.cfs=1, _a.cfs=1, _p.cfs=1, _n.cfs=1, _b.cfs=1, _g.cfs=1, _3.cfs=1, _5.tvd=1, _k.cfs=1, _f.cfs=1, _8.cfs=1, _o.cfs=1}

Stack Trace:
java.lang.RuntimeException: MockDirectoryWrapper: cannot close: there are still 29 open files: {_m.cfs=1, _7.cfs=1, _c.cfs=1, _2.cfs=1, _h.cfs=1, _l.cfs=1, _1.cfs=1, _6.cfs=1, _d.cfs=1, _i.cfs=1, _q.cfs=1, _5.fdx=1, _5.fdt=1, _5.tvx=1, _0.cfs=1, _j.cfs=1, _9.cfs=1, _e.cfs=1, _a.cfs=1, _p.cfs=1, _n.cfs=1, _b.cfs=1, _g.cfs=1, _3.cfs=1, _5.tvd=1, _k.cfs=1, _f.cfs=1, _8.cfs=1, _o.cfs=1}
	at __randomizedtesting.SeedInfo.seed([DCE654447CCFA75:5A9842A5E27DBF2B]:0)
	at org.apache.lucene.store.MockDirectoryWrapper.close(MockDirectoryWrapper.java:838)
	at org.apache.lucene.index.TestIndexWriterWithThreads._testMultipleThreadsFailure(TestIndexWriterWithThreads.java:341)
	at org.apache.lucene.index.TestIndexWriterWithThreads.testIOExceptionDuringAbortWithThreadsOnlyOnce(TestIndexWriterWithThreads.java:464)
	at sun.reflect.NativeMethodAccessorImpl.invoke0(Native Method)
	at sun.reflect.NativeMethodAccessorImpl.invoke(NativeMethodAccessorImpl.java:62)
	at sun.reflect.DelegatingMethodAccessorImpl.invoke(DelegatingMethodAccessorImpl.java:43)
	at java.lang.reflect.Method.invoke(Method.java:498)
	at com.carrotsearch.randomizedtesting.RandomizedRunner.invoke(RandomizedRunner.java:1742)
	at com.carrotsearch.randomizedtesting.RandomizedRunner$8.evaluate(RandomizedRunner.java:935)
	at com.carrotsearch.randomizedtesting.RandomizedRunner$9.evaluate(RandomizedRunner.java:971)
	at com.carrotsearch.randomizedtesting.RandomizedRunner$10.evaluate(RandomizedRunner.java:985)
	at org.apache.lucene.util.TestRuleSetupTeardownChained$1.evaluate(TestRuleSetupTeardownChained.java:49)
	at org.apache.lucene.util.AbstractBeforeAfterRule$1.evaluate(AbstractBeforeAfterRule.java:45)
	at org.apache.lucene.util.TestRuleThreadAndTestName$1.evaluate(TestRuleThreadAndTestName.java:48)
	at org.apache.lucene.util.TestRuleIgnoreAfterMaxFailures$1.evaluate(TestRuleIgnoreAfterMaxFailures.java:64)
	at org.apache.lucene.util.TestRuleMarkFailure$1.evaluate(TestRuleMarkFailure.java:47)
	at com.carrotsearch.randomizedtesting.rules.StatementAdapter.evaluate(StatementAdapter.java:36)
	at com.carrotsearch.randomizedtesting.ThreadLeakControl$StatementRunner.run(ThreadLeakControl.java:368)
	at com.carrotsearch.randomizedtesting.ThreadLeakControl.forkTimeoutingTask(ThreadLeakControl.java:817)
	at com.carrotsearch.randomizedtesting.ThreadLeakControl$3.evaluate(ThreadLeakControl.java:468)
	at com.carrotsearch.randomizedtesting.RandomizedRunner.runSingleTest(RandomizedRunner.java:944)
	at com.carrotsearch.randomizedtesting.RandomizedRunner$5.evaluate(RandomizedRunner.java:830)
	at com.carrotsearch.randomizedtesting.RandomizedRunner$6.evaluate(RandomizedRunner.java:880)
	at com.carrotsearch.randomizedtesting.RandomizedRunner$7.evaluate(RandomizedRunner.java:891)
	at org.apache.lucene.util.AbstractBeforeAfterRule$1.evaluate(AbstractBeforeAfterRule.java:45)
	at com.carrotsearch.randomizedtesting.rules.StatementAdapter.evaluate(StatementAdapter.java:36)
	at org.apache.lucene.util.TestRuleStoreClassName$1.evaluate(TestRuleStoreClassName.java:41)
	at com.carrotsearch.randomizedtesting.rules.NoShadowingOrOverridesOnMethodsRule$1.evaluate(NoShadowingOrOverridesOnMethodsRule.java:40)
	at com.carrotsearch.randomizedtesting.rules.NoShadowingOrOverridesOnMethodsRule$1.evaluate(NoShadowingOrOverridesOnMethodsRule.java:40)
	at com.carrotsearch.randomizedtesting.rules.StatementAdapter.evaluate(StatementAdapter.java:36)
	at com.carrotsearch.randomizedtesting.rules.StatementAdapter.evaluate(StatementAdapter.java:36)
	at com.carrotsearch.randomizedtesting.rules.StatementAdapter.evaluate(StatementAdapter.java:36)
	at org.apache.lucene.util.TestRuleAssertionsRequired$1.evaluate(TestRuleAssertionsRequired.java:53)
	at org.apache.lucene.util.TestRuleMarkFailure$1.evaluate(TestRuleMarkFailure.java:47)
	at org.apache.lucene.util.TestRuleIgnoreAfterMaxFailures$1.evaluate(TestRuleIgnoreAfterMaxFailures.java:64)
	at org.apache.lucene.util.TestRuleIgnoreTestSuites$1.evaluate(TestRuleIgnoreTestSuites.java:54)
	at com.carrotsearch.randomizedtesting.rules.StatementAdapter.evaluate(StatementAdapter.java:36)
	at com.carrotsearch.randomizedtesting.ThreadLeakControl$StatementRunner.run(ThreadLeakControl.java:368)
	at java.lang.Thread.run(Thread.java:748)
Caused by: java.lang.RuntimeException: unclosed IndexOutput: _5.tvx
	at org.apache.lucene.store.MockDirectoryWrapper.addFileHandle(MockDirectoryWrapper.java:730)
	at org.apache.lucene.store.MockDirectoryWrapper.createOutput(MockDirectoryWrapper.java:669)
	at org.apache.lucene.store.LockValidatingDirectoryWrapper.createOutput(LockValidatingDirectoryWrapper.java:44)
	at org.apache.lucene.store.TrackingDirectoryWrapper.createOutput(TrackingDirectoryWrapper.java:43)
	at org.apache.lucene.codecs.compressing.CompressingTermVectorsWriter.<init>(CompressingTermVectorsWriter.java:221)
	at org.apache.lucene.codecs.compressing.CompressingTermVectorsFormat.vectorsWriter(CompressingTermVectorsFormat.java:98)
	at org.apache.lucene.index.TermVectorsConsumer.initTermVectorsWriter(TermVectorsConsumer.java:88)
	at org.apache.lucene.index.TermVectorsConsumer.finishDocument(TermVectorsConsumer.java:103)
	at org.apache.lucene.index.TermsHash.finishDocument(TermsHash.java:95)
	at org.apache.lucene.index.DefaultIndexingChain.processDocument(DefaultIndexingChain.java:418)
	at org.apache.lucene.index.DocumentsWriterPerThread.updateDocument(DocumentsWriterPerThread.java:251)
	at org.apache.lucene.index.DocumentsWriter.updateDocument(DocumentsWriter.java:494)
	at org.apache.lucene.index.IndexWriter.updateDocument(IndexWriter.java:1617)
	at org.apache.lucene.index.IndexWriter.updateDocument(IndexWriter.java:1609)
	at org.apache.lucene.index.TestIndexWriterWithThreads$IndexerThread.run(TestIndexWriterWithThreads.java:96)


FAILED:  junit.framework.TestSuite.org.apache.solr.cloud.HealthCheckHandlerTest

Error Message:
java.util.concurrent.TimeoutException: Could not connect to ZooKeeper 127.0.0.1:43736 within 30000 ms

Stack Trace:
org.apache.solr.common.SolrException: java.util.concurrent.TimeoutException: Could not connect to ZooKeeper 127.0.0.1:43736 within 30000 ms
	at __randomizedtesting.SeedInfo.seed([6796389A1DB7AAB1]:0)
	at org.apache.solr.common.cloud.SolrZkClient.<init>(SolrZkClient.java:184)
	at org.apache.solr.common.cloud.SolrZkClient.<init>(SolrZkClient.java:121)
	at org.apache.solr.common.cloud.SolrZkClient.<init>(SolrZkClient.java:116)
	at org.apache.solr.common.cloud.SolrZkClient.<init>(SolrZkClient.java:103)
	at org.apache.solr.cloud.MiniSolrCloudCluster.<init>(MiniSolrCloudCluster.java:233)
	at org.apache.solr.cloud.SolrCloudTestCase$Builder.build(SolrCloudTestCase.java:200)
	at org.apache.solr.cloud.SolrCloudTestCase$Builder.configure(SolrCloudTestCase.java:192)
	at org.apache.solr.cloud.HealthCheckHandlerTest.setupCluster(HealthCheckHandlerTest.java:44)
	at sun.reflect.NativeMethodAccessorImpl.invoke0(Native Method)
	at sun.reflect.NativeMethodAccessorImpl.invoke(NativeMethodAccessorImpl.java:62)
	at sun.reflect.DelegatingMethodAccessorImpl.invoke(DelegatingMethodAccessorImpl.java:43)
	at java.lang.reflect.Method.invoke(Method.java:498)
	at com.carrotsearch.randomizedtesting.RandomizedRunner.invoke(RandomizedRunner.java:1742)
	at com.carrotsearch.randomizedtesting.RandomizedRunner$6.evaluate(RandomizedRunner.java:875)
	at com.carrotsearch.randomizedtesting.RandomizedRunner$7.evaluate(RandomizedRunner.java:891)
	at com.carrotsearch.randomizedtesting.rules.StatementAdapter.evaluate(StatementAdapter.java:36)
	at com.carrotsearch.randomizedtesting.rules.SystemPropertiesRestoreRule$1.evaluate(SystemPropertiesRestoreRule.java:57)
	at org.apache.lucene.util.AbstractBeforeAfterRule$1.evaluate(AbstractBeforeAfterRule.java:45)
	at com.carrotsearch.randomizedtesting.rules.StatementAdapter.evaluate(StatementAdapter.java:36)
	at org.apache.lucene.util.TestRuleStoreClassName$1.evaluate(TestRuleStoreClassName.java:41)
	at com.carrotsearch.randomizedtesting.rules.NoShadowingOrOverridesOnMethodsRule$1.evaluate(NoShadowingOrOverridesOnMethodsRule.java:40)
	at com.carrotsearch.randomizedtesting.rules.NoShadowingOrOverridesOnMethodsRule$1.evaluate(NoShadowingOrOverridesOnMethodsRule.java:40)
	at com.carrotsearch.randomizedtesting.rules.StatementAdapter.evaluate(StatementAdapter.java:36)
	at com.carrotsearch.randomizedtesting.rules.StatementAdapter.evaluate(StatementAdapter.java:36)
	at com.carrotsearch.randomizedtesting.rules.StatementAdapter.evaluate(StatementAdapter.java:36)
	at org.apache.lucene.util.TestRuleAssertionsRequired$1.evaluate(TestRuleAssertionsRequired.java:53)
	at org.apache.lucene.util.TestRuleMarkFailure$1.evaluate(TestRuleMarkFailure.java:47)
	at org.apache.lucene.util.TestRuleIgnoreAfterMaxFailures$1.evaluate(TestRuleIgnoreAfterMaxFailures.java:64)
	at org.apache.lucene.util.TestRuleIgnoreTestSuites$1.evaluate(TestRuleIgnoreTestSuites.java:54)
	at com.carrotsearch.randomizedtesting.rules.StatementAdapter.evaluate(StatementAdapter.java:36)
	at com.carrotsearch.randomizedtesting.ThreadLeakControl$StatementRunner.run(ThreadLeakControl.java:368)
	at java.lang.Thread.run(Thread.java:748)
Caused by: java.util.concurrent.TimeoutException: Could not connect to ZooKeeper 127.0.0.1:43736 within 30000 ms
	at org.apache.solr.common.cloud.ConnectionManager.waitForConnected(ConnectionManager.java:232)
	at org.apache.solr.common.cloud.SolrZkClient.<init>(SolrZkClient.java:176)
	... 31 more


FAILED:  junit.framework.TestSuite.org.apache.solr.cloud.HealthCheckHandlerTest

Error Message:
4 threads leaked from SUITE scope at org.apache.solr.cloud.HealthCheckHandlerTest:     1) Thread[id=20383, name=SessionTracker, state=TIMED_WAITING, group=TGRP-HealthCheckHandlerTest]         at java.lang.Object.wait(Native Method)         at org.apache.zookeeper.server.SessionTrackerImpl.run(SessionTrackerImpl.java:147)    2) Thread[id=20382, name=NIOServerCxn.Factory:0.0.0.0/0.0.0.0:0, state=RUNNABLE, group=TGRP-HealthCheckHandlerTest]         at sun.nio.ch.DevPollArrayWrapper.poll0(Native Method)         at sun.nio.ch.DevPollArrayWrapper.poll(DevPollArrayWrapper.java:223)         at sun.nio.ch.DevPollSelectorImpl.doSelect(DevPollSelectorImpl.java:98)         at sun.nio.ch.SelectorImpl.lockAndDoSelect(SelectorImpl.java:86)         at sun.nio.ch.SelectorImpl.select(SelectorImpl.java:97)         at org.apache.zookeeper.server.NIOServerCnxnFactory.run(NIOServerCnxnFactory.java:196)         at java.lang.Thread.run(Thread.java:748)    3) Thread[id=20381, name=Thread-3938, state=WAITING, group=TGRP-HealthCheckHandlerTest]         at java.lang.Object.wait(Native Method)         at java.lang.Thread.join(Thread.java:1252)         at java.lang.Thread.join(Thread.java:1326)         at org.apache.zookeeper.server.NIOServerCnxnFactory.join(NIOServerCnxnFactory.java:313)         at org.apache.solr.cloud.ZkTestServer$ZKServerMain.runFromConfig(ZkTestServer.java:313)         at org.apache.solr.cloud.ZkTestServer$2.run(ZkTestServer.java:496)    4) Thread[id=20385, name=ProcessThread(sid:0 cport:43736):, state=WAITING, group=TGRP-HealthCheckHandlerTest]         at sun.misc.Unsafe.park(Native Method)         at java.util.concurrent.locks.LockSupport.park(LockSupport.java:175)         at java.util.concurrent.locks.AbstractQueuedSynchronizer$ConditionObject.await(AbstractQueuedSynchronizer.java:2039)         at java.util.concurrent.LinkedBlockingQueue.take(LinkedBlockingQueue.java:442)         at org.apache.zookeeper.server.PrepRequestProcessor.run(PrepRequestProcessor.java:123)

Stack Trace:
com.carrotsearch.randomizedtesting.ThreadLeakError: 4 threads leaked from SUITE scope at org.apache.solr.cloud.HealthCheckHandlerTest: 
   1) Thread[id=20383, name=SessionTracker, state=TIMED_WAITING, group=TGRP-HealthCheckHandlerTest]
        at java.lang.Object.wait(Native Method)
        at org.apache.zookeeper.server.SessionTrackerImpl.run(SessionTrackerImpl.java:147)
   2) Thread[id=20382, name=NIOServerCxn.Factory:0.0.0.0/0.0.0.0:0, state=RUNNABLE, group=TGRP-HealthCheckHandlerTest]
        at sun.nio.ch.DevPollArrayWrapper.poll0(Native Method)
        at sun.nio.ch.DevPollArrayWrapper.poll(DevPollArrayWrapper.java:223)
        at sun.nio.ch.DevPollSelectorImpl.doSelect(DevPollSelectorImpl.java:98)
        at sun.nio.ch.SelectorImpl.lockAndDoSelect(SelectorImpl.java:86)
        at sun.nio.ch.SelectorImpl.select(SelectorImpl.java:97)
        at org.apache.zookeeper.server.NIOServerCnxnFactory.run(NIOServerCnxnFactory.java:196)
        at java.lang.Thread.run(Thread.java:748)
   3) Thread[id=20381, name=Thread-3938, state=WAITING, group=TGRP-HealthCheckHandlerTest]
        at java.lang.Object.wait(Native Method)
        at java.lang.Thread.join(Thread.java:1252)
        at java.lang.Thread.join(Thread.java:1326)
        at org.apache.zookeeper.server.NIOServerCnxnFactory.join(NIOServerCnxnFactory.java:313)
        at org.apache.solr.cloud.ZkTestServer$ZKServerMain.runFromConfig(ZkTestServer.java:313)
        at org.apache.solr.cloud.ZkTestServer$2.run(ZkTestServer.java:496)
   4) Thread[id=20385, name=ProcessThread(sid:0 cport:43736):, state=WAITING, group=TGRP-HealthCheckHandlerTest]
        at sun.misc.Unsafe.park(Native Method)
        at java.util.concurrent.locks.LockSupport.park(LockSupport.java:175)
        at java.util.concurrent.locks.AbstractQueuedSynchronizer$ConditionObject.await(AbstractQueuedSynchronizer.java:2039)
        at java.util.concurrent.LinkedBlockingQueue.take(LinkedBlockingQueue.java:442)
        at org.apache.zookeeper.server.PrepRequestProcessor.run(PrepRequestProcessor.java:123)
	at __randomizedtesting.SeedInfo.seed([6796389A1DB7AAB1]:0)


FAILED:  junit.framework.TestSuite.org.apache.solr.cloud.HealthCheckHandlerTest

Error Message:
There are still zombie threads that couldn't be terminated:    1) Thread[id=20382, name=NIOServerCxn.Factory:0.0.0.0/0.0.0.0:0, state=RUNNABLE, group=TGRP-HealthCheckHandlerTest]         at sun.nio.ch.IOUtil.drain(Native Method)         at sun.nio.ch.DevPollSelectorImpl.doSelect(DevPollSelectorImpl.java:109)         at sun.nio.ch.SelectorImpl.lockAndDoSelect(SelectorImpl.java:86)         at sun.nio.ch.SelectorImpl.select(SelectorImpl.java:97)         at org.apache.zookeeper.server.NIOServerCnxnFactory.run(NIOServerCnxnFactory.java:196)         at java.lang.Thread.run(Thread.java:748)

Stack Trace:
com.carrotsearch.randomizedtesting.ThreadLeakError: There are still zombie threads that couldn't be terminated:
   1) Thread[id=20382, name=NIOServerCxn.Factory:0.0.0.0/0.0.0.0:0, state=RUNNABLE, group=TGRP-HealthCheckHandlerTest]
        at sun.nio.ch.IOUtil.drain(Native Method)
        at sun.nio.ch.DevPollSelectorImpl.doSelect(DevPollSelectorImpl.java:109)
        at sun.nio.ch.SelectorImpl.lockAndDoSelect(SelectorImpl.java:86)
        at sun.nio.ch.SelectorImpl.select(SelectorImpl.java:97)
        at org.apache.zookeeper.server.NIOServerCnxnFactory.run(NIOServerCnxnFactory.java:196)
        at java.lang.Thread.run(Thread.java:748)
	at __randomizedtesting.SeedInfo.seed([6796389A1DB7AAB1]:0)




Build Log:
[...truncated 1431 lines...]
   [junit4] Suite: org.apache.lucene.index.TestIndexWriterWithThreads
   [junit4]   2> NOTE: reproduce with: ant test  -Dtestcase=TestIndexWriterWithThreads -Dtests.method=testIOExceptionDuringAbortWithThreadsOnlyOnce -Dtests.seed=DCE654447CCFA75 -Dtests.slow=true -Dtests.locale=sr-Latn-BA -Dtests.timezone=Africa/Accra -Dtests.asserts=true -Dtests.file.encoding=UTF-8
   [junit4] ERROR   0.09s J1 | TestIndexWriterWithThreads.testIOExceptionDuringAbortWithThreadsOnlyOnce <<<
   [junit4]    > Throwable #1: java.lang.RuntimeException: MockDirectoryWrapper: cannot close: there are still 29 open files: {_m.cfs=1, _7.cfs=1, _c.cfs=1, _2.cfs=1, _h.cfs=1, _l.cfs=1, _1.cfs=1, _6.cfs=1, _d.cfs=1, _i.cfs=1, _q.cfs=1, _5.fdx=1, _5.fdt=1, _5.tvx=1, _0.cfs=1, _j.cfs=1, _9.cfs=1, _e.cfs=1, _a.cfs=1, _p.cfs=1, _n.cfs=1, _b.cfs=1, _g.cfs=1, _3.cfs=1, _5.tvd=1, _k.cfs=1, _f.cfs=1, _8.cfs=1, _o.cfs=1}
   [junit4]    > 	at __randomizedtesting.SeedInfo.seed([DCE654447CCFA75:5A9842A5E27DBF2B]:0)
   [junit4]    > 	at org.apache.lucene.store.MockDirectoryWrapper.close(MockDirectoryWrapper.java:838)
   [junit4]    > 	at org.apache.lucene.index.TestIndexWriterWithThreads._testMultipleThreadsFailure(TestIndexWriterWithThreads.java:341)
   [junit4]    > 	at org.apache.lucene.index.TestIndexWriterWithThreads.testIOExceptionDuringAbortWithThreadsOnlyOnce(TestIndexWriterWithThreads.java:464)
   [junit4]    > 	at java.lang.Thread.run(Thread.java:748)
   [junit4]    > Caused by: java.lang.RuntimeException: unclosed IndexOutput: _5.tvx
   [junit4]    > 	at org.apache.lucene.store.MockDirectoryWrapper.addFileHandle(MockDirectoryWrapper.java:730)
   [junit4]    > 	at org.apache.lucene.store.MockDirectoryWrapper.createOutput(MockDirectoryWrapper.java:669)
   [junit4]    > 	at org.apache.lucene.store.LockValidatingDirectoryWrapper.createOutput(LockValidatingDirectoryWrapper.java:44)
   [junit4]    > 	at org.apache.lucene.store.TrackingDirectoryWrapper.createOutput(TrackingDirectoryWrapper.java:43)
   [junit4]    > 	at org.apache.lucene.codecs.compressing.CompressingTermVectorsWriter.<init>(CompressingTermVectorsWriter.java:221)
   [junit4]    > 	at org.apache.lucene.codecs.compressing.CompressingTermVectorsFormat.vectorsWriter(CompressingTermVectorsFormat.java:98)
   [junit4]    > 	at org.apache.lucene.index.TermVectorsConsumer.initTermVectorsWriter(TermVectorsConsumer.java:88)
   [junit4]    > 	at org.apache.lucene.index.TermVectorsConsumer.finishDocument(TermVectorsConsumer.java:103)
   [junit4]    > 	at org.apache.lucene.index.TermsHash.finishDocument(TermsHash.java:95)
   [junit4]    > 	at org.apache.lucene.index.DefaultIndexingChain.processDocument(DefaultIndexingChain.java:418)
   [junit4]    > 	at org.apache.lucene.index.DocumentsWriterPerThread.updateDocument(DocumentsWriterPerThread.java:251)
   [junit4]    > 	at org.apache.lucene.index.DocumentsWriter.updateDocument(DocumentsWriter.java:494)
   [junit4]    > 	at org.apache.lucene.index.IndexWriter.updateDocument(IndexWriter.java:1617)
   [junit4]    > 	at org.apache.lucene.index.IndexWriter.updateDocument(IndexWriter.java:1609)
   [junit4]    > 	at org.apache.lucene.index.TestIndexWriterWithThreads$IndexerThread.run(TestIndexWriterWithThreads.java:96)
   [junit4]   2> NOTE: test params are: codec=DummyCompressingStoredFields(storedFieldsFormat=CompressingStoredFieldsFormat(compressionMode=DUMMY, chunkSize=10, maxDocsPerChunk=86, blockSize=600), termVectorsFormat=CompressingTermVectorsFormat(compressionMode=DUMMY, chunkSize=10, blockSize=600)), sim=Asserting(org.apache.lucene.search.similarities.AssertingSimilarity@2dd7112b), locale=sr-Latn-BA, timezone=Africa/Accra
   [junit4]   2> NOTE: SunOS 5.11 amd64/Oracle Corporation 1.8.0_172 (64-bit)/cpus=3,threads=1,free=233646064,total=318005248
   [junit4]   2> NOTE: All tests run in this JVM: [TestTotalHitCountCollector, TestCompiledAutomaton, TestReadOnlyIndex, TestIndexWriter, TestAttributeSource, TestTermQuery, TestTopDocsCollector, TestByteArrayDataInput, TestNRTReaderCleanup, TestPolygon2D, TestExceedMaxTermLength, TestAllFilesDetectTruncation, TestOperations, TestLatLonPointDistanceSort, TestSPIClassIterator, TestUTF32ToUTF8, TestCharsRefBuilder, TestByteSlices, TestSegmentCacheables, TestSpanSearchEquivalence, TestReaderPool, TestWANDScorer, TestPositiveScoresOnlyCollector, TestLucene60PointsFormat, TestParallelTermEnum, TestDistributionSPL, TestStressIndexing2, TestCodecHoldsOpenFiles, TestIndexSearcher, TestPackedTokenAttributeImpl, TestSpans, TestGeoUtils, TestIndexWriterDeleteByQuery, TestBufferedChecksum, TestPostingsOffsets, TestMaxTermFrequency, TestLongRange, TestLatLonPointQueries, TestWeakIdentityMap, TestOmitNorms, TestSortedSetDocValues, TestTieredMergePolicy, TestSimilarity, TestStopFilter, TestStringMSBRadixSorter, TestSpanNotQuery, TestSimilarity2, TestCachingTokenFilter, TestFlex, TestWildcardRandom, TestIndexWriterOnDiskFull, TestSetOnce, TestConjunctionDISI, TestPackedInts, TestRecyclingByteBlockAllocator, TestSoftDeletesDirectoryReaderWrapper, Test2BPagedBytes, TestFieldReuse, TestNRTThreads, TestIndexWriterFromReader, TestTransactionRollback, TestStressDeletes, TestLMDirichletSimilarity, TestOfflineSorter, TestMultiThreadTermVectors, TestSimpleFSLockFactory, TestNotDocIdSet, LimitedFiniteStringsIteratorTest, TestFixedBitSet, TestAutomatonQuery, TestPriorityQueue, TestScorerPerf, TestFastDecompressionMode, TestBKD, TestTerms, TestCustomNorms, TestForTooMuchCloning, TestCustomSearcherSort, TestPendingSoftDeletes, TestLevenshteinAutomata, TestMixedCodecs, TestLucene70DocValuesFormat, TestParallelLeafReader, TestDocumentsWriterDeleteQueue, TestTimSorterWorstCase, Test2BPostings, TestNorms, TestBasics, TestNGramPhraseQuery, TestLucene50StoredFieldsFormat, TestBM25Similarity, TestFutureObjects, TestSpanBoostQuery, TestAxiomaticF1LOG, TestLucene50TermVectorsFormat, TestPersistentSnapshotDeletionPolicy, TestBoolean2, TestBlockPostingsFormat, TestFrequencyTrackingRingBuffer, TestNewestSegment, TestDisjunctionMaxQuery, TestBagOfPositions, TestFieldCacheRewriteMethod, TestBinaryDocument, TestComplexExplanations, TestGraphTokenizers, TestTermVectorsWriter, TestEarlyTermination, TestFuzzyQuery, TestIndexWriterReader, TestSpanExplanationsOfNonMatches, TestIndexCommit, TestDoubleRangeFieldQueries, TestLucene50CompoundFormat, TestMinShouldMatch2, TestPerFieldPostingsFormat, TestIndexWriterExceptions2, TestSubScorerFreqs, TestBytesRefHash, TestFieldInfos, TestFilterWeight, TestSpanMultiTermQueryWrapper, TestFilterDirectory, TestDeletionPolicy, TestMatchesIterator, TestIndexWriterConfig, TestBlockPostingsFormat3, TestIndexWriterOnJRECrash, TestIndexWriterThreadsToSegments, TestIndexWriterWithThreads]
   [junit4] Completed [338/510 (1!)] on J1 in 7.42s, 14 tests, 1 error <<< FAILURES!

[...truncated 11854 lines...]
   [junit4] Suite: org.apache.solr.cloud.HealthCheckHandlerTest
   [junit4]   2> 1774714 INFO  (SUITE-HealthCheckHandlerTest-seed#[6796389A1DB7AAB1]-worker) [    ] o.a.s.SolrTestCaseJ4 SecureRandom sanity checks: test.solr.allowed.securerandom=null & java.security.egd=file:/dev/./urandom
   [junit4]   2> Creating dataDir: /export/home/jenkins/workspace/Lucene-Solr-master-Solaris/solr/build/solr-core/test/J1/temp/solr.cloud.HealthCheckHandlerTest_6796389A1DB7AAB1-001/init-core-data-001
   [junit4]   2> 1774715 WARN  (SUITE-HealthCheckHandlerTest-seed#[6796389A1DB7AAB1]-worker) [    ] o.a.s.SolrTestCaseJ4 startTrackingSearchers: numOpens=39 numCloses=39
   [junit4]   2> 1774715 INFO  (SUITE-HealthCheckHandlerTest-seed#[6796389A1DB7AAB1]-worker) [    ] o.a.s.SolrTestCaseJ4 Using PointFields (NUMERIC_POINTS_SYSPROP=true) w/NUMERIC_DOCVALUES_SYSPROP=true
   [junit4]   2> 1774717 INFO  (SUITE-HealthCheckHandlerTest-seed#[6796389A1DB7AAB1]-worker) [    ] o.a.s.SolrTestCaseJ4 Randomized ssl (false) and clientAuth (false) via: @org.apache.solr.util.RandomizeSSL(reason=, value=NaN, ssl=NaN, clientAuth=NaN)
   [junit4]   2> 1774717 INFO  (SUITE-HealthCheckHandlerTest-seed#[6796389A1DB7AAB1]-worker) [    ] o.a.s.c.MiniSolrCloudCluster Starting cluster of 1 servers in /export/home/jenkins/workspace/Lucene-Solr-master-Solaris/solr/build/solr-core/test/J1/temp/solr.cloud.HealthCheckHandlerTest_6796389A1DB7AAB1-001/tempDir-001
   [junit4]   2> 1774717 INFO  (SUITE-HealthCheckHandlerTest-seed#[6796389A1DB7AAB1]-worker) [    ] o.a.s.c.ZkTestServer STARTING ZK TEST SERVER
   [junit4]   2> 1774718 INFO  (Thread-3938) [    ] o.a.s.c.ZkTestServer client port:0.0.0.0/0.0.0.0:0
   [junit4]   2> 1774718 INFO  (Thread-3938) [    ] o.a.s.c.ZkTestServer Starting server
   [junit4]   2> 1774722 ERROR (Thread-3938) [    ] o.a.z.s.ZooKeeperServer ZKShutdownHandler is not registered, so ZooKeeper server won't take any action on ERROR or SHUTDOWN server state changes
   [junit4]   2> 1774818 INFO  (SUITE-HealthCheckHandlerTest-seed#[6796389A1DB7AAB1]-worker) [    ] o.a.s.c.ZkTestServer start zk server on port:43736
   [junit4]   2> 1774823 WARN  (SUITE-HealthCheckHandlerTest-seed#[6796389A1DB7AAB1]-worker-SendThread(127.0.0.1:43736)) [    ] o.a.z.ClientCnxn Session 0x0 for server 127.0.0.1/127.0.0.1:43736, unexpected error, closing socket connection and attempting reconnect
   [junit4]   2> java.io.IOException: Packet len1213486160 is out of range!
   [junit4]   2> 	at org.apache.zookeeper.ClientCnxnSocket.readLength(ClientCnxnSocket.java:113) ~[zookeeper-3.4.11.jar:3.4.11-37e277162d567b55a07d1755f0b31c32e93c01a0]
   [junit4]   2> 	at org.apache.zookeeper.ClientCnxnSocketNIO.doIO(ClientCnxnSocketNIO.java:79) ~[zookeeper-3.4.11.jar:3.4.11-37e277162d567b55a07d1755f0b31c32e93c01a0]
   [junit4]   2> 	at org.apache.zookeeper.ClientCnxnSocketNIO.doTransport(ClientCnxnSocketNIO.java:366) ~[zookeeper-3.4.11.jar:3.4.11-37e277162d567b55a07d1755f0b31c32e93c01a0]
   [junit4]   2> 	at org.apache.zookeeper.ClientCnxn$SendThread.run(ClientCnxn.java:1144) [zookeeper-3.4.11.jar:3.4.11-37e277162d567b55a07d1755f0b31c32e93c01a0]
   [junit4]   2> 1776225 WARN  (SUITE-HealthCheckHandlerTest-seed#[6796389A1DB7AAB1]-worker-SendThread(127.0.0.1:43736)) [    ] o.a.z.ClientCnxn Session 0x0 for server 127.0.0.1/127.0.0.1:43736, unexpected error, closing socket connection and attempting reconnect
   [junit4]   2> java.io.IOException: Packet len1213486160 is out of range!
   [junit4]   2> 	at org.apache.zookeeper.ClientCnxnSocket.readLength(ClientCnxnSocket.java:113) ~[zookeeper-3.4.11.jar:3.4.11-37e277162d567b55a07d1755f0b31c32e93c01a0]
   [junit4]   2> 	at org.apache.zookeeper.ClientCnxnSocketNIO.doIO(ClientCnxnSocketNIO.java:79) ~[zookeeper-3.4.11.jar:3.4.11-37e277162d567b55a07d1755f0b31c32e93c01a0]
   [junit4]   2> 	at org.apache.zookeeper.ClientCnxnSocketNIO.doTransport(ClientCnxnSocketNIO.java:366) ~[zookeeper-3.4.11.jar:3.4.11-37e277162d567b55a07d1755f0b31c32e93c01a0]
   [junit4]   2> 	at org.apache.zookeeper.ClientCnxn$SendThread.run(ClientCnxn.java:1144) [zookeeper-3.4.11.jar:3.4.11-37e277162d567b55a07d1755f0b31c32e93c01a0]
   [junit4]   2> 1777925 WARN  (SUITE-HealthCheckHandlerTest-seed#[6796389A1DB7AAB1]-worker-SendThread(127.0.0.1:43736)) [    ] o.a.z.ClientCnxn Session 0x0 for server 127.0.0.1/127.0.0.1:43736, unexpected error, closing socket connection and attempting reconnect
   [junit4]   2> java.io.IOException: Packet len1213486160 is out of range!
   [junit4]   2> 	at org.apache.zookeeper.ClientCnxnSocket.readLength(ClientCnxnSocket.java:113) ~[zookeeper-3.4.11.jar:3.4.11-37e277162d567b55a07d1755f0b31c32e93c01a0]
   [junit4]   2> 	at org.apache.zookeeper.ClientCnxnSocketNIO.doIO(ClientCnxnSocketNIO.java:79) ~[zookeeper-3.4.11.jar:3.4.11-37e277162d567b55a07d1755f0b31c32e93c01a0]
   [junit4]   2> 	at org.apache.zookeeper.ClientCnxnSocketNIO.doTransport(ClientCnxnSocketNIO.java:366) ~[zookeeper-3.4.11.jar:3.4.11-37e277162d567b55a07d1755f0b31c32e93c01a0]
   [junit4]   2> 	at org.apache.zookeeper.ClientCnxn$SendThread.run(ClientCnxn.java:1144) [zookeeper-3.4.11.jar:3.4.11-37e277162d567b55a07d1755f0b31c32e93c01a0]
   [junit4]   2> 1779833 WARN  (SUITE-HealthCheckHandlerTest-seed#[6796389A1DB7AAB1]-worker-SendThread(127.0.0.1:43736)) [    ] o.a.z.ClientCnxn Session 0x0 for server 127.0.0.1/127.0.0.1:43736, unexpected error, closing socket connection and attempting reconnect
   [junit4]   2> java.io.IOException: Packet len1213486160 is out of range!
   [junit4]   2> 	at org.apache.zookeeper.ClientCnxnSocket.readLength(ClientCnxnSocket.java:113) ~[zookeeper-3.4.11.jar:3.4.11-37e277162d567b55a07d1755f0b31c32e93c01a0]
   [junit4]   2> 	at org.apache.zookeeper.ClientCnxnSocketNIO.doIO(ClientCnxnSocketNIO.java:79) ~[zookeeper-3.4.11.jar:3.4.11-37e277162d567b55a07d1755f0b31c32e93c01a0]
   [junit4]   2> 	at org.apache.zookeeper.ClientCnxnSocketNIO.doTransport(ClientCnxnSocketNIO.java:366) ~[zookeeper-3.4.11.jar:3.4.11-37e277162d567b55a07d1755f0b31c32e93c01a0]
   [junit4]   2> 	at org.apache.zookeeper.ClientCnxn$SendThread.run(ClientCnxn.java:1144) [zookeeper-3.4.11.jar:3.4.11-37e277162d567b55a07d1755f0b31c32e93c01a0]
   [junit4]   2> 1781275 WARN  (SUITE-HealthCheckHandlerTest-seed#[6796389A1DB7AAB1]-worker-SendThread(127.0.0.1:43736)) [    ] o.a.z.ClientCnxn Session 0x0 for server 127.0.0.1/127.0.0.1:43736, unexpected error, closing socket connection and attempting reconnect
   [junit4]   2> java.io.IOException: Packet len1213486160 is out of range!
   [junit4]   2> 	at org.apache.zookeeper.ClientCnxnSocket.readLength(ClientCnxnSocket.java:113) ~[zookeeper-3.4.11.jar:3.4.11-37e277162d567b55a07d1755f0b31c32e93c01a0]
   [junit4]   2> 	at org.apache.zookeeper.ClientCnxnSocketNIO.doIO(ClientCnxnSocketNIO.java:79) ~[zookeeper-3.4.11.jar:3.4.11-37e277162d567b55a07d1755f0b31c32e93c01a0]
   [junit4]   2> 	at org.apache.zookeeper.ClientCnxnSocketNIO.doTransport(ClientCnxnSocketNIO.java:366) ~[zookeeper-3.4.11.jar:3.4.11-37e277162d567b55a07d1755f0b31c32e93c01a0]
   [junit4]   2> 	at org.apache.zookeeper.ClientCnxn$SendThread.run(ClientCnxn.java:1144) [zookeeper-3.4.11.jar:3.4.11-37e277162d567b55a07d1755f0b31c32e93c01a0]
   [junit4]   2> 1782675 WARN  (SUITE-HealthCheckHandlerTest-seed#[6796389A1DB7AAB1]-worker-SendThread(127.0.0.1:43736)) [    ] o.a.z.ClientCnxn Session 0x0 for server 127.0.0.1/127.0.0.1:43736, unexpected error, closing socket connection and attempting reconnect
   [junit4]   2> java.io.IOException: Packet len1213486160 is out of range!
   [junit4]   2> 	at org.apache.zookeeper.ClientCnxnSocket.readLength(ClientCnxnSocket.java:113) ~[zookeeper-3.4.11.jar:3.4.11-37e277162d567b55a07d1755f0b31c32e93c01a0]
   [junit4]   2> 	at org.apache.zookeeper.ClientCnxnSocketNIO.doIO(ClientCnxnSocketNIO.java:79) ~[zookeeper-3.4.11.jar:3.4.11-37e277162d567b55a07d1755f0b31c32e93c01a0]
   [junit4]   2> 	at org.apache.zookeeper.ClientCnxnSocketNIO.doTransport(ClientCnxnSocketNIO.java:366) ~[zookeeper-3.4.11.jar:3.4.11-37e277162d567b55a07d1755f0b31c32e93c01a0]
   [junit4]   2> 	at org.apache.zookeeper.ClientCnxn$SendThread.run(ClientCnxn.java:1144) [zookeeper-3.4.11.jar:3.4.11-37e277162d567b55a07d1755f0b31c32e93c01a0]
   [junit4]   2> 1784846 WARN  (SUITE-HealthCheckHandlerTest-seed#[6796389A1DB7AAB1]-worker-SendThread(127.0.0.1:43736)) [    ] o.a.z.ClientCnxn Session 0x0 for server 127.0.0.1/127.0.0.1:43736, unexpected error, closing socket connection and attempting reconnect
   [junit4]   2> java.io.IOException: Packet len1213486160 is out of range!
   [junit4]   2> 	at org.apache.zookeeper.ClientCnxnSocket.readLength(ClientCnxnSocket.java:113) ~[zookeeper-3.4.11.jar:3.4.11-37e277162d567b55a07d1755f0b31c32e93c01a0]
   [junit4]   2> 	at org.apache.zookeeper.ClientCnxnSocketNIO.doIO(ClientCnxnSocketNIO.java:79) ~[zookeeper-3.4.11.jar:3.4.11-37e277162d567b55a07d1755f0b31c32e93c01a0]
   [junit4]   2> 	at org.apache.zookeeper.ClientCnxnSocketNIO.doTransport(ClientCnxnSocketNIO.java:366) ~[zookeeper-3.4.11.jar:3.4.11-37e277162d567b55a07d1755f0b31c32e93c01a0]
   [junit4]   2> 	at org.apache.zookeeper.ClientCnxn$SendThread.run(ClientCnxn.java:1144) [zookeeper-3.4.11.jar:3.4.11-37e277162d567b55a07d1755f0b31c32e93c01a0]
   [junit4]   2> 1786847 WARN  (SUITE-HealthCheckHandlerTest-seed#[6796389A1DB7AAB1]-worker-SendThread(127.0.0.1:43736)) [    ] o.a.z.ClientCnxn Session 0x0 for server 127.0.0.1/127.0.0.1:43736, unexpected error, closing socket connection and attempting reconnect
   [junit4]   2> java.io.IOException: Packet len1213486160 is out of range!
   [junit4]   2> 	at org.apache.zookeeper.ClientCnxnSocket.readLength(ClientCnxnSocket.java:113) ~[zookeeper-3.4.11.jar:3.4.11-37e277162d567b55a07d1755f0b31c32e93c01a0]
   [junit4]   2> 	at org.apache.zookeeper.ClientCnxnSocketNIO.doIO(ClientCnxnSocketNIO.java:79) ~[zookeeper-3.4.11.jar:3.4.11-37e277162d567b55a07d1755f0b31c32e93c01a0]
   [junit4]   2> 	at org.apache.zookeeper.ClientCnxnSocketNIO.doTransport(ClientCnxnSocketNIO.java:366) ~[zookeeper-3.4.11.jar:3.4.11-37e277162d567b55a07d1755f0b31c32e93c01a0]
   [junit4]   2> 	at org.apache.zookeeper.ClientCnxn$SendThread.run(ClientCnxn.java:1144) [zookeeper-3.4.11.jar:3.4.11-37e277162d567b55a07d1755f0b31c32e93c01a0]
   [junit4]   2> 1788475 WARN  (SUITE-HealthCheckHandlerTest-seed#[6796389A1DB7AAB1]-worker-SendThread(127.0.0.1:43736)) [    ] o.a.z.ClientCnxn Session 0x0 for server 127.0.0.1/127.0.0.1:43736, unexpected error, closing socket connection and attempting reconnect
   [junit4]   2> java.io.IOException: Packet len1213486160 is out of range!
   [junit4]   2> 	at org.apache.zookeeper.ClientCnxnSocket.readLength(ClientCnxnSocket.java:113) ~[zookeeper-3.4.11.jar:3.4.11-37e277162d567b55a07d1755f0b31c32e93c01a0]
   [junit4]   2> 	at org.apache.zookeeper.ClientCnxnSocketNIO.doIO(ClientCnxnSocketNIO.java:79) ~[zookeeper-3.4.11.jar:3.4.11-37e277162d567b55a07d1755f0b31c32e93c01a0]
   [junit4]   2> 	at org.apache.zookeeper.ClientCnxnSocketNIO.doTransport(ClientCnxnSocketNIO.java:366) ~[zookeeper-3.4.11.jar:3.4.11-37e277162d567b55a07d1755f0b31c32e93c01a0]
   [junit4]   2> 	at org.apache.zookeeper.ClientCnxn$SendThread.run(ClientCnxn.java:1144) [zookeeper-3.4.11.jar:3.4.11-37e277162d567b55a07d1755f0b31c32e93c01a0]
   [junit4]   2> 1790178 WARN  (SUITE-HealthCheckHandlerTest-seed#[6796389A1DB7AAB1]-worker-SendThread(127.0.0.1:43736)) [    ] o.a.z.ClientCnxn Session 0x0 for server 127.0.0.1/127.0.0.1:43736, unexpected error, closing socket connection and attempting reconnect
   [junit4]   2> java.io.IOException: Packet len1213486160 is out of range!
   [junit4]   2> 	at org.apache.zookeeper.ClientCnxnSocket.readLength(ClientCnxnSocket.java:113) ~[zookeeper-3.4.11.jar:3.4.11-37e277162d567b55a07d1755f0b31c32e93c01a0]
   [junit4]   2> 	at org.apache.zookeeper.ClientCnxnSocketNIO.doIO(ClientCnxnSocketNIO.java:79) ~[zookeeper-3.4.11.jar:3.4.11-37e277162d567b55a07d1755f0b31c32e93c01a0]
   [junit4]   2> 	at org.apache.zookeeper.ClientCnxnSocketNIO.doTransport(ClientCnxnSocketNIO.java:366) ~[zookeeper-3.4.11.jar:3.4.11-37e277162d567b55a07d1755f0b31c32e93c01a0]
   [junit4]   2> 	at org.apache.zookeeper.ClientCnxn$SendThread.run(ClientCnxn.java:1144) [zookeeper-3.4.11.jar:3.4.11-37e277162d567b55a07d1755f0b31c32e93c01a0]
   [junit4]   2> 1791674 WARN  (SUITE-HealthCheckHandlerTest-seed#[6796389A1DB7AAB1]-worker-SendThread(127.0.0.1:43736)) [    ] o.a.z.ClientCnxn Session 0x0 for server 127.0.0.1/127.0.0.1:43736, unexpected error, closing socket connection and attempting reconnect
   [junit4]   2> java.io.IOException: Packet len1213486160 is out of range!
   [junit4]   2> 	at org.apache.zookeeper.ClientCnxnSocket.readLength(ClientCnxnSocket.java:113) ~[zookeeper-3.4.11.jar:3.4.11-37e277162d567b55a07d1755f0b31c32e93c01a0]
   [junit4]   2> 	at org.apache.zookeeper.ClientCnxnSocketNIO.doIO(ClientCnxnSocketNIO.java:79) ~[zookeeper-3.4.11.jar:3.4.11-37e277162d567b55a07d1755f0b31c32e93c01a0]
   [junit4]   2> 	at org.apache.zookeeper.ClientCnxnSocketNIO.doTransport(ClientCnxnSocketNIO.java:366) ~[zookeeper-3.4.11.jar:3.4.11-37e277162d567b55a07d1755f0b31c32e93c01a0]
   [junit4]   2> 	at org.apache.zookeeper.ClientCnxn$SendThread.run(ClientCnxn.java:1144) [zookeeper-3.4.11.jar:3.4.11-37e277162d567b55a07d1755f0b31c32e93c01a0]
   [junit4]   2> 1793026 WARN  (SUITE-HealthCheckHandlerTest-seed#[6796389A1DB7AAB1]-worker-SendThread(127.0.0.1:43736)) [    ] o.a.z.ClientCnxn Session 0x0 for server 127.0.0.1/127.0.0.1:43736, unexpected error, closing socket connection and attempting reconnect
   [junit4]   2> java.io.IOException: Packet len1213486160 is out of range!
   [junit4]   2> 	at org.apache.zookeeper.ClientCnxnSocket.readLength(ClientCnxnSocket.java:113) ~[zookeeper-3.4.11.jar:3.4.11-37e277162d567b55a07d1755f0b31c32e93c01a0]
   [junit4]   2> 	at org.apache.zookeeper.ClientCnxnSocketNIO.doIO(ClientCnxnSocketNIO.java:79) ~[zookeeper-3.4.11.jar:3.4.11-37e277162d567b55a07d1755f0b31c32e93c01a0]
   [junit4]   2> 	at org.apache.zookeeper.ClientCnxnSocketNIO.doTransport(ClientCnxnSocketNIO.java:366) ~[zookeeper-3.4.11.jar:3.4.11-37e277162d567b55a07d1755f0b31c32e93c01a0]
   [junit4]   2> 	at org.apache.zookeeper.ClientCnxn$SendThread.run(ClientCnxn.java:1144) [zookeeper-3.4.11.jar:3.4.11-37e277162d567b55a07d1755f0b31c32e93c01a0]
   [junit4]   2> 1794437 WARN  (SUITE-HealthCheckHandlerTest-seed#[6796389A1DB7AAB1]-worker-SendThread(127.0.0.1:43736)) [    ] o.a.z.ClientCnxn Session 0x0 for server 127.0.0.1/127.0.0.1:43736, unexpected error, closing socket connection and attempting reconnect
   [junit4]   2> java.io.IOException: Packet len1213486160 is out of range!
   [junit4]   2> 	at org.apache.zookeeper.ClientCnxnSocket.readLength(ClientCnxnSocket.java:113) ~[zookeeper-3.4.11.jar:3.4.11-37e277162d567b55a07d1755f0b31c32e93c01a0]
   [junit4]   2> 	at org.apache.zookeeper.ClientCnxnSocketNIO.doIO(ClientCnxnSocketNIO.java:79) ~[zookeeper-3.4.11.jar:3.4.11-37e277162d567b55a07d1755f0b31c32e93c01a0]
   [junit4]   2> 	at org.apache.zookeeper.ClientCnxnSocketNIO.doTransport(ClientCnxnSocketNIO.java:366) ~[zookeeper-3.4.11.jar:3.4.11-37e277162d567b55a07d1755f0b31c32e93c01a0]
   [junit4]   2> 	at org.apache.zookeeper.ClientCnxn$SendThread.run(ClientCnxn.java:1144) [zookeeper-3.4.11.jar:3.4.11-37e277162d567b55a07d1755f0b31c32e93c01a0]
   [junit4]   2> 1795976 WARN  (SUITE-HealthCheckHandlerTest-seed#[6796389A1DB7AAB1]-worker-SendThread(127.0.0.1:43736)) [    ] o.a.z.ClientCnxn Session 0x0 for server 127.0.0.1/127.0.0.1:43736, unexpected error, closing socket connection and attempting reconnect
   [junit4]   2> java.io.IOException: Packet len1213486160 is out of range!
   [junit4]   2> 	at org.apache.zookeeper.ClientCnxnSocket.readLength(ClientCnxnSocket.java:113) ~[zookeeper-3.4.11.jar:3.4.11-37e277162d567b55a07d1755f0b31c32e93c01a0]
   [junit4]   2> 	at org.apache.zookeeper.ClientCnxnSocketNIO.doIO(ClientCnxnSocketNIO.java:79) ~[zookeeper-3.4.11.jar:3.4.11-37e277162d567b55a07d1755f0b31c32e93c01a0]
   [junit4]   2> 	at org.apache.zookeeper.ClientCnxnSocketNIO.doTransport(ClientCnxnSocketNIO.java:366) ~[zookeeper-3.4.11.jar:3.4.11-37e277162d567b55a07d1755f0b31c32e93c01a0]
   [junit4]   2> 	at org.apache.zookeeper.ClientCnxn$SendThread.run(ClientCnxn.java:1144) [zookeeper-3.4.11.jar:3.4.11-37e277162d567b55a07d1755f0b31c32e93c01a0]
   [junit4]   2> 1797376 WARN  (SUITE-HealthCheckHandlerTest-seed#[6796389A1DB7AAB1]-worker-SendThread(127.0.0.1:43736)) [    ] o.a.z.ClientCnxn Session 0x0 for server 127.0.0.1/127.0.0.1:43736, unexpected error, closing socket connection and attempting reconnect
   [junit4]   2> java.io.IOException: Packet len1213486160 is out of range!
   [junit4]   2> 	at org.apache.zookeeper.ClientCnxnSocket.readLength(ClientCnxnSocket.java:113) ~[zookeeper-3.4.11.jar:3.4.11-37e277162d567b55a07d1755f0b31c32e93c01a0]
   [junit4]   2> 	at org.apache.zookeeper.ClientCnxnSocketNIO.doIO(ClientCnxnSocketNIO.java:79) ~[zookeeper-3.4.11.jar:3.4.11-37e277162d567b55a07d1755f0b31c32e93c01a0]
   [junit4]   2> 	at org.apache.zookeeper.ClientCnxnSocketNIO.doTransport(ClientCnxnSocketNIO.java:366) ~[zookeeper-3.4.11.jar:3.4.11-37e277162d567b55a07d1755f0b31c32e93c01a0]
   [junit4]   2> 	at org.apache.zookeeper.ClientCnxn$SendThread.run(ClientCnxn.java:1144) [zookeeper-3.4.11.jar:3.4.11-37e277162d567b55a07d1755f0b31c32e93c01a0]
   [junit4]   2> 1799446 WARN  (SUITE-HealthCheckHandlerTest-seed#[6796389A1DB7AAB1]-worker-SendThread(127.0.0.1:43736)) [    ] o.a.z.ClientCnxn Session 0x0 for server 127.0.0.1/127.0.0.1:43736, unexpected error, closing socket connection and attempting reconnect
   [junit4]   2> java.io.IOException: Packet len1213486160 is out of range!
   [junit4]   2> 	at org.apache.zookeeper.ClientCnxnSocket.readLength(ClientCnxnSocket.java:113) ~[zookeeper-3.4.11.jar:3.4.11-37e277162d567b55a07d1755f0b31c32e93c01a0]
   [junit4]   2> 	at org.apache.zookeeper.ClientCnxnSocketNIO.doIO(ClientCnxnSocketNIO.java:79) ~[zookeeper-3.4.11.jar:3.4.11-37e277162d567b55a07d1755f0b31c32e93c01a0]
   [junit4]   2> 	at org.apache.zookeeper.ClientCnxnSocketNIO.doTransport(ClientCnxnSocketNIO.java:366) ~[zookeeper-3.4.11.jar:3.4.11-37e277162d567b55a07d1755f0b31c32e93c01a0]
   [junit4]   2> 	at org.apache.zookeeper.ClientCnxn$SendThread.run(ClientCnxn.java:1144) [zookeeper-3.4.11.jar:3.4.11-37e277162d567b55a07d1755f0b31c32e93c01a0]
   [junit4]   2> 1801128 WARN  (SUITE-HealthCheckHandlerTest-seed#[6796389A1DB7AAB1]-worker-SendThread(127.0.0.1:43736)) [    ] o.a.z.ClientCnxn Session 0x0 for server 127.0.0.1/127.0.0.1:43736, unexpected error, closing socket connection and attempting reconnect
   [junit4]   2> java.io.IOException: Packet len1213486160 is out of range!
   [junit4]   2> 	at org.apache.zookeeper.ClientCnxnSocket.readLength(ClientCnxnSocket.java:113) ~[zookeeper-3.4.11.jar:3.4.11-37e277162d567b55a07d1755f0b31c32e93c01a0]
   [junit4]   2> 	at org.apache.zookeeper.ClientCnxnSocketNIO.doIO(ClientCnxnSocketNIO.java:79) ~[zookeeper-3.4.11.jar:3.4.11-37e277162d567b55a07d1755f0b31c32e93c01a0]
   [junit4]   2> 	at org.apache.zookeeper.ClientCnxnSocketNIO.doTransport(ClientCnxnSocketNIO.java:366) ~[zookeeper-3.4.11.jar:3.4.11-37e277162d567b55a07d1755f0b31c32e93c01a0]
   [junit4]   2> 	at org.apache.zookeeper.ClientCnxn$SendThread.run(ClientCnxn.java:1144) [zookeeper-3.4.11.jar:3.4.11-37e277162d567b55a07d1755f0b31c32e93c01a0]
   [junit4]   2> 1802628 WARN  (SUITE-HealthCheckHandlerTest-seed#[6796389A1DB7AAB1]-worker-SendThread(127.0.0.1:43736)) [    ] o.a.z.ClientCnxn Session 0x0 for server 127.0.0.1/127.0.0.1:43736, unexpected error, closing socket connection and attempting reconnect
   [junit4]   2> java.io.IOException: Packet len1213486160 is out of range!
   [junit4]   2> 	at org.apache.zookeeper.ClientCnxnSocket.readLength(ClientCnxnSocket.java:113) ~[zookeeper-3.4.11.jar:3.4.11-37e277162d567b55a07d1755f0b31c32e93c01a0]
   [junit4]   2> 	at org.apache.zookeeper.ClientCnxnSocketNIO.doIO(ClientCnxnSocketNIO.java:79) ~[zookeeper-3.4.11.jar:3.4.11-37e277162d567b55a07d1755f0b31c32e93c01a0]
   [junit4]   2> 	at org.apache.zookeeper.ClientCnxnSocketNIO.doTransport(ClientCnxnSocketNIO.java:366) ~[zookeeper-3.4.11.jar:3.4.11-37e277162d567b55a07d1755f0b31c32e93c01a0]
   [junit4]   2> 	at org.apache.zookeeper.ClientCnxn$SendThread.run(ClientCnxn.java:1144) [zookeeper-3.4.11.jar:3.4.11-37e277162d567b55a07d1755f0b31c32e93c01a0]
   [junit4]   2> 1804539 WARN  (SUITE-HealthCheckHandlerTest-seed#[6796389A1DB7AAB1]-worker-SendThread(127.0.0.1:43736)) [    ] o.a.z.ClientCnxn Session 0x0 for server 127.0.0.1/127.0.0.1:43736, unexpected error, closing socket connection and attempting reconnect
   [junit4]   2> java.io.IOException: Packet len1213486160 is out of range!
   [junit4]   2> 	at org.apache.zookeeper.ClientCnxnSocket.readLength(ClientCnxnSocket.java:113) ~[zookeeper-3.4.11.jar:3.4.11-37e277162d567b55a07d1755f0b31c32e93c01a0]
   [junit4]   2> 	at org.apache.zookeeper.ClientCnxnSocketNIO.doIO(ClientCnxnSocketNIO.java:79) ~[zookeeper-3.4.11.jar:3.4.11-37e277162d567b55a07d1755f0b31c32e93c01a0]
   [junit4]   2> 	at org.apache.zookeeper.ClientCnxnSocketNIO.doTransport(ClientCnxnSocketNIO.java:366) ~[zookeeper-3.4.11.jar:3.4.11-37e277162d567b55a07d1755f0b31c32e93c01a0]
   [junit4]   2> 	at org.apache.zookeeper.ClientCnxn$SendThread.run(ClientCnxn.java:1144) [zookeeper-3.4.11.jar:3.4.11-37e277162d567b55a07d1755f0b31c32e93c01a0]
   [junit4]   2> 1805819 INFO  (SUITE-HealthCheckHandlerTest-seed#[6796389A1DB7AAB1]-worker) [    ] o.a.s.SolrTestCaseJ4 ------------------------------------------------------- Done waiting for tracked resources to be released
   [junit4]   2> Oct 04, 2018 2:01:21 AM com.carrotsearch.randomizedtesting.ThreadLeakControl checkThreadLeaks
   [junit4]   2> WARNING: Will linger awaiting termination of 4 leaked thread(s).
   [junit4]   2> Oct 04, 2018 2:02:41 AM com.carrotsearch.randomizedtesting.ThreadLeakControl checkThreadLeaks
   [junit4]   2> SEVERE: 4 threads leaked from SUITE scope at org.apache.solr.cloud.HealthCheckHandlerTest: 
   [junit4]   2>    1) Thread[id=20383, name=SessionTracker, state=TIMED_WAITING, group=TGRP-HealthCheckHandlerTest]
   [junit4]   2>         at java.lang.Object.wait(Native Method)
   [junit4]   2>         at org.apache.zookeeper.server.SessionTrackerImpl.run(SessionTrackerImpl.java:147)
   [junit4]   2>    2) Thread[id=20382, name=NIOServerCxn.Factory:0.0.0.0/0.0.0.0:0, state=RUNNABLE, group=TGRP-HealthCheckHandlerTest]
   [junit4]   2>         at sun.nio.ch.DevPollArrayWrapper.poll0(Native Method)
   [junit4]   2>         at sun.nio.ch.DevPollArrayWrapper.poll(DevPollArrayWrapper.java:223)
   [junit4]   2>         at sun.nio.ch.DevPollSelectorImpl.doSelect(DevPollSelectorImpl.java:98)
   [junit4]   2>         at sun.nio.ch.SelectorImpl.lockAndDoSelect(SelectorImpl.java:86)
   [junit4]   2>         at sun.nio.ch.SelectorImpl.select(SelectorImpl.java:97)
   [junit4]   2>         at org.apache.zookeeper.server.NIOServerCnxnFactory.run(NIOServerCnxnFactory.java:196)
   [junit4]   2>         at java.lang.Thread.run(Thread.java:748)
   [junit4]   2>    3) Thread[id=20381, name=Thread-3938, state=WAITING, group=TGRP-HealthCheckHandlerTest]
   [junit4]   2>         at java.lang.Object.wait(Native Method)
   [junit4]   2>         at java.lang.Thread.join(Thread.java:1252)
   [junit4]   2>         at java.lang.Thread.join(Thread.java:1326)
   [junit4]   2>         at org.apache.zookeeper.server.NIOServerCnxnFactory.join(NIOServerCnxnFactory.java:313)
   [junit4]   2>         at org.apache.solr.cloud.ZkTestServer$ZKServerMain.runFromConfig(ZkTestServer.java:313)
   [junit4]   2>         at org.apache.solr.cloud.ZkTestServer$2.run(ZkTestServer.java:496)
   [junit4]   2>    4) Thread[id=20385, name=ProcessThread(sid:0 cport:43736):, state=WAITING, group=TGRP-HealthCheckHandlerTest]
   [junit4]   2>         at sun.misc.Unsafe.park(Native Method)
   [junit4]   2>         at java.util.concurrent.locks.LockSupport.park(LockSupport.java:175)
   [junit4]   2>         at java.util.concurrent.locks.AbstractQueuedSynchronizer$ConditionObject.await(AbstractQueuedSynchronizer.java:2039)
   [junit4]   2>         at java.util.concurrent.LinkedBlockingQueue.take(LinkedBlockingQueue.java:442)
   [junit4]   2>         at org.apache.zookeeper.server.PrepRequestProcessor.run(PrepRequestProcessor.java:123)
   [junit4]   2> Oct 04, 2018 2:02:41 AM com.carrotsearch.randomizedtesting.ThreadLeakControl tryToInterruptAll
   [junit4]   2> INFO: Starting to interrupt leaked threads:
   [junit4]   2>    1) Thread[id=20383, name=SessionTracker, state=TIMED_WAITING, group=TGRP-HealthCheckHandlerTest]
   [junit4]   2>    2) Thread[id=20382, name=NIOServerCxn.Factory:0.0.0.0/0.0.0.0:0, state=RUNNABLE, group=TGRP-HealthCheckHandlerTest]
   [junit4]   2>    3) Thread[id=20381, name=Thread-3938, state=WAITING, group=TGRP-HealthCheckHandlerTest]
   [junit4]   2>    4) Thread[id=20385, name=ProcessThread(sid:0 cport:43736):, state=WAITING, group=TGRP-HealthCheckHandlerTest]
   [junit4]   2> 1885892 ERROR (SessionTracker) [    ] o.a.z.s.ZooKeeperCriticalThread Severe unrecoverable error, from thread : SessionTracker
   [junit4]   2> java.lang.InterruptedException: null
   [junit4]   2> 	at java.lang.Object.wait(Native Method) ~[?:1.8.0_172]
   [junit4]   2> 	at org.apache.zookeeper.server.SessionTrackerImpl.run(SessionTrackerImpl.java:147) [zookeeper-3.4.11.jar:3.4.11-37e277162d567b55a07d1755f0b31c32e93c01a0]
   [junit4]   2> 1885893 ERROR (SessionTracker) [    ] o.a.z.s.ZooKeeperServer ZKShutdownHandler is not registered, so ZooKeeper server won't take any action on ERROR or SHUTDOWN server state changes
   [junit4]   2> 1885893 WARN  (Thread-3938) [    ] o.a.s.c.ZkTestServer Server interrupted
   [junit4]   2> java.lang.InterruptedException: null
   [junit4]   2> 	at java.lang.Object.wait(Native Method) ~[?:1.8.0_172]
   [junit4]   2> 	at java.lang.Thread.join(Thread.java:1252) ~[?:1.8.0_172]
   [junit4]   2> 	at java.lang.Thread.join(Thread.java:1326) ~[?:1.8.0_172]
   [junit4]   2> 	at org.apache.zookeeper.server.NIOServerCnxnFactory.join(NIOServerCnxnFactory.java:313) ~[zookeeper-3.4.11.jar:3.4.11-37e277162d567b55a07d1755f0b31c32e93c01a0]
   [junit4]   2> 	at org.apache.solr.cloud.ZkTestServer$ZKServerMain.runFromConfig(ZkTestServer.java:313) [java/:?]
   [junit4]   2> 	at org.apache.solr.cloud.ZkTestServer$2.run(ZkTestServer.java:496) [java/:?]
   [junit4]   2> 1885893 ERROR (ProcessThread(sid:0 cport:43736):) [    ] o.a.z.s.ZooKeeperCriticalThread Severe unrecoverable error, from thread : ProcessThread(sid:0 cport:43736):
   [junit4]   2> java.lang.InterruptedException: null
   [junit4]   2> 	at java.util.concurrent.locks.AbstractQueuedSynchronizer$ConditionObject.reportInterruptAfterWait(AbstractQueuedSynchronizer.java:2014) ~[?:1.8.0_172]
   [junit4]   2> 	at java.util.concurrent.locks.AbstractQueuedSynchronizer$ConditionObject.await(AbstractQueuedSynchronizer.java:2048) ~[?:1.8.0_172]
   [junit4]   2> 	at java.util.concurrent.LinkedBlockingQueue.take(LinkedBlockingQueue.java:442) ~[?:1.8.0_172]
   [junit4]   2> 	at org.apache.zookeeper.server.PrepRequestProcessor.run(PrepRequestProcessor.java:123) [zookeeper-3.4.11.jar:3.4.11-37e277162d567b55a07d1755f0b31c32e93c01a0]
   [junit4]   2> 1885893 ERROR (ProcessThread(sid:0 cport:43736):) [    ] o.a.z.s.ZooKeeperServer ZKShutdownHandler is not registered, so ZooKeeper server won't take any action on ERROR or SHUTDOWN server state changes
   [junit4]   2> Oct 04, 2018 2:02:45 AM com.carrotsearch.randomizedtesting.ThreadLeakControl tryToInterruptAll
   [junit4]   2> SEVERE: There are still zombie threads that couldn't be terminated:
   [junit4]   2>    1) Thread[id=20382, name=NIOServerCxn.Factory:0.0.0.0/0.0.0.0:0, state=RUNNABLE, group=TGRP-HealthCheckHandlerTest]
   [junit4]   2>         at sun.nio.ch.IOUtil.drain(Native Method)
   [junit4]   2>         at sun.nio.ch.DevPollSelectorImpl.doSelect(DevPollSelectorImpl.java:109)
   [junit4]   2>         at sun.nio.ch.SelectorImpl.lockAndDoSelect(SelectorImpl.java:86)
   [junit4]   2>         at sun.nio.ch.SelectorImpl.select(SelectorImpl.java:97)
   [junit4]   2>         at org.apache.zookeeper.server.NIOServerCnxnFactory.run(NIOServerCnxnFactory.java:196)
   [junit4]   2>         at java.lang.Thread.run(Thread.java:748)
   [junit4]   2> NOTE: test params are: codec=Asserting(Lucene80): {}, docValues:{}, maxPointsInLeafNode=1433, maxMBSortInHeap=6.623164728087234, sim=Asserting(org.apache.lucene.search.similarities.AssertingSimilarity@4bbca47a), locale=ko-KR, timezone=Asia/Novokuznetsk
   [junit4]   2> NOTE: SunOS 5.11 amd64/Oracle Corporation 1.8.0_172 (64-bit)/cpus=3,threads=3,free=271424208,total=518979584
   [junit4]   2> NOTE: All tests run in this JVM: [TestDocTermOrds, TestStressReorder, TestImplicitCoreProperties, RequiredFieldsTest, TestOrdValues, TestRebalanceLeaders, TestXmlQParser, JsonLoaderTest, TestPKIAuthenticationPlugin, TestRecovery, BlockJoinFacetDistribTest, TestDynamicLoading, SuggesterTSTTest, LargeFieldTest, CleanupOldIndexTest, SignificantTermsQParserPluginTest, TestUniqueKeyFieldResource, CurrencyRangeFacetCloudTest, BasicZkTest, CoreMergeIndexesAdminHandlerTest, TestSchemaManager, NodeAddedTriggerTest, TestCoreDiscovery, SystemLogListenerTest, TestSimGenericDistributedQueue, LeaderElectionIntegrationTest, ExitableDirectoryReaderTest, TestZkAclsWithHadoopAuth, V2ApiIntegrationTest, TestHdfsBackupRestoreCore, OverseerRolesTest, QueryResultKeyTest, CollectionsAPISolrJTest, TestSimDistribStateManager, BadCopyFieldTest, TestClusterProperties, TestSolrJ, TestSolrQueryResponse, TestInitQParser, DistanceFunctionTest, WrapperMergePolicyFactoryTest, ConfigSetsAPITest, TestRTGBase, SolrJmxReporterTest, TestFoldingMultitermQuery, TestFieldCacheVsDocValues, BlockDirectoryTest, MoveReplicaHDFSFailoverTest, OpenCloseCoreStressTest, OverseerCollectionConfigSetProcessorTest, TestSimClusterStateProvider, TestFileDictionaryLookup, SoftAutoCommitTest, DistributedExpandComponentTest, TestReplicationHandlerBackup, ForceLeaderTest, TestOnReconnectListenerSupport, HDFSCollectionsAPITest, TestJsonFacets, TestManagedResource, RankQueryTest, TestHighlightDedupGrouping, DeleteShardTest, ShowFileRequestHandlerTest, SolrRequestParserTest, TestSolrCoreParser, TestCharFilters, SolrMetricsIntegrationTest, TestBadConfig, TestManagedSynonymFilterFactory, TestCryptoKeys, TestDistribDocBasedVersion, TestPartialUpdateDeduplication, TestConfig, TestOverriddenPrefixQueryForCustomFieldType, TestFastLRUCache, NodeLostTriggerTest, TestSubQueryTransformerCrossCore, RulesTest, UpdateParamsTest, BlobRepositoryCloudTest, TestLRUCache, ChaosMonkeySafeLeaderWithPullReplicasTest, DistributedVersionInfoTest, TestLegacyFieldCache, AddBlockUpdateTest, WordBreakSolrSpellCheckerTest, TestRangeQuery, TestInPlaceUpdatesStandalone, TestTrieFacet, TestMultiWordSynonyms, DistributedFacetPivotSmallAdvancedTest, TestReload, NumberUtilsTest, UUIDUpdateProcessorFallbackTest, TestSimpleQParserPlugin, DistributedFacetPivotWhiteBoxTest, SystemInfoHandlerTest, TestLazyCores, TestSQLHandlerNonCloud, CollectionPropsTest, TaggingAttributeTest, TestStressLiveNodes, TestLeaderElectionZkExpiry, TestRestoreCore, TestCloudPivotFacet, TestRawTransformer, CdcrBootstrapTest, TestSolr4Spatial, Tagger2Test, SpellingQueryConverterTest, HdfsThreadLeakTest, DebugComponentTest, TestDocumentBuilder, VMParamsZkACLAndCredentialsProvidersTest, DocValuesMissingTest, SyncSliceTest, MetricsConfigTest, TestPushWriter, TestZkChroot, CachingDirectoryFactoryTest, BigEndianAscendingWordSerializerTest, TestExpandComponent, TestRandomFlRTGCloud, SolrCoreTest, SpellCheckComponentTest, TestDynamicFieldResource, TestLockTree, ShardRoutingTest, TermVectorComponentDistributedTest, TestCollectionAPIs, DistributedQueryComponentCustomSortTest, TestExportWriter, ScriptEngineTest, SolrCloudReportersTest, EmbeddedSolrNoSerializeTest, TestCloudConsistency, CollectionsAPIAsyncDistributedZkTest, MBeansHandlerTest, TolerantUpdateProcessorTest, TestSolrDeletionPolicy2, TestSkipOverseerOperations, DeleteNodeTest, TestPullReplica, BasicDistributedZk2Test, AutoAddReplicasPlanActionTest, TestSha256AuthenticationProvider, TestMaxScoreQueryParser, TestQuerySenderNoQuery, TestExactStatsCache, SolrRrdBackendFactoryTest, MigrateRouteKeyTest, CoreAdminOperationTest, TestEmbeddedSolrServerAdminHandler, BinaryUpdateRequestHandlerTest, DistribJoinFromCollectionTest, TestFieldResource, TestCustomStream, RecoveryZkTest, ResponseBuilderTest, ConnectionReuseTest, ClassificationUpdateProcessorIntegrationTest, CloneFieldUpdateProcessorFactoryTest, SpatialFilterTest, QueryEqualityTest, TestNRTOpen, SpatialRPTFieldTypeTest, TestSolrCloudWithKerberosAlt, PathHierarchyTokenizerFactoryTest, PingRequestHandlerTest, SolrTestCaseJ4Test, LegacyCloudClusterPropTest, HLLSerializationTest, IgnoreLargeDocumentProcessorFactoryTest, TestManagedSchemaAPI, BasicFunctionalityTest, HealthCheckHandlerTest]
   [junit4]   2> NOTE: reproduce with: ant test  -Dtestcase=HealthCheckHandlerTest -Dtests.seed=6796389A1DB7AAB1 -Dtests.slow=true -Dtests.locale=ko-KR -Dtests.timezone=Asia/Novokuznetsk -Dtests.asserts=true -Dtests.file.encoding=UTF-8
   [junit4] ERROR   0.00s J1 | HealthCheckHandlerTest (suite) <<<
   [junit4]    > Throwable #1: org.apache.solr.common.SolrException: java.util.concurrent.TimeoutException: Could not connect to ZooKeeper 127.0.0.1:43736 within 30000 ms
   [junit4]    > 	at __randomizedtesting.SeedInfo.seed([6796389A1DB7AAB1]:0)
   [junit4]    > 	at org.apache.solr.common.cloud.SolrZkClient.<init>(SolrZkClient.java:184)
   [junit4]    > 	at org.apache.solr.common.cloud.SolrZkClient.<init>(SolrZkClient.java:121)
   [junit4]    > 	at org.apache.solr.common.cloud.SolrZkClient.<init>(SolrZkClient.java:116)
   [junit4]    > 	at org.apache.solr.common.cloud.SolrZkClient.<init>(SolrZkClient.java:103)
   [junit4]    > 	at org.apache.solr.cloud.MiniSolrCloudCluster.<init>(MiniSolrCloudCluster.java:233)
   [junit4]    > 	at org.apache.solr.cloud.SolrCloudTestCase$Builder.build(SolrCloudTestCase.java:200)
   [junit4]    > 	at org.apache.solr.cloud.SolrCloudTestCase$Builder.configure(SolrCloudTestCase.java:192)
   [junit4]    > 	at org.apache.solr.cloud.HealthCheckHandlerTest.setupCluster(HealthCheckHandlerTest.java:44)
   [junit4]    > 	at java.lang.Thread.run(Thread.java:748)
   [junit4]    > Caused by: java.util.concurrent.TimeoutException: Could not connect to ZooKeeper 127.0.0.1:43736 within 30000 ms
   [junit4]    > 	at org.apache.solr.common.cloud.ConnectionManager.waitForConnected(ConnectionManager.java:232)
   [junit4]    > 	at org.apache.solr.common.cloud.SolrZkClient.<init>(SolrZkClient.java:176)
   [junit4]    > 	... 31 moreThrowable #2: com.carrotsearch.randomizedtesting.ThreadLeakError: 4 threads leaked from SUITE scope at org.apache.solr.cloud.HealthCheckHandlerTest: 
   [junit4]    >    1) Thread[id=20383, name=SessionTracker, state=TIMED_WAITING, group=TGRP-HealthCheckHandlerTest]
   [junit4]    >         at java.lang.Object.wait(Native Method)
   [junit4]    >         at org.apache.zookeeper.server.SessionTrackerImpl.run(SessionTrackerImpl.java:147)
   [junit4]    >    2) Thread[id=20382, name=NIOServerCxn.Factory:0.0.0.0/0.0.0.0:0, state=RUNNABLE, group=TGRP-HealthCheckHandlerTest]
   [junit4]    >         at sun.nio.ch.DevPollArrayWrapper.poll0(Native Method)
   [junit4]    >         at sun.nio.ch.DevPollArrayWrapper.poll(DevPollArrayWrapper.java:223)
   [junit4]    >         at sun.nio.ch.DevPollSelectorImpl.doSelect(DevPollSelectorImpl.java:98)
   [junit4]    >         at sun.nio.ch.SelectorImpl.lockAndDoSelect(SelectorImpl.java:86)
   [junit4]    >         at sun.nio.ch.SelectorImpl.select(SelectorImpl.java:97)
   [junit4]    >         at org.apache.zookeeper.server.NIOServerCnxnFactory.run(NIOServerCnxnFactory.java:196)
   [junit4]    >         at java.lang.Thread.run(Thread.java:748)
   [junit4]    >    3) Thread[id=20381, name=Thread-3938, state=WAITING, group=TGRP-HealthCheckHandlerTest]
   [junit4]    >         at java.lang.Object.wait(Native Method)
   [junit4]    >         at java.lang.Thread.join(Thread.java:1252)
   [junit4]    >         at java.lang.Thread.join(Thread.java:1326)
   [junit4]    >         at org.apache.zookeeper.server.NIOServerCnxnFactory.join(NIOServerCnxnFactory.java:313)
   [junit4]    >         at org.apache.solr.cloud.ZkTestServer$ZKServerMain.runFromConfig(ZkTestServer.java:313)
   [junit4]    >         at org.apache.solr.cloud.ZkTestServer$2.run(ZkTestServer.java:496)
   [junit4]    >    4) Thread[id=20385, name=ProcessThread(sid:0 cport:43736):, state=WAITING, group=TGRP-HealthCheckHandlerTest]
   [junit4]    >         at sun.misc.Unsafe.park(Native Method)
   [junit4]    >         at java.util.concurrent.locks.LockSupport.park(LockSupport.java:175)
   [junit4]    >         at java.util.concurrent.locks.AbstractQueuedSynchronizer$ConditionObject.await(AbstractQueuedSynchronizer.java:2039)
   [junit4]    >         at java.util.concurrent.LinkedBlockingQueue.take(LinkedBlockingQueue.java:442)
   [junit4]    >         at org.apache.zookeeper.server.PrepRequestProcessor.run(PrepRequestProcessor.java:123)
   [junit4]    > 	at __randomizedtesting.SeedInfo.seed([6796389A1DB7AAB1]:0)Throwable #3: com.carrotsearch.randomizedtesting.ThreadLeakError: There are still zombie threads that couldn't be terminated:
   [junit4]    >    1) Thread[id=20382, name=NIOServerCxn.Factory:0.0.0.0/0.0.0.0:0, state=RUNNABLE, group=TGRP-HealthCheckHandlerTest]
   [junit4]    >         at sun.nio.ch.IOUtil.drain(Native Method)
   [junit4]    >         at sun.nio.ch.DevPollSelectorImpl.doSelect(DevPollSelectorImpl.java:109)
   [junit4]    >         at sun.nio.ch.SelectorImpl.lockAndDoSelect(SelectorImpl.java:86)
   [junit4]    >         at sun.nio.ch.SelectorImpl.select(SelectorImpl.java:97)
   [junit4]    >         at org.apache.zookeeper.server.NIOServerCnxnFactory.run(NIOServerCnxnFactory.java:196)
   [junit4]    >         at java.lang.Thread.run(Thread.java:748)
   [junit4]    > 	at __randomizedtesting.SeedInfo.seed([6796389A1DB7AAB1]:0)
   [junit4] Completed [285/835 (1!)] on J1 in 114.26s, 0 tests, 3 errors <<< FAILURES!

[...truncated 50638 lines...]
[asciidoctor:convert] asciidoctor: ERROR: about-this-guide.adoc: line 1: invalid part, must have at least one section (e.g., chapter, appendix, etc.)
[asciidoctor:convert] asciidoctor: ERROR: solr-glossary.adoc: line 1: invalid part, must have at least one section (e.g., chapter, appendix, etc.)
     [java] Processed 2432 links (1984 relative) to 3172 anchors in 246 files
     [echo] Validated Links & Anchors via: /export/home/jenkins/workspace/Lucene-Solr-master-Solaris/solr/build/solr-ref-guide/bare-bones-html/

-documentation-lint:
    [jtidy] Checking for broken html (such as invalid tags)...
   [delete] Deleting directory /export/home/jenkins/workspace/Lucene-Solr-master-Solaris/lucene/build/jtidy_tmp
     [echo] Checking for broken links...
     [exec] 
     [exec] Crawl/parse...
     [exec] 
     [exec] Verify...
     [echo] Checking for malformed docs...

jar-checksums:

resolve:

ivy-availability-check:
[loadresource] Do not set property disallowed.ivy.jars.list as its length is 0.

-ivy-fail-disallowed-ivy-version:

ivy-fail:

ivy-configure:
[ivy:configure] :: loading settings :: file = /export/home/jenkins/workspace/Lucene-Solr-master-Solaris/lucene/top-level-ivy-settings.xml

resolve:

ivy-availability-check:
[loadresource] Do not set property disallowed.ivy.jars.list as its length is 0.

-ivy-fail-disallowed-ivy-version:

ivy-fail:

ivy-configure:
[ivy:configure] :: loading settings :: file = /export/home/jenkins/workspace/Lucene-Solr-master-Solaris/lucene/top-level-ivy-settings.xml

resolve:

resolve:

ivy-availability-check:
[loadresource] Do not set property disallowed.ivy.jars.list as its length is 0.

-ivy-fail-disallowed-ivy-version:

ivy-fail:

ivy-configure:
[ivy:configure] :: loading settings :: file = /export/home/jenkins/workspace/Lucene-Solr-master-Solaris/lucene/top-level-ivy-settings.xml

resolve:

ivy-availability-check:
[loadresource] Do not set property disallowed.ivy.jars.list as its length is 0.

-ivy-fail-disallowed-ivy-version:

ivy-fail:

ivy-configure:
[ivy:configure] :: loading settings :: file = /export/home/jenkins/workspace/Lucene-Solr-master-Solaris/lucene/top-level-ivy-settings.xml

resolve:

ivy-availability-check:
[loadresource] Do not set property disallowed.ivy.jars.list as its length is 0.

-ivy-fail-disallowed-ivy-version:

ivy-fail:

ivy-configure:
[ivy:configure] :: loading settings :: file = /export/home/jenkins/workspace/Lucene-Solr-master-Solaris/lucene/top-level-ivy-settings.xml

resolve:

ivy-availability-check:
[loadresource] Do not set property disallowed.ivy.jars.list as its length is 0.

-ivy-fail-disallowed-ivy-version:

ivy-fail:

ivy-configure:
[ivy:configure] :: loading settings :: file = /export/home/jenkins/workspace/Lucene-Solr-master-Solaris/lucene/top-level-ivy-settings.xml

resolve:

ivy-availability-check:
[loadresource] Do not set property disallowed.ivy.jars.list as its length is 0.

-ivy-fail-disallowed-ivy-version:

ivy-fail:

ivy-configure:
[ivy:configure] :: loading settings :: file = /export/home/jenkins/workspace/Lucene-Solr-master-Solaris/lucene/top-level-ivy-settings.xml

resolve:

ivy-availability-check:
[loadresource] Do not set property disallowed.ivy.jars.list as its length is 0.

-ivy-fail-disallowed-ivy-version:

ivy-fail:

ivy-configure:
[ivy:configure] :: loading settings :: file = /export/home/jenkins/workspace/Lucene-Solr-master-Solaris/lucene/top-level-ivy-settings.xml

resolve:

ivy-availability-check:
[loadresource] Do not set property disallowed.ivy.jars.list as its length is 0.

-ivy-fail-disallowed-ivy-version:

ivy-fail:

ivy-configure:
[ivy:configure] :: loading settings :: file = /export/home/jenkins/workspace/Lucene-Solr-master-Solaris/lucene/top-level-ivy-settings.xml

resolve:

ivy-availability-check:
[loadresource] Do not set property disallowed.ivy.jars.list as its length is 0.

-ivy-fail-disallowed-ivy-version:

ivy-fail:

ivy-configure:
[ivy:configure] :: loading settings :: file = /export/home/jenkins/workspace/Lucene-Solr-master-Solaris/lucene/top-level-ivy-settings.xml

resolve:

ivy-availability-check:
[loadresource] Do not set property disallowed.ivy.jars.list as its length is 0.

-ivy-fail-disallowed-ivy-version:

ivy-fail:

ivy-configure:
[ivy:configure] :: loading settings :: file = /export/home/jenkins/workspace/Lucene-Solr-master-Solaris/lucene/top-level-ivy-settings.xml

resolve:

ivy-availability-check:
[loadresource] Do not set property disallowed.ivy.jars.list as its length is 0.

-ivy-fail-disallowed-ivy-version:

ivy-fail:

ivy-configure:
[ivy:configure] :: loading settings :: file = /export/home/jenkins/workspace/Lucene-Solr-master-Solaris/lucene/top-level-ivy-settings.xml

resolve:

ivy-availability-check:
[loadresource] Do not set property disallowed.ivy.jars.list as its length is 0.

-ivy-fail-disallowed-ivy-version:

ivy-fail:

ivy-configure:
[ivy:configure] :: loading settings :: file = /export/home/jenkins/workspace/Lucene-Solr-master-Solaris/lucene/top-level-ivy-settings.xml

resolve:

ivy-availability-check:
[loadresource] Do not set property disallowed.ivy.jars.list as its length is 0.

-ivy-fail-disallowed-ivy-version:

ivy-fail:

ivy-configure:
[ivy:configure] :: loading settings :: file = /export/home/jenkins/workspace/Lucene-Solr-master-Solaris/lucene/top-level-ivy-settings.xml

resolve:

ivy-availability-check:
[loadresource] Do not set property disallowed.ivy.jars.list as its length is 0.

-ivy-fail-disallowed-ivy-version:

ivy-fail:

ivy-configure:
[ivy:configure] :: loading settings :: file = /export/home/jenkins/workspace/Lucene-Solr-master-Solaris/lucene/top-level-ivy-settings.xml

resolve:

ivy-availability-check:
[loadresource] Do not set property disallowed.ivy.jars.list as its length is 0.

-ivy-fail-disallowed-ivy-version:

ivy-fail:

ivy-configure:
[ivy:configure] :: loading settings :: file = /export/home/jenkins/workspace/Lucene-Solr-master-Solaris/lucene/top-level-ivy-settings.xml

resolve:

ivy-availability-check:
[loadresource] Do not set property disallowed.ivy.jars.list as its length is 0.

-ivy-fail-disallowed-ivy-version:

ivy-fail:

ivy-configure:
[ivy:configure] :: loading settings :: file = /export/home/jenkins/workspace/Lucene-Solr-master-Solaris/lucene/top-level-ivy-settings.xml

resolve:

ivy-availability-check:
[loadresource] Do not set property disallowed.ivy.jars.list as its length is 0.

-ivy-fail-disallowed-ivy-version:

ivy-fail:

ivy-configure:
[ivy:configure] :: loading settings :: file = /export/home/jenkins/workspace/Lucene-Solr-master-Solaris/lucene/top-level-ivy-settings.xml

resolve:

ivy-availability-check:
[loadresource] Do not set property disallowed.ivy.jars.list as its length is 0.

-ivy-fail-disallowed-ivy-version:

ivy-fail:

ivy-configure:
[ivy:configure] :: loading settings :: file = /export/home/jenkins/workspace/Lucene-Solr-master-Solaris/lucene/top-level-ivy-settings.xml

resolve:

ivy-availability-check:
[loadresource] Do not set property disallowed.ivy.jars.list as its length is 0.

-ivy-fail-disallowed-ivy-version:

ivy-fail:

ivy-configure:
[ivy:configure] :: loading settings :: file = /export/home/jenkins/workspace/Lucene-Solr-master-Solaris/lucene/top-level-ivy-settings.xml

resolve:

ivy-availability-check:
[loadresource] Do not set property disallowed.ivy.jars.list as its length is 0.

-ivy-fail-disallowed-ivy-version:

ivy-fail:

ivy-configure:
[ivy:configure] :: loading settings :: file = /export/home/jenkins/workspace/Lucene-Solr-master-Solaris/lucene/top-level-ivy-settings.xml

resolve:

ivy-availability-check:
[loadresource] Do not set property disallowed.ivy.jars.list as its length is 0.

-ivy-fail-disallowed-ivy-version:

ivy-fail:

ivy-configure:
[ivy:configure] :: loading settings :: file = /export/home/jenkins/workspace/Lucene-Solr-master-Solaris/lucene/top-level-ivy-settings.xml

resolve:

ivy-availability-check:
[loadresource] Do not set property disallowed.ivy.jars.list as its length is 0.

-ivy-fail-disallowed-ivy-version:

ivy-fail:

ivy-configure:
[ivy:configure] :: loading settings :: file = /export/home/jenkins/workspace/Lucene-Solr-master-Solaris/lucene/top-level-ivy-settings.xml

resolve:

ivy-availability-check:
[loadresource] Do not set property disallowed.ivy.jars.list as its length is 0.

-ivy-fail-disallowed-ivy-version:

ivy-fail:

ivy-configure:
[ivy:configure] :: loading settings :: file = /export/home/jenkins/workspace/Lucene-Solr-master-Solaris/lucene/top-level-ivy-settings.xml

resolve:

ivy-availability-check:
[loadresource] Do not set property disallowed.ivy.jars.list as its length is 0.

-ivy-fail-disallowed-ivy-version:

ivy-fail:

ivy-configure:
[ivy:configure] :: loading settings :: file = /export/home/jenkins/workspace/Lucene-Solr-master-Solaris/lucene/top-level-ivy-settings.xml

resolve:

ivy-availability-check:
[loadresource] Do not set property disallowed.ivy.jars.list as its length is 0.

-ivy-fail-disallowed-ivy-version:

ivy-fail:

ivy-configure:
[ivy:configure] :: loading settings :: file = /export/home/jenkins/workspace/Lucene-Solr-master-Solaris/lucene/top-level-ivy-settings.xml

common.resolve:

resolve:

ivy-availability-check:
[loadresource] Do not set property disallowed.ivy.jars.list as its length is 0.

-ivy-fail-disallowed-ivy-version:

ivy-fail:

ivy-configure:
[ivy:configure] :: loading settings :: file = /export/home/jenkins/workspace/Lucene-Solr-master-Solaris/lucene/top-level-ivy-settings.xml

resolve:

ivy-availability-check:
[loadresource] Do not set property disallowed.ivy.jars.list as its length is 0.

-ivy-fail-disallowed-ivy-version:

ivy-fail:

ivy-configure:
[ivy:configure] :: loading settings :: file = /export/home/jenkins/workspace/Lucene-Solr-master-Solaris/lucene/top-level-ivy-settings.xml

resolve:

ivy-availability-check:
[loadresource] Do not set property disallowed.ivy.jars.list as its length is 0.

-ivy-fail-disallowed-ivy-version:

ivy-fail:

ivy-configure:
[ivy:configure] :: loading settings :: file = /export/home/jenkins/workspace/Lucene-Solr-master-Solaris/lucene/top-level-ivy-settings.xml

resolve:

ivy-availability-check:
[loadresource] Do not set property disallowed.ivy.jars.list as its length is 0.

-ivy-fail-disallowed-ivy-version:

ivy-fail:

ivy-configure:
[ivy:configure] :: loading settings :: file = /export/home/jenkins/workspace/Lucene-Solr-master-Solaris/lucene/top-level-ivy-settings.xml

resolve:

ivy-availability-check:
[loadresource] Do not set property disallowed.ivy.jars.list as its length is 0.

-ivy-fail-disallowed-ivy-version:

ivy-fail:

ivy-configure:
[ivy:configure] :: loading settings :: file = /export/home/jenkins/workspace/Lucene-Solr-master-Solaris/lucene/top-level-ivy-settings.xml

resolve:

jar-checksums:
    [mkdir] Created dir: /export/home/jenkins/workspace/Lucene-Solr-master-Solaris/lucene/null265368451
     [copy] Copying 35 files to /export/home/jenkins/workspace/Lucene-Solr-master-Solaris/lucene/null265368451
   [delete] Deleting directory /export/home/jenkins/workspace/Lucene-Solr-master-Solaris/lucene/null265368451

resolve-example:

ivy-availability-check:
[loadresource] Do not set property disallowed.ivy.jars.list as its length is 0.

-ivy-fail-disallowed-ivy-version:

ivy-fail:

ivy-configure:
[ivy:configure] :: loading settings :: file = /export/home/jenkins/workspace/Lucene-Solr-master-Solaris/lucene/top-level-ivy-settings.xml

resolve:

resolve-server:

ivy-availability-check:
[loadresource] Do not set property disallowed.ivy.jars.list as its length is 0.

-ivy-fail-disallowed-ivy-version:

ivy-fail:

ivy-fail:

ivy-configure:
[ivy:configure] :: loading settings :: file = /export/home/jenkins/workspace/Lucene-Solr-master-Solaris/lucene/top-level-ivy-settings.xml

resolve:

resolve:

ivy-availability-check:
[loadresource] Do not set property disallowed.ivy.jars.list as its length is 0.

-ivy-fail-disallowed-ivy-version:

ivy-fail:

ivy-fail:

ivy-configure:
[ivy:configure] :: loading settings :: file = /export/home/jenkins/workspace/Lucene-Solr-master-Solaris/lucene/top-level-ivy-settings.xml

resolve:

ivy-availability-check:
[loadresource] Do not set property disallowed.ivy.jars.list as its length is 0.

-ivy-fail-disallowed-ivy-version:

ivy-fail:

ivy-fail:

ivy-configure:
[ivy:configure] :: loading settings :: file = /export/home/jenkins/workspace/Lucene-Solr-master-Solaris/lucene/top-level-ivy-settings.xml

resolve:

ivy-availability-check:
[loadresource] Do not set property disallowed.ivy.jars.list as its length is 0.

-ivy-fail-disallowed-ivy-version:

ivy-fail:

ivy-configure:
[ivy:configure] :: loading settings :: file = /export/home/jenkins/workspace/Lucene-Solr-master-Solaris/lucene/top-level-ivy-settings.xml

resolve:

ivy-availability-check:
[loadresource] Do not set property disallowed.ivy.jars.list as its length is 0.

-ivy-fail-disallowed-ivy-version:

ivy-fail:

ivy-fail:

ivy-configure:
[ivy:configure] :: loading settings :: file = /export/home/jenkins/workspace/Lucene-Solr-master-Solaris/lucene/top-level-ivy-settings.xml

resolve:

ivy-availability-check:
[loadresource] Do not set property disallowed.ivy.jars.list as its length is 0.

-ivy-fail-disallowed-ivy-version:

ivy-fail:

ivy-configure:
[ivy:configure] :: loading settings :: file = /export/home/jenkins/workspace/Lucene-Solr-master-Solaris/lucene/top-level-ivy-settings.xml

resolve:

ivy-availability-check:
[loadresource] Do not set property disallowed.ivy.jars.list as its length is 0.

-ivy-fail-disallowed-ivy-version:

ivy-fail:

ivy-fail:

ivy-configure:
[ivy:configure] :: loading settings :: file = /export/home/jenkins/workspace/Lucene-Solr-master-Solaris/lucene/top-level-ivy-settings.xml

resolve:

ivy-availability-check:
[loadresource] Do not set property disallowed.ivy.jars.list as its length is 0.

-ivy-fail-disallowed-ivy-version:

ivy-fail:

ivy-fail:

ivy-configure:
[ivy:configure] :: loading settings :: file = /export/home/jenkins/workspace/Lucene-Solr-master-Solaris/lucene/top-level-ivy-settings.xml

resolve:

ivy-availability-check:
[loadresource] Do not set property disallowed.ivy.jars.list as its length is 0.

-ivy-fail-disallowed-ivy-version:

ivy-fail:

ivy-fail:

ivy-configure:
[ivy:configure] :: loading settings :: file = /export/home/jenkins/workspace/Lucene-Solr-master-Solaris/lucene/top-level-ivy-settings.xml

resolve:

ivy-availability-check:
[loadresource] Do not set property disallowed.ivy.jars.list as its length is 0.

-ivy-fail-disallowed-ivy-version:

ivy-fail:

ivy-fail:

ivy-configure:
[ivy:configure] :: loading settings :: file = /export/home/jenkins/workspace/Lucene-Solr-master-Solaris/lucene/top-level-ivy-settings.xml

resolve:

ivy-availability-check:
[loadresource] Do not set property disallowed.ivy.jars.list as its length is 0.

-ivy-fail-disallowed-ivy-version:

ivy-fail:

ivy-fail:

ivy-configure:
[ivy:configure] :: loading settings :: file = /export/home/jenkins/workspace/Lucene-Solr-master-Solaris/lucene/top-level-ivy-settings.xml

resolve:

ivy-availability-check:
[loadresource] Do not set property disallowed.ivy.jars.list as its length is 0.

-ivy-fail-disallowed-ivy-version:

ivy-fail:

ivy-fail:

ivy-configure:
[ivy:configure] :: loading settings :: file = /export/home/jenkins/workspace/Lucene-Solr-master-Solaris/lucene/top-level-ivy-settings.xml

resolve:

ivy-availability-check:
[loadresource] Do not set property disallowed.ivy.jars.list as its length is 0.

-ivy-fail-disallowed-ivy-version:

ivy-fail:

ivy-fail:

ivy-configure:
[ivy:configure] :: loading settings :: file = /export/home/jenkins/workspace/Lucene-Solr-master-Solaris/lucene/top-level-ivy-settings.xml

resolve:

ivy-availability-check:
[loadresource] Do not set property disallowed.ivy.jars.list as its length is 0.

-ivy-fail-disallowed-ivy-version:

ivy-fail:

ivy-fail:

ivy-configure:
[ivy:configure] :: loading settings :: file = /export/home/jenkins/workspace/Lucene-Solr-master-Solaris/lucene/top-level-ivy-settings.xml

resolve:

ivy-availability-check:
[loadresource] Do not set property disallowed.ivy.jars.list as its length is 0.

-ivy-fail-disallowed-ivy-version:

ivy-fail:

ivy-fail:

ivy-configure:
[ivy:configure] :: loading settings :: file = /export/home/jenkins/workspace/Lucene-Solr-master-Solaris/lucene/top-level-ivy-settings.xml

resolve:

ivy-availability-check:
[loadresource] Do not set property disallowed.ivy.jars.list as its length is 0.

-ivy-fail-disallowed-ivy-version:

ivy-fail:

ivy-fail:

ivy-configure:
[ivy:configure] :: loading settings :: file = /export/home/jenkins/workspace/Lucene-Solr-master-Solaris/lucene/top-level-ivy-settings.xml

resolve:

jar-checksums:
    [mkdir] Created dir: /export/home/jenkins/workspace/Lucene-Solr-master-Solaris/solr/null758136562
     [copy] Copying 238 files to /export/home/jenkins/workspace/Lucene-Solr-master-Solaris/solr/null758136562
   [delete] Deleting directory /export/home/jenkins/workspace/Lucene-Solr-master-Solaris/solr/null758136562

check-working-copy:
[ivy:cachepath] :: resolving dependencies :: org.eclipse.jgit#org.eclipse.jgit-caller;working
[ivy:cachepath] 	confs: [default]
[ivy:cachepath] 	found org.eclipse.jgit#org.eclipse.jgit;4.6.0.201612231935-r in public
[ivy:cachepath] 	found com.jcraft#jsch;0.1.53 in public
[ivy:cachepath] 	found com.googlecode.javaewah#JavaEWAH;1.1.6 in public
[ivy:cachepath] 	found org.apache.httpcomponents#httpclient;4.3.6 in public
[ivy:cachepath] 	found org.apache.httpcomponents#httpcore;4.3.3 in public
[ivy:cachepath] 	found commons-logging#commons-logging;1.1.3 in public
[ivy:cachepath] 	found commons-codec#commons-codec;1.6 in public
[ivy:cachepath] 	found org.slf4j#slf4j-api;1.7.2 in public
[ivy:cachepath] :: resolution report :: resolve 88ms :: artifacts dl 9ms
	---------------------------------------------------------------------
	|                  |            modules            ||   artifacts   |
	|       conf       | number| search|dwnlded|evicted|| number|dwnlded|
	---------------------------------------------------------------------
	|      default     |   8   |   0   |   0   |   0   ||   8   |   0   |
	---------------------------------------------------------------------
[wc-checker] Initializing working copy...
[wc-checker] SLF4J: Failed to load class "org.slf4j.impl.StaticLoggerBinder".
[wc-checker] SLF4J: Defaulting to no-operation (NOP) logger implementation
[wc-checker] SLF4J: See http://www.slf4j.org/codes.html#StaticLoggerBinder for further details.
[wc-checker] Checking working copy status...

-jenkins-base:

BUILD SUCCESSFUL
Total time: 83 minutes 12 seconds
Setting ANT_1_8_2_HOME=/export/home/jenkins/tools/hudson.tasks.Ant_AntInstallation/ANT_1.8.2
[Lucene-Solr-master-Solaris] $ /bin/sh -xe /var/tmp/jenkins1939659192478090931.sh
+ mv lucene/build lucene/build.orig
+ mv solr/build solr/build.orig
+ ANT_HOME=/export/home/jenkins/tools/hudson.tasks.Ant_AntInstallation/ANT_1.8.2
+ export ANT_HOME
+ PATH=/export/home/jenkins/tools/hudson.tasks.Ant_AntInstallation/ANT_1.8.2/bin:/export/home/jenkins/tools/java/64bit/jdk1.8.0/bin:/usr/bin:/usr/sbin
+ export PATH
+ python3.4 -u dev-tools/scripts/reproduceJenkinsFailures.py --no-git https://jenkins.thetaphi.de/job/Lucene-Solr-master-Solaris/2090/consoleText
[repro] Jenkins log URL: https://jenkins.thetaphi.de/job/Lucene-Solr-master-Solaris/2090/consoleText

[repro] Revision: 46f753d7c6df52c06d970a13d3b742310276f2ca

[repro] Ant options: "-Dargs=-XX:-UseCompressedOops -XX:+UseConcMarkSweepGC"
[repro] Repro line:  ant test  -Dtestcase=TestIndexWriterWithThreads -Dtests.method=testIOExceptionDuringAbortWithThreadsOnlyOnce -Dtests.seed=DCE654447CCFA75 -Dtests.slow=true -Dtests.locale=sr-Latn-BA -Dtests.timezone=Africa/Accra -Dtests.asserts=true -Dtests.file.encoding=UTF-8

[repro] Repro line:  ant test  -Dtestcase=HealthCheckHandlerTest -Dtests.seed=6796389A1DB7AAB1 -Dtests.slow=true -Dtests.locale=ko-KR -Dtests.timezone=Asia/Novokuznetsk -Dtests.asserts=true -Dtests.file.encoding=UTF-8

[repro] ant clean
Buildfile: /export/home/jenkins/workspace/Lucene-Solr-master-Solaris/build.xml

clean:

clean:

clean:

BUILD SUCCESSFUL
Total time: 0 seconds
[repro] Test suites by module:
[repro]    solr/core
[repro]       HealthCheckHandlerTest
[repro]    lucene/core
[repro]       TestIndexWriterWithThreads
[repro] ant compile-test
Buildfile: /export/home/jenkins/workspace/Lucene-Solr-master-Solaris/solr/core/build.xml

check-analyzers-icu-uptodate:

jar-analyzers-icu:

-mrjar-classes-uptodate:

ivy-availability-check:
[loadresource] Do not set property disallowed.ivy.jars.list as its length is 0.

-ivy-fail-disallowed-ivy-version:

ivy-fail:

ivy-configure:
[ivy:configure] :: Apache Ivy 2.4.0 - 20141213170938 :: http://ant.apache.org/ivy/ ::
[ivy:configure] :: loading settings :: file = /export/home/jenkins/workspace/Lucene-Solr-master-Solaris/lucene/top-level-ivy-settings.xml

resolve-groovy:
[ivy:cachepath] :: resolving dependencies :: org.codehaus.groovy#groovy-all-caller;working
[ivy:cachepath] 	confs: [default]
[ivy:cachepath] 	found org.codehaus.groovy#groovy-all;2.4.15 in public
[ivy:cachepath] :: resolution report :: resolve 112ms :: artifacts dl 1ms
	---------------------------------------------------------------------
	|                  |            modules            ||   artifacts   |
	|       conf       | number| search|dwnlded|evicted|| number|dwnlded|
	---------------------------------------------------------------------
	|      default     |   1   |   0   |   0   |   0   ||   1   |   0   |
	---------------------------------------------------------------------

check-analyzers-common-uptodate:

jar-analyzers-common:

-mrjar-classes-uptodate:

ivy-availability-check:
[loadresource] Do not set property disallowed.ivy.jars.list as its length is 0.

-ivy-fail-disallowed-ivy-version:

ivy-fail:

ivy-configure:
[ivy:configure] :: loading settings :: file = /export/home/jenkins/workspace/Lucene-Solr-master-Solaris/lucene/top-level-ivy-settings.xml

resolve-groovy:

-check-git-state:

-git-cleanroot:

-copy-git-state:
     [copy] Copying 1 file to /export/home/jenkins/workspace/Lucene-Solr-master-Solaris/lucene/build

git-autoclean:

resolve:

common.init:

compile-lucene-core:

-check-git-state:

-git-cleanroot:

-copy-git-state:

git-autoclean:

ivy-availability-check:
[loadresource] Do not set property disallowed.ivy.jars.list as its length is 0.

-ivy-fail-disallowed-ivy-version:

ivy-fail:

ivy-configure:
[ivy:configure] :: loading settings :: file = /export/home/jenkins/workspace/Lucene-Solr-master-Solaris/lucene/top-level-ivy-settings.xml

resolve:

init:

-clover.disable:

-clover.load:

-clover.classpath:

-clover.setup:

clover:

compile-core:
    [mkdir] Created dir: /export/home/jenkins/workspace/Lucene-Solr-master-Solaris/lucene/build/core/classes/java
    [javac] Compiling 868 source files to /export/home/jenkins/workspace/Lucene-Solr-master-Solaris/lucene/build/core/classes/java
    [javac] Note: Some input files use or override a deprecated API.
    [javac] Note: Recompile with -Xlint:deprecation for details.
    [javac] Creating empty /export/home/jenkins/workspace/Lucene-Solr-master-Solaris/lucene/build/core/classes/java/org/apache/lucene/util/graph/package-info.class
    [javac] Creating empty /export/home/jenkins/workspace/Lucene-Solr-master-Solaris/lucene/build/core/classes/java/org/apache/lucene/document/package-info.class
    [javac] Creating empty /export/home/jenkins/workspace/Lucene-Solr-master-Solaris/lucene/build/core/classes/java/org/apache/lucene/package-info.class
    [javac] Creating empty /export/home/jenkins/workspace/Lucene-Solr-master-Solaris/lucene/build/core/classes/java/org/apache/lucene/util/bkd/package-info.class
    [javac] Creating empty /export/home/jenkins/workspace/Lucene-Solr-master-Solaris/lucene/build/core/classes/java/org/apache/lucene/codecs/compressing/package-info.class
    [javac] Creating empty /export/home/jenkins/workspace/Lucene-Solr-master-Solaris/lucene/build/core/classes/java/org/apache/lucene/codecs/lucene60/package-info.class
    [javac] Creating empty /export/home/jenkins/workspace/Lucene-Solr-master-Solaris/lucene/build/core/classes/java/org/apache/lucene/codecs/package-info.class
    [javac] Creating empty /export/home/jenkins/workspace/Lucene-Solr-master-Solaris/lucene/build/core/classes/java/org/apache/lucene/codecs/lucene80/package-info.class
    [javac] Creating empty /export/home/jenkins/workspace/Lucene-Solr-master-Solaris/lucene/build/core/classes/java/org/apache/lucene/util/package-info.class
    [javac] Creating empty /export/home/jenkins/workspace/Lucene-Solr-master-Solaris/lucene/build/core/classes/java/org/apache/lucene/index/package-info.class
    [javac] Creating empty /export/home/jenkins/workspace/Lucene-Solr-master-Solaris/lucene/build/core/classes/java/org/apache/lucene/util/fst/package-info.class
    [javac] Creating empty /export/home/jenkins/workspace/Lucene-Solr-master-Solaris/lucene/build/core/classes/java/org/apache/lucene/analysis/tokenattributes/package-info.class
    [javac] Creating empty /export/home/jenkins/workspace/Lucene-Solr-master-Solaris/lucene/build/core/classes/java/org/apache/lucene/search/package-info.class
    [javac] Creating empty /export/home/jenkins/workspace/Lucene-Solr-master-Solaris/lucene/build/core/classes/java/org/apache/lucene/util/packed/package-info.class
    [javac] Creating empty /export/home/jenkins/workspace/Lucene-Solr-master-Solaris/lucene/build/core/classes/java/org/apache/lucene/util/mutable/package-info.class
    [javac] Creating empty /export/home/jenkins/workspace/Lucene-Solr-master-Solaris/lucene/build/core/classes/java/org/apache/lucene/codecs/lucene70/package-info.class
    [javac] Creating empty /export/home/jenkins/workspace/Lucene-Solr-master-Solaris/lucene/build/core/classes/java/org/apache/lucene/codecs/perfield/package-info.class
    [javac] Creating empty /export/home/jenkins/workspace/Lucene-Solr-master-Solaris/lucene/build/core/classes/java/org/apache/lucene/analysis/package-info.class
    [javac] Creating empty /export/home/jenkins/workspace/Lucene-Solr-master-Solaris/lucene/build/core/classes/java/org/apache/lucene/analysis/standard/package-info.class
    [javac] Creating empty /export/home/jenkins/workspace/Lucene-Solr-master-Solaris/lucene/build/core/classes/java/org/apache/lucene/store/package-info.class
    [javac] Creating empty /export/home/jenkins/workspace/Lucene-Solr-master-Solaris/lucene/build/core/classes/java/org/apache/lucene/codecs/blocktree/package-info.class
    [javac] Creating empty /export/home/jenkins/workspace/Lucene-Solr-master-Solaris/lucene/build/core/classes/java/org/apache/lucene/search/spans/package-info.class
    [javac] Creating empty /export/home/jenkins/workspace/Lucene-Solr-master-Solaris/lucene/build/core/classes/java/org/apache/lucene/search/similarities/package-info.class
    [javac] Creating empty /export/home/jenkins/workspace/Lucene-Solr-master-Solaris/lucene/build/core/classes/java/org/apache/lucene/util/automaton/package-info.class
    [javac] Creating empty /export/home/jenkins/workspace/Lucene-Solr-master-Solaris/lucene/build/core/classes/java/org/apache/lucene/codecs/lucene50/package-info.class
    [javac] Creating empty /export/home/jenkins/workspace/Lucene-Solr-master-Solaris/lucene/build/core/classes/java/org/apache/lucene/geo/package-info.class
     [copy] Copying 3 files to /export/home/jenkins/workspace/Lucene-Solr-master-Solaris/lucene/build/core/classes/java

init:

-clover.disable:

-clover.load:

-clover.classpath:

-clover.setup:

clover:

compile-core:
    [mkdir] Created dir: /export/home/jenkins/workspace/Lucene-Solr-master-Solaris/lucene/build/analysis/common/classes/java
    [javac] Compiling 472 source files to /export/home/jenkins/workspace/Lucene-Solr-master-Solaris/lucene/build/analysis/common/classes/java
    [javac] Note: Some input files use or override a deprecated API.
    [javac] Note: Recompile with -Xlint:deprecation for details.
    [javac] Creating empty /export/home/jenkins/workspace/Lucene-Solr-master-Solaris/lucene/build/analysis/common/classes/java/org/apache/lucene/analysis/hunspell/package-info.class
    [javac] Creating empty /export/home/jenkins/workspace/Lucene-Solr-master-Solaris/lucene/build/analysis/common/classes/java/org/apache/lucene/analysis/minhash/package-info.class
    [javac] Creating empty /export/home/jenkins/workspace/Lucene-Solr-master-Solaris/lucene/build/analysis/common/classes/java/org/apache/lucene/analysis/ga/package-info.class
    [javac] Creating empty /export/home/jenkins/workspace/Lucene-Solr-master-Solaris/lucene/build/analysis/common/classes/java/org/apache/lucene/analysis/ca/package-info.class
    [javac] Creating empty /export/home/jenkins/workspace/Lucene-Solr-master-Solaris/lucene/build/analysis/common/classes/java/org/apache/lucene/analysis/custom/package-info.class
    [javac] Creating empty /export/home/jenkins/workspace/Lucene-Solr-master-Solaris/lucene/build/analysis/common/classes/java/org/apache/lucene/analysis/sr/package-info.class
    [javac] Creating empty /export/home/jenkins/workspace/Lucene-Solr-master-Solaris/lucene/build/analysis/common/classes/java/org/apache/lucene/collation/package-info.class
    [javac] Creating em

[...truncated too long message...]

reads.testIOExceptionDuringAbortWithThreadsOnlyOnce
   [junit4] OK      1.11s J0 | TestIndexWriterWithThreads.testRollbackAndCommitWithThreads
   [junit4] OK      0.06s J0 | TestIndexWriterWithThreads.testIOExceptionDuringAbort
   [junit4] OK      2.59s J0 | TestIndexWriterWithThreads.testCloseWithThreads
   [junit4] OK      0.15s J0 | TestIndexWriterWithThreads.testIOExceptionDuringAbortWithThreads
   [junit4] OK      0.01s J0 | TestIndexWriterWithThreads.testOpenTwoIndexWritersOnDifferentThreads
   [junit4] OK      1.77s J0 | TestIndexWriterWithThreads.testSoftUpdateSingleDocWithThreads
   [junit4] OK      0.14s J0 | TestIndexWriterWithThreads.testIOExceptionDuringWriteSegmentWithThreadsOnlyOnce
   [junit4] Completed [3/5] on J0 in 7.40s, 14 tests
   [junit4] 
   [junit4] Suite: org.apache.lucene.index.TestIndexWriterWithThreads
   [junit4] OK      2.03s J1 | TestIndexWriterWithThreads.testUpdateSingleDocWithThreads
   [junit4] OK      0.02s J1 | TestIndexWriterWithThreads.testIOExceptionDuringWriteSegmentOnlyOnce
   [junit4] OK      0.01s J1 | TestIndexWriterWithThreads.testIOExceptionDuringWriteSegment
   [junit4] OK      0.12s J1 | TestIndexWriterWithThreads.testImmediateDiskFullWithThreads
   [junit4] OK      0.02s J1 | TestIndexWriterWithThreads.testIOExceptionDuringAbortOnlyOnce
   [junit4] OK      0.09s J1 | TestIndexWriterWithThreads.testIOExceptionDuringWriteSegmentWithThreads
   [junit4] OK      0.08s J1 | TestIndexWriterWithThreads.testIOExceptionDuringAbortWithThreadsOnlyOnce
   [junit4] OK      1.97s J1 | TestIndexWriterWithThreads.testRollbackAndCommitWithThreads
   [junit4] OK      0.00s J1 | TestIndexWriterWithThreads.testIOExceptionDuringAbort
   [junit4] OK      1.29s J1 | TestIndexWriterWithThreads.testCloseWithThreads
   [junit4] OK      0.12s J1 | TestIndexWriterWithThreads.testIOExceptionDuringAbortWithThreads
   [junit4] OK      0.01s J1 | TestIndexWriterWithThreads.testOpenTwoIndexWritersOnDifferentThreads
   [junit4] OK      0.86s J1 | TestIndexWriterWithThreads.testSoftUpdateSingleDocWithThreads
   [junit4] OK      0.06s J1 | TestIndexWriterWithThreads.testIOExceptionDuringWriteSegmentWithThreadsOnlyOnce
   [junit4] Completed [4/5] on J1 in 6.73s, 14 tests
   [junit4] 
   [junit4] Suite: org.apache.lucene.index.TestIndexWriterWithThreads
   [junit4] OK      0.98s J0 | TestIndexWriterWithThreads.testUpdateSingleDocWithThreads
   [junit4] OK      0.01s J0 | TestIndexWriterWithThreads.testIOExceptionDuringWriteSegmentOnlyOnce
   [junit4] OK      0.01s J0 | TestIndexWriterWithThreads.testIOExceptionDuringWriteSegment
   [junit4] OK      0.12s J0 | TestIndexWriterWithThreads.testImmediateDiskFullWithThreads
   [junit4] OK      0.00s J0 | TestIndexWriterWithThreads.testIOExceptionDuringAbortOnlyOnce
   [junit4] OK      0.11s J0 | TestIndexWriterWithThreads.testIOExceptionDuringWriteSegmentWithThreads
   [junit4] OK      0.06s J0 | TestIndexWriterWithThreads.testIOExceptionDuringAbortWithThreadsOnlyOnce
   [junit4] OK      0.29s J0 | TestIndexWriterWithThreads.testRollbackAndCommitWithThreads
   [junit4] OK      0.01s J0 | TestIndexWriterWithThreads.testIOExceptionDuringAbort
   [junit4] OK      0.40s J0 | TestIndexWriterWithThreads.testCloseWithThreads
   [junit4] OK      0.01s J0 | TestIndexWriterWithThreads.testIOExceptionDuringAbortWithThreads
   [junit4] OK      0.00s J0 | TestIndexWriterWithThreads.testOpenTwoIndexWritersOnDifferentThreads
   [junit4] OK      0.11s J0 | TestIndexWriterWithThreads.testSoftUpdateSingleDocWithThreads
   [junit4] OK      0.02s J0 | TestIndexWriterWithThreads.testIOExceptionDuringWriteSegmentWithThreadsOnlyOnce
   [junit4] Completed [5/5] on J0 in 2.16s, 14 tests
   [junit4] 
   [junit4] JVM J0:     0.67 ..    22.77 =    22.10s
   [junit4] JVM J1:     0.65 ..    21.75 =    21.09s
   [junit4] Execution time total: 22 seconds
   [junit4] Tests summary: 5 suites, 70 tests
   [junit4] Could not remove temporary path: /export/home/jenkins/workspace/Lucene-Solr-master-Solaris/lucene/build/core/test/J0 (java.nio.file.DirectoryNotEmptyException: Remaining files: [/export/home/jenkins/workspace/Lucene-Solr-master-Solaris/lucene/build/core/test/J0/temp])
   [junit4] Could not remove temporary path: /export/home/jenkins/workspace/Lucene-Solr-master-Solaris/lucene/build/core/test/J1 (java.nio.file.DirectoryNotEmptyException: Remaining files: [/export/home/jenkins/workspace/Lucene-Solr-master-Solaris/lucene/build/core/test/J1/temp])
     [echo] 5 slowest tests:
[junit4:tophints]  62.91s | org.apache.lucene.codecs.lucene70.TestLucene70DocValuesFormat
[junit4:tophints]  46.29s | org.apache.lucene.index.TestDocumentsWriterStallControl
[junit4:tophints]  19.41s | org.apache.lucene.index.TestIndexingSequenceNumbers
[junit4:tophints]  18.46s | org.apache.lucene.search.TestLatLonDocValuesQueries
[junit4:tophints]  18.12s | org.apache.lucene.search.TestSimpleExplanationsWithFillerDocs

-check-totals:

test-nocompile:

BUILD SUCCESSFUL
Total time: 25 seconds
[repro] Failures:
[repro]   0/5 failed: org.apache.lucene.index.TestIndexWriterWithThreads
[repro]   0/5 failed: org.apache.solr.cloud.HealthCheckHandlerTest
[repro] Exiting with code 0
+ mv lucene/build lucene/build.repro
+ mv solr/build solr/build.repro
+ mv lucene/build.orig lucene/build
+ mv solr/build.orig solr/build
Archiving artifacts
Setting ANT_1_8_2_HOME=/export/home/jenkins/tools/hudson.tasks.Ant_AntInstallation/ANT_1.8.2
java.lang.InterruptedException: no matches found within 10000
	at hudson.FilePath$ValidateAntFileMask.hasMatch(FilePath.java:2845)
	at hudson.FilePath$ValidateAntFileMask.invoke(FilePath.java:2724)
	at hudson.FilePath$ValidateAntFileMask.invoke(FilePath.java:2705)
	at hudson.FilePath$FileCallableWrapper.call(FilePath.java:3084)
Also:   hudson.remoting.Channel$CallSiteStackTrace: Remote call to Solaris VBOX
		at hudson.remoting.Channel.attachCallSiteStackTrace(Channel.java:1741)
		at hudson.remoting.UserRequest$ExceptionResponse.retrieve(UserRequest.java:357)
		at hudson.remoting.Channel.call(Channel.java:955)
		at hudson.FilePath.act(FilePath.java:1070)
		at hudson.FilePath.act(FilePath.java:1059)
		at hudson.FilePath.validateAntFileMask(FilePath.java:2703)
		at hudson.tasks.ArtifactArchiver.perform(ArtifactArchiver.java:243)
		at hudson.tasks.BuildStepCompatibilityLayer.perform(BuildStepCompatibilityLayer.java:81)
		at hudson.tasks.BuildStepMonitor$1.perform(BuildStepMonitor.java:20)
		at hudson.model.AbstractBuild$AbstractBuildExecution.perform(AbstractBuild.java:744)
		at hudson.model.AbstractBuild$AbstractBuildExecution.performAllBuildSteps(AbstractBuild.java:690)
		at hudson.model.Build$BuildExecution.post2(Build.java:186)
		at hudson.model.AbstractBuild$AbstractBuildExecution.post(AbstractBuild.java:635)
		at hudson.model.Run.execute(Run.java:1831)
		at hudson.model.FreeStyleBuild.run(FreeStyleBuild.java:43)
		at hudson.model.ResourceController.execute(ResourceController.java:97)
		at hudson.model.Executor.run(Executor.java:429)
Caused: hudson.FilePath$TunneledInterruptedException
	at hudson.FilePath$FileCallableWrapper.call(FilePath.java:3086)
	at hudson.remoting.UserRequest.perform(UserRequest.java:212)
	at hudson.remoting.UserRequest.perform(UserRequest.java:54)
	at hudson.remoting.Request$2.run(Request.java:369)
	at hudson.remoting.InterceptingExecutorService$1.call(InterceptingExecutorService.java:72)
	at java.util.concurrent.FutureTask.run(FutureTask.java:266)
	at java.util.concurrent.ThreadPoolExecutor.runWorker(ThreadPoolExecutor.java:1149)
	at java.util.concurrent.ThreadPoolExecutor$Worker.run(ThreadPoolExecutor.java:624)
	at java.lang.Thread.run(Thread.java:748)
Caused: java.lang.InterruptedException: java.lang.InterruptedException: no matches found within 10000
	at hudson.FilePath.act(FilePath.java:1072)
	at hudson.FilePath.act(FilePath.java:1059)
	at hudson.FilePath.validateAntFileMask(FilePath.java:2703)
	at hudson.tasks.ArtifactArchiver.perform(ArtifactArchiver.java:243)
	at hudson.tasks.BuildStepCompatibilityLayer.perform(BuildStepCompatibilityLayer.java:81)
	at hudson.tasks.BuildStepMonitor$1.perform(BuildStepMonitor.java:20)
	at hudson.model.AbstractBuild$AbstractBuildExecution.perform(AbstractBuild.java:744)
	at hudson.model.AbstractBuild$AbstractBuildExecution.performAllBuildSteps(AbstractBuild.java:690)
	at hudson.model.Build$BuildExecution.post2(Build.java:186)
	at hudson.model.AbstractBuild$AbstractBuildExecution.post(AbstractBuild.java:635)
	at hudson.model.Run.execute(Run.java:1831)
	at hudson.model.FreeStyleBuild.run(FreeStyleBuild.java:43)
	at hudson.model.ResourceController.execute(ResourceController.java:97)
	at hudson.model.Executor.run(Executor.java:429)
No artifacts found that match the file pattern "**/*.events,heapdumps/**,**/*_pid*.log". Configuration error?
[WARNINGS] Parsing warnings in console log with parser Java Compiler (javac)
Setting ANT_1_8_2_HOME=/export/home/jenkins/tools/hudson.tasks.Ant_AntInstallation/ANT_1.8.2
Setting ANT_1_8_2_HOME=/export/home/jenkins/tools/hudson.tasks.Ant_AntInstallation/ANT_1.8.2
<Git Blamer> Using GitBlamer to create author and commit information for all warnings.
<Git Blamer> GIT_COMMIT=46f753d7c6df52c06d970a13d3b742310276f2ca, workspace=/export/home/jenkins/workspace/Lucene-Solr-master-Solaris
[WARNINGS] Computing warning deltas based on reference build #2089
Recording test results
Setting ANT_1_8_2_HOME=/export/home/jenkins/tools/hudson.tasks.Ant_AntInstallation/ANT_1.8.2
Build step 'Publish JUnit test result report' changed build result to UNSTABLE
Email was triggered for: Unstable (Test Failures)
Sending email for trigger: Unstable (Test Failures)
Setting ANT_1_8_2_HOME=/export/home/jenkins/tools/hudson.tasks.Ant_AntInstallation/ANT_1.8.2
Setting ANT_1_8_2_HOME=/export/home/jenkins/tools/hudson.tasks.Ant_AntInstallation/ANT_1.8.2
Setting ANT_1_8_2_HOME=/export/home/jenkins/tools/hudson.tasks.Ant_AntInstallation/ANT_1.8.2
Setting ANT_1_8_2_HOME=/export/home/jenkins/tools/hudson.tasks.Ant_AntInstallation/ANT_1.8.2

Mime
View raw message