lucene-dev mailing list archives

Site index · List index
Message view « Date » · « Thread »
Top « Date » · « Thread »
From Apache Jenkins Server <jenk...@builds.apache.org>
Subject [JENKINS] Lucene-Solr-Tests-master - Build # 2843 - Still Unstable
Date Wed, 03 Oct 2018 18:23:36 GMT
Build: https://builds.apache.org/job/Lucene-Solr-Tests-master/2843/

1 tests failed.
FAILED:  org.apache.solr.cloud.autoscaling.IndexSizeTriggerTest.testMixedBounds

Error Message:
did not finish processing in time

Stack Trace:
java.lang.AssertionError: did not finish processing in time
	at __randomizedtesting.SeedInfo.seed([1A75798A1ECBA479:10F6C6275370AF23]:0)
	at org.junit.Assert.fail(Assert.java:93)
	at org.junit.Assert.assertTrue(Assert.java:43)
	at org.apache.solr.cloud.autoscaling.IndexSizeTriggerTest.testMixedBounds(IndexSizeTriggerTest.java:572)
	at sun.reflect.NativeMethodAccessorImpl.invoke0(Native Method)
	at sun.reflect.NativeMethodAccessorImpl.invoke(NativeMethodAccessorImpl.java:62)
	at sun.reflect.DelegatingMethodAccessorImpl.invoke(DelegatingMethodAccessorImpl.java:43)
	at java.lang.reflect.Method.invoke(Method.java:498)
	at com.carrotsearch.randomizedtesting.RandomizedRunner.invoke(RandomizedRunner.java:1742)
	at com.carrotsearch.randomizedtesting.RandomizedRunner$8.evaluate(RandomizedRunner.java:935)
	at com.carrotsearch.randomizedtesting.RandomizedRunner$9.evaluate(RandomizedRunner.java:971)
	at com.carrotsearch.randomizedtesting.RandomizedRunner$10.evaluate(RandomizedRunner.java:985)
	at com.carrotsearch.randomizedtesting.rules.SystemPropertiesRestoreRule$1.evaluate(SystemPropertiesRestoreRule.java:57)
	at org.apache.lucene.util.TestRuleSetupTeardownChained$1.evaluate(TestRuleSetupTeardownChained.java:49)
	at org.apache.lucene.util.AbstractBeforeAfterRule$1.evaluate(AbstractBeforeAfterRule.java:45)
	at org.apache.lucene.util.TestRuleThreadAndTestName$1.evaluate(TestRuleThreadAndTestName.java:48)
	at org.apache.lucene.util.TestRuleIgnoreAfterMaxFailures$1.evaluate(TestRuleIgnoreAfterMaxFailures.java:64)
	at org.apache.lucene.util.TestRuleMarkFailure$1.evaluate(TestRuleMarkFailure.java:47)
	at com.carrotsearch.randomizedtesting.rules.StatementAdapter.evaluate(StatementAdapter.java:36)
	at com.carrotsearch.randomizedtesting.ThreadLeakControl$StatementRunner.run(ThreadLeakControl.java:368)
	at com.carrotsearch.randomizedtesting.ThreadLeakControl.forkTimeoutingTask(ThreadLeakControl.java:817)
	at com.carrotsearch.randomizedtesting.ThreadLeakControl$3.evaluate(ThreadLeakControl.java:468)
	at com.carrotsearch.randomizedtesting.RandomizedRunner.runSingleTest(RandomizedRunner.java:944)
	at com.carrotsearch.randomizedtesting.RandomizedRunner$5.evaluate(RandomizedRunner.java:830)
	at com.carrotsearch.randomizedtesting.RandomizedRunner$6.evaluate(RandomizedRunner.java:880)
	at com.carrotsearch.randomizedtesting.RandomizedRunner$7.evaluate(RandomizedRunner.java:891)
	at com.carrotsearch.randomizedtesting.rules.StatementAdapter.evaluate(StatementAdapter.java:36)
	at com.carrotsearch.randomizedtesting.rules.SystemPropertiesRestoreRule$1.evaluate(SystemPropertiesRestoreRule.java:57)
	at org.apache.lucene.util.AbstractBeforeAfterRule$1.evaluate(AbstractBeforeAfterRule.java:45)
	at com.carrotsearch.randomizedtesting.rules.StatementAdapter.evaluate(StatementAdapter.java:36)
	at org.apache.lucene.util.TestRuleStoreClassName$1.evaluate(TestRuleStoreClassName.java:41)
	at com.carrotsearch.randomizedtesting.rules.NoShadowingOrOverridesOnMethodsRule$1.evaluate(NoShadowingOrOverridesOnMethodsRule.java:40)
	at com.carrotsearch.randomizedtesting.rules.NoShadowingOrOverridesOnMethodsRule$1.evaluate(NoShadowingOrOverridesOnMethodsRule.java:40)
	at com.carrotsearch.randomizedtesting.rules.StatementAdapter.evaluate(StatementAdapter.java:36)
	at com.carrotsearch.randomizedtesting.rules.StatementAdapter.evaluate(StatementAdapter.java:36)
	at com.carrotsearch.randomizedtesting.rules.StatementAdapter.evaluate(StatementAdapter.java:36)
	at org.apache.lucene.util.TestRuleAssertionsRequired$1.evaluate(TestRuleAssertionsRequired.java:53)
	at org.apache.lucene.util.TestRuleMarkFailure$1.evaluate(TestRuleMarkFailure.java:47)
	at org.apache.lucene.util.TestRuleIgnoreAfterMaxFailures$1.evaluate(TestRuleIgnoreAfterMaxFailures.java:64)
	at org.apache.lucene.util.TestRuleIgnoreTestSuites$1.evaluate(TestRuleIgnoreTestSuites.java:54)
	at com.carrotsearch.randomizedtesting.rules.StatementAdapter.evaluate(StatementAdapter.java:36)
	at com.carrotsearch.randomizedtesting.ThreadLeakControl$StatementRunner.run(ThreadLeakControl.java:368)
	at java.lang.Thread.run(Thread.java:748)




Build Log:
[...truncated 13675 lines...]
   [junit4] Suite: org.apache.solr.cloud.autoscaling.IndexSizeTriggerTest
   [junit4]   2> 1254999 INFO  (SUITE-IndexSizeTriggerTest-seed#[1A75798A1ECBA479]-worker) [    ] o.a.s.SolrTestCaseJ4 SecureRandom sanity checks: test.solr.allowed.securerandom=null & java.security.egd=file:/dev/./urandom
   [junit4]   2> Creating dataDir: /x1/jenkins/jenkins-slave/workspace/Lucene-Solr-Tests-master/solr/build/solr-core/test/J0/temp/solr.cloud.autoscaling.IndexSizeTriggerTest_1A75798A1ECBA479-001/init-core-data-001
   [junit4]   2> 1255000 INFO  (SUITE-IndexSizeTriggerTest-seed#[1A75798A1ECBA479]-worker) [    ] o.a.s.SolrTestCaseJ4 Using PointFields (NUMERIC_POINTS_SYSPROP=true) w/NUMERIC_DOCVALUES_SYSPROP=false
   [junit4]   2> 1255006 INFO  (SUITE-IndexSizeTriggerTest-seed#[1A75798A1ECBA479]-worker) [    ] o.a.s.SolrTestCaseJ4 Randomized ssl (true) and clientAuth (false) via: @org.apache.solr.util.RandomizeSSL(reason=, ssl=NaN, value=NaN, clientAuth=NaN)
   [junit4]   2> 1255006 INFO  (SUITE-IndexSizeTriggerTest-seed#[1A75798A1ECBA479]-worker) [    ] o.a.s.c.MiniSolrCloudCluster Starting cluster of 2 servers in /x1/jenkins/jenkins-slave/workspace/Lucene-Solr-Tests-master/solr/build/solr-core/test/J0/temp/solr.cloud.autoscaling.IndexSizeTriggerTest_1A75798A1ECBA479-001/tempDir-001
   [junit4]   2> 1255007 INFO  (SUITE-IndexSizeTriggerTest-seed#[1A75798A1ECBA479]-worker) [    ] o.a.s.c.ZkTestServer STARTING ZK TEST SERVER
   [junit4]   2> 1255007 INFO  (Thread-2272) [    ] o.a.s.c.ZkTestServer client port:0.0.0.0/0.0.0.0:0
   [junit4]   2> 1255007 INFO  (Thread-2272) [    ] o.a.s.c.ZkTestServer Starting server
   [junit4]   2> 1255012 ERROR (Thread-2272) [    ] o.a.z.s.ZooKeeperServer ZKShutdownHandler is not registered, so ZooKeeper server won't take any action on ERROR or SHUTDOWN server state changes
   [junit4]   2> 1255107 INFO  (SUITE-IndexSizeTriggerTest-seed#[1A75798A1ECBA479]-worker) [    ] o.a.s.c.ZkTestServer start zk server on port:42014
   [junit4]   2> 1255109 INFO  (zkConnectionManagerCallback-7386-thread-1) [    ] o.a.s.c.c.ConnectionManager zkClient has connected
   [junit4]   2> 1255123 INFO  (jetty-launcher-7383-thread-2) [    ] o.e.j.s.Server jetty-9.4.11.v20180605; built: 2018-06-05T18:24:03.829Z; git: d5fc0523cfa96bfebfbda19606cad384d772f04c; jvm 1.8.0_172-b11
   [junit4]   2> 1255123 INFO  (jetty-launcher-7383-thread-1) [    ] o.e.j.s.Server jetty-9.4.11.v20180605; built: 2018-06-05T18:24:03.829Z; git: d5fc0523cfa96bfebfbda19606cad384d772f04c; jvm 1.8.0_172-b11
   [junit4]   2> 1255124 INFO  (jetty-launcher-7383-thread-2) [    ] o.e.j.s.session DefaultSessionIdManager workerName=node0
   [junit4]   2> 1255124 INFO  (jetty-launcher-7383-thread-2) [    ] o.e.j.s.session No SessionScavenger set, using defaults
   [junit4]   2> 1255124 INFO  (jetty-launcher-7383-thread-2) [    ] o.e.j.s.session node0 Scavenging every 660000ms
   [junit4]   2> 1255124 INFO  (jetty-launcher-7383-thread-1) [    ] o.e.j.s.session DefaultSessionIdManager workerName=node0
   [junit4]   2> 1255124 INFO  (jetty-launcher-7383-thread-1) [    ] o.e.j.s.session No SessionScavenger set, using defaults
   [junit4]   2> 1255124 INFO  (jetty-launcher-7383-thread-1) [    ] o.e.j.s.session node0 Scavenging every 660000ms
   [junit4]   2> 1255124 INFO  (jetty-launcher-7383-thread-2) [    ] o.e.j.s.h.ContextHandler Started o.e.j.s.ServletContextHandler@4b7fc02f{/solr,null,AVAILABLE}
   [junit4]   2> 1255125 INFO  (jetty-launcher-7383-thread-2) [    ] o.e.j.s.AbstractConnector Started ServerConnector@df8596e{SSL,[ssl, http/1.1]}{127.0.0.1:35686}
   [junit4]   2> 1255125 INFO  (jetty-launcher-7383-thread-2) [    ] o.e.j.s.Server Started @1255179ms
   [junit4]   2> 1255125 INFO  (jetty-launcher-7383-thread-1) [    ] o.e.j.s.h.ContextHandler Started o.e.j.s.ServletContextHandler@344c4e79{/solr,null,AVAILABLE}
   [junit4]   2> 1255125 INFO  (jetty-launcher-7383-thread-2) [    ] o.a.s.c.s.e.JettySolrRunner Jetty properties: {hostContext=/solr, hostPort=35686}
   [junit4]   2> 1255125 ERROR (jetty-launcher-7383-thread-2) [    ] o.a.s.u.StartupLoggingUtils Missing Java Option solr.log.dir. Logging may be missing or incomplete.
   [junit4]   2> 1255125 INFO  (jetty-launcher-7383-thread-2) [    ] o.a.s.s.SolrDispatchFilter Using logger factory org.apache.logging.slf4j.Log4jLoggerFactory
   [junit4]   2> 1255125 INFO  (jetty-launcher-7383-thread-2) [    ] o.a.s.s.SolrDispatchFilter  ___      _       Welcome to Apache Solr? version 8.0.0
   [junit4]   2> 1255125 INFO  (jetty-launcher-7383-thread-1) [    ] o.e.j.s.AbstractConnector Started ServerConnector@c109f68{SSL,[ssl, http/1.1]}{127.0.0.1:40446}
   [junit4]   2> 1255125 INFO  (jetty-launcher-7383-thread-2) [    ] o.a.s.s.SolrDispatchFilter / __| ___| |_ _   Starting in cloud mode on port null
   [junit4]   2> 1255125 INFO  (jetty-launcher-7383-thread-1) [    ] o.e.j.s.Server Started @1255179ms
   [junit4]   2> 1255125 INFO  (jetty-launcher-7383-thread-2) [    ] o.a.s.s.SolrDispatchFilter \__ \/ _ \ | '_|  Install dir: null
   [junit4]   2> 1255125 INFO  (jetty-launcher-7383-thread-1) [    ] o.a.s.c.s.e.JettySolrRunner Jetty properties: {hostContext=/solr, hostPort=40446}
   [junit4]   2> 1255125 INFO  (jetty-launcher-7383-thread-2) [    ] o.a.s.s.SolrDispatchFilter |___/\___/_|_|    Start time: 2018-10-03T17:36:06.037Z
   [junit4]   2> 1255126 ERROR (jetty-launcher-7383-thread-1) [    ] o.a.s.u.StartupLoggingUtils Missing Java Option solr.log.dir. Logging may be missing or incomplete.
   [junit4]   2> 1255126 INFO  (jetty-launcher-7383-thread-1) [    ] o.a.s.s.SolrDispatchFilter Using logger factory org.apache.logging.slf4j.Log4jLoggerFactory
   [junit4]   2> 1255126 INFO  (jetty-launcher-7383-thread-1) [    ] o.a.s.s.SolrDispatchFilter  ___      _       Welcome to Apache Solr? version 8.0.0
   [junit4]   2> 1255126 INFO  (jetty-launcher-7383-thread-1) [    ] o.a.s.s.SolrDispatchFilter / __| ___| |_ _   Starting in cloud mode on port null
   [junit4]   2> 1255126 INFO  (jetty-launcher-7383-thread-1) [    ] o.a.s.s.SolrDispatchFilter \__ \/ _ \ | '_|  Install dir: null
   [junit4]   2> 1255126 INFO  (jetty-launcher-7383-thread-1) [    ] o.a.s.s.SolrDispatchFilter |___/\___/_|_|    Start time: 2018-10-03T17:36:06.038Z
   [junit4]   2> 1255128 INFO  (zkConnectionManagerCallback-7388-thread-1) [    ] o.a.s.c.c.ConnectionManager zkClient has connected
   [junit4]   2> 1255128 INFO  (zkConnectionManagerCallback-7390-thread-1) [    ] o.a.s.c.c.ConnectionManager zkClient has connected
   [junit4]   2> 1255136 INFO  (jetty-launcher-7383-thread-2) [    ] o.a.s.s.SolrDispatchFilter solr.xml found in ZooKeeper. Loading...
   [junit4]   2> 1255142 INFO  (jetty-launcher-7383-thread-1) [    ] o.a.s.s.SolrDispatchFilter solr.xml found in ZooKeeper. Loading...
   [junit4]   2> 1255260 INFO  (jetty-launcher-7383-thread-1) [    ] o.a.s.c.ZkContainer Zookeeper client=127.0.0.1:42014/solr
   [junit4]   2> 1255262 INFO  (zkConnectionManagerCallback-7394-thread-1) [    ] o.a.s.c.c.ConnectionManager zkClient has connected
   [junit4]   2> 1255264 INFO  (zkConnectionManagerCallback-7396-thread-1) [    ] o.a.s.c.c.ConnectionManager zkClient has connected
   [junit4]   2> 1255378 INFO  (jetty-launcher-7383-thread-1) [n:127.0.0.1:40446_solr    ] o.a.s.c.OverseerElectionContext I am going to be the leader 127.0.0.1:40446_solr
   [junit4]   2> 1255379 INFO  (jetty-launcher-7383-thread-1) [n:127.0.0.1:40446_solr    ] o.a.s.c.Overseer Overseer (id=72442741391556612-127.0.0.1:40446_solr-n_0000000000) starting
   [junit4]   2> 1255390 INFO  (zkConnectionManagerCallback-7403-thread-1) [    ] o.a.s.c.c.ConnectionManager zkClient has connected
   [junit4]   2> 1255394 INFO  (jetty-launcher-7383-thread-1) [n:127.0.0.1:40446_solr    ] o.a.s.c.s.i.ZkClientClusterStateProvider Cluster at 127.0.0.1:42014/solr ready
   [junit4]   2> 1255395 INFO  (jetty-launcher-7383-thread-1) [n:127.0.0.1:40446_solr    ] o.a.s.c.ZkController Register node as live in ZooKeeper:/live_nodes/127.0.0.1:40446_solr
   [junit4]   2> 1255396 INFO  (OverseerStateUpdate-72442741391556612-127.0.0.1:40446_solr-n_0000000000) [n:127.0.0.1:40446_solr    ] o.a.s.c.Overseer Starting to work on the main queue : 127.0.0.1:40446_solr
   [junit4]   2> 1255404 INFO  (OverseerStateUpdate-72442741391556612-127.0.0.1:40446_solr-n_0000000000) [n:127.0.0.1:40446_solr    ] o.a.s.c.c.ZkStateReader Updated live nodes from ZooKeeper... (0) -> (1)
   [junit4]   2> 1255404 DEBUG (OverseerAutoScalingTriggerThread-72442741391556612-127.0.0.1:40446_solr-n_0000000000) [    ] o.a.s.c.a.OverseerTriggerThread Adding .auto_add_replicas and .scheduled_maintenance triggers
   [junit4]   2> 1255406 DEBUG (OverseerAutoScalingTriggerThread-72442741391556612-127.0.0.1:40446_solr-n_0000000000) [    ] o.a.s.c.a.OverseerTriggerThread Refreshing /autoscaling.json with znode version 1
   [junit4]   2> 1255407 DEBUG (OverseerAutoScalingTriggerThread-72442741391556612-127.0.0.1:40446_solr-n_0000000000) [    ] o.a.s.c.a.OverseerTriggerThread Current znodeVersion 1, lastZnodeVersion -1
   [junit4]   2> 1255407 DEBUG (OverseerAutoScalingTriggerThread-72442741391556612-127.0.0.1:40446_solr-n_0000000000) [    ] o.a.s.c.a.OverseerTriggerThread Processed trigger updates upto znodeVersion 1
   [junit4]   2> 1255412 INFO  (zkCallback-7402-thread-1) [    ] o.a.s.c.c.ZkStateReader Updated live nodes from ZooKeeper... (0) -> (1)
   [junit4]   2> 1255416 DEBUG (OverseerAutoScalingTriggerThread-72442741391556612-127.0.0.1:40446_solr-n_0000000000) [    ] o.a.s.c.a.NodeLostTrigger NodeLostTrigger .auto_add_replicas - Initial livenodes: [127.0.0.1:40446_solr]
   [junit4]   2> 1255417 DEBUG (OverseerAutoScalingTriggerThread-72442741391556612-127.0.0.1:40446_solr-n_0000000000) [    ] o.a.s.c.a.OverseerTriggerThread -- clean old nodeAdded markers
   [junit4]   2> 1255417 DEBUG (OverseerAutoScalingTriggerThread-72442741391556612-127.0.0.1:40446_solr-n_0000000000) [    ] o.a.s.c.a.OverseerTriggerThread Current znodeVersion 1, lastZnodeVersion 1
   [junit4]   2> 1255423 DEBUG (ScheduledTrigger-4695-thread-2) [    ] o.a.s.c.a.NodeLostTrigger Running NodeLostTrigger: .auto_add_replicas with currently live nodes: 1
   [junit4]   2> 1255423 INFO  (jetty-launcher-7383-thread-1) [n:127.0.0.1:40446_solr    ] o.a.s.h.a.MetricsHistoryHandler No .system collection, keeping metrics history in memory.
   [junit4]   2> 1255449 INFO  (jetty-launcher-7383-thread-1) [n:127.0.0.1:40446_solr    ] o.a.s.m.r.SolrJmxReporter JMX monitoring for 'solr_40446.solr.node' (registry 'solr.node') enabled at server: com.sun.jmx.mbeanserver.JmxMBeanServer@30c3654e
   [junit4]   2> 1255457 INFO  (jetty-launcher-7383-thread-1) [n:127.0.0.1:40446_solr    ] o.a.s.m.r.SolrJmxReporter JMX monitoring for 'solr_40446.solr.jvm' (registry 'solr.jvm') enabled at server: com.sun.jmx.mbeanserver.JmxMBeanServer@30c3654e
   [junit4]   2> 1255457 INFO  (jetty-launcher-7383-thread-1) [n:127.0.0.1:40446_solr    ] o.a.s.m.r.SolrJmxReporter JMX monitoring for 'solr_40446.solr.jetty' (registry 'solr.jetty') enabled at server: com.sun.jmx.mbeanserver.JmxMBeanServer@30c3654e
   [junit4]   2> 1255458 INFO  (jetty-launcher-7383-thread-1) [n:127.0.0.1:40446_solr    ] o.a.s.c.CorePropertiesLocator Found 0 core definitions underneath /x1/jenkins/jenkins-slave/workspace/Lucene-Solr-Tests-master/solr/build/solr-core/test/J0/temp/solr.cloud.autoscaling.IndexSizeTriggerTest_1A75798A1ECBA479-001/tempDir-001/node1/.
   [junit4]   2> 1255645 INFO  (jetty-launcher-7383-thread-2) [    ] o.a.s.c.ZkContainer Zookeeper client=127.0.0.1:42014/solr
   [junit4]   2> 1255648 INFO  (zkConnectionManagerCallback-7408-thread-1) [    ] o.a.s.c.c.ConnectionManager zkClient has connected
   [junit4]   2> 1255651 INFO  (zkConnectionManagerCallback-7410-thread-1) [    ] o.a.s.c.c.ConnectionManager zkClient has connected
   [junit4]   2> 1255660 INFO  (jetty-launcher-7383-thread-2) [n:127.0.0.1:35686_solr    ] o.a.s.c.c.ZkStateReader Updated live nodes from ZooKeeper... (0) -> (1)
   [junit4]   2> 1255664 INFO  (jetty-launcher-7383-thread-2) [n:127.0.0.1:35686_solr    ] o.a.s.c.TransientSolrCoreCacheDefault Allocating transient cache for 2147483647 transient cores
   [junit4]   2> 1255664 INFO  (jetty-launcher-7383-thread-2) [n:127.0.0.1:35686_solr    ] o.a.s.c.ZkController Register node as live in ZooKeeper:/live_nodes/127.0.0.1:35686_solr
   [junit4]   2> 1255665 INFO  (zkCallback-7402-thread-1) [    ] o.a.s.c.c.ZkStateReader Updated live nodes from ZooKeeper... (1) -> (2)
   [junit4]   2> 1255665 INFO  (zkCallback-7395-thread-1) [    ] o.a.s.c.c.ZkStateReader Updated live nodes from ZooKeeper... (1) -> (2)
   [junit4]   2> 1255677 INFO  (zkCallback-7409-thread-1) [    ] o.a.s.c.c.ZkStateReader Updated live nodes from ZooKeeper... (1) -> (2)
   [junit4]   2> 1255685 INFO  (zkConnectionManagerCallback-7417-thread-1) [    ] o.a.s.c.c.ConnectionManager zkClient has connected
   [junit4]   2> 1255686 INFO  (jetty-launcher-7383-thread-2) [n:127.0.0.1:35686_solr    ] o.a.s.c.c.ZkStateReader Updated live nodes from ZooKeeper... (0) -> (2)
   [junit4]   2> 1255687 INFO  (jetty-launcher-7383-thread-2) [n:127.0.0.1:35686_solr    ] o.a.s.c.s.i.ZkClientClusterStateProvider Cluster at 127.0.0.1:42014/solr ready
   [junit4]   2> 1255687 INFO  (jetty-launcher-7383-thread-2) [n:127.0.0.1:35686_solr    ] o.a.s.h.a.MetricsHistoryHandler No .system collection, keeping metrics history in memory.
   [junit4]   2> 1255703 INFO  (jetty-launcher-7383-thread-2) [n:127.0.0.1:35686_solr    ] o.a.s.m.r.SolrJmxReporter JMX monitoring for 'solr_35686.solr.node' (registry 'solr.node') enabled at server: com.sun.jmx.mbeanserver.JmxMBeanServer@30c3654e
   [junit4]   2> 1255711 INFO  (jetty-launcher-7383-thread-2) [n:127.0.0.1:35686_solr    ] o.a.s.m.r.SolrJmxReporter JMX monitoring for 'solr_35686.solr.jvm' (registry 'solr.jvm') enabled at server: com.sun.jmx.mbeanserver.JmxMBeanServer@30c3654e
   [junit4]   2> 1255711 INFO  (jetty-launcher-7383-thread-2) [n:127.0.0.1:35686_solr    ] o.a.s.m.r.SolrJmxReporter JMX monitoring for 'solr_35686.solr.jetty' (registry 'solr.jetty') enabled at server: com.sun.jmx.mbeanserver.JmxMBeanServer@30c3654e
   [junit4]   2> 1255712 INFO  (jetty-launcher-7383-thread-2) [n:127.0.0.1:35686_solr    ] o.a.s.c.CorePropertiesLocator Found 0 core definitions underneath /x1/jenkins/jenkins-slave/workspace/Lucene-Solr-Tests-master/solr/build/solr-core/test/J0/temp/solr.cloud.autoscaling.IndexSizeTriggerTest_1A75798A1ECBA479-001/tempDir-001/node2/.
   [junit4]   2> 1255738 INFO  (zkConnectionManagerCallback-7420-thread-1) [    ] o.a.s.c.c.ConnectionManager zkClient has connected
   [junit4]   2> 1255743 INFO  (zkConnectionManagerCallback-7425-thread-1) [    ] o.a.s.c.c.ConnectionManager zkClient has connected
   [junit4]   2> 1255744 INFO  (SUITE-IndexSizeTriggerTest-seed#[1A75798A1ECBA479]-worker) [    ] o.a.s.c.c.ZkStateReader Updated live nodes from ZooKeeper... (0) -> (2)
   [junit4]   2> 1255745 INFO  (SUITE-IndexSizeTriggerTest-seed#[1A75798A1ECBA479]-worker) [    ] o.a.s.c.s.i.ZkClientClusterStateProvider Cluster at 127.0.0.1:42014/solr ready
   [junit4]   2> 1255767 DEBUG (SUITE-IndexSizeTriggerTest-seed#[1A75798A1ECBA479]-worker) [    ] o.a.s.c.a.s.SimClusterStateProvider --- new Overseer leader: 127.0.0.1:10007_solr
   [junit4]   2> 1255767 DEBUG (Simulated OverseerAutoScalingTriggerThread) [    ] o.a.s.c.a.OverseerTriggerThread Adding .auto_add_replicas and .scheduled_maintenance triggers
   [junit4]   2> 1255768 DEBUG (Simulated OverseerAutoScalingTriggerThread) [    ] o.a.s.c.a.OverseerTriggerThread Refreshing /autoscaling.json with znode version 0
   [junit4]   2> 1255768 DEBUG (Simulated OverseerAutoScalingTriggerThread) [    ] o.a.s.c.a.OverseerTriggerThread Current znodeVersion 0, lastZnodeVersion -1
   [junit4]   2> 1255768 DEBUG (Simulated OverseerAutoScalingTriggerThread) [    ] o.a.s.c.a.OverseerTriggerThread Processed trigger updates upto znodeVersion 0
   [junit4]   2> 1255769 DEBUG (Simulated OverseerAutoScalingTriggerThread) [    ] o.a.s.c.a.NodeLostTrigger NodeLostTrigger .auto_add_replicas - Initial livenodes: [127.0.0.1:10007_solr]
   [junit4]   2> 1255769 DEBUG (Simulated OverseerAutoScalingTriggerThread) [    ] o.a.s.c.a.OverseerTriggerThread -- clean old nodeAdded markers
   [junit4]   2> 1255769 DEBUG (Simulated OverseerAutoScalingTriggerThread) [    ] o.a.s.c.a.OverseerTriggerThread Current znodeVersion 0, lastZnodeVersion 0
   [junit4]   2> 1255769 DEBUG (ScheduledTrigger-4711-thread-2) [    ] o.a.s.c.a.NodeLostTrigger Running NodeLostTrigger: .auto_add_replicas with currently live nodes: 1
   [junit4]   2> 1255770 DEBUG (SUITE-IndexSizeTriggerTest-seed#[1A75798A1ECBA479]-worker) [    ] o.a.s.c.a.s.SimClusterStateProvider ** creating new collection states, currentVersion=0
   [junit4]   2> 1255770 DEBUG (SUITE-IndexSizeTriggerTest-seed#[1A75798A1ECBA479]-worker) [    ] o.a.s.c.a.s.SimClusterStateProvider ** saved cluster state version 0
   [junit4]   2> 1255770 INFO  (SUITE-IndexSizeTriggerTest-seed#[1A75798A1ECBA479]-worker) [    ] o.a.s.h.a.MetricsHistoryHandler No .system collection, keeping metrics history in memory.
   [junit4]   2> 1255790 DEBUG (ScheduledTrigger-4711-thread-3) [    ] o.a.s.c.a.NodeLostTrigger Running NodeLostTrigger: .auto_add_replicas with currently live nodes: 2
   [junit4]   2> 1255811 DEBUG (ScheduledTrigger-4711-thread-4) [    ] o.a.s.c.a.NodeLostTrigger Running NodeLostTrigger: .auto_add_replicas with currently live nodes: 2
   [junit4]   2> 1255831 DEBUG (ScheduledTrigger-4711-thread-3) [    ] o.a.s.c.a.NodeLostTrigger Running NodeLostTrigger: .auto_add_replicas with currently live nodes: 2
   [junit4]   2> 1255851 DEBUG (ScheduledTrigger-4711-thread-4) [    ] o.a.s.c.a.NodeLostTrigger Running NodeLostTrigger: .auto_add_replicas with currently live nodes: 2
   [junit4]   2> 1255872 DEBUG (ScheduledTrigger-4711-thread-3) [    ] o.a.s.c.a.NodeLostTrigger Running NodeLostTrigger: .auto_add_replicas with currently live nodes: 2
   [junit4]   2> 1255892 DEBUG (ScheduledTrigger-4711-thread-4) [    ] o.a.s.c.a.NodeLostTrigger Running NodeLostTrigger: .auto_add_replicas with currently live nodes: 2
   [junit4]   2> 1255912 DEBUG (ScheduledTrigger-4711-thread-3) [    ] o.a.s.c.a.NodeLostTrigger Running NodeLostTrigger: .auto_add_replicas with currently live nodes: 2
   [junit4]   2> 1255932 DEBUG (ScheduledTrigger-4711-thread-2) [    ] o.a.s.c.a.NodeLostTrigger Running NodeLostTrigger: .auto_add_replicas with currently live nodes: 2
   [junit4]   2> 1255952 DEBUG (ScheduledTrigger-4711-thread-2) [    ] o.a.s.c.a.NodeLostTrigger Running NodeLostTrigger: .auto_add_replicas with currently live nodes: 2
   [junit4]   2> 1255974 DEBUG (ScheduledTrigger-4711-thread-2) [    ] o.a.s.c.a.NodeLostTrigger Running NodeLostTrigger: .auto_add_replicas with currently live nodes: 2
   [junit4]   2> 1255993 INFO  (TEST-IndexSizeTriggerTest.testTrigger-seed#[1A75798A1ECBA479]) [    ] o.a.s.SolrTestCaseJ4 ###Starting testTrigger
   [junit4]   2> 1255994 DEBUG (simCloudManagerPool-4710-thread-1) [    ] o.a.s.c.a.s.SimClusterStateProvider -- simCreateCollection testTrigger_collection, currentVersion=1
   [junit4]   2> 1255994 DEBUG (simCloudManagerPool-4710-thread-1) [    ] o.a.s.c.a.s.SimClusterStateProvider ** creating new collection states, currentVersion=1
   [junit4]   2> 1255994 DEBUG (simCloudManagerPool-4710-thread-1) [    ] o.a.s.c.a.s.SimClusterStateProvider ** saved cluster state version 1
   [junit4]   2> 1255995 DEBUG (ScheduledTrigger-4711-thread-2) [    ] o.a.s.c.a.NodeLostTrigger Running NodeLostTrigger: .auto_add_replicas with currently live nodes: 2
   [junit4]   2> 1256004 DEBUG (simCloudManagerPool-4710-thread-1) [    ] o.a.s.c.a.s.SimClusterStateProvider ** creating new collection states, currentVersion=2
   [junit4]   2> 1256004 DEBUG (simCloudManagerPool-4710-thread-1) [    ] o.a.s.c.a.s.SimClusterStateProvider ** saved cluster state version 2
   [junit4]   2> 1256005 DEBUG (simCloudManagerPool-4710-thread-1) [    ] o.a.s.c.a.s.SimClusterStateProvider -- finished createCollection testTrigger_collection, currentVersion=3
   [junit4]   2> 1256015 DEBUG (ScheduledTrigger-4711-thread-2) [    ] o.a.s.c.a.NodeLostTrigger Running NodeLostTrigger: .auto_add_replicas with currently live nodes: 2
   [junit4]   2> 1256015 DEBUG (simCloudManagerPool-4710-thread-2) [    ] o.a.s.c.a.s.SimClusterStateProvider ** creating new collection states, currentVersion=3
   [junit4]   2> 1256015 DEBUG (simCloudManagerPool-4710-thread-2) [    ] o.a.s.c.a.s.SimClusterStateProvider ** saved cluster state version 3
   [junit4]   2> 1256016 DEBUG (simCloudManagerPool-4710-thread-6) [    ] o.a.s.c.a.s.SimClusterStateProvider -- elected new leader for testTrigger_collection / shard1 (currentVersion=4): {"core_node1":{
   [junit4]   2>     "core":"testTrigger_collection_shard1_replica_n1",
   [junit4]   2>     "shard":"shard1",
   [junit4]   2>     "collection":"testTrigger_collection",
   [junit4]   2>     "node_name":"127.0.0.1:10008_solr",
   [junit4]   2>     "type":"NRT",
   [junit4]   2>     "leader":"true",
   [junit4]   2>     "SEARCHER.searcher.maxDoc":0,
   [junit4]   2>     "SEARCHER.searcher.deletedDocs":0,
   [junit4]   2>     "INDEX.sizeInBytes":10240,
   [junit4]   2>     "state":"active",
   [junit4]   2>     "INDEX.sizeInGB":9.5367431640625E-6,
   [junit4]   2>     "SEARCHER.searcher.numDocs":0}}
   [junit4]   2> 1256026 DEBUG (simCloudManagerPool-4710-thread-4) [    ] o.a.s.c.a.s.SimClusterStateProvider ** creating new collection states, currentVersion=4
   [junit4]   2> 1256026 DEBUG (simCloudManagerPool-4710-thread-4) [    ] o.a.s.c.a.s.SimClusterStateProvider ** saved cluster state version 4
   [junit4]   2> 1256027 DEBUG (simCloudManagerPool-4710-thread-7) [    ] o.a.s.c.a.s.SimClusterStateProvider -- elected new leader for testTrigger_collection / shard2 (currentVersion=5): {"core_node3":{
   [junit4]   2>     "core":"testTrigger_collection_shard2_replica_n3",
   [junit4]   2>     "shard":"shard2",
   [junit4]   2>     "collection":"testTrigger_collection",
   [junit4]   2>     "node_name":"127.0.0.1:10008_solr",
   [junit4]   2>     "type":"NRT",
   [junit4]   2>     "leader":"true",
   [junit4]   2>     "SEARCHER.searcher.maxDoc":0,
   [junit4]   2>     "SEARCHER.searcher.deletedDocs":0,
   [junit4]   2>     "INDEX.sizeInBytes":10240,
   [junit4]   2>     "state":"active",
   [junit4]   2>     "INDEX.sizeInGB":9.5367431640625E-6,
   [junit4]   2>     "SEARCHER.searcher.numDocs":0}}
   [junit4]   2> 1256035 DEBUG (ScheduledTrigger-4711-thread-2) [    ] o.a.s.c.a.NodeLostTrigger Running NodeLostTrigger: .auto_add_replicas with currently live nodes: 2
   [junit4]   2> 1256036 DEBUG (simCloudManagerPool-4710-thread-5) [    ] o.a.s.c.a.s.SimClusterStateProvider ** creating new collection states, currentVersion=5
   [junit4]   2> 1256036 DEBUG (simCloudManagerPool-4710-thread-5) [    ] o.a.s.c.a.s.SimClusterStateProvider ** saved cluster state version 5
   [junit4]   2> 1256047 DEBUG (simCloudManagerPool-4710-thread-3) [    ] o.a.s.c.a.s.SimClusterStateProvider ** creating new collection states, currentVersion=6
   [junit4]   2> 1256047 DEBUG (simCloudManagerPool-4710-thread-3) [    ] o.a.s.c.a.s.SimClusterStateProvider ** saved cluster state version 6
   [junit4]   2> 1256047 DEBUG (TEST-IndexSizeTriggerTest.testTrigger-seed#[1A75798A1ECBA479]) [    ] o.a.s.c.a.s.SimClusterStateProvider ** creating new collection states, currentVersion=7
   [junit4]   2> 1256048 DEBUG (TEST-IndexSizeTriggerTest.testTrigger-seed#[1A75798A1ECBA479]) [    ] o.a.s.c.a.s.SimClusterStateProvider ** saved cluster state version 7
   [junit4]   2> 1256055 DEBUG (ScheduledTrigger-4711-thread-2) [    ] o.a.s.c.a.NodeLostTrigger Running NodeLostTrigger: .auto_add_replicas with currently live nodes: 2
   [junit4]   2> 1256075 DEBUG (ScheduledTrigger-4711-thread-3) [    ] o.a.s.c.a.NodeLostTrigger Running NodeLostTrigger: .auto_add_replicas with currently live nodes: 2
   [junit4]   2> 1256095 DEBUG (ScheduledTrigger-4711-thread-2) [    ] o.a.s.c.a.NodeLostTrigger Running NodeLostTrigger: .auto_add_replicas with currently live nodes: 2
   [junit4]   2> 1256116 DEBUG (ScheduledTrigger-4711-thread-2) [    ] o.a.s.c.a.NodeLostTrigger Running NodeLostTrigger: .auto_add_replicas with currently live nodes: 2
   [junit4]   2> 1256136 DEBUG (ScheduledTrigger-4711-thread-2) [    ] o.a.s.c.a.NodeLostTrigger Running NodeLostTrigger: .auto_add_replicas with currently live nodes: 2
   [junit4]   2> 1256156 DEBUG (ScheduledTrigger-4711-thread-1) [    ] o.a.s.c.a.NodeLostTrigger Running NodeLostTrigger: .auto_add_replicas with currently live nodes: 2
   [junit4]   2> 1256176 DEBUG (ScheduledTrigger-4711-thread-3) [    ] o.a.s.c.a.NodeLostTrigger Running NodeLostTrigger: .auto_add_replicas with currently live nodes: 2
   [junit4]   2> 1256197 DEBUG (ScheduledTrigger-4711-thread-3) [    ] o.a.s.c.a.NodeLostTrigger Running NodeLostTrigger: .auto_add_replicas with currently live nodes: 2
   [junit4]   2> 1256206 DEBUG (TEST-IndexSizeTriggerTest.testTrigger-seed#[1A75798A1ECBA479]) [    ] o.a.s.c.a.s.SimClusterStateProvider ** creating new collection states, currentVersion=8
   [junit4]   2> 1256206 DEBUG (TEST-IndexSizeTriggerTest.testTrigger-seed#[1A75798A1ECBA479]) [    ] o.a.s.c.a.s.SimClusterStateProvider ** saved cluster state version 8
   [junit4]   2> 1256207 INFO  (TEST-IndexSizeTriggerTest.testTrigger-seed#[1A75798A1ECBA479]) [    ] o.a.s.c.a.IndexSizeTriggerTest #######################################
   [junit4]   2> ############ CLUSTER STATE ############
   [junit4]   2> #######################################
   [junit4]   2> ## Live nodes:		2
   [junit4]   2> ## Empty nodes:	0
   [junit4]   2> ## Dead nodes:		0
   [junit4]   2> ## Collections:
   [junit4]   2> ##  * testTrigger_collection
   [junit4]   2> ##    shardsTotal	2
   [junit4]   2> ##    shardsState	{active=2}
   [junit4]   2> ##      shardsWithoutLeader	0
   [junit4]   2> ##    totalReplicas	4
   [junit4]   2> ##      activeReplicas	4
   [junit4]   2> ##      inactiveReplicas	0
   [junit4]   2> ##    totalActiveDocs	25
   [junit4]   2> ##      bufferedDocs	0
   [junit4]   2> ##      maxActiveSliceDocs	14
   [junit4]   2> ##      minActiveSliceDocs	11
   [junit4]   2> ##      avgActiveSliceDocs	13
   [junit4]   2> ##    totalInactiveDocs	0
   [junit4]   2> ##      maxInactiveSliceDocs	0
   [junit4]   2> ##      minInactiveSliceDocs	0
   [junit4]   2> ##      avgInactiveSliceDocs	NaN
   [junit4]   2> ##    totalActiveBytes	32,980
   [junit4]   2> ##      maxActiveSliceBytes	17,240
   [junit4]   2> ##      minActiveSliceBytes	15,740
   [junit4]   2> ##      avgActiveSliceBytes	16,490
   [junit4]   2> ##    totalInactiveBytes	0
   [junit4]   2> ##      maxInactiveSliceBytes	0
   [junit4]   2> ##      minInactiveSliceBytes	0
   [junit4]   2> ##      avgInactiveSliceBytes	NaN
   [junit4]   2> ##    totalActiveDeletedDocs	0
   [junit4]   2> DocCollection(testTrigger_collection//clusterstate.json/8)={
   [junit4]   2>   "replicationFactor":"1",
   [junit4]   2>   "pullReplicas":"0",
   [junit4]   2>   "router":{"name":"compositeId"},
   [junit4]   2>   "maxShardsPerNode":"2",
   [junit4]   2>   "autoAddReplicas":"false",
   [junit4]   2>   "nrtReplicas":"2",
   [junit4]   2>   "tlogReplicas":"0",
   [junit4]   2>   "autoCreated":"true",
   [junit4]   2>   "shards":{
   [junit4]   2>     "shard2":{
   [junit4]   2>       "replicas":{
   [junit4]   2>         "core_node3":{
   [junit4]   2>           "core":"testTrigger_collection_shard2_replica_n3",
   [junit4]   2>           "leader":"true",
   [junit4]   2>           "SEARCHER.searcher.maxDoc":11,
   [junit4]   2>           "SEARCHER.searcher.deletedDocs":0,
   [junit4]   2>           "INDEX.sizeInBytes":15740,
   [junit4]   2>           "node_name":"127.0.0.1:10008_solr",
   [junit4]   2>           "state":"active",
   [junit4]   2>           "type":"NRT",
   [junit4]   2>           "INDEX.sizeInGB":1.4659017324447632E-5,
   [junit4]   2>           "SEARCHER.searcher.numDocs":11},
   [junit4]   2>         "core_node4":{
   [junit4]   2>           "core":"testTrigger_collection_shard2_replica_n4",
   [junit4]   2>           "SEARCHER.searcher.maxDoc":11,
   [junit4]   2>           "SEARCHER.searcher.deletedDocs":0,
   [junit4]   2>           "INDEX.sizeInBytes":15740,
   [junit4]   2>           "node_name":"127.0.0.1:10007_solr",
   [junit4]   2>           "state":"active",
   [junit4]   2>           "type":"NRT",
   [junit4]   2>           "INDEX.sizeInGB":1.4659017324447632E-5,
   [junit4]   2>           "SEARCHER.searcher.numDocs":11}},
   [junit4]   2>       "range":"0-7fffffff",
   [junit4]   2>       "state":"active"},
   [junit4]   2>     "shard1":{
   [junit4]   2>       "replicas":{
   [junit4]   2>         "core_node1":{
   [junit4]   2>           "core":"testTrigger_collection_shard1_replica_n1",
   [junit4]   2>           "leader":"true",
   [junit4]   2>           "SEARCHER.searcher.maxDoc":14,
   [junit4]   2>           "SEARCHER.searcher.deletedDocs":0,
   [junit4]   2>           "INDEX.sizeInBytes":17240,
   [junit4]   2>           "node_name":"127.0.0.1:10008_solr",
   [junit4]   2>           "state":"active",
   [junit4]   2>           "type":"NRT",
   [junit4]   2>           "INDEX.sizeInGB":1.605600118637085E-5,
   [junit4]   2>           "SEARCHER.searcher.numDocs":14},
   [junit4]   2>         "core_node2":{
   [junit4]   2>           "core":"testTrigger_collection_shard1_replica_n2",
   [junit4]   2>           "SEARCHER.searcher.maxDoc":14,
   [junit4]   2>           "SEARCHER.searcher.deletedDocs":0,
   [junit4]   2>           "INDEX.sizeInBytes":17240,
   [junit4]   2>           "node_name":"127.0.0.1:10007_solr",
   [junit4]   2>           "state":"active",
   [junit4]   2>           "type":"NRT",
   [junit4]   2>           "INDEX.sizeInGB":1.605600118637085E-5,
   [junit4]   2>           "SEARCHER.searcher.numDocs":14}},
   [junit4]   2>       "range":"80000000-ffffffff",
   [junit4]   2>       "state":"active"}}}
   [junit4]   2> ## Max replicas per node:	2
   [junit4]   2> ## Min replicas per node:	2
   [junit4]   2> ## Total replicas:		4
   [junit4]   2> ## * testTrigger_collection		4
   [junit4]   2> ##		- active           4
   [junit4]   2> ######### Solr op counts ##########
   [junit4]   2> ##		- CREATE             1
   [junit4]   2> ##		- update            26
   [junit4]   2> ######### Autoscaling event counts ###########
   [junit4]   2> 
   [junit4]   2> 1256207 INFO  (TEST-IndexSizeTriggerTest.testTrigger-seed#[1A75798A1ECBA479]) [    ] o.a.s.c.a.s.SimCloudManager === Restarting OverseerTriggerThread and clearing object cache...
   [junit4]   2> 1256207 WARN  (Simulated OverseerAutoScalingTriggerThread) [    ] o.a.s.c.a.OverseerTriggerThread Interrupted
   [junit4]   2> java.lang.InterruptedException: null
   [junit4]   2> 	at java.util.concurrent.locks.AbstractQueuedSynchronizer$ConditionObject.reportInterruptAfterWait(AbstractQueuedSynchronizer.java:2014) ~[?:1.8.0_172]
   [junit4]   2> 	at java.util.concurrent.locks.AbstractQueuedSynchronizer$ConditionObject.await(AbstractQueuedSynchronizer.java:2048) ~[?:1.8.0_172]
   [junit4]   2> 	at org.apache.solr.cloud.autoscaling.OverseerTriggerThread.run(OverseerTriggerThread.java:189) [java/:?]
   [junit4]   2> 	at java.lang.Thread.run(Thread.java:748) [?:1.8.0_172]
   [junit4]   2> 1256213 DEBUG (TEST-IndexSizeTriggerTest.testTrigger-seed#[1A75798A1ECBA479]) [    ] o.a.s.c.a.ScheduledTriggers Shutting down scheduled thread pool executor now
   [junit4]   2> 1256213 DEBUG (TEST-IndexSizeTriggerTest.testTrigger-seed#[1A75798A1ECBA479]) [    ] o.a.s.c.a.ScheduledTriggers Shutting down action executor now
   [junit4]   2> 1256213 DEBUG (TEST-IndexSizeTriggerTest.testTrigger-seed#[1A75798A1ECBA479]) [    ] o.a.s.c.a.ScheduledTriggers Awaiting termination for action executor
   [junit4]   2> 1256213 DEBUG (TEST-IndexSizeTriggerTest.testTrigger-seed#[1A75798A1ECBA479]) [    ] o.a.s.c.a.ScheduledTriggers Awaiting termination for scheduled thread pool executor
   [junit4]   2> 1256213 DEBUG (TEST-IndexSizeTriggerTest.testTrigger-seed#[1A75798A1ECBA479]) [    ] o.a.s.c.a.ScheduledTriggers ScheduledTriggers closed completely
   [junit4]   2> 1256213 DEBUG (TEST-IndexSizeTriggerTest.testTrigger-seed#[1A75798A1ECBA479]) [    ] o.a.s.c.a.OverseerTriggerThread OverseerTriggerThread has been closed explicitly
   [junit4]   2> 1256217 DEBUG (Simulated OverseerAutoScalingTriggerThread) [    ] o.a.s.c.a.OverseerTriggerThread Refreshing /autoscaling.json with znode version 0
   [junit4]   2> 1256217 DEBUG (Simulated OverseerAutoScalingTriggerThread) [    ] o.a.s.c.a.OverseerTriggerThread Current znodeVersion 0, lastZnodeVersion -1
   [junit4]   2> 1256217 DEBUG (Simulated OverseerAutoScalingTriggerThread) [    ] o.a.s.c.a.OverseerTriggerThread Processed trigger updates upto znodeVersion 0
   [junit4]   2> 1256217 DEBUG (Simulated OverseerAutoScalingTriggerThread) [    ] o.a.s.c.a.NodeLostTrigger NodeLostTrigger .auto_add_replicas - Initial livenodes: [127.0.0.1:10008_solr, 127.0.0.1:10007_solr]
   [junit4]   2> 1256218 DEBUG (Simulated OverseerAutoScalingTriggerThread) [    ] o.a.s.c.a.OverseerTriggerThread -- clean old nodeAdded markers
   [junit4]   2> 1256218 DEBUG (Simulated OverseerAutoScalingTriggerThread) [    ] o.a.s.c.a.OverseerTriggerThread Current znodeVersion 0, lastZnodeVersion 0
   [junit4]   2> 1256218 DEBUG (ScheduledTrigger-4716-thread-2) [    ] o.a.s.c.a.NodeLostTrigger Running NodeLostTrigger: .auto_add_replicas with currently live nodes: 2
   [junit4]   2> 1256224 DEBUG (TEST-IndexSizeTriggerTest.testTrigger-seed#[1A75798A1ECBA479]) [    ] o.a.s.c.a.OverseerTriggerThread Refreshing /autoscaling.json with znode version 1
   [junit4]   2> 1256224 DEBUG (Simulated OverseerAutoScalingTriggerThread) [    ] o.a.s.c.a.OverseerTriggerThread Processed trigger updates upto znodeVersion 1
   [junit4]   2> 1256225 DEBUG (Simulated OverseerAutoScalingTriggerThread) [    ] o.a.s.c.a.OverseerTriggerThread -- clean old nodeLost markers
   [junit4]   2> 1256225 DEBUG (Simulated OverseerAutoScalingTriggerThread) [    ] o.a.s.c.a.OverseerTriggerThread -- clean old nodeAdded markers
   [junit4]   2> 1256225 DEBUG (Simulated OverseerAutoScalingTriggerThread) [    ] o.a.s.c.a.OverseerTriggerThread Current znodeVersion 1, lastZnodeVersion 1
   [junit4]   2> 1256325 INFO  (TEST-IndexSizeTriggerTest.testTrigger-seed#[1A75798A1ECBA479]) [    ] o.a.s.SolrTestCaseJ4 ###Ending testTrigger
   [junit4]   2> 1256349 INFO  (TEST-IndexSizeTriggerTest.testMergeIntegration-seed#[1A75798A1ECBA479]) [    ] o.a.s.SolrTestCaseJ4 ###Starting testMergeIntegration
   [junit4]   2> 1256349 DEBUG (simCloudManagerPool-4715-thread-1) [    ] o.a.s.c.a.s.SimClusterStateProvider -- simCreateCollection testMergeIntegration_collection, currentVersion=9
   [junit4]   2> 1256349 DEBUG (simCloudManagerPool-4715-thread-1) [    ] o.a.s.c.a.s.SimClusterStateProvider ** creating new collection states, currentVersion=9
   [junit4]   2> 1256349 DEBUG (simCloudManagerPool-4715-thread-1) [    ] o.a.s.c.a.s.SimClusterStateProvider ** saved cluster state version 9
   [junit4]   2> 1256359 DEBUG (simCloudManagerPool-4715-thread-1) [    ] o.a.s.c.a.s.SimClusterStateProvider ** creating new collection states, currentVersion=10
   [junit4]   2> 1256360 DEBUG (simCloudManagerPool-4715-thread-1) [    ] o.a.s.c.a.s.SimClusterStateProvider ** saved cluster state version 10
   [junit4]   2> 1256360 DEBUG (simCloudManagerPool-4715-thread-1) [    ] o.a.s.c.a.s.SimClusterStateProvider -- finished createCollection testMergeIntegration_collection, currentVersion=11
   [junit4]   2> 1256370 DEBUG (simCloudManagerPool-4715-thread-2) [    ] o.a.s.c.a.s.SimClusterStateProvider ** creating new collection states, currentVersion=11
   [junit4]   2> 1256371 DEBUG (simCloudManagerPool-4715-thread-2) [    ] o.a.s.c.a.s.SimClusterStateProvider ** saved cluster state version 11
   [junit4]   2> 1256372 DEBUG (simCloudManagerPool-4715-thread-6) [    ] o.a.s.c.a.s.SimClusterStateProvider -- elected new leader for testMergeIntegration_collection / shard1 (currentVersion=12): {"core_node1":{
   [junit4]   2>     "core":"testMergeIntegration_collection_shard1_replica_n1",
   [junit4]   2>     "shard":"shard1",
   [junit4]   2>     "collection":"testMergeIntegration_collection",
   [junit4]   2>     "node_name":"127.0.0.1:10008_solr",
   [junit4]   2>     "type":"NRT",
   [junit4]   2>     "leader":"true",
   [junit4]   2>     "SEARCHER.searcher.maxDoc":0,
   [junit4]   2>     "SEARCHER.searcher.deletedDocs":0,
   [junit4]   2>     "INDEX.sizeInBytes":10240,
   [junit4]   2>     "state":"active",
   [junit4]   2>     "INDEX.sizeInGB":9.5367431640625E-6,
   [junit4]   2>     "SEARCHER.searcher.numDocs":0}}
   [junit4]   2> 1256381 DEBUG (simCloudManagerPool-4715-thread-3) [    ] o.a.s.c.a.s.SimClusterStateProvider ** creating new collection states, currentVersion=12
   [junit4]   2> 1256381 DEBUG (simCloudManagerPool-4715-thread-3) [    ] o.a.s.c.a.s.SimClusterStateProvider ** saved cluster state version 12
   [junit4]   2> 1256392 DEBUG (simCloudManagerPool-4715-thread-4) [    ] o.a.s.c.a.s.SimClusterStateProvider ** creating new collection states, currentVersion=13
   [junit4]   2> 1256393 DEBUG (simCloudManagerPool-4715-thread-4) [    ] o.a.s.c.a.s.SimClusterStateProvider ** saved cluster state version 13
   [junit4]   2> 1256393 DEBUG (TEST-IndexSizeTriggerTest.testMergeIntegration-seed#[1A75798A1ECBA479]) [    ] o.a.s.c.a.s.SimClusterStateProvider ** creating new collection states, currentVersion=14
   [junit4]   2> 1256394 DEBUG (TEST-IndexSizeTriggerTest.testMergeIntegration-seed#[1A75798A1ECBA479]) [    ] o.a.s.c.a.s.SimClusterStateProvider ** saved cluster state version 14
   [junit4]   2> 1256394 DEBUG (simCloudManagerPool-4715-thread-7) [    ] o.a.s.c.a.s.SimClusterStateProvider -- elected new leader for testMergeIntegration_collection / shard2 (currentVersion=15): {"core_node3":{
   [junit4]   2>     "core":"testMergeIntegration_collection_shard2_replica_n3",
   [junit4]   2>     "shard":"shard2",
   [junit4]   2>     "collection":"testMergeIntegration_collection",
   [junit4]   2>     "node_name":"127.0.0.1:10008_solr",
   [junit4]   2>     "type":"NRT",
   [junit4]   2>     "leader":"true",
   [junit4]   2>     "SEARCHER.searcher.maxDoc":0,
   [junit4]   2>     "SEARCHER.searcher.deletedDocs":0,
   [junit4]   2>     "INDEX.sizeInBytes":10240,
   [junit4]   2>     "state":"active",
   [junit4]   2>     "INDEX.sizeInGB":9.5367431640625E-6,
   [junit4]   2>     "SEARCHER.searcher.numDocs":0}}
   [junit4]   2> 1256404 DEBUG (simCloudManagerPool-4715-thread-5) [    ] o.a.s.c.a.s.SimClusterStateProvider ** creating new collection states, currentVersion=15
   [junit4]   2> 1256404 DEBUG (simCloudManagerPool-4715-thread-5) [    ] o.a.s.c.a.s.SimClusterStateProvider ** saved cluster state version 15
   [junit4]   2> 1256404 DEBUG (TEST-IndexSizeTriggerTest.testMergeIntegration-seed#[1A75798A1ECBA479]) [    ] o.a.s.c.a.s.SimClusterStateProvider ** creating new collection states, currentVersion=16
   [junit4]   2> 1256405 DEBUG (TEST-IndexSizeTriggerTest.testMergeIntegration-seed#[1A75798A1ECBA479]) [    ] o.a.s.c.a.s.SimClusterStateProvider ** saved cluster state version 16
   [junit4]   2> 1256415 DEBUG (simCloudManagerPool-4715-thread-29) [    ] o.a.s.c.a.AutoScalingHandler Verified autoscaling configuration
   [junit4]   2> 1256415 DEBUG (simCloudManagerPool-4715-thread-29) [    ] o.a.s.c.a.OverseerTriggerThread Refreshing /autoscaling.json with znode version 2
   [junit4]   2> 1256415 DEBUG (Simulated OverseerAutoScalingTriggerThread) [    ] o.a.s.c.a.OverseerTriggerThread Processed trigger updates upto znodeVersion 2
   [junit4]   2> 1256416 DEBUG (Simulated OverseerAutoScalingTriggerThread) [    ] o.a.s.c.a.OverseerTriggerThread -- clean old nodeLost markers
   [junit4]   2> 1256416 DEBUG (Simulated OverseerAutoScalingTriggerThread) [    ] o.a.s.c.a.OverseerTriggerThread -- clean old nodeAdded markers
   [junit4]   2> 1256416 DEBUG (Simulated OverseerAutoScalingTriggerThread) [    ] o.a.s.c.a.OverseerTriggerThread Current znodeVersion 2, lastZnodeVersion 2
   [junit4]   2> 1256418 DEBUG (simCloudManagerPool-4715-thread-30) [    ] o.a.s.c.a.AutoScalingHandler Verified autoscaling configuration
   [junit4]   2> 1256418 DEBUG (simCloudManagerPool-4715-thread-30) [    ] o.a.s.c.a.OverseerTriggerThread Refreshing /autoscaling.json with znode version 3
   [junit4]   2> 1256418 DEBUG (Simulated OverseerAutoScalingTriggerThread) [    ] o.a.s.c.a.OverseerTriggerThread Processed trigger updates upto znodeVersion 3
   [junit4]   2> 1256418 DEBUG (Simulated OverseerAutoScalingTriggerThread) [    ] o.a.s.c.a.OverseerTriggerThread -- clean old nodeLost markers
   [junit4]   2> 1256418 DEBUG (Simulated OverseerAutoScalingTriggerThread) [    ] o.a.s.c.a.OverseerTriggerThread -- clean old nodeAdded markers
   [junit4]   2> 1256418 DEBUG (Simulated OverseerAutoScalingTriggerThread) [    ] o.a.s.c.a.OverseerTriggerThread Current znodeVersion 3, lastZnodeVersion 3
   [junit4]   2> 1256421 DEBUG (simCloudManagerPool-4715-thread-31) [    ] o.a.s.c.a.AutoScalingHandler Verified autoscaling configuration
   [junit4]   2> 1256421 DEBUG (simCloudManagerPool-4715-thread-31) [    ] o.a.s.c.a.OverseerTriggerThread Refreshing /autoscaling.json with znode version 4
   [junit4]   2> 1256421 DEBUG (Simulated OverseerAutoScalingTriggerThread) [    ] o.a.s.c.a.OverseerTriggerThread Processed trigger updates upto znodeVersion 4
   [junit4]   2> 1256421 DEBUG (Simulated OverseerAutoScalingTriggerThread) [    ] o.a.s.c.a.OverseerTriggerThread -- clean old nodeLost markers
   [junit4]   2> 1256421 DEBUG (Simulated OverseerAutoScalingTriggerThread) [    ] o.a.s.c.a.OverseerTriggerThread -- clean old nodeAdded markers
   [junit4]   2> 1256421 DEBUG (Simulated OverseerAutoScalingTriggerThread) [    ] o.a.s.c.a.OverseerTriggerThread Current znodeVersion 4, lastZnodeVersion 4
   [junit4]   2> 1256425 DEBUG (ScheduledTrigger-4695-thread-1) [    ] o.a.s.c.a.NodeLostTrigger Running NodeLostTrigger: .auto_add_replicas with currently live nodes: 2
   [junit4]   2> 1256431 DEBUG (simCloudManagerPool-4715-thread-48) [    ] o.a.s.c.a.AutoScalingHandler Verified autoscaling configuration
   [junit4]   2> 1256431 DEBUG (simCloudManagerPool-4715-thread-48) [    ] o.a.s.c.a.OverseerTriggerThread Refreshing /autoscaling.json with znode version 5
   [junit4]   2> 1256435 DEBUG (Simulated OverseerAutoScalingTriggerThread) [    ] o.a.s.c.a.OverseerTriggerThread Processed trigger updates upto znodeVersion 5
   [junit4]   2> 1256435 DEBUG (Simulated OverseerAutoScalingTriggerThread) [    ] o.a.s.c.a.OverseerTriggerThread -- clean old nodeLost markers
   [junit4]   2> 1256435 DEBUG (Simulated OverseerAutoScalingTriggerThread) [    ] o.a.s.c.a.OverseerTriggerThread -- clean old nodeAdded markers
   [junit4]   2> 1256435 DEBUG (Simulated OverseerAutoScalingTriggerThread) [    ] o.a.s.c.a.OverseerTriggerThread Current znodeVersion 5, lastZnodeVersion 5
   [junit4]   2> 1256560 DEBUG (ScheduledTrigger-4716-thread-3) [    ] o.a.s.c.a.ScheduledTriggers ++++++++ Cooldown inactive - processing event: {
   [junit4]   2>   "id":"1503f7fd6f8e13T2806lyyyz41sgmg6nm0vbspdl",
   [junit4]   2>   "source":"index_size_trigger3",
   [junit4]   2>   "eventTime":5915338154675731,
   [junit4]   2>   "eventType":"INDEXSIZE",
   [junit4]   2>   "properties":{
   [junit4]   2>     "aboveSize":{},
   [junit4]   2>     "belowSize":{
   [junit4]   2>       "testMergeIntegration_collection_shard1_replica_n1":"docs=2, bytes=11240",
   [junit4]   2>       "testMergeIntegration_collection_shard2_replica_n3":"docs=3, bytes=11740"},
   [junit4]   2>     "requestedOps":[{
   [junit4]   2>         "action":"MERGESHARDS",
   [junit4]   2>         "hints":{"COLL_SHARD":[
   [junit4]   2>             {
   [junit4]   2>               "first":"testMergeIntegration_collection",
   [junit4]   2>               "second":"shard1"},
   [junit4]   2>             {
   [junit4]   2>               "first":"testMergeIntegration_collection",
   [junit4]   2>               "second":"shard2"}]}}]}}
   [junit4]   2> 1256561 DEBUG (ScheduledTrigger-4716-thread-3) [    ] o.a.s.c.a.ScheduledTriggers Pausing all triggers: [index_size_trigger3]
   [junit4]   2> 1256562 DEBUG (simCloudManagerPool-4715-thread-49) [    ] o.a.s.c.a.s.SimClusterStateProvider -- simCreateCollection .system, currentVersion=17
   [junit4]   2> 1256562 DEBUG (simCloudManagerPool-4715-thread-49) [    ] o.a.s.c.a.s.SimClusterStateProvider ** creating new collection states, currentVersion=17
   [junit4]   2> 1256563 DEBUG (simCloudManagerPool-4715-thread-49) [    ] o.a.s.c.a.s.SimClusterStateProvider ** saved cluster state version 17
   [junit4]   2> 1256573 DEBUG (simCloudManagerPool-4715-thread-49) [    ] o.a.s.c.a.s.SimClusterStateProvider ** creating new collection states, currentVersion=18
   [junit4]   2> 1256573 DEBUG (simCloudManagerPool-4715-thread-49) [    ] o.a.s.c.a.s.SimClusterStateProvider ** saved cluster state version 18
   [junit4]   2> 1256584 DEBUG (simCloudManagerPool-4715-thread-50) [    ] o.a.s.c.a.s.SimClusterStateProvider ** creating new collection states, currentVersion=19
   [junit4]   2> 1256584 DEBUG (simCloudManagerPool-4715-thread-50) [    ] o.a.s.c.a.s.SimClusterStateProvider ** saved cluster state version 19
   [junit4]   2> 1256585 DEBUG (simCloudManagerPool-4715-thread-52) [    ] o.a.s.c.a.s.SimClusterStateProvider -- elected new leader for .system / shard1 (currentVersion=20): {"core_node1":{
   [junit4]   2>     "core":".system_shard1_replica_n1",
   [junit4]   2>     "shard":"shard1",
   [junit4]   2>     "collection":".system",
   [junit4]   2>     "node_name":"127.0.0.1:10007_solr",
   [junit4]   2>     "type":"NRT",
   [junit4]   2>     "leader":"true",
   [junit4]   2>     "SEARCHER.searcher.maxDoc":0,
   [junit4]   2>     "SEARCHER.searcher.deletedDocs":0,
   [junit4]   2>     "INDEX.sizeInBytes":10240,
   [junit4]   2>     "state":"active",
   [junit4]   2>     "INDEX.sizeInGB":9.5367431640625E-6,
   [junit4]   2>     "SEARCHER.searcher.numDocs":0}}
   [junit4]   2> 1256595 DEBUG (simCloudManagerPool-4715-thread-51) [    ] o.a.s.c.a.s.SimClusterStateProvider ** creating new collection states, currentVersion=20
   [junit4]   2> 1256595 DEBUG (simCloudManagerPool-4715-thread-51) [    ] o.a.s.c.a.s.SimClusterStateProvider ** saved cluster state version 20
   [junit4]   2> 1256595 DEBUG (simCloudManagerPool-4715-thread-49) [    ] o.a.s.c.a.s.SimClusterStateProvider -- finished createCollection .system, currentVersion=21
   [junit4]   2> 1256597 INFO  (ScheduledTrigger-4716-thread-3) [    ] o.a.s.c.a.IndexSizeTriggerTest =======> CapturedEvent{timestamp=5915346231849781, stage=STARTED, actionName='null', event={
   [junit4]   2>   "id":"1503f7fd6f8e13T2806lyyyz41sgmg6nm0vbspdl",
   [junit4]   2>   "source":"index_size_trigger3",
   [junit4]   2>   "eventTime":5915338154675731,
   [junit4]   2>   "eventType":"INDEXSIZE",
   [junit4]   2>   "properties":{
   [junit4]   2>     "aboveSize":{},
   [junit4]   2>     "belowSize":{
   [junit4]   2>       "testMergeIntegration_collection_shard1_replica_n1":"docs=2, bytes=11240",
   [junit4]   2>       "testMergeIntegration_collection_shard2_replica_n3":"docs=3, bytes=11740"},
   [junit4]   2>     "_enqueue_time_":5915344434724881,
   [junit4]   2>     "requestedOps":[{
   [junit4]   2>         "action":"MERGESHARDS",
   [junit4]   2>         "hints":{"COLL_SHARD":[
   [junit4]   2>             {
   [junit4]   2>               "first":"testMergeIntegration_collection",
   [junit4]   2>               "second":"shard1"},
   [junit4]   2>             {
   [junit4]   2>               "first":"testMergeIntegration_collection",
   [junit4]   2>               "second":"shard2"}]}}]}}, context={}, config={
   [junit4]   2>   "trigger":"index_size_trigger3",
   [junit4]   2>   "stage":[
   [junit4]   2>     "STARTED",
   [junit4]   2>     "ABORTED",
   [junit4]   2>     "SUCCEEDED",
   [junit4]   2>     "FAILED"],
   [junit4]   2>   "beforeAction":[
   [junit4]   2>     "compute_plan",
   [junit4]   2>     "execute_plan"],
   [junit4]   2>   "afterAction":[
   [junit4]   2>     "compute_plan",
   [junit4]   2>     "execute_plan"],
   [junit4]   2>   "class":"org.apache.solr.cloud.autoscaling.IndexSizeTriggerTest$CapturingTriggerListener"}, message='null'}
   [junit4]   2> 1256598 DEBUG (AutoscalingActionExecutor-4717-thread-1) [    ] o.a.s.c.a.ScheduledTriggers -- processing actions for {
   [junit4]   2>   "id":"1503f7fd6f8e13T2806lyyyz41sgmg6nm0vbspdl",
   [junit4]   2>   "source":"index_size_trigger3",
   [junit4]   2>   "eventTime":5915338154675731,
   [junit4]   2>   "eventType":"INDEXSIZE",
   [junit4]   2>   "properties":{
   [junit4]   2>     "aboveSize":{},
   [junit4]   2>     "belowSize":{
   [junit4]   2>       "testMergeIntegration_collection_shard1_replica_n1":"docs=2, bytes=11240",
   [junit4]   2>       "testMergeIntegration_collection_shard2_replica_n3":"docs=3, bytes=11740"},
   [junit4]   2>     "_enqueue_time_":5915344434724881,
   [junit4]   2>     "requestedOps":[{
   [junit4]   2>         "action":"MERGESHARDS",
   [junit4]   2>         "hints":{"COLL_SHARD":[
   [junit4]   2>             {
   [junit4]   2>               "first":"testMergeIntegration_collection",
   [junit4]   2>               "second":"shard1"},
   [junit4]   2>             {
   [junit4]   2>               "first":"testMergeIntegration_collection",
   [junit4]   2>               "second":"shard2"}]}}]}}
   [junit4]   2> 1256598 INFO  (AutoscalingActionExecutor-4717-thread-1) [    ] o.a.s.c.a.IndexSizeTriggerTest =======> CapturedEvent{timestamp=5915346300479981, stage=BEFORE_ACTION, actionName='compute_plan', event={
   [junit4]   2>   "id":"1503f7fd6f8e13T2806lyyyz41sgmg6nm0vbspdl",
   [junit4]   2>   "source":"index_size_trigger3",
   [junit4]   2>   "eventTime":5915338154675731,
   [junit4]   2>   "eventType":"INDEXSIZE",
   [junit4]   2>   "properties":{
   [junit4]   2>     "aboveSize":{},
   [junit4]   2>     "belowSize":{
   [junit4]   2>       "testMergeIntegration_collection_shard1_replica_n1":"docs=2, bytes=11240",
   [junit4]   2>       "testMergeIntegration_collection_shard2_replica_n3":"docs=3, bytes=11740"},
   [junit4]   2>     "_enqueue_time_":5915344434724881,
   [junit4]   2>     "requestedOps":[{
   [junit4]   2>         "action":"MERGESHARDS",
   [junit4]   2>         "hints":{"COLL_SHARD":[
   [junit4]   2>             {
   [junit4]   2>               "first":"testMergeIntegration_collection",
   [junit4]   2>               "second":"shard1"},
   [junit4]   2>             {
   [junit4]   2>               "first":"testMergeIntegration_collection",
   [junit4]   2>               "second":"shard2"}]}}]}}, context={properties.BEFORE_ACTION=[compute_plan], source=index_size_trigger3}, config={
   [junit4]   2>   "trigger":"index_size_trigger3",
   [junit4]   2>   "stage":[
   [junit4]   2>     "STARTED",
   [junit4]   2>     "ABORTED",
   [junit4]   2>     "SUCCEEDED",
   [junit4]   2>     "FAILED"],
   [junit4]   2>   "beforeAction":[
   [junit4]   2>     "compute_plan",
   [junit4]   2>     "execute_plan"],
   [junit4]   2>   "afterAction":[
   [junit4]   2>     "compute_plan",
   [junit4]   2>     "execute_plan"],
   [junit4]   2>   "class":"org.apache.solr.cloud.autoscaling.IndexSizeTriggerTest$CapturingTriggerListener"}, message='null'}
   [junit4]   2> 1256599 DEBUG (AutoscalingActionExecutor-4717-thread-1) [    ] o.a.s.c.a.ComputePlanAction -- processing event: {
   [junit4]   2>   "id":"1503f7fd6f8e13T2806lyyyz41sgmg6nm0vbspdl",
   [junit4]   2>   "source":"index_size_trigger3",
   [junit4]   2>   "eventTime":5915338154675731,
   [junit4]   2>   "eventType":"INDEXSIZE",
   [junit4]   2>   "properties":{
   [junit4]   2>     "aboveSize":{},
   [junit4]   2>     "belowSize":{
   [junit4]   2>       "testMergeIntegration_collection_shard1_replica_n1":"docs=2, bytes=11240",
   [junit4]   2>       "testMergeIntegration_collection_shard2_replica_n3":"docs=3, bytes=11740"},
   [junit4]   2>     "_enqueue_time_":5915344434724881,
   [junit4]   2>     "requestedOps":[{
   [junit4]   2>         "action":"MERGESHARDS",
   [junit4]   2>         "hints":{"COLL_SHARD":[
   [junit4]   2>             {
   [junit4]   2>               "first":"testMergeIntegration_collection",
   [junit4]   2>               "second":"shard1"},
   [junit4]   2>             {
   [junit4]   2>               "first":"testMergeIntegration_collection",
   [junit4]   2>               "second":"shard2"}]}}]}} with context properties: {BEFORE_ACTION=[compute_plan]}
   [junit4]   2> 1256601 INFO  (AutoscalingActionExecutor-4717-thread-1) [    ] o.a.s.c.a.ComputePlanAction Computed plan empty, remained 0 requested ops to try.
   [junit4]   2> 1256601 INFO  (AutoscalingActionExecutor-4717-thread-1) [    ] o.a.s.c.a.IndexSizeTriggerTest =======> CapturedEvent{timestamp=5915346415452381, stage=AFTER_ACTION, actionName='compute_plan', event={
   [junit4]   2>   "id":"1503f7fd6f8e13T2806lyyyz41sgmg6nm0vbspdl",
   [junit4]   2>   "source":"index_size_trigger3",
   [junit4]   2>   "eventTime":5915338154675731,
   [junit4]   2>   "eventType":"INDEXSIZE",
   [junit4]   2>   "properties":{
   [junit4]   2>     "__start__":1,
   [junit4]   2>     "aboveSize":{},
   [junit4]   2>     "belowSize":{
   [junit4]   2>       "testMergeIntegration_collection_shard1_replica_n1":"docs=2, bytes=11240",
   [junit4]   2>       "testMergeIntegration_collection_shard2_replica_n3":"docs=3, bytes=11740"},
   [junit4]   2>     "_enqueue_time_":5915344434724881,
   [junit4]   2>     "requestedOps":[{
   [junit4]   2>         "action":"MERGESHARDS",
   [junit4]   2>         "hints":{"COLL_SHARD":[
   [junit4]   2>             {
   [junit4]   2>               "first":"testMergeIntegration_collection",
   [junit4]   2>               "second":"shard1"},
   [junit4]   2>             {
   [junit4]   2>               "first":"testMergeIntegration_collection",
   [junit4]   2>               "second":"shard2"}]}}]}}, context={properties.unsupportedOps=[Op{action=MERGESHARDS, hints={COLL_SHARD=[{
   [junit4]   2>   "first":"testMergeIntegration_collection",
   [junit4]   2>   "second":"shard1"}, {
   [junit4]   2>   "first":"testMergeIntegration_collection",
   [junit4]   2>   "second":"shard2"}]}}], properties.BEFORE_ACTION=[compute_plan], source=index_size_trigger3, properties.AFTER_ACTION=[compute_plan]}, config={
   [junit4]   2>   "trigger":"index_size_trigger3",
   [junit4]   2>   "stage":[
   [junit4]   2>     "STARTED",
   [junit4]   2>     "ABORTED",
   [junit4]   2>     "SUCCEEDED",
   [junit4]   2>     "FAILED"],
   [junit4]   2>   "beforeAction":[
   [junit4]   2>     "compute_plan",
   [junit4]   2>     "execute_plan"],
   [junit4]   2>   "afterAction":[
   [junit4]   2>     "compute_plan",
   [junit4]   2>     "execute_plan"],
   [junit4]   2>   "class":"org.apache.solr.cloud.autoscaling.IndexSizeTriggerTest$CapturingTriggerListener"}, message='null'}
   [junit4]   2> 1256601 INFO  (AutoscalingActionExecutor-4717-thread-1) [    ] o.a.s.c.a.IndexSizeTriggerTest =======> CapturedEvent{timestamp=5915346427922931, stage=BEFORE_ACTION, actionName='execute_plan', event={
   [junit4]   2>   "id":"1503f7fd6f8e13T2806lyyyz41sgmg6nm0vbspdl",
   [junit4]   2>   "source":"index_size_trigger3",
   [junit4]   2>   "eventTime":5915338154675731,
   [junit4]   2>   "eventType":"INDEXSIZE",
   [junit4]   2>   "properties":{
   [junit4]   2>     "__start__":1,
   [junit4]   2>     "aboveSize":{},
   [junit4]   2>     "belowSize":{
   [junit4]   2>       "testMergeIntegration_collection_shard1_replica_n1":"docs=2, bytes=11240",
   [junit4]   2>       "testMergeIntegration_collection_shard2_replica_n3":"docs=3, bytes=11740"},
   [junit4]   2>     "_enqueue_time_":5915344434724881,
   [junit4]   2>     "requestedOps":[{
   [junit4]   2>         "action":"MERGESHARDS",
   [junit4]   2>         "hints":{"COLL_SHARD":[
   [junit4]   2>             {
   [junit4]   2>               "first":"testMergeIntegration_collection",
   [junit4]   2>               "second":"shard1"},
   [junit4]   2>             {
   [junit4]   2>               "first":"testMergeIntegration_collection",
   [junit4]   2>               "second":"shard2"}]}}]}}, context={properties.unsupportedOps=[Op{action=MERGESHARDS, hints={COLL_SHARD=[{
   [junit4]   2>   "first":"testMergeIntegration_collection",
   [junit4]   2>   "second":"shard1"}, {
   [junit4]   2>   "first":"testMergeIntegration_collection",
   [junit4]   2>   "second":"shard2"}]}}], properties.BEFORE_ACTION=[compute_plan, execute_plan], source=index_size_trigger3, properties.AFTER_ACTION=[compute_plan]}, config={
   [junit4]   2>   "trigger":"index_size_trigger3",
   [junit4]   2>   "stage":[
   [junit4]   2>     "STARTED",
   [junit4]   2>     "ABORTED",
   [junit4]   2>     "SUCCEEDED",
   [junit4]   2>     "FAILED"],
   [junit4]   2>   "beforeAction":[
   [junit4]   2>     "compute_plan",
   [junit4]   2>     "execute_plan"],
   [junit4]   2>   "afterAction":[
   [junit4]   2>     "compute_plan",
   [junit4]   2>     "execute_plan"],
   [junit4]   2>   "class":"org.apache.solr.cloud.autoscaling.IndexSizeTriggerTest$CapturingTriggerListener"}, message='null'}
   [junit4]   2> 1256601 DEBUG (AutoscalingActionExecutor-4717-thread-1) [    ] o.a.s.c.a.ExecutePlanAction -- processing event: {
   [junit4]   2>   "id":"1503f7fd6f8e13T2806lyyyz41sgmg6nm0vbspdl",
   [junit4]   2>   "source":"index_size_trigger3",
   [junit4]   2>   "eventTime":5915338154675731,
   [junit4]   2>   "eventType":"INDEXSIZE",
   [junit4]   2>   "properties":{
   [junit4]   2>     "__start__":1,
   [junit4]   2>     "aboveSize":{},
   [junit4]   2>     "belowSize":{
   [junit4]   2>       "testMergeIntegration_collection_shard1_replica_n1":"docs=2, bytes=11240",
   [junit4]   2>       "testMergeIntegration_collection_shard2_replica_n3":"docs=3, bytes=11740"},
   [junit4]   2>     "_enqueue_time_":5915344434724881,
   [junit4]   2>     "requestedOps":[{
   [junit4]   2>         "action":"MERGESHARDS",
   [junit4]   2>         "hints":{"COLL_SHARD":[
   [junit4]   2>             {
   [junit4]   2>               "first":"testMergeIntegration_collection",
   [junit4]   2>               "second":"shard1"},
   [junit4]   2>             {
   [junit4]   2>               "first":"testMergeIntegration_collection",
   [junit4]   2>               "second":"shard2"}]}}]}} with context properties: {AFTER_ACTION=[compute_plan], unsupportedOps=[Op{action=MERGESHARDS, hints={COLL_SHARD=[{
   [junit4]   2>   "first":"testMergeIntegration_collection",
   [junit4]   2>   "second":"shard1"}, {
   [junit4]   2>   "first":"testMergeIntegration_collection",
   [junit4]   2>   "second":"shard2"}]}}], BEFORE_ACTION=[compute_plan, execute_plan]}
   [junit4]   2> 1256601 INFO  (AutoscalingActionExecutor-4717-thread-1) [    ] o.a.s.c.a.ExecutePlanAction No operations to execute for event: {
   [junit4]   2>   "id":"1503f7fd6f8e13T2806lyyyz41sgmg6nm0vbspdl",
   [junit4]   2>   "source":"index_size_trigger3",
   [junit4]   2>   "eventTime":5915338154675731,
   [junit4]   2>   "eventType":"INDEXSIZE",
   [junit4]   2>   "properties":{
   [junit4]   2>     "__start__":1,
   [junit4]   2>     "aboveSize":{},
   [junit4]   2>     "belowSize":{
   [junit4]   2>       "testMergeIntegration_collection_shard1_replica_n1":"docs=2, bytes=11240",
   [junit4]   2>       "testMergeIntegration_collection_shard2_replica_n3":"docs=3, bytes=11740"},
   [junit4]   2>     "_enqueue_time_":5915344434724881,
   [junit4]   2>     "requestedOps":[{
   [junit4]   2>         "action":"MERGESHARDS",
   [junit4]   2>         "hints":{"COLL_SHARD":[
   [junit4]   2>             {
   [junit4]   2>               "first":"testMergeIntegration_collection",
   [junit4]   2>               "second":"shard1"},
   [junit4]   2>             {
   [junit4]   2>               "first":"testMergeIntegration_collection",
   [junit4]   2>               "second":"shard2"}]}}]}}
   [junit4]   2> 1256602 INFO  (AutoscalingActionExecutor-4717-thread-1) [    ] o.a.s.c.a.IndexSizeTriggerTest =======> CapturedEvent{timestamp=5915346457711181, stage=AFTER_ACTION, actionName='execute_plan', event={
   [junit4]   2>   "id":"1503f7fd6f8e13T2806lyyyz41sgmg6nm0vbspdl",
   [junit4]   2>   "source":"index_size_trigger3",
   [junit4]   2>   "eventTime":5915338154675731,
   [junit4]   2>   "eventType":"INDEXSIZE",
   [junit4]   2>   "properties":{
   [junit4]   2>     "__start__":1,
   [junit4]   2>     "aboveSize":{},
   [junit4]   2>     "belowSize":{
   [junit4]   2>       "testMergeIntegration_collection_shard1_replica_n1":"docs=2, bytes=11240",
   [junit4]   2>       "testMergeIntegration_collection_shard2_replica_n3":"docs=3, bytes=11740"},
   [junit4]   2>     "_enqueue_time_":5915344434724881,
   [junit4]   2>     "requestedOps":[{
   [junit4]   2>         "action":"MERGESHARDS",
   [junit4]   2>         "hints":{"COLL_SHARD":[
   [junit4]   2>             {
   [junit4]   2>               "first":"testMergeIntegration_collection",
   [junit4]   2>               "second":"shard1"},
   [junit4]   2>             {
   [junit4]   2>               "first":"testMergeIntegration_collection",
   [junit4]   2>               "second":"shard2"}]}}]}}, context={properties.unsupportedOps=[Op{action=MERGESHARDS, hints={COLL_SHARD=[{
   [junit4]   2>   "first":"testMergeIntegration_collection",
   [junit4]   2>   "second":"shard1"}, {
   [junit4]   2>   "first":"testMergeIntegration_collection",
   [junit4]   2>   "second":"shard2"}]}}], properties.BEFORE_ACTION=[compute_plan, execute_plan], source=index_size_trigger3, properties.AFTER_ACTION=[compute_plan, execute_plan]}, config={
   [junit4]   2>   "trigger":"index_size_trigger3",
   [junit4]   2>   "stage":[
   [junit4]   2>     "STARTED",
   [junit4]   2>     "ABORTED",
   [junit4]   2>     "SUCCEEDED",
   [junit4]   2>     "FAILED"],
   [junit4]   2>   "beforeAction":[
   [junit4]   2>     "compute_plan",
   [junit4]   2>     "execute_plan"],
   [junit4]   2>   "afterAction":[
   [junit4]   2>     "compute_plan",
   [junit4]   2>     "execute_plan"],
   [junit4]   2>   "class":"org.apache.solr.cloud.autoscaling.IndexSizeTriggerTest$CapturingTriggerListener"}, message='null'}
   [junit4]   2> 1256603 INFO  (AutoscalingActionExecutor-4717-thread-1) [    ] o.a.s.c.a.IndexSizeTriggerTest =======> CapturedEvent{timestamp=5915346506562331, stage=SUCCEEDED, actionName='null', event={
   [junit4]   2>   "id":"1503f7fd6f8e13T2806lyyyz41sgmg6nm0vbspdl",
   [junit4]   2>   "source":"index_size_trigger3",
   [junit4]   2>   "eventTime":5915338154675731,
   [junit4]   2>   "eventType":"INDEXSIZE",
   [junit4]   2>   "properties":{
   [junit4]   2>     "__start__":1,
   [junit4]   2>     "aboveSize":{},
   [junit4]   2>     "belowSize":{
   [junit4]   2>       "testMergeIntegration_collection_shard1_replica_n1":"docs=2, bytes=11240",
   [junit4]   2>       "testMergeIntegration_collection_shard2_replica_n3":"docs=3, bytes=11740"},
   [junit4]   2>     "_enqueue_time_":5915344434724881,
   [junit4]   2>     "requestedOps":[{
   [junit4]   2>         "action":"MERGESHARDS",
   [junit4]   2>         "hints":{"COLL_SHARD":[
   [junit4]   2>             {
   [junit4]   2>               "first":"testMergeIntegration_collection",
   [junit4]   2>               "second":"shard1"},
   [junit4]   2>             {
   [junit4]   2>               "first":"testMergeIntegration_collection",
   [junit4]   2>               "second":"shard2"}]}}]}}, context={}, config={
   [junit4]   2>   "trigger":"index_size_trigger3",
   [junit4]   2>   "stage":[
   [junit4]   2>     "STARTED",
   [junit4]   2>     "ABORTED",
   [junit4]   2>     "SUCCEEDED",
   [junit4]   2>     "FAILED"],
   [junit4]   2>   "beforeAction":[
   [junit4]   2>     "compute_plan",
   [junit4]   2>     "execute_plan"],
   [junit4]   2>   "afterAction":[
   [junit4]   2>     "compute_plan",
   [junit4]   2>     "execute_plan"],
   [junit4]   2>   "class":"org.apache.solr.cloud.autoscaling.IndexSizeTriggerTest$CapturingTriggerListener"}, message='null'}
   [junit4]   2> 1256603 DEBUG (AutoscalingActionExecutor-4717-thread-1) [    ] o.a.s.c.a.ScheduledTriggers Resuming trigger: index_size_trigger3 after 100ms
   [junit4]   2> 1256603 DEBUG (AutoscalingActionExecutor-4717-thread-1) [    ] o.a.s.c.a.ScheduledTriggers -- processing took 249 ms for event id=1503f7fd6f8e13T2806lyyyz41sgmg6nm0vbspdl
   [junit4]   2> 1256604 DEBUG (TEST-IndexSizeTriggerTest.testMergeIntegration-seed#[1A75798A1ECBA479]) [    ] o.a.s.c.a.s.SimClusterStateProvider ** creating new collection states, currentVersion=21
   [junit4]   2> 1256604 DEBUG (TEST-IndexSizeTriggerTest.testMergeIntegration-seed#[1A75798A1ECBA479]) [    ] o.a.s.c.a.s.SimClusterStateProvider ** saved cluster state version 21
   [junit4]   2> 1256604 INFO  (TEST-IndexSizeTriggerTest.testMergeIntegration-seed#[1A75798A1ECBA479]) [    ] o.a.s.c.a.IndexSizeTriggerTest #######################################
   [junit4]   2> ############ CLUSTER STATE ############
   [junit4]   2> #######################################
   [junit4]   2> ## Live nodes:		2
   [junit4]   2> ## Empty nodes:	0
   [junit4]   2> ## Dead nodes:		0
   [junit4]   2> ## Collections:
   [junit4]   2> ##  * .system
   [junit4]   2> ##    shardsTotal	1
   [junit4]   2> ##    shardsState	{active=1}
   [junit4]   2> ##      shardsWithoutLeader	0
   [junit4]   2> ##    totalReplicas	2
   [junit4]   2> ##      activeReplicas	2
   [junit4]   2> ##      inactiveReplicas	0
   [junit4]   2> ##    totalActiveDocs	2
   [junit4]   2> ##      bufferedDocs	0
   [junit4]   2> ##      maxActiveSliceDocs	2
   [junit4]   2> ##      minActiveSliceDocs	2
   [junit4]   2> ##      avgActiveSliceDocs	2
   [junit4]   2> ##    totalInactiveDocs	0
   [junit4]   2> ##      maxInactiveSliceDocs	0
   [junit4]   2> ##      minInactiveSliceDocs	0
   [junit4]   2> ##      avgInactiveSliceDocs	NaN
   [junit4]   2> ##    totalActiveBytes	11,240
   [junit4]   2> ##      maxActiveSliceBytes	11,240
   [junit4]   2> ##      minActiveSliceBytes	11,240
   [junit4]   2> ##      avgActiveSliceBytes	11,240
   [junit4]   2> ##    totalInactiveBytes	0
   [junit4]   2> ##      maxInactiveSliceBytes	0
   [junit4]   2> ##      minInactiveSliceBytes	0
   [junit4]   2> ##      avgInactiveSliceBytes	NaN
   [junit4]   2> ##    totalActiveDeletedDocs	0
   [junit4]   2> ##  * testMergeIntegration_collection
   [junit4]   2> ##    shardsTotal	2
   [junit4]   2> ##    shardsState	{active=2}
   [junit4]   2> ##      shardsWithoutLeader	0
   [junit4]   2> ##    totalReplicas	4
   [junit4]   2> ##      activeReplicas	4
   [junit4]   2> ##      inactiveReplicas	0
   [junit4]   2> ##    totalActiveDocs	5
   [junit4]   2> ##      bufferedDocs	0
   [junit4]   2> ##      maxActiveSliceDocs	3
   [junit4]   2> ##      minActiveSliceDocs	2
   [junit4]   2> ##      avgActiveSliceDocs	3
   [junit4]   2> ##    totalInactiveDocs	0
   [junit4]   2> ##      maxInactiveSliceDocs	0
   [junit4]   2> ##      minInactiveSliceDocs	0
   [junit4]   2> ##      avgInactiveSliceDocs	NaN
   [junit4]   2> ##    totalActiveBytes	22,980
   [junit4]   2> ##      maxActiveSliceBytes	11,740
   [junit4]   2> ##      minActiveSliceBytes	11,240
   [junit4]   2> ##      avgActiveSliceBytes	11,490
   [junit4]   2> ##    totalInactiveBytes	0
   [junit4]   2> ##      maxInactiveSliceBytes	0
   [junit4]   2> ##      minInactiveSliceBytes	0
   [junit4]   2> ##      avgInactiveSliceBytes	NaN
   [junit4]   2> ##    totalActiveDeletedDocs	0
   [junit4]   2> DocCollection(testMergeIntegration_collection//clusterstate.json/21)={
   [junit4]   2>   "replicationFactor":"1",
   [junit4]   2>   "pullReplicas":"0",
   [junit4]   2>   "router":{"name":"compositeId"},
   [junit4]   2>   "maxShardsPerNode":"2",
   [junit4]   2>   "autoAddReplicas":"false",
   [junit4]   2>   "nrtReplicas":"2",
   [junit4]   2>   "tlogReplicas":"0",
   [junit4]   2>   "autoCreated":"true",
   [junit4]   2>   "shards":{
   [junit4]   2>     "shard2":{
   [junit4]   2>       "replicas":{
   [junit4]   2>         "core_node3":{
   [junit4]   2>           "core":"testMergeIntegration_collection_shard2_replica_n3",
   [junit4]   2>           "leader":"true",
   [junit4]   2>           "SEARCHER.searcher.maxDoc":8,
   [junit4]   2>           "SEARCHER.searcher.deletedDocs":5,
   [junit4]   2>           "INDEX.sizeInBytes":11740,
   [junit4]   2>           "node_name":"127.0.0.1:10008_solr",
   [junit4]   2>           "state":"active",
   [junit4]   2>           "type":"NRT",
   [junit4]   2>           "INDEX.sizeInGB":1.0933727025985718E-5,
   [junit4]   2>           "SEARCHER.searcher.numDocs":3},
   [junit4]   2>         "core_node4":{
   [junit4]   2>           "core":"testMergeIntegration_collection_shard2_replica_n4",
   [junit4]   2>           "SEARCHER.searcher.maxDoc":8,
   [junit4]   2>           "SEARCHER.searcher.deletedDocs":5,
   [junit4]   2>           "INDEX.sizeInBytes":11740,
   [junit4]   2>           "node_name":"127.0.0.1:10007_solr",
   [junit4]   2>           "state":"active",
   [junit4]   2>           "type":"NRT",
   [junit4]   2>           "INDEX.sizeInGB":1.0933727025985718E-5,
   [junit4]   2>           "SEARCHER.searcher.numDocs":3}},
   [junit4]   2>       "range":"0-7fffffff",
   [junit4]   2>       "state":"active"},
   [junit4]   2>     "shard1":{
   [junit4]   2>       "replicas":{
   [junit4]   2>         "core_node1":{
   [junit4]   2>           "core":"testMergeIntegration_collection_shard1_replica_n1",
   [junit4]   2>           "leader":"true",
   [junit4]   2>           "SEARCHER.searcher.maxDoc":12,
   [junit4]   2>           "SEARCHER.searcher.deletedDocs":10,
   [junit4]   2>           "INDEX.sizeInBytes":11240,
   [junit4]   2>           "node_name":"127.0.0.1:10008_solr",
   [junit4]   2>           "state":"active",
   [junit4]   2>           "type":"NRT",
   [junit4]   2>           "INDEX.sizeInGB":1.0468065738677979E-5,
   [junit4]   2>           "SEARCHER.searcher.numDocs":2},
   [junit4]   2>         "core_node2":{
   [junit4]   2>           "core":"testMergeIntegration_collection_shard1_replica_n2",
   [junit4]   2>           "SEARCHER.searcher.maxDoc":12,
   [junit4]   2>           "SEARCHER.searcher.deletedDocs":10,
   [junit4]   2>           "INDEX.sizeInBytes":11240,
   [junit4]   2>           "node_name":"127.0.0.1:10007_solr",
   [junit4]   2>           "state":"active",
   [junit4]   2>           "type":"NRT",
   [junit4]   2>           "INDEX.sizeInGB":1.0468065738677979E-5,
   [junit4]   2>           "SEARCHER.searcher.numDocs":2}},
   [junit4]   2>       "range":"80000000-ffffffff",
   [junit4]   2>       "state":"active"}}}
   [junit4]   2> DocCollection(.system//clusterstate.json/21)={
   [junit4]   2>   "replicationFactor":"2",
   [junit4]   2>   "pullReplicas":"0",
   [junit4]   2>   "router":{"name":"compositeId"},
   [junit4]   2>   "maxShardsPerNode":"1",
   [junit4]   2>   "autoAddReplicas":"false",
   [junit4]   2>   "nrtReplicas":"1",
   [junit4]   2>   "tlogReplicas":"0",
   [junit4]   2>   "autoCreated":"true",
   [junit4]   2>   "shards":{"shard1":{
   [junit4]   2>       "replicas":{
   [junit4]   2>         "core_node1":{
   [junit4]   2>           "core":".system_shard1_replica_n1",
   [junit4]   2>           "leader":"true",
   [junit4]   2>           "SEARCHER.searcher.maxDoc":2,
   [junit4]   2>           "SEARCHER.searcher.deletedDocs":0,
   [junit4]   2>           "INDEX.sizeInBytes":11240,
   [junit4]   2>           "node_name":"127.0.0.1:10007_solr",
   [junit4]   2>           "state":"active",
   [junit4]   2>           "type":"NRT",
   [junit4]   2>           "INDEX.sizeInGB":1.0468065738677979E-5,
   [junit4]   2>           "SEARCHER.searcher.numDocs":2},
   [junit4]   2>         "core_node2":{
   [junit4]   2>           "core":".system_shard1_replica_n2",
   [junit4]   2>           "SEARCHER.searcher.maxDoc":2,
   [junit4]   2>           "SEARCHER.searcher.deletedDocs":0,
   [junit4]   2>           "INDEX.sizeInBytes":11240,
   [junit4]   2>           "node_name":"127.0.0.1:10008_solr",
   [junit4]   2>           "state":"active",
   [junit4]   2>           "type":"NRT",
   [junit4]   2>           "INDEX.sizeInGB":1.0468065738677979E-5,
   [junit4]   2>           "SEARCHER.searcher.numDocs":2}},
   [junit4]   2>       "range":"80000000-7fffffff",
   [junit4]   2>       "state":"active"}}}
   [junit4]   2> ## Max replicas per node:	3
   [junit4]   2> ## Min replicas per node:	3
   [junit4]   2> ## Total replicas:		6
   [junit4]   2> ## * .system		2
   [junit4]   2> ##		- active           2
   [junit4]   2> ## * testMergeIntegration_collection		4
   [junit4]   2> ##		- active           4
   [junit4]   2> ######### Solr op counts ##########
   [junit4]   2> ##		- CREATE             1
   [junit4]   2> ##		- autoscaling        4
   [junit4]   2> ##		- update            39
   [junit4]   2> ######### Autoscaling event counts ###########
   [junit4]   2> ## * Trigger: index_size_trigger3
   [junit4]   2> ##		- STARTED         1
   [junit4]   2> ##		- SUCCEEDED       1
   [junit4]   2> 
   [junit4]   2> 1256605 INFO  (TEST-IndexSizeTriggerTest.testMergeIntegration-seed#[1A75798A1ECBA479]) [    ] o.a.s.c.a.s.SimCloudManager === Restarting OverseerTriggerThread and clearing object cache...
   [junit4]   2> 1256606 DEBUG (TEST-IndexSizeTriggerTest.testMergeIntegration-seed#[1A75798A1ECBA479]) [    ] o.a.s.c.a.ScheduledTriggers Shutting down scheduled thread pool executor now
   [junit4]   2> 1256606 WARN  (Simulated OverseerAutoScalingTriggerThread) [    ] o.a.s.c.a.OverseerTriggerThread OverseerTriggerThread woken up but we are closed, exiting.
   [junit4]   2> 1256606 DEBUG (TEST-IndexSizeTriggerTest.testMergeIntegration-seed#[1A75798A1ECBA479]) [    ] o.a.s.c.a.ScheduledTriggers Shutting down action executor now
   [junit4]   2> 1256606 DEBUG (TEST-IndexSizeTriggerTest.testMergeIntegration-seed#[1A75798A1ECBA479]) [    ] o.a.s.c.a.ScheduledTriggers Awaiting termination for action executor
   [junit4]   2> 1256606 DEBUG (TEST-IndexSizeTriggerTest.testMergeIntegration-seed#[1A75798A1ECBA479]) [    ] o.a.s.c.a.ScheduledTriggers Awaiting termination for scheduled thread pool executor
   [junit4]   2> 1256606 DEBUG (TEST-IndexSizeTriggerTest.testMergeIntegration-seed#[1A75798A1ECBA479]) [    ] o.a.s.c.a.ScheduledTriggers ScheduledTriggers closed completely
   [junit4]   2> 1256606 DEBUG (TEST-IndexSizeTriggerTest.testMergeIntegration-seed#[1A75798A1ECBA479]) [    ] o.a.s.c.a.OverseerTriggerThread OverseerTriggerThread has been closed explicitly
   [junit4]   2> 1256607 DEBUG (Simulated OverseerAutoScalingTriggerThread) [    ] o.a.s.c.a.OverseerTriggerThread Adding .auto_add_replicas and .scheduled_maintenance triggers
   [junit4]   2> 1256608 DEBUG (Simulated OverseerAutoScalingTriggerThread) [    ] o.a.s.c.a.OverseerTriggerThread Refreshing /autoscaling.json with znode version 6
   [junit4]   2> 1256609 DEBUG (Simulated OverseerAutoScalingTriggerThread) [    ] o.a.s.c.a.OverseerTriggerThread Current znodeVersion 6, lastZnodeVersion -1
   [junit4]   2> 1256609 DEBUG (Simulated OverseerAutoScalingTriggerThread) [    ] o.a.s.c.a.OverseerTriggerThread Processed trigger updates upto znodeVersion 6
   [junit4]   2> 1256614 DEBUG (ScheduledTrigger-4719-thread-1) [    ] o.a.s.c.a.s.SimClusterStateProvider ** creating new collection states, currentVersion=22
   [junit4]   2> 1256614 DEBUG (Simulated OverseerAutoScalingTriggerThread) [    ] o.a.s.c.a.NodeLostTrigger NodeLostTrigger .auto_add_replicas - Initial livenodes: [127.0.0.1:10008_solr, 127.0.0.1:10007_solr]
   [junit4]   2> 1256614 DEBUG (ScheduledTrigger-4719-thread-2) [    ] o.a.s.c.a.NodeLostTrigger Running NodeLostTrigger: .auto_add_replicas with currently live nodes: 2
   [junit4]   2> 1256614 DEBUG (ScheduledTrigger-4719-thread-1) [    ] o.a.s.c.a.s.SimClusterStateProvider ** saved cluster state version 22
   [junit4]   2> 1256614 DEBUG (Simulated OverseerAutoScalingTriggerThread) [    ] o.a.s.c.a.OverseerTriggerThread -- clean old nodeAdded markers
   [junit4]   2> 1256615 DEBUG (Simulated OverseerAutoScalingTriggerThread) [    ] o.a.s.c.a.OverseerTriggerThread Current znodeVersion 6, lastZnodeVersion 6
   [junit4]   2> 1256617 DEBUG (TEST-IndexSizeTriggerTest.testMergeIntegration-seed#[1A75798A1ECBA479]) [    ] o.a.s.c.a.OverseerTriggerThread Refreshing /autoscaling.json with znode version 7
   [junit4]   2> 1256617 DEBUG (Simulated OverseerAutoScalingTriggerThread) [    ] o.a.s.c.a.OverseerTriggerThread Processed trigger updates upto znodeVersion 7
   [junit4]   2> 1256618 DEBUG (Simulated OverseerAutoScalingTriggerThread) [    ] o.a.s.c.a.OverseerTriggerThread -- clean old nodeLost markers
   [junit4]   2> 1256618 DEBUG (Simulated OverseerAutoScalingTriggerThread) [    ] o.a.s.c.a.OverseerTriggerThread -- clean old nodeAdded markers
   [junit4]   2> 1256618 DEBUG (Simulated OverseerAutoScalingTriggerThread) [    ] o.a.s.c.a.OverseerTriggerThread Current znodeVersion 7, lastZnodeVersion 7
   [junit4]   2> 1256718 INFO  (TEST-IndexSizeTriggerTest.testMergeIntegration-seed#[1A75798A1ECBA479]) [    ] o.a.s.SolrTestCaseJ4 ###Ending testMergeIntegration
   [junit4]   2> 1256742 INFO  (TEST-IndexSizeTriggerTest.testSplitIntegration-seed#[1A75798A1ECBA479]) [    ] o.a.s.SolrTestCaseJ4 ###Starting testSplitIntegration
   [junit4]   2> 1256743 DEBUG (simCloudManagerPool-4718-thread-1) [    ] o.a.s.c.a.s.SimClusterStateProvider -- simCreateCollection testSplitIntegration_collection, currentVersion=23
   [junit4]   2> 1256743 DEBUG (simCloudManagerPool-4718-thread-1) [    ] o.a.s.c.a.s.SimClusterStateProvider ** creating new collection states, currentVersion=23
   [junit4]   2> 1256743 DEBUG (simCloudManagerPool-4718-thread-1) [    ] o.a.s.c.a.s.SimClusterStateProvider ** saved cluster state version 23
   [junit4]   2> 1256753 DEBUG (simCloudManagerPool-4718-thread-1) [    ] o.a.s.c.a.s.SimClusterStateProvider ** creating new collection states, currentVersion=24
   [junit4]   2> 1256754 DEBUG (simCloudManagerPool-4718-thread-1) [    ] o.a.s.c.a.s.SimClusterStateProvider ** saved cluster state version 24
   [junit4]   2> 1256755 DEBUG (simCloudManagerPool-4718-thread-1) [    ] o.a.s.c.a.s.SimClusterStateProvider -- finished createCollection testSplitIntegration_collection, currentVersion=25
   [junit4]   2> 1256764 DEBUG (simCloudManagerPool-4718-thread-2) [    ] o.a.s.c.a.s.SimClusterStateProvider ** creating new collection states, currentVersion=25
   [junit4]   2> 1256765 DEBUG (simCloudManagerPool-4718-thread-2) [    ] o.a.s.c.a.s.SimClusterStateProvider ** saved cluster state version 25
   [junit4]   2> 1256765 DEBUG (simCloudManagerPool-4718-thread-6) [    ] o.a.s.c.a.s.SimClusterStateProvider -- elected new leader for testSplitIntegration_collection / shard1 (currentVersion=26): {"core_node1":{
   [junit4]   2>     "core":"testSplitIntegration_collection_shard1_replica_n1",
   [junit4]   2>     "shard":"shard1",
   [junit4]   2>     "collection":"testSplitIntegration_collection",
   [junit4]   2>     "node_name":"127.0.0.1:10007_solr",
   [junit4]   2>     "type":"NRT",
   [junit4]   2>     "leader":"true",
   [junit4]   2>     "SEARCHER.searcher.maxDoc":0,
   [junit4]   2>     "SEARCHER.searcher.deletedDocs":0,
   [junit4]   2>     "INDEX.sizeInBytes":10240,
   [junit4]   2>     "state":"active",
   [junit4]   2>     "INDEX.sizeInGB":9.5367431640625E-6,
   [junit4]   2>     "SEARCHER.searcher.numDocs":0}}
   [junit4]   2> 1256775 DEBUG (simCloudManagerPool-4718-thread-3) [    ] o.a.s.c.a.s.SimClusterStateProvider ** creating new collection states, currentVersion=26
   [junit4]   2> 1256775 DEBUG (simCloudManagerPool-4718-thread-3) [    ] o.a.s.c.a.s.SimClusterStateProvider ** saved cluster state version 26
   [junit4]   2> 1256775 DEBUG (TEST-IndexSizeTriggerTest.testSplitIntegration-seed#[1A75798A1ECBA479]) [    ] o.a.s.c.a.s.SimClusterStateProvider ** creating new collection states, currentVersion=27
   [junit4]   2> 1256776 DEBUG (TEST-IndexSizeTriggerTest.testSplitIntegration-seed#[1A75798A1ECBA479]) [    ] o.a.s.c.a.s.SimClusterStateProvider ** saved cluster state version 27
   [junit4]   2> 1256786 DEBUG (simCloudManagerPool-4718-thread-5) [    ] o.a.s.c.a.s.SimClusterStateProvider ** creating new collection states, currentVersion=28
   [junit4]   2> 1256786 DEBUG (simCloudManagerPool-4718-thread-5) [    ] o.a.s.c.a.s.SimClusterStateProvider ** saved cluster state version 28
   [junit4]   2> 1256787 DEBUG (simCloudManagerPool-4718-thread-7) [    ] o.a.s.c.a.s.SimClusterStateProvider -- elected new leader for testSplitIntegration_collection / shard2 (currentVersion=29): {"core_node4":{
   [junit4]   2>     "core":"testSplitIntegration_collection_shard2_replica_n4",
   [junit4]   2>     "shard":"shard2",
   [junit4]   2>     "collection":"testSplitIntegration_collection",
   [junit4]   2>     "node_name":"127.0.0.1:10008_solr",
   [junit4]   2>     "type":"NRT",
   [junit4]   2>     "leader":"true",
   [junit4]   2>     "SEARCHER.searcher.maxDoc":0,
   [junit4]   2>     "SEARCHER.searcher.deletedDocs":0,
   [junit4]   2>     "INDEX.sizeInBytes":10240,
   [junit4]   2>     "state":"active",
   [junit4]   2>     "INDEX.sizeInGB":9.5367431640625E-6,
   [junit4]   2>     "SEARCHER.searcher.numDocs":0}}
   [junit4]   2> 1256797 DEBUG (simCloudManagerPool-4718-thread-4) [    ] o.a.s.c.a.s.SimClusterStateProvider ** creating new collection states, currentVersion=29
   [junit4]   2> 1256797 DEBUG (simCloudManagerPool-4718-thread-4) [    ] o.a.s.c.a.s.SimClusterStateProvider ** saved cluster state version 29
   [junit4]   2> 1256797 DEBUG (TEST-IndexSizeTriggerTest.testSplitIntegration-seed#[1A75798A1ECBA479]) [    ] o.a.s.c.a.s.SimClusterStateProvider ** creating new collection states, currentVersion=30
   [junit4]   2> 1256798 DEBUG (TEST-IndexSizeTriggerTest.testSplitIntegration-seed#[1A75798A1ECBA479]) [    ] o.a.s.c.a.s.SimClusterStateProvider ** saved cluster state version 30
   [junit4]   2> 1256799 DEBUG (simCloudManagerPool-4718-thread-8) [    ] o.a.s.c.a.AutoScalingHandler Verified autoscaling configuration
   [junit4]   2> 1256800 DEBUG (simCloudManagerPool-4718-thread-8) [    ] o.a.s.c.a.OverseerTriggerThread Refreshing /autoscaling.json with znode version 8
   [junit4]   2> 1256800 DEBUG (Simulated OverseerAutoScalingTriggerThread) [    ] o.a.s.c.a.OverseerTriggerThread Processed trigger updates upto znodeVersion 8
   [junit4]   2> 1256800 DEBUG (Simulated OverseerAutoScalingTriggerThread) [    ] o.a.s.c.a.OverseerTriggerThread -- clean old nodeLost markers
   [junit4]   2> 1256800 DEBUG (Simulated OverseerAutoScalingTriggerThread) [    ] o.a.s.c.a.OverseerTriggerThread -- clean old nodeAdded markers
   [junit4]   2> 1256800 DEBUG (Simulated OverseerAutoScalingTriggerThread) [    ] o.a.s.c.a.OverseerTriggerThread Current znodeVersion 8, lastZnodeVersion 8
   [junit4]   2> 1256801 DEBUG (simCloudManagerPool-4718-thread-9) [    ] o.a.s.c.a.AutoScalingHandler Verified autoscaling configuration
   [junit4]   2> 1256801 DEBUG (simCloudManagerPool-4718-thread-9) [    ] o.a.s.c.a.OverseerTriggerThread Refreshing /autoscaling.json with znode version 9
   [junit4]   2> 1256801 DEBUG (Simulated OverseerAutoScalingTriggerThread) [    ] o.a.s.c.a.OverseerTriggerThread Processed trigger updates upto znodeVersion 9
   [junit4]   2> 1256801 DEBUG (Simulated OverseerAutoScalingTriggerThread) [    ] o.a.s.c.a.OverseerTriggerThread -- clean old nodeLost markers
   [junit4]   2> 1256801 DEBUG (Simulated OverseerAutoScalingTriggerThread) [    ] o.a.s.c.a.OverseerTriggerThread -- clean old nodeAdded markers
   [junit4]   2> 1256801 DEBUG (Simulated OverseerAutoScalingTriggerThread) [    ] o.a.s.c.a.OverseerTriggerThread Current znodeVersion 9, lastZnodeVersion 9
   [junit4]   2> 1256802 DEBUG (simCloudManagerPool-4718-thread-10) [    ] o.a.s.c.a.AutoScalingHandler Verified autoscaling configuration
   [junit4]   2> 1256802 DEBUG (simCloudManagerPool-4718-thread-10) [    ] o.a.s.c.a.OverseerTriggerThread Refreshing /autoscaling.json with znode version 10
   [junit4]   2> 1256802 DEBUG (Simulated OverseerAutoScalingTriggerThread) [    ] o.a.s.c.a.OverseerTriggerThread Processed trigger updates upto znodeVersion 10
   [junit4]   2> 1256802 DEBUG (Simulated OverseerAutoScalingTriggerThread) [    ] o.a.s.c.a.OverseerTriggerThread -- clean old nodeLost markers
   [junit4]   2> 1256802 DEBUG (Simulated OverseerAutoScalingTriggerThread) [    ] o.a.s.c.a.OverseerTriggerThread -- clean old nodeAdded markers
   [junit4]   2> 1256802 DEBUG (Simulated OverseerAutoScalingTriggerThread) [    ] o.a.s.c.a.OverseerTriggerThread Current znodeVersion 10, lastZnodeVersion 10
   [junit4]   2> 1256814 DEBUG (simCloudManagerPool-4718-thread-62) [    ] o.a.s.c.a.AutoScalingHandler Verified autoscaling configuration
   [junit4]   2> 1256814 DEBUG (simCloudManagerPool-4718-thread-62) [    ] o.a.s.c.a.OverseerTriggerThread Refreshing /autoscaling.json with znode version 11
   [junit4]   2> 1256814 DEBUG (Simulated OverseerAutoScalingTriggerThread) [    ] o.a.s.c.a.OverseerTriggerThread Processed trigger updates upto znodeVersion 11
   [junit4]   2> 1256814 DEBUG (Simu

[...truncated too long message...]

d.ivy.jars.list as its length is 0.

-ivy-fail-disallowed-ivy-version:

ivy-fail:

ivy-fail:

ivy-configure:
[ivy:configure] :: loading settings :: file = /x1/jenkins/jenkins-slave/workspace/Lucene-Solr-Tests-master/lucene/top-level-ivy-settings.xml

resolve:

ivy-availability-check:
[loadresource] Do not set property disallowed.ivy.jars.list as its length is 0.

-ivy-fail-disallowed-ivy-version:

ivy-fail:

ivy-configure:
[ivy:configure] :: loading settings :: file = /x1/jenkins/jenkins-slave/workspace/Lucene-Solr-Tests-master/lucene/top-level-ivy-settings.xml

resolve:

ivy-availability-check:
[loadresource] Do not set property disallowed.ivy.jars.list as its length is 0.

-ivy-fail-disallowed-ivy-version:

ivy-fail:

ivy-fail:

ivy-configure:
[ivy:configure] :: loading settings :: file = /x1/jenkins/jenkins-slave/workspace/Lucene-Solr-Tests-master/lucene/top-level-ivy-settings.xml

resolve:

ivy-availability-check:
[loadresource] Do not set property disallowed.ivy.jars.list as its length is 0.

-ivy-fail-disallowed-ivy-version:

ivy-fail:

ivy-configure:
[ivy:configure] :: loading settings :: file = /x1/jenkins/jenkins-slave/workspace/Lucene-Solr-Tests-master/lucene/top-level-ivy-settings.xml

resolve:

ivy-availability-check:
[loadresource] Do not set property disallowed.ivy.jars.list as its length is 0.

-ivy-fail-disallowed-ivy-version:

ivy-fail:

ivy-fail:

ivy-configure:
[ivy:configure] :: loading settings :: file = /x1/jenkins/jenkins-slave/workspace/Lucene-Solr-Tests-master/lucene/top-level-ivy-settings.xml

resolve:

ivy-availability-check:
[loadresource] Do not set property disallowed.ivy.jars.list as its length is 0.

-ivy-fail-disallowed-ivy-version:

ivy-fail:

ivy-fail:

ivy-configure:
[ivy:configure] :: loading settings :: file = /x1/jenkins/jenkins-slave/workspace/Lucene-Solr-Tests-master/lucene/top-level-ivy-settings.xml

resolve:

ivy-availability-check:
[loadresource] Do not set property disallowed.ivy.jars.list as its length is 0.

-ivy-fail-disallowed-ivy-version:

ivy-fail:

ivy-fail:

ivy-configure:
[ivy:configure] :: loading settings :: file = /x1/jenkins/jenkins-slave/workspace/Lucene-Solr-Tests-master/lucene/top-level-ivy-settings.xml

resolve:

ivy-availability-check:
[loadresource] Do not set property disallowed.ivy.jars.list as its length is 0.

-ivy-fail-disallowed-ivy-version:

ivy-fail:

ivy-fail:

ivy-configure:
[ivy:configure] :: loading settings :: file = /x1/jenkins/jenkins-slave/workspace/Lucene-Solr-Tests-master/lucene/top-level-ivy-settings.xml

resolve:

ivy-availability-check:
[loadresource] Do not set property disallowed.ivy.jars.list as its length is 0.

-ivy-fail-disallowed-ivy-version:

ivy-fail:

ivy-fail:

ivy-configure:
[ivy:configure] :: loading settings :: file = /x1/jenkins/jenkins-slave/workspace/Lucene-Solr-Tests-master/lucene/top-level-ivy-settings.xml

resolve:

ivy-availability-check:
[loadresource] Do not set property disallowed.ivy.jars.list as its length is 0.

-ivy-fail-disallowed-ivy-version:

ivy-fail:

ivy-fail:

ivy-configure:
[ivy:configure] :: loading settings :: file = /x1/jenkins/jenkins-slave/workspace/Lucene-Solr-Tests-master/lucene/top-level-ivy-settings.xml

resolve:

ivy-availability-check:
[loadresource] Do not set property disallowed.ivy.jars.list as its length is 0.

-ivy-fail-disallowed-ivy-version:

ivy-fail:

ivy-fail:

ivy-configure:
[ivy:configure] :: loading settings :: file = /x1/jenkins/jenkins-slave/workspace/Lucene-Solr-Tests-master/lucene/top-level-ivy-settings.xml

resolve:

ivy-availability-check:
[loadresource] Do not set property disallowed.ivy.jars.list as its length is 0.

-ivy-fail-disallowed-ivy-version:

ivy-fail:

ivy-fail:

ivy-configure:
[ivy:configure] :: loading settings :: file = /x1/jenkins/jenkins-slave/workspace/Lucene-Solr-Tests-master/lucene/top-level-ivy-settings.xml

resolve:

ivy-availability-check:
[loadresource] Do not set property disallowed.ivy.jars.list as its length is 0.

-ivy-fail-disallowed-ivy-version:

ivy-fail:

ivy-fail:

ivy-configure:
[ivy:configure] :: loading settings :: file = /x1/jenkins/jenkins-slave/workspace/Lucene-Solr-Tests-master/lucene/top-level-ivy-settings.xml

resolve:

ivy-availability-check:
[loadresource] Do not set property disallowed.ivy.jars.list as its length is 0.

-ivy-fail-disallowed-ivy-version:

ivy-fail:

ivy-fail:

ivy-configure:
[ivy:configure] :: loading settings :: file = /x1/jenkins/jenkins-slave/workspace/Lucene-Solr-Tests-master/lucene/top-level-ivy-settings.xml

resolve:

jar-checksums:
    [mkdir] Created dir: /x1/jenkins/jenkins-slave/workspace/Lucene-Solr-Tests-master/solr/null364131578
     [copy] Copying 238 files to /x1/jenkins/jenkins-slave/workspace/Lucene-Solr-Tests-master/solr/null364131578
   [delete] Deleting directory /x1/jenkins/jenkins-slave/workspace/Lucene-Solr-Tests-master/solr/null364131578

check-working-copy:
[ivy:cachepath] :: resolving dependencies :: org.eclipse.jgit#org.eclipse.jgit-caller;working
[ivy:cachepath] 	confs: [default]
[ivy:cachepath] 	found org.eclipse.jgit#org.eclipse.jgit;4.6.0.201612231935-r in public
[ivy:cachepath] 	found com.jcraft#jsch;0.1.53 in public
[ivy:cachepath] 	found com.googlecode.javaewah#JavaEWAH;1.1.6 in public
[ivy:cachepath] 	found org.apache.httpcomponents#httpclient;4.3.6 in public
[ivy:cachepath] 	found org.apache.httpcomponents#httpcore;4.3.3 in public
[ivy:cachepath] 	found commons-logging#commons-logging;1.1.3 in public
[ivy:cachepath] 	found commons-codec#commons-codec;1.6 in public
[ivy:cachepath] 	found org.slf4j#slf4j-api;1.7.2 in public
[ivy:cachepath] :: resolution report :: resolve 47ms :: artifacts dl 1ms
	---------------------------------------------------------------------
	|                  |            modules            ||   artifacts   |
	|       conf       | number| search|dwnlded|evicted|| number|dwnlded|
	---------------------------------------------------------------------
	|      default     |   8   |   0   |   0   |   0   ||   8   |   0   |
	---------------------------------------------------------------------
[wc-checker] Initializing working copy...
[wc-checker] SLF4J: Failed to load class "org.slf4j.impl.StaticLoggerBinder".
[wc-checker] SLF4J: Defaulting to no-operation (NOP) logger implementation
[wc-checker] SLF4J: See http://www.slf4j.org/codes.html#StaticLoggerBinder for further details.
[wc-checker] Checking working copy status...

-jenkins-base:

BUILD SUCCESSFUL
Total time: 104 minutes 46 seconds
Archiving artifacts
java.lang.InterruptedException: no matches found within 10000
	at hudson.FilePath$34.hasMatch(FilePath.java:2678)
	at hudson.FilePath$34.invoke(FilePath.java:2557)
	at hudson.FilePath$34.invoke(FilePath.java:2547)
	at hudson.FilePath$FileCallableWrapper.call(FilePath.java:2918)
Also:   hudson.remoting.Channel$CallSiteStackTrace: Remote call to lucene
		at hudson.remoting.Channel.attachCallSiteStackTrace(Channel.java:1741)
		at hudson.remoting.UserRequest$ExceptionResponse.retrieve(UserRequest.java:357)
		at hudson.remoting.Channel.call(Channel.java:955)
		at hudson.FilePath.act(FilePath.java:1036)
		at hudson.FilePath.act(FilePath.java:1025)
		at hudson.FilePath.validateAntFileMask(FilePath.java:2547)
		at hudson.tasks.ArtifactArchiver.perform(ArtifactArchiver.java:243)
		at hudson.tasks.BuildStepCompatibilityLayer.perform(BuildStepCompatibilityLayer.java:81)
		at hudson.tasks.BuildStepMonitor$1.perform(BuildStepMonitor.java:20)
		at hudson.model.AbstractBuild$AbstractBuildExecution.perform(AbstractBuild.java:744)
		at hudson.model.AbstractBuild$AbstractBuildExecution.performAllBuildSteps(AbstractBuild.java:690)
		at hudson.model.Build$BuildExecution.post2(Build.java:186)
		at hudson.model.AbstractBuild$AbstractBuildExecution.post(AbstractBuild.java:635)
		at hudson.model.Run.execute(Run.java:1819)
		at hudson.model.FreeStyleBuild.run(FreeStyleBuild.java:43)
		at hudson.model.ResourceController.execute(ResourceController.java:97)
		at hudson.model.Executor.run(Executor.java:429)
Caused: hudson.FilePath$TunneledInterruptedException
	at hudson.FilePath$FileCallableWrapper.call(FilePath.java:2920)
	at hudson.remoting.UserRequest.perform(UserRequest.java:212)
	at hudson.remoting.UserRequest.perform(UserRequest.java:54)
	at hudson.remoting.Request$2.run(Request.java:369)
	at hudson.remoting.InterceptingExecutorService$1.call(InterceptingExecutorService.java:72)
	at java.util.concurrent.FutureTask.run(FutureTask.java:266)
	at java.util.concurrent.ThreadPoolExecutor.runWorker(ThreadPoolExecutor.java:1142)
	at java.util.concurrent.ThreadPoolExecutor$Worker.run(ThreadPoolExecutor.java:617)
	at java.lang.Thread.run(Thread.java:748)
Caused: java.lang.InterruptedException: java.lang.InterruptedException: no matches found within 10000
	at hudson.FilePath.act(FilePath.java:1038)
	at hudson.FilePath.act(FilePath.java:1025)
	at hudson.FilePath.validateAntFileMask(FilePath.java:2547)
	at hudson.tasks.ArtifactArchiver.perform(ArtifactArchiver.java:243)
	at hudson.tasks.BuildStepCompatibilityLayer.perform(BuildStepCompatibilityLayer.java:81)
	at hudson.tasks.BuildStepMonitor$1.perform(BuildStepMonitor.java:20)
	at hudson.model.AbstractBuild$AbstractBuildExecution.perform(AbstractBuild.java:744)
	at hudson.model.AbstractBuild$AbstractBuildExecution.performAllBuildSteps(AbstractBuild.java:690)
	at hudson.model.Build$BuildExecution.post2(Build.java:186)
	at hudson.model.AbstractBuild$AbstractBuildExecution.post(AbstractBuild.java:635)
	at hudson.model.Run.execute(Run.java:1819)
	at hudson.model.FreeStyleBuild.run(FreeStyleBuild.java:43)
	at hudson.model.ResourceController.execute(ResourceController.java:97)
	at hudson.model.Executor.run(Executor.java:429)
No artifacts found that match the file pattern "**/*.events,heapdumps/**,**/hs_err_pid*". Configuration error?
Recording test results
Build step 'Publish JUnit test result report' changed build result to UNSTABLE
Email was triggered for: Unstable (Test Failures)
Sending email for trigger: Unstable (Test Failures)

Mime
View raw message