lucene-dev mailing list archives

Site index · List index
Message view « Date » · « Thread »
Top « Date » · « Thread »
From Policeman Jenkins Server <jenk...@thetaphi.de>
Subject [JENKINS] Lucene-Solr-master-Linux (64bit/jdk-10.0.1) - Build # 23127 - Still Unstable!
Date Wed, 31 Oct 2018 10:53:07 GMT
Build: https://jenkins.thetaphi.de/job/Lucene-Solr-master-Linux/23127/
Java: 64bit/jdk-10.0.1 -XX:+UseCompressedOops -XX:+UseParallelGC

4 tests failed.
FAILED:  org.apache.solr.cloud.TestTlogReplica.testRecovery

Error Message:
Can not find doc 7 in https://127.0.0.1:37465/solr

Stack Trace:
java.lang.AssertionError: Can not find doc 7 in https://127.0.0.1:37465/solr
	at __randomizedtesting.SeedInfo.seed([5D7DFA0B2B8D19AA:9C8D83A706DDD30D]:0)
	at org.junit.Assert.fail(Assert.java:93)
	at org.junit.Assert.assertTrue(Assert.java:43)
	at org.junit.Assert.assertNotNull(Assert.java:526)
	at org.apache.solr.cloud.TestTlogReplica.checkRTG(TestTlogReplica.java:902)
	at org.apache.solr.cloud.TestTlogReplica.testRecovery(TestTlogReplica.java:567)
	at java.base/jdk.internal.reflect.NativeMethodAccessorImpl.invoke0(Native Method)
	at java.base/jdk.internal.reflect.NativeMethodAccessorImpl.invoke(NativeMethodAccessorImpl.java:62)
	at java.base/jdk.internal.reflect.DelegatingMethodAccessorImpl.invoke(DelegatingMethodAccessorImpl.java:43)
	at java.base/java.lang.reflect.Method.invoke(Method.java:564)
	at com.carrotsearch.randomizedtesting.RandomizedRunner.invoke(RandomizedRunner.java:1742)
	at com.carrotsearch.randomizedtesting.RandomizedRunner$8.evaluate(RandomizedRunner.java:935)
	at com.carrotsearch.randomizedtesting.RandomizedRunner$9.evaluate(RandomizedRunner.java:971)
	at com.carrotsearch.randomizedtesting.RandomizedRunner$10.evaluate(RandomizedRunner.java:985)
	at com.carrotsearch.randomizedtesting.rules.SystemPropertiesRestoreRule$1.evaluate(SystemPropertiesRestoreRule.java:57)
	at org.apache.lucene.util.TestRuleSetupTeardownChained$1.evaluate(TestRuleSetupTeardownChained.java:49)
	at org.apache.lucene.util.AbstractBeforeAfterRule$1.evaluate(AbstractBeforeAfterRule.java:45)
	at org.apache.lucene.util.TestRuleThreadAndTestName$1.evaluate(TestRuleThreadAndTestName.java:48)
	at org.apache.lucene.util.TestRuleIgnoreAfterMaxFailures$1.evaluate(TestRuleIgnoreAfterMaxFailures.java:64)
	at org.apache.lucene.util.TestRuleMarkFailure$1.evaluate(TestRuleMarkFailure.java:47)
	at com.carrotsearch.randomizedtesting.rules.StatementAdapter.evaluate(StatementAdapter.java:36)
	at com.carrotsearch.randomizedtesting.ThreadLeakControl$StatementRunner.run(ThreadLeakControl.java:368)
	at com.carrotsearch.randomizedtesting.ThreadLeakControl.forkTimeoutingTask(ThreadLeakControl.java:817)
	at com.carrotsearch.randomizedtesting.ThreadLeakControl$3.evaluate(ThreadLeakControl.java:468)
	at com.carrotsearch.randomizedtesting.RandomizedRunner.runSingleTest(RandomizedRunner.java:944)
	at com.carrotsearch.randomizedtesting.RandomizedRunner$5.evaluate(RandomizedRunner.java:830)
	at com.carrotsearch.randomizedtesting.RandomizedRunner$6.evaluate(RandomizedRunner.java:880)
	at com.carrotsearch.randomizedtesting.RandomizedRunner$7.evaluate(RandomizedRunner.java:891)
	at com.carrotsearch.randomizedtesting.rules.StatementAdapter.evaluate(StatementAdapter.java:36)
	at com.carrotsearch.randomizedtesting.rules.SystemPropertiesRestoreRule$1.evaluate(SystemPropertiesRestoreRule.java:57)
	at org.apache.lucene.util.AbstractBeforeAfterRule$1.evaluate(AbstractBeforeAfterRule.java:45)
	at com.carrotsearch.randomizedtesting.rules.StatementAdapter.evaluate(StatementAdapter.java:36)
	at org.apache.lucene.util.TestRuleStoreClassName$1.evaluate(TestRuleStoreClassName.java:41)
	at com.carrotsearch.randomizedtesting.rules.NoShadowingOrOverridesOnMethodsRule$1.evaluate(NoShadowingOrOverridesOnMethodsRule.java:40)
	at com.carrotsearch.randomizedtesting.rules.NoShadowingOrOverridesOnMethodsRule$1.evaluate(NoShadowingOrOverridesOnMethodsRule.java:40)
	at com.carrotsearch.randomizedtesting.rules.StatementAdapter.evaluate(StatementAdapter.java:36)
	at com.carrotsearch.randomizedtesting.rules.StatementAdapter.evaluate(StatementAdapter.java:36)
	at org.apache.lucene.util.TestRuleAssertionsRequired$1.evaluate(TestRuleAssertionsRequired.java:53)
	at org.apache.lucene.util.TestRuleMarkFailure$1.evaluate(TestRuleMarkFailure.java:47)
	at org.apache.lucene.util.TestRuleIgnoreAfterMaxFailures$1.evaluate(TestRuleIgnoreAfterMaxFailures.java:64)
	at org.apache.lucene.util.TestRuleIgnoreTestSuites$1.evaluate(TestRuleIgnoreTestSuites.java:54)
	at com.carrotsearch.randomizedtesting.rules.StatementAdapter.evaluate(StatementAdapter.java:36)
	at com.carrotsearch.randomizedtesting.ThreadLeakControl$StatementRunner.run(ThreadLeakControl.java:368)
	at java.base/java.lang.Thread.run(Thread.java:844)


FAILED:  org.apache.solr.cloud.TestTlogReplica.testRecovery

Error Message:
Can not find doc 7 in https://127.0.0.1:39015/solr

Stack Trace:
java.lang.AssertionError: Can not find doc 7 in https://127.0.0.1:39015/solr
	at __randomizedtesting.SeedInfo.seed([5D7DFA0B2B8D19AA:9C8D83A706DDD30D]:0)
	at org.junit.Assert.fail(Assert.java:93)
	at org.junit.Assert.assertTrue(Assert.java:43)
	at org.junit.Assert.assertNotNull(Assert.java:526)
	at org.apache.solr.cloud.TestTlogReplica.checkRTG(TestTlogReplica.java:902)
	at org.apache.solr.cloud.TestTlogReplica.testRecovery(TestTlogReplica.java:567)
	at java.base/jdk.internal.reflect.NativeMethodAccessorImpl.invoke0(Native Method)
	at java.base/jdk.internal.reflect.NativeMethodAccessorImpl.invoke(NativeMethodAccessorImpl.java:62)
	at java.base/jdk.internal.reflect.DelegatingMethodAccessorImpl.invoke(DelegatingMethodAccessorImpl.java:43)
	at java.base/java.lang.reflect.Method.invoke(Method.java:564)
	at com.carrotsearch.randomizedtesting.RandomizedRunner.invoke(RandomizedRunner.java:1742)
	at com.carrotsearch.randomizedtesting.RandomizedRunner$8.evaluate(RandomizedRunner.java:935)
	at com.carrotsearch.randomizedtesting.RandomizedRunner$9.evaluate(RandomizedRunner.java:971)
	at com.carrotsearch.randomizedtesting.RandomizedRunner$10.evaluate(RandomizedRunner.java:985)
	at com.carrotsearch.randomizedtesting.rules.SystemPropertiesRestoreRule$1.evaluate(SystemPropertiesRestoreRule.java:57)
	at org.apache.lucene.util.TestRuleSetupTeardownChained$1.evaluate(TestRuleSetupTeardownChained.java:49)
	at org.apache.lucene.util.AbstractBeforeAfterRule$1.evaluate(AbstractBeforeAfterRule.java:45)
	at org.apache.lucene.util.TestRuleThreadAndTestName$1.evaluate(TestRuleThreadAndTestName.java:48)
	at org.apache.lucene.util.TestRuleIgnoreAfterMaxFailures$1.evaluate(TestRuleIgnoreAfterMaxFailures.java:64)
	at org.apache.lucene.util.TestRuleMarkFailure$1.evaluate(TestRuleMarkFailure.java:47)
	at com.carrotsearch.randomizedtesting.rules.StatementAdapter.evaluate(StatementAdapter.java:36)
	at com.carrotsearch.randomizedtesting.ThreadLeakControl$StatementRunner.run(ThreadLeakControl.java:368)
	at com.carrotsearch.randomizedtesting.ThreadLeakControl.forkTimeoutingTask(ThreadLeakControl.java:817)
	at com.carrotsearch.randomizedtesting.ThreadLeakControl$3.evaluate(ThreadLeakControl.java:468)
	at com.carrotsearch.randomizedtesting.RandomizedRunner.runSingleTest(RandomizedRunner.java:944)
	at com.carrotsearch.randomizedtesting.RandomizedRunner$5.evaluate(RandomizedRunner.java:830)
	at com.carrotsearch.randomizedtesting.RandomizedRunner$6.evaluate(RandomizedRunner.java:880)
	at com.carrotsearch.randomizedtesting.RandomizedRunner$7.evaluate(RandomizedRunner.java:891)
	at com.carrotsearch.randomizedtesting.rules.StatementAdapter.evaluate(StatementAdapter.java:36)
	at com.carrotsearch.randomizedtesting.rules.SystemPropertiesRestoreRule$1.evaluate(SystemPropertiesRestoreRule.java:57)
	at org.apache.lucene.util.AbstractBeforeAfterRule$1.evaluate(AbstractBeforeAfterRule.java:45)
	at com.carrotsearch.randomizedtesting.rules.StatementAdapter.evaluate(StatementAdapter.java:36)
	at org.apache.lucene.util.TestRuleStoreClassName$1.evaluate(TestRuleStoreClassName.java:41)
	at com.carrotsearch.randomizedtesting.rules.NoShadowingOrOverridesOnMethodsRule$1.evaluate(NoShadowingOrOverridesOnMethodsRule.java:40)
	at com.carrotsearch.randomizedtesting.rules.NoShadowingOrOverridesOnMethodsRule$1.evaluate(NoShadowingOrOverridesOnMethodsRule.java:40)
	at com.carrotsearch.randomizedtesting.rules.StatementAdapter.evaluate(StatementAdapter.java:36)
	at com.carrotsearch.randomizedtesting.rules.StatementAdapter.evaluate(StatementAdapter.java:36)
	at org.apache.lucene.util.TestRuleAssertionsRequired$1.evaluate(TestRuleAssertionsRequired.java:53)
	at org.apache.lucene.util.TestRuleMarkFailure$1.evaluate(TestRuleMarkFailure.java:47)
	at org.apache.lucene.util.TestRuleIgnoreAfterMaxFailures$1.evaluate(TestRuleIgnoreAfterMaxFailures.java:64)
	at org.apache.lucene.util.TestRuleIgnoreTestSuites$1.evaluate(TestRuleIgnoreTestSuites.java:54)
	at com.carrotsearch.randomizedtesting.rules.StatementAdapter.evaluate(StatementAdapter.java:36)
	at com.carrotsearch.randomizedtesting.ThreadLeakControl$StatementRunner.run(ThreadLeakControl.java:368)
	at java.base/java.lang.Thread.run(Thread.java:844)


FAILED:  org.apache.solr.cloud.TestTlogReplica.testRecovery

Error Message:
Can not find doc 7 in https://127.0.0.1:41483/solr

Stack Trace:
java.lang.AssertionError: Can not find doc 7 in https://127.0.0.1:41483/solr
	at __randomizedtesting.SeedInfo.seed([5D7DFA0B2B8D19AA:9C8D83A706DDD30D]:0)
	at org.junit.Assert.fail(Assert.java:93)
	at org.junit.Assert.assertTrue(Assert.java:43)
	at org.junit.Assert.assertNotNull(Assert.java:526)
	at org.apache.solr.cloud.TestTlogReplica.checkRTG(TestTlogReplica.java:902)
	at org.apache.solr.cloud.TestTlogReplica.testRecovery(TestTlogReplica.java:567)
	at java.base/jdk.internal.reflect.NativeMethodAccessorImpl.invoke0(Native Method)
	at java.base/jdk.internal.reflect.NativeMethodAccessorImpl.invoke(NativeMethodAccessorImpl.java:62)
	at java.base/jdk.internal.reflect.DelegatingMethodAccessorImpl.invoke(DelegatingMethodAccessorImpl.java:43)
	at java.base/java.lang.reflect.Method.invoke(Method.java:564)
	at com.carrotsearch.randomizedtesting.RandomizedRunner.invoke(RandomizedRunner.java:1742)
	at com.carrotsearch.randomizedtesting.RandomizedRunner$8.evaluate(RandomizedRunner.java:935)
	at com.carrotsearch.randomizedtesting.RandomizedRunner$9.evaluate(RandomizedRunner.java:971)
	at com.carrotsearch.randomizedtesting.RandomizedRunner$10.evaluate(RandomizedRunner.java:985)
	at com.carrotsearch.randomizedtesting.rules.SystemPropertiesRestoreRule$1.evaluate(SystemPropertiesRestoreRule.java:57)
	at org.apache.lucene.util.TestRuleSetupTeardownChained$1.evaluate(TestRuleSetupTeardownChained.java:49)
	at org.apache.lucene.util.AbstractBeforeAfterRule$1.evaluate(AbstractBeforeAfterRule.java:45)
	at org.apache.lucene.util.TestRuleThreadAndTestName$1.evaluate(TestRuleThreadAndTestName.java:48)
	at org.apache.lucene.util.TestRuleIgnoreAfterMaxFailures$1.evaluate(TestRuleIgnoreAfterMaxFailures.java:64)
	at org.apache.lucene.util.TestRuleMarkFailure$1.evaluate(TestRuleMarkFailure.java:47)
	at com.carrotsearch.randomizedtesting.rules.StatementAdapter.evaluate(StatementAdapter.java:36)
	at com.carrotsearch.randomizedtesting.ThreadLeakControl$StatementRunner.run(ThreadLeakControl.java:368)
	at com.carrotsearch.randomizedtesting.ThreadLeakControl.forkTimeoutingTask(ThreadLeakControl.java:817)
	at com.carrotsearch.randomizedtesting.ThreadLeakControl$3.evaluate(ThreadLeakControl.java:468)
	at com.carrotsearch.randomizedtesting.RandomizedRunner.runSingleTest(RandomizedRunner.java:944)
	at com.carrotsearch.randomizedtesting.RandomizedRunner$5.evaluate(RandomizedRunner.java:830)
	at com.carrotsearch.randomizedtesting.RandomizedRunner$6.evaluate(RandomizedRunner.java:880)
	at com.carrotsearch.randomizedtesting.RandomizedRunner$7.evaluate(RandomizedRunner.java:891)
	at com.carrotsearch.randomizedtesting.rules.StatementAdapter.evaluate(StatementAdapter.java:36)
	at com.carrotsearch.randomizedtesting.rules.SystemPropertiesRestoreRule$1.evaluate(SystemPropertiesRestoreRule.java:57)
	at org.apache.lucene.util.AbstractBeforeAfterRule$1.evaluate(AbstractBeforeAfterRule.java:45)
	at com.carrotsearch.randomizedtesting.rules.StatementAdapter.evaluate(StatementAdapter.java:36)
	at org.apache.lucene.util.TestRuleStoreClassName$1.evaluate(TestRuleStoreClassName.java:41)
	at com.carrotsearch.randomizedtesting.rules.NoShadowingOrOverridesOnMethodsRule$1.evaluate(NoShadowingOrOverridesOnMethodsRule.java:40)
	at com.carrotsearch.randomizedtesting.rules.NoShadowingOrOverridesOnMethodsRule$1.evaluate(NoShadowingOrOverridesOnMethodsRule.java:40)
	at com.carrotsearch.randomizedtesting.rules.StatementAdapter.evaluate(StatementAdapter.java:36)
	at com.carrotsearch.randomizedtesting.rules.StatementAdapter.evaluate(StatementAdapter.java:36)
	at org.apache.lucene.util.TestRuleAssertionsRequired$1.evaluate(TestRuleAssertionsRequired.java:53)
	at org.apache.lucene.util.TestRuleMarkFailure$1.evaluate(TestRuleMarkFailure.java:47)
	at org.apache.lucene.util.TestRuleIgnoreAfterMaxFailures$1.evaluate(TestRuleIgnoreAfterMaxFailures.java:64)
	at org.apache.lucene.util.TestRuleIgnoreTestSuites$1.evaluate(TestRuleIgnoreTestSuites.java:54)
	at com.carrotsearch.randomizedtesting.rules.StatementAdapter.evaluate(StatementAdapter.java:36)
	at com.carrotsearch.randomizedtesting.ThreadLeakControl$StatementRunner.run(ThreadLeakControl.java:368)
	at java.base/java.lang.Thread.run(Thread.java:844)


FAILED:  org.apache.solr.cloud.TestTlogReplica.testRecovery

Error Message:
Can not find doc 7 in https://127.0.0.1:39955/solr

Stack Trace:
java.lang.AssertionError: Can not find doc 7 in https://127.0.0.1:39955/solr
	at __randomizedtesting.SeedInfo.seed([5D7DFA0B2B8D19AA:9C8D83A706DDD30D]:0)
	at org.junit.Assert.fail(Assert.java:93)
	at org.junit.Assert.assertTrue(Assert.java:43)
	at org.junit.Assert.assertNotNull(Assert.java:526)
	at org.apache.solr.cloud.TestTlogReplica.checkRTG(TestTlogReplica.java:902)
	at org.apache.solr.cloud.TestTlogReplica.testRecovery(TestTlogReplica.java:567)
	at java.base/jdk.internal.reflect.NativeMethodAccessorImpl.invoke0(Native Method)
	at java.base/jdk.internal.reflect.NativeMethodAccessorImpl.invoke(NativeMethodAccessorImpl.java:62)
	at java.base/jdk.internal.reflect.DelegatingMethodAccessorImpl.invoke(DelegatingMethodAccessorImpl.java:43)
	at java.base/java.lang.reflect.Method.invoke(Method.java:564)
	at com.carrotsearch.randomizedtesting.RandomizedRunner.invoke(RandomizedRunner.java:1742)
	at com.carrotsearch.randomizedtesting.RandomizedRunner$8.evaluate(RandomizedRunner.java:935)
	at com.carrotsearch.randomizedtesting.RandomizedRunner$9.evaluate(RandomizedRunner.java:971)
	at com.carrotsearch.randomizedtesting.RandomizedRunner$10.evaluate(RandomizedRunner.java:985)
	at com.carrotsearch.randomizedtesting.rules.SystemPropertiesRestoreRule$1.evaluate(SystemPropertiesRestoreRule.java:57)
	at org.apache.lucene.util.TestRuleSetupTeardownChained$1.evaluate(TestRuleSetupTeardownChained.java:49)
	at org.apache.lucene.util.AbstractBeforeAfterRule$1.evaluate(AbstractBeforeAfterRule.java:45)
	at org.apache.lucene.util.TestRuleThreadAndTestName$1.evaluate(TestRuleThreadAndTestName.java:48)
	at org.apache.lucene.util.TestRuleIgnoreAfterMaxFailures$1.evaluate(TestRuleIgnoreAfterMaxFailures.java:64)
	at org.apache.lucene.util.TestRuleMarkFailure$1.evaluate(TestRuleMarkFailure.java:47)
	at com.carrotsearch.randomizedtesting.rules.StatementAdapter.evaluate(StatementAdapter.java:36)
	at com.carrotsearch.randomizedtesting.ThreadLeakControl$StatementRunner.run(ThreadLeakControl.java:368)
	at com.carrotsearch.randomizedtesting.ThreadLeakControl.forkTimeoutingTask(ThreadLeakControl.java:817)
	at com.carrotsearch.randomizedtesting.ThreadLeakControl$3.evaluate(ThreadLeakControl.java:468)
	at com.carrotsearch.randomizedtesting.RandomizedRunner.runSingleTest(RandomizedRunner.java:944)
	at com.carrotsearch.randomizedtesting.RandomizedRunner$5.evaluate(RandomizedRunner.java:830)
	at com.carrotsearch.randomizedtesting.RandomizedRunner$6.evaluate(RandomizedRunner.java:880)
	at com.carrotsearch.randomizedtesting.RandomizedRunner$7.evaluate(RandomizedRunner.java:891)
	at com.carrotsearch.randomizedtesting.rules.StatementAdapter.evaluate(StatementAdapter.java:36)
	at com.carrotsearch.randomizedtesting.rules.SystemPropertiesRestoreRule$1.evaluate(SystemPropertiesRestoreRule.java:57)
	at org.apache.lucene.util.AbstractBeforeAfterRule$1.evaluate(AbstractBeforeAfterRule.java:45)
	at com.carrotsearch.randomizedtesting.rules.StatementAdapter.evaluate(StatementAdapter.java:36)
	at org.apache.lucene.util.TestRuleStoreClassName$1.evaluate(TestRuleStoreClassName.java:41)
	at com.carrotsearch.randomizedtesting.rules.NoShadowingOrOverridesOnMethodsRule$1.evaluate(NoShadowingOrOverridesOnMethodsRule.java:40)
	at com.carrotsearch.randomizedtesting.rules.NoShadowingOrOverridesOnMethodsRule$1.evaluate(NoShadowingOrOverridesOnMethodsRule.java:40)
	at com.carrotsearch.randomizedtesting.rules.StatementAdapter.evaluate(StatementAdapter.java:36)
	at com.carrotsearch.randomizedtesting.rules.StatementAdapter.evaluate(StatementAdapter.java:36)
	at org.apache.lucene.util.TestRuleAssertionsRequired$1.evaluate(TestRuleAssertionsRequired.java:53)
	at org.apache.lucene.util.TestRuleMarkFailure$1.evaluate(TestRuleMarkFailure.java:47)
	at org.apache.lucene.util.TestRuleIgnoreAfterMaxFailures$1.evaluate(TestRuleIgnoreAfterMaxFailures.java:64)
	at org.apache.lucene.util.TestRuleIgnoreTestSuites$1.evaluate(TestRuleIgnoreTestSuites.java:54)
	at com.carrotsearch.randomizedtesting.rules.StatementAdapter.evaluate(StatementAdapter.java:36)
	at com.carrotsearch.randomizedtesting.ThreadLeakControl$StatementRunner.run(ThreadLeakControl.java:368)
	at java.base/java.lang.Thread.run(Thread.java:844)




Build Log:
[...truncated 14486 lines...]
   [junit4] Suite: org.apache.solr.cloud.TestTlogReplica
   [junit4]   2> 1692482 INFO  (SUITE-TestTlogReplica-seed#[5D7DFA0B2B8D19AA]-worker) [    ] o.a.s.SolrTestCaseJ4 SecureRandom sanity checks: test.solr.allowed.securerandom=null & java.security.egd=file:/dev/./urandom
   [junit4]   2> Creating dataDir: /home/jenkins/workspace/Lucene-Solr-master-Linux/solr/build/solr-core/test/J2/temp/solr.cloud.TestTlogReplica_5D7DFA0B2B8D19AA-001/init-core-data-001
   [junit4]   2> 1692483 INFO  (SUITE-TestTlogReplica-seed#[5D7DFA0B2B8D19AA]-worker) [    ] o.a.s.SolrTestCaseJ4 Using PointFields (NUMERIC_POINTS_SYSPROP=true) w/NUMERIC_DOCVALUES_SYSPROP=false
   [junit4]   2> 1692484 INFO  (SUITE-TestTlogReplica-seed#[5D7DFA0B2B8D19AA]-worker) [    ] o.a.s.SolrTestCaseJ4 Randomized ssl (true) and clientAuth (true) via: @org.apache.solr.util.RandomizeSSL(reason="", ssl=0.0/0.0, value=0.0/0.0, clientAuth=0.0/0.0)
   [junit4]   2> 1692484 INFO  (SUITE-TestTlogReplica-seed#[5D7DFA0B2B8D19AA]-worker) [    ] o.a.s.c.MiniSolrCloudCluster Starting cluster of 2 servers in /home/jenkins/workspace/Lucene-Solr-master-Linux/solr/build/solr-core/test/J2/temp/solr.cloud.TestTlogReplica_5D7DFA0B2B8D19AA-001/tempDir-001
   [junit4]   2> 1692484 INFO  (SUITE-TestTlogReplica-seed#[5D7DFA0B2B8D19AA]-worker) [    ] o.a.s.c.ZkTestServer STARTING ZK TEST SERVER
   [junit4]   2> 1692484 INFO  (Thread-4003) [    ] o.a.s.c.ZkTestServer client port:0.0.0.0/0.0.0.0:0
   [junit4]   2> 1692485 INFO  (Thread-4003) [    ] o.a.s.c.ZkTestServer Starting server
   [junit4]   2> 1692491 ERROR (Thread-4003) [    ] o.a.z.s.ZooKeeperServer ZKShutdownHandler is not registered, so ZooKeeper server won't take any action on ERROR or SHUTDOWN server state changes
   [junit4]   2> 1692585 INFO  (SUITE-TestTlogReplica-seed#[5D7DFA0B2B8D19AA]-worker) [    ] o.a.s.c.ZkTestServer start zk server on port:40543
   [junit4]   2> 1692589 INFO  (zkConnectionManagerCallback-7444-thread-1) [    ] o.a.s.c.c.ConnectionManager zkClient has connected
   [junit4]   2> 1692592 INFO  (jetty-launcher-7441-thread-1) [    ] o.e.j.s.Server jetty-9.4.11.v20180605; built: 2018-06-05T18:24:03.829Z; git: d5fc0523cfa96bfebfbda19606cad384d772f04c; jvm 10.0.1+10
   [junit4]   2> 1692592 INFO  (jetty-launcher-7441-thread-2) [    ] o.e.j.s.Server jetty-9.4.11.v20180605; built: 2018-06-05T18:24:03.829Z; git: d5fc0523cfa96bfebfbda19606cad384d772f04c; jvm 10.0.1+10
   [junit4]   2> 1692593 INFO  (jetty-launcher-7441-thread-2) [    ] o.e.j.s.session DefaultSessionIdManager workerName=node0
   [junit4]   2> 1692593 INFO  (jetty-launcher-7441-thread-2) [    ] o.e.j.s.session No SessionScavenger set, using defaults
   [junit4]   2> 1692593 INFO  (jetty-launcher-7441-thread-1) [    ] o.e.j.s.session DefaultSessionIdManager workerName=node0
   [junit4]   2> 1692593 INFO  (jetty-launcher-7441-thread-1) [    ] o.e.j.s.session No SessionScavenger set, using defaults
   [junit4]   2> 1692593 INFO  (jetty-launcher-7441-thread-2) [    ] o.e.j.s.session node0 Scavenging every 660000ms
   [junit4]   2> 1692593 INFO  (jetty-launcher-7441-thread-1) [    ] o.e.j.s.session node0 Scavenging every 660000ms
   [junit4]   2> 1692593 INFO  (jetty-launcher-7441-thread-2) [    ] o.e.j.s.h.ContextHandler Started o.e.j.s.ServletContextHandler@4fc93668{/solr,null,AVAILABLE}
   [junit4]   2> 1692593 INFO  (jetty-launcher-7441-thread-1) [    ] o.e.j.s.h.ContextHandler Started o.e.j.s.ServletContextHandler@1eb580fc{/solr,null,AVAILABLE}
   [junit4]   2> 1692593 INFO  (jetty-launcher-7441-thread-1) [    ] o.e.j.s.AbstractConnector Started ServerConnector@627e8374{SSL,[ssl, http/1.1]}{127.0.0.1:32857}
   [junit4]   2> 1692594 INFO  (jetty-launcher-7441-thread-2) [    ] o.e.j.s.AbstractConnector Started ServerConnector@5d059435{SSL,[ssl, http/1.1]}{127.0.0.1:39955}
   [junit4]   2> 1692594 INFO  (jetty-launcher-7441-thread-1) [    ] o.e.j.s.Server Started @1692655ms
   [junit4]   2> 1692594 INFO  (jetty-launcher-7441-thread-2) [    ] o.e.j.s.Server Started @1692655ms
   [junit4]   2> 1692594 INFO  (jetty-launcher-7441-thread-2) [    ] o.a.s.c.s.e.JettySolrRunner Jetty properties: {hostContext=/solr, hostPort=39955}
   [junit4]   2> 1692594 INFO  (jetty-launcher-7441-thread-1) [    ] o.a.s.c.s.e.JettySolrRunner Jetty properties: {hostContext=/solr, hostPort=32857}
   [junit4]   2> 1692594 ERROR (jetty-launcher-7441-thread-2) [    ] o.a.s.u.StartupLoggingUtils Missing Java Option solr.log.dir. Logging may be missing or incomplete.
   [junit4]   2> 1692594 ERROR (jetty-launcher-7441-thread-1) [    ] o.a.s.u.StartupLoggingUtils Missing Java Option solr.log.dir. Logging may be missing or incomplete.
   [junit4]   2> 1692594 INFO  (jetty-launcher-7441-thread-2) [    ] o.a.s.s.SolrDispatchFilter Using logger factory org.apache.logging.slf4j.Log4jLoggerFactory
   [junit4]   2> 1692594 INFO  (jetty-launcher-7441-thread-1) [    ] o.a.s.s.SolrDispatchFilter Using logger factory org.apache.logging.slf4j.Log4jLoggerFactory
   [junit4]   2> 1692594 INFO  (jetty-launcher-7441-thread-2) [    ] o.a.s.s.SolrDispatchFilter  ___      _       Welcome to Apache Solr? version 8.0.0
   [junit4]   2> 1692594 INFO  (jetty-launcher-7441-thread-1) [    ] o.a.s.s.SolrDispatchFilter  ___      _       Welcome to Apache Solr? version 8.0.0
   [junit4]   2> 1692594 INFO  (jetty-launcher-7441-thread-2) [    ] o.a.s.s.SolrDispatchFilter / __| ___| |_ _   Starting in cloud mode on port null
   [junit4]   2> 1692594 INFO  (jetty-launcher-7441-thread-2) [    ] o.a.s.s.SolrDispatchFilter \__ \/ _ \ | '_|  Install dir: null
   [junit4]   2> 1692594 INFO  (jetty-launcher-7441-thread-1) [    ] o.a.s.s.SolrDispatchFilter / __| ___| |_ _   Starting in cloud mode on port null
   [junit4]   2> 1692594 INFO  (jetty-launcher-7441-thread-2) [    ] o.a.s.s.SolrDispatchFilter |___/\___/_|_|    Start time: 2018-10-31T10:21:13.001693Z
   [junit4]   2> 1692594 INFO  (jetty-launcher-7441-thread-1) [    ] o.a.s.s.SolrDispatchFilter \__ \/ _ \ | '_|  Install dir: null
   [junit4]   2> 1692594 INFO  (jetty-launcher-7441-thread-1) [    ] o.a.s.s.SolrDispatchFilter |___/\___/_|_|    Start time: 2018-10-31T10:21:13.001724Z
   [junit4]   2> 1692604 INFO  (zkConnectionManagerCallback-7446-thread-1) [    ] o.a.s.c.c.ConnectionManager zkClient has connected
   [junit4]   2> 1692604 INFO  (zkConnectionManagerCallback-7448-thread-1) [    ] o.a.s.c.c.ConnectionManager zkClient has connected
   [junit4]   2> 1692605 INFO  (jetty-launcher-7441-thread-2) [    ] o.a.s.s.SolrDispatchFilter solr.xml found in ZooKeeper. Loading...
   [junit4]   2> 1692605 INFO  (jetty-launcher-7441-thread-1) [    ] o.a.s.s.SolrDispatchFilter solr.xml found in ZooKeeper. Loading...
   [junit4]   2> 1692612 WARN  (NIOServerCxn.Factory:0.0.0.0/0.0.0.0:0) [    ] o.a.z.s.NIOServerCnxn Unable to read additional data from client sessionid 0x1001530e2780001, likely client has closed socket
   [junit4]   2> 1692675 INFO  (jetty-launcher-7441-thread-2) [    ] o.a.s.c.ZkContainer Zookeeper client=127.0.0.1:40543/solr
   [junit4]   2> 1692676 INFO  (zkConnectionManagerCallback-7452-thread-1) [    ] o.a.s.c.c.ConnectionManager zkClient has connected
   [junit4]   2> 1692677 INFO  (zkConnectionManagerCallback-7454-thread-1) [    ] o.a.s.c.c.ConnectionManager zkClient has connected
   [junit4]   2> 1692694 INFO  (jetty-launcher-7441-thread-1) [    ] o.a.s.c.ZkContainer Zookeeper client=127.0.0.1:40543/solr
   [junit4]   2> 1692694 INFO  (zkConnectionManagerCallback-7460-thread-1) [    ] o.a.s.c.c.ConnectionManager zkClient has connected
   [junit4]   2> 1692696 WARN  (NIOServerCxn.Factory:0.0.0.0/0.0.0.0:0) [    ] o.a.z.s.NIOServerCnxn Unable to read additional data from client sessionid 0x1001530e2780005, likely client has closed socket
   [junit4]   2> 1692696 INFO  (zkConnectionManagerCallback-7462-thread-1) [    ] o.a.s.c.c.ConnectionManager zkClient has connected
   [junit4]   2> 1692700 INFO  (jetty-launcher-7441-thread-1) [n:127.0.0.1:32857_solr    ] o.a.s.c.OverseerElectionContext I am going to be the leader 127.0.0.1:32857_solr
   [junit4]   2> 1692700 INFO  (jetty-launcher-7441-thread-1) [n:127.0.0.1:32857_solr    ] o.a.s.c.Overseer Overseer (id=72080893740056582-127.0.0.1:32857_solr-n_0000000000) starting
   [junit4]   2> 1692703 INFO  (zkConnectionManagerCallback-7469-thread-1) [    ] o.a.s.c.c.ConnectionManager zkClient has connected
   [junit4]   2> 1692704 INFO  (jetty-launcher-7441-thread-1) [n:127.0.0.1:32857_solr    ] o.a.s.c.s.i.ZkClientClusterStateProvider Cluster at 127.0.0.1:40543/solr ready
   [junit4]   2> 1692705 DEBUG (OverseerAutoScalingTriggerThread-72080893740056582-127.0.0.1:32857_solr-n_0000000000) [    ] o.a.s.c.a.OverseerTriggerThread Adding .auto_add_replicas and .scheduled_maintenance triggers
   [junit4]   2> 1692705 DEBUG (OverseerAutoScalingTriggerThread-72080893740056582-127.0.0.1:32857_solr-n_0000000000) [    ] o.a.s.c.a.OverseerTriggerThread Refreshing /autoscaling.json with znode version 1
   [junit4]   2> 1692705 INFO  (OverseerStateUpdate-72080893740056582-127.0.0.1:32857_solr-n_0000000000) [n:127.0.0.1:32857_solr    ] o.a.s.c.Overseer Starting to work on the main queue : 127.0.0.1:32857_solr
   [junit4]   2> 1692705 INFO  (jetty-launcher-7441-thread-1) [n:127.0.0.1:32857_solr    ] o.a.s.c.ZkController Register node as live in ZooKeeper:/live_nodes/127.0.0.1:32857_solr
   [junit4]   2> 1692705 DEBUG (OverseerAutoScalingTriggerThread-72080893740056582-127.0.0.1:32857_solr-n_0000000000) [    ] o.a.s.c.a.OverseerTriggerThread Current znodeVersion 1, lastZnodeVersion -1
   [junit4]   2> 1692705 DEBUG (OverseerAutoScalingTriggerThread-72080893740056582-127.0.0.1:32857_solr-n_0000000000) [    ] o.a.s.c.a.OverseerTriggerThread Processed trigger updates upto znodeVersion 1
   [junit4]   2> 1692705 INFO  (OverseerStateUpdate-72080893740056582-127.0.0.1:32857_solr-n_0000000000) [n:127.0.0.1:32857_solr    ] o.a.s.c.c.ZkStateReader Updated live nodes from ZooKeeper... (0) -> (1)
   [junit4]   2> 1692706 INFO  (zkCallback-7468-thread-1) [    ] o.a.s.c.c.ZkStateReader Updated live nodes from ZooKeeper... (0) -> (1)
   [junit4]   2> 1692708 DEBUG (OverseerAutoScalingTriggerThread-72080893740056582-127.0.0.1:32857_solr-n_0000000000) [    ] o.a.s.c.a.NodeLostTrigger NodeLostTrigger .auto_add_replicas - Initial livenodes: [127.0.0.1:32857_solr]
   [junit4]   2> 1692708 DEBUG (OverseerAutoScalingTriggerThread-72080893740056582-127.0.0.1:32857_solr-n_0000000000) [    ] o.a.s.c.a.OverseerTriggerThread -- clean old nodeAdded markers
   [junit4]   2> 1692708 DEBUG (OverseerAutoScalingTriggerThread-72080893740056582-127.0.0.1:32857_solr-n_0000000000) [    ] o.a.s.c.a.OverseerTriggerThread Current znodeVersion 1, lastZnodeVersion 1
   [junit4]   2> 1692708 DEBUG (ScheduledTrigger-7346-thread-1) [    ] o.a.s.c.a.NodeLostTrigger Running NodeLostTrigger: .auto_add_replicas with currently live nodes: 1
   [junit4]   2> 1692714 INFO  (jetty-launcher-7441-thread-1) [n:127.0.0.1:32857_solr    ] o.a.s.h.a.MetricsHistoryHandler No .system collection, keeping metrics history in memory.
   [junit4]   2> 1692724 INFO  (jetty-launcher-7441-thread-1) [n:127.0.0.1:32857_solr    ] o.a.s.m.r.SolrJmxReporter JMX monitoring for 'solr_32857.solr.node' (registry 'solr.node') enabled at server: com.sun.jmx.mbeanserver.JmxMBeanServer@215527fd
   [junit4]   2> 1692725 INFO  (jetty-launcher-7441-thread-2) [n:127.0.0.1:39955_solr    ] o.a.s.c.c.ZkStateReader Updated live nodes from ZooKeeper... (0) -> (1)
   [junit4]   2> 1692726 INFO  (jetty-launcher-7441-thread-2) [n:127.0.0.1:39955_solr    ] o.a.s.c.TransientSolrCoreCacheDefault Allocating transient cache for 2147483647 transient cores
   [junit4]   2> 1692726 INFO  (jetty-launcher-7441-thread-2) [n:127.0.0.1:39955_solr    ] o.a.s.c.ZkController Register node as live in ZooKeeper:/live_nodes/127.0.0.1:39955_solr
   [junit4]   2> 1692727 DEBUG (OverseerStateUpdate-72080893740056582-127.0.0.1:32857_solr-n_0000000000) [n:127.0.0.1:32857_solr    ] o.a.s.c.Overseer processMessage: queueSize: 1, message = {
   [junit4]   2>   "operation":"downnode",
   [junit4]   2>   "node_name":"127.0.0.1:39955_solr"} current state version: 0
   [junit4]   2> 1692727 INFO  (zkCallback-7468-thread-1) [    ] o.a.s.c.c.ZkStateReader Updated live nodes from ZooKeeper... (1) -> (2)
   [junit4]   2> 1692727 INFO  (zkCallback-7461-thread-1) [    ] o.a.s.c.c.ZkStateReader Updated live nodes from ZooKeeper... (1) -> (2)
   [junit4]   2> 1692727 INFO  (zkCallback-7453-thread-1) [    ] o.a.s.c.c.ZkStateReader Updated live nodes from ZooKeeper... (1) -> (2)
   [junit4]   2> 1692731 INFO  (jetty-launcher-7441-thread-1) [n:127.0.0.1:32857_solr    ] o.a.s.m.r.SolrJmxReporter JMX monitoring for 'solr_32857.solr.jvm' (registry 'solr.jvm') enabled at server: com.sun.jmx.mbeanserver.JmxMBeanServer@215527fd
   [junit4]   2> 1692731 INFO  (jetty-launcher-7441-thread-1) [n:127.0.0.1:32857_solr    ] o.a.s.m.r.SolrJmxReporter JMX monitoring for 'solr_32857.solr.jetty' (registry 'solr.jetty') enabled at server: com.sun.jmx.mbeanserver.JmxMBeanServer@215527fd
   [junit4]   2> 1692731 INFO  (jetty-launcher-7441-thread-1) [n:127.0.0.1:32857_solr    ] o.a.s.c.CorePropertiesLocator Found 0 core definitions underneath /home/jenkins/workspace/Lucene-Solr-master-Linux/solr/build/solr-core/test/J2/temp/solr.cloud.TestTlogReplica_5D7DFA0B2B8D19AA-001/tempDir-001/node1/.
   [junit4]   2> 1692736 INFO  (zkConnectionManagerCallback-7475-thread-1) [    ] o.a.s.c.c.ConnectionManager zkClient has connected
   [junit4]   2> 1692736 INFO  (jetty-launcher-7441-thread-2) [n:127.0.0.1:39955_solr    ] o.a.s.c.c.ZkStateReader Updated live nodes from ZooKeeper... (0) -> (2)
   [junit4]   2> 1692737 INFO  (jetty-launcher-7441-thread-2) [n:127.0.0.1:39955_solr    ] o.a.s.c.s.i.ZkClientClusterStateProvider Cluster at 127.0.0.1:40543/solr ready
   [junit4]   2> 1692741 INFO  (jetty-launcher-7441-thread-2) [n:127.0.0.1:39955_solr    ] o.a.s.h.a.MetricsHistoryHandler No .system collection, keeping metrics history in memory.
   [junit4]   2> 1692751 INFO  (jetty-launcher-7441-thread-2) [n:127.0.0.1:39955_solr    ] o.a.s.m.r.SolrJmxReporter JMX monitoring for 'solr_39955.solr.node' (registry 'solr.node') enabled at server: com.sun.jmx.mbeanserver.JmxMBeanServer@215527fd
   [junit4]   2> 1692758 INFO  (jetty-launcher-7441-thread-2) [n:127.0.0.1:39955_solr    ] o.a.s.m.r.SolrJmxReporter JMX monitoring for 'solr_39955.solr.jvm' (registry 'solr.jvm') enabled at server: com.sun.jmx.mbeanserver.JmxMBeanServer@215527fd
   [junit4]   2> 1692758 INFO  (jetty-launcher-7441-thread-2) [n:127.0.0.1:39955_solr    ] o.a.s.m.r.SolrJmxReporter JMX monitoring for 'solr_39955.solr.jetty' (registry 'solr.jetty') enabled at server: com.sun.jmx.mbeanserver.JmxMBeanServer@215527fd
   [junit4]   2> 1692758 INFO  (jetty-launcher-7441-thread-2) [n:127.0.0.1:39955_solr    ] o.a.s.c.CorePropertiesLocator Found 0 core definitions underneath /home/jenkins/workspace/Lucene-Solr-master-Linux/solr/build/solr-core/test/J2/temp/solr.cloud.TestTlogReplica_5D7DFA0B2B8D19AA-001/tempDir-001/node2/.
   [junit4]   2> 1692775 INFO  (zkConnectionManagerCallback-7478-thread-1) [    ] o.a.s.c.c.ConnectionManager zkClient has connected
   [junit4]   2> 1692776 INFO  (zkConnectionManagerCallback-7483-thread-1) [    ] o.a.s.c.c.ConnectionManager zkClient has connected
   [junit4]   2> 1692777 INFO  (SUITE-TestTlogReplica-seed#[5D7DFA0B2B8D19AA]-worker) [    ] o.a.s.c.c.ZkStateReader Updated live nodes from ZooKeeper... (0) -> (2)
   [junit4]   2> 1692777 INFO  (SUITE-TestTlogReplica-seed#[5D7DFA0B2B8D19AA]-worker) [    ] o.a.s.c.s.i.ZkClientClusterStateProvider Cluster at 127.0.0.1:40543/solr ready
   [junit4]   2> 1692779 INFO  (SUITE-TestTlogReplica-seed#[5D7DFA0B2B8D19AA]-worker) [    ] o.a.s.c.TestTlogReplica Using legacyCloud?: false
   [junit4]   2> 1692791 INFO  (qtp1767646854-21336) [n:127.0.0.1:32857_solr    ] o.a.s.h.a.CollectionsHandler Invoked Collection Action :clusterprop with params val=false&name=legacyCloud&action=CLUSTERPROP&wt=javabin&version=2 and sendToOCPQueue=true
   [junit4]   2> 1692792 INFO  (qtp1767646854-21336) [n:127.0.0.1:32857_solr    ] o.a.s.s.HttpSolrCall [admin] webapp=null path=/admin/collections params={val=false&name=legacyCloud&action=CLUSTERPROP&wt=javabin&version=2} status=0 QTime=0
   [junit4]   2> 1692799 INFO  (TEST-TestTlogReplica.testAddDocs-seed#[5D7DFA0B2B8D19AA]) [    ] o.a.s.SolrTestCaseJ4 ###Starting testAddDocs
   [junit4]   2> 1692800 INFO  (qtp1767646854-21338) [n:127.0.0.1:32857_solr    ] o.a.s.h.a.CollectionsHandler Invoked Collection Action :create with params pullReplicas=0&collection.configName=conf&maxShardsPerNode=100&name=tlog_replica_test_add_docs&nrtReplicas=0&action=CREATE&numShards=1&tlogReplicas=2&wt=javabin&version=2 and sendToOCPQueue=true
   [junit4]   2> 1692801 INFO  (OverseerThreadFactory-7348-thread-1-processing-n:127.0.0.1:32857_solr) [n:127.0.0.1:32857_solr    ] o.a.s.c.a.c.CreateCollectionCmd Create collection tlog_replica_test_add_docs
   [junit4]   2> 1692803 DEBUG (OverseerStateUpdate-72080893740056582-127.0.0.1:32857_solr-n_0000000000) [n:127.0.0.1:32857_solr    ] o.a.s.c.Overseer processMessage: queueSize: 2, message = {
   [junit4]   2>   "name":"tlog_replica_test_add_docs",
   [junit4]   2>   "fromApi":"true",
   [junit4]   2>   "collection.configName":"conf",
   [junit4]   2>   "numShards":"1",
   [junit4]   2>   "maxShardsPerNode":"100",
   [junit4]   2>   "pullReplicas":"0",
   [junit4]   2>   "tlogReplicas":"2",
   [junit4]   2>   "nrtReplicas":"0",
   [junit4]   2>   "stateFormat":"2",
   [junit4]   2>   "replicationFactor":"0",
   [junit4]   2>   "operation":"create"} current state version: 0
   [junit4]   2> 1692906 INFO  (qtp1767646854-21341) [n:127.0.0.1:32857_solr    ] o.a.s.s.HttpSolrCall [admin] webapp=null path=/admin/metrics params={prefix=CONTAINER.fs.usableSpace,CONTAINER.fs.totalSpace,CORE.coreName&wt=javabin&version=2&group=solr.node,solr.core} status=0 QTime=0
   [junit4]   2> 1692918 INFO  (qtp1948262564-21337) [n:127.0.0.1:39955_solr    ] o.a.s.s.HttpSolrCall [admin] webapp=null path=/admin/metrics params={prefix=CONTAINER.fs.usableSpace,CONTAINER.fs.totalSpace,CORE.coreName&wt=javabin&version=2&group=solr.node,solr.core} status=0 QTime=0
   [junit4]   2> 1692921 DEBUG (OverseerStateUpdate-72080893740056582-127.0.0.1:32857_solr-n_0000000000) [n:127.0.0.1:32857_solr    ] o.a.s.c.Overseer processMessage: queueSize: 1, message = {
   [junit4]   2>   "operation":"ADDREPLICA",
   [junit4]   2>   "collection":"tlog_replica_test_add_docs",
   [junit4]   2>   "shard":"shard1",
   [junit4]   2>   "core":"tlog_replica_test_add_docs_shard1_replica_t1",
   [junit4]   2>   "state":"down",
   [junit4]   2>   "base_url":"https://127.0.0.1:39955/solr",
   [junit4]   2>   "type":"TLOG",
   [junit4]   2>   "waitForFinalState":"false"} current state version: 0
   [junit4]   2> 1692921 INFO  (OverseerStateUpdate-72080893740056582-127.0.0.1:32857_solr-n_0000000000) [n:127.0.0.1:32857_solr    ] o.a.s.c.o.SliceMutator createReplica() {
   [junit4]   2>   "operation":"ADDREPLICA",
   [junit4]   2>   "collection":"tlog_replica_test_add_docs",
   [junit4]   2>   "shard":"shard1",
   [junit4]   2>   "core":"tlog_replica_test_add_docs_shard1_replica_t1",
   [junit4]   2>   "state":"down",
   [junit4]   2>   "base_url":"https://127.0.0.1:39955/solr",
   [junit4]   2>   "type":"TLOG",
   [junit4]   2>   "waitForFinalState":"false"} 
   [junit4]   2> 1692921 DEBUG (OverseerStateUpdate-72080893740056582-127.0.0.1:32857_solr-n_0000000000) [n:127.0.0.1:32857_solr    ] o.a.s.c.Overseer processMessage: queueSize: 2, message = {
   [junit4]   2>   "operation":"ADDREPLICA",
   [junit4]   2>   "collection":"tlog_replica_test_add_docs",
   [junit4]   2>   "shard":"shard1",
   [junit4]   2>   "core":"tlog_replica_test_add_docs_shard1_replica_t2",
   [junit4]   2>   "state":"down",
   [junit4]   2>   "base_url":"https://127.0.0.1:32857/solr",
   [junit4]   2>   "type":"TLOG",
   [junit4]   2>   "waitForFinalState":"false"} current state version: 0
   [junit4]   2> 1692921 INFO  (OverseerStateUpdate-72080893740056582-127.0.0.1:32857_solr-n_0000000000) [n:127.0.0.1:32857_solr    ] o.a.s.c.o.SliceMutator createReplica() {
   [junit4]   2>   "operation":"ADDREPLICA",
   [junit4]   2>   "collection":"tlog_replica_test_add_docs",
   [junit4]   2>   "shard":"shard1",
   [junit4]   2>   "core":"tlog_replica_test_add_docs_shard1_replica_t2",
   [junit4]   2>   "state":"down",
   [junit4]   2>   "base_url":"https://127.0.0.1:32857/solr",
   [junit4]   2>   "type":"TLOG",
   [junit4]   2>   "waitForFinalState":"false"} 
   [junit4]   2> 1693125 INFO  (qtp1948262564-21340) [n:127.0.0.1:39955_solr    x:tlog_replica_test_add_docs_shard1_replica_t1] o.a.s.h.a.CoreAdminOperation core create command qt=/admin/cores&coreNodeName=core_node3&collection.configName=conf&newCollection=true&name=tlog_replica_test_add_docs_shard1_replica_t1&action=CREATE&numShards=1&collection=tlog_replica_test_add_docs&shard=shard1&wt=javabin&version=2&replicaType=TLOG
   [junit4]   2> 1693125 INFO  (qtp1767646854-21328) [n:127.0.0.1:32857_solr    x:tlog_replica_test_add_docs_shard1_replica_t2] o.a.s.h.a.CoreAdminOperation core create command qt=/admin/cores&coreNodeName=core_node4&collection.configName=conf&newCollection=true&name=tlog_replica_test_add_docs_shard1_replica_t2&action=CREATE&numShards=1&collection=tlog_replica_test_add_docs&shard=shard1&wt=javabin&version=2&replicaType=TLOG
   [junit4]   2> 1693125 INFO  (qtp1767646854-21328) [n:127.0.0.1:32857_solr    x:tlog_replica_test_add_docs_shard1_replica_t2] o.a.s.c.TransientSolrCoreCacheDefault Allocating transient cache for 2147483647 transient cores
   [junit4]   2> 1693127 DEBUG (OverseerStateUpdate-72080893740056582-127.0.0.1:32857_solr-n_0000000000) [n:127.0.0.1:32857_solr    ] o.a.s.c.Overseer processMessage: queueSize: 2, message = {
   [junit4]   2>   "core":"tlog_replica_test_add_docs_shard1_replica_t1",
   [junit4]   2>   "core_node_name":"core_node3",
   [junit4]   2>   "roles":null,
   [junit4]   2>   "base_url":"https://127.0.0.1:39955/solr",
   [junit4]   2>   "node_name":"127.0.0.1:39955_solr",
   [junit4]   2>   "numShards":"1",
   [junit4]   2>   "state":"down",
   [junit4]   2>   "shard":"shard1",
   [junit4]   2>   "collection":"tlog_replica_test_add_docs",
   [junit4]   2>   "type":"TLOG",
   [junit4]   2>   "force_set_state":"false",
   [junit4]   2>   "operation":"state"} current state version: 0
   [junit4]   2> 1693127 DEBUG (OverseerStateUpdate-72080893740056582-127.0.0.1:32857_solr-n_0000000000) [n:127.0.0.1:32857_solr    ] o.a.s.c.Overseer processMessage: queueSize: 2, message = {
   [junit4]   2>   "core":"tlog_replica_test_add_docs_shard1_replica_t2",
   [junit4]   2>   "core_node_name":"core_node4",
   [junit4]   2>   "roles":null,
   [junit4]   2>   "base_url":"https://127.0.0.1:32857/solr",
   [junit4]   2>   "node_name":"127.0.0.1:32857_solr",
   [junit4]   2>   "numShards":"1",
   [junit4]   2>   "state":"down",
   [junit4]   2>   "shard":"shard1",
   [junit4]   2>   "collection":"tlog_replica_test_add_docs",
   [junit4]   2>   "type":"TLOG",
   [junit4]   2>   "force_set_state":"false",
   [junit4]   2>   "operation":"state"} current state version: 0
   [junit4]   2> 1693709 DEBUG (ScheduledTrigger-7346-thread-3) [    ] o.a.s.c.a.NodeLostTrigger Running NodeLostTrigger: .auto_add_replicas with currently live nodes: 2
   [junit4]   2> 1694131 INFO  (qtp1948262564-21340) [n:127.0.0.1:39955_solr c:tlog_replica_test_add_docs s:shard1 r:core_node3 x:tlog_replica_test_add_docs_shard1_replica_t1] o.a.s.c.SolrConfig Using Lucene MatchVersion: 8.0.0
   [junit4]   2> 1694131 INFO  (qtp1767646854-21328) [n:127.0.0.1:32857_solr c:tlog_replica_test_add_docs s:shard1 r:core_node4 x:tlog_replica_test_add_docs_shard1_replica_t2] o.a.s.c.SolrConfig Using Lucene MatchVersion: 8.0.0
   [junit4]   2> 1694139 INFO  (qtp1948262564-21340) [n:127.0.0.1:39955_solr c:tlog_replica_test_add_docs s:shard1 r:core_node3 x:tlog_replica_test_add_docs_shard1_replica_t1] o.a.s.s.IndexSchema [tlog_replica_test_add_docs_shard1_replica_t1] Schema name=minimal
   [junit4]   2> 1694139 INFO  (qtp1767646854-21328) [n:127.0.0.1:32857_solr c:tlog_replica_test_add_docs s:shard1 r:core_node4 x:tlog_replica_test_add_docs_shard1_replica_t2] o.a.s.s.IndexSchema [tlog_replica_test_add_docs_shard1_replica_t2] Schema name=minimal
   [junit4]   2> 1694140 INFO  (qtp1948262564-21340) [n:127.0.0.1:39955_solr c:tlog_replica_test_add_docs s:shard1 r:core_node3 x:tlog_replica_test_add_docs_shard1_replica_t1] o.a.s.s.IndexSchema Loaded schema minimal/1.1 with uniqueid field id
   [junit4]   2> 1694140 INFO  (qtp1948262564-21340) [n:127.0.0.1:39955_solr c:tlog_replica_test_add_docs s:shard1 r:core_node3 x:tlog_replica_test_add_docs_shard1_replica_t1] o.a.s.c.CoreContainer Creating SolrCore 'tlog_replica_test_add_docs_shard1_replica_t1' using configuration from collection tlog_replica_test_add_docs, trusted=true
   [junit4]   2> 1694140 INFO  (qtp1767646854-21328) [n:127.0.0.1:32857_solr c:tlog_replica_test_add_docs s:shard1 r:core_node4 x:tlog_replica_test_add_docs_shard1_replica_t2] o.a.s.s.IndexSchema Loaded schema minimal/1.1 with uniqueid field id
   [junit4]   2> 1694140 INFO  (qtp1767646854-21328) [n:127.0.0.1:32857_solr c:tlog_replica_test_add_docs s:shard1 r:core_node4 x:tlog_replica_test_add_docs_shard1_replica_t2] o.a.s.c.CoreContainer Creating SolrCore 'tlog_replica_test_add_docs_shard1_replica_t2' using configuration from collection tlog_replica_test_add_docs, trusted=true
   [junit4]   2> 1694140 INFO  (qtp1948262564-21340) [n:127.0.0.1:39955_solr c:tlog_replica_test_add_docs s:shard1 r:core_node3 x:tlog_replica_test_add_docs_shard1_replica_t1] o.a.s.m.r.SolrJmxReporter JMX monitoring for 'solr_39955.solr.core.tlog_replica_test_add_docs.shard1.replica_t1' (registry 'solr.core.tlog_replica_test_add_docs.shard1.replica_t1') enabled at server: com.sun.jmx.mbeanserver.JmxMBeanServer@215527fd
   [junit4]   2> 1694140 INFO  (qtp1767646854-21328) [n:127.0.0.1:32857_solr c:tlog_replica_test_add_docs s:shard1 r:core_node4 x:tlog_replica_test_add_docs_shard1_replica_t2] o.a.s.m.r.SolrJmxReporter JMX monitoring for 'solr_32857.solr.core.tlog_replica_test_add_docs.shard1.replica_t2' (registry 'solr.core.tlog_replica_test_add_docs.shard1.replica_t2') enabled at server: com.sun.jmx.mbeanserver.JmxMBeanServer@215527fd
   [junit4]   2> 1694141 INFO  (qtp1948262564-21340) [n:127.0.0.1:39955_solr c:tlog_replica_test_add_docs s:shard1 r:core_node3 x:tlog_replica_test_add_docs_shard1_replica_t1] o.a.s.c.SolrCore [[tlog_replica_test_add_docs_shard1_replica_t1] ] Opening new SolrCore at [/home/jenkins/workspace/Lucene-Solr-master-Linux/solr/build/solr-core/test/J2/temp/solr.cloud.TestTlogReplica_5D7DFA0B2B8D19AA-001/tempDir-001/node2/tlog_replica_test_add_docs_shard1_replica_t1], dataDir=[/home/jenkins/workspace/Lucene-Solr-master-Linux/solr/build/solr-core/test/J2/temp/solr.cloud.TestTlogReplica_5D7DFA0B2B8D19AA-001/tempDir-001/node2/./tlog_replica_test_add_docs_shard1_replica_t1/data/]
   [junit4]   2> 1694141 INFO  (qtp1767646854-21328) [n:127.0.0.1:32857_solr c:tlog_replica_test_add_docs s:shard1 r:core_node4 x:tlog_replica_test_add_docs_shard1_replica_t2] o.a.s.c.SolrCore [[tlog_replica_test_add_docs_shard1_replica_t2] ] Opening new SolrCore at [/home/jenkins/workspace/Lucene-Solr-master-Linux/solr/build/solr-core/test/J2/temp/solr.cloud.TestTlogReplica_5D7DFA0B2B8D19AA-001/tempDir-001/node1/tlog_replica_test_add_docs_shard1_replica_t2], dataDir=[/home/jenkins/workspace/Lucene-Solr-master-Linux/solr/build/solr-core/test/J2/temp/solr.cloud.TestTlogReplica_5D7DFA0B2B8D19AA-001/tempDir-001/node1/./tlog_replica_test_add_docs_shard1_replica_t2/data/]
   [junit4]   2> 1694170 INFO  (qtp1948262564-21340) [n:127.0.0.1:39955_solr c:tlog_replica_test_add_docs s:shard1 r:core_node3 x:tlog_replica_test_add_docs_shard1_replica_t1] o.a.s.u.UpdateHandler Using UpdateLog implementation: org.apache.solr.update.UpdateLog
   [junit4]   2> 1694170 INFO  (qtp1767646854-21328) [n:127.0.0.1:32857_solr c:tlog_replica_test_add_docs s:shard1 r:core_node4 x:tlog_replica_test_add_docs_shard1_replica_t2] o.a.s.u.UpdateHandler Using UpdateLog implementation: org.apache.solr.update.UpdateLog
   [junit4]   2> 1694170 INFO  (qtp1948262564-21340) [n:127.0.0.1:39955_solr c:tlog_replica_test_add_docs s:shard1 r:core_node3 x:tlog_replica_test_add_docs_shard1_replica_t1] o.a.s.u.UpdateLog Initializing UpdateLog: dataDir=null defaultSyncLevel=FLUSH numRecordsToKeep=100 maxNumLogsToKeep=10 numVersionBuckets=65536
   [junit4]   2> 1694170 INFO  (qtp1767646854-21328) [n:127.0.0.1:32857_solr c:tlog_replica_test_add_docs s:shard1 r:core_node4 x:tlog_replica_test_add_docs_shard1_replica_t2] o.a.s.u.UpdateLog Initializing UpdateLog: dataDir=null defaultSyncLevel=FLUSH numRecordsToKeep=100 maxNumLogsToKeep=10 numVersionBuckets=65536
   [junit4]   2> 1694171 INFO  (qtp1948262564-21340) [n:127.0.0.1:39955_solr c:tlog_replica_test_add_docs s:shard1 r:core_node3 x:tlog_replica_test_add_docs_shard1_replica_t1] o.a.s.u.CommitTracker Hard AutoCommit: disabled
   [junit4]   2> 1694171 INFO  (qtp1948262564-21340) [n:127.0.0.1:39955_solr c:tlog_replica_test_add_docs s:shard1 r:core_node3 x:tlog_replica_test_add_docs_shard1_replica_t1] o.a.s.u.CommitTracker Soft AutoCommit: disabled
   [junit4]   2> 1694171 INFO  (qtp1767646854-21328) [n:127.0.0.1:32857_solr c:tlog_replica_test_add_docs s:shard1 r:core_node4 x:tlog_replica_test_add_docs_shard1_replica_t2] o.a.s.u.CommitTracker Hard AutoCommit: disabled
   [junit4]   2> 1694171 INFO  (qtp1767646854-21328) [n:127.0.0.1:32857_solr c:tlog_replica_test_add_docs s:shard1 r:core_node4 x:tlog_replica_test_add_docs_shard1_replica_t2] o.a.s.u.CommitTracker Soft AutoCommit: disabled
   [junit4]   2> 1694172 INFO  (qtp1948262564-21340) [n:127.0.0.1:39955_solr c:tlog_replica_test_add_docs s:shard1 r:core_node3 x:tlog_replica_test_add_docs_shard1_replica_t1] o.a.s.s.SolrIndexSearcher Opening [Searcher@5ac223e5[tlog_replica_test_add_docs_shard1_replica_t1] main]
   [junit4]   2> 1694172 INFO  (qtp1767646854-21328) [n:127.0.0.1:32857_solr c:tlog_replica_test_add_docs s:shard1 r:core_node4 x:tlog_replica_test_add_docs_shard1_replica_t2] o.a.s.s.SolrIndexSearcher Opening [Searcher@4aca316[tlog_replica_test_add_docs_shard1_replica_t2] main]
   [junit4]   2> 1694173 INFO  (qtp1948262564-21340) [n:127.0.0.1:39955_solr c:tlog_replica_test_add_docs s:shard1 r:core_node3 x:tlog_replica_test_add_docs_shard1_replica_t1] o.a.s.r.ManagedResourceStorage Configured ZooKeeperStorageIO with znodeBase: /configs/conf
   [junit4]   2> 1694173 INFO  (qtp1767646854-21328) [n:127.0.0.1:32857_solr c:tlog_replica_test_add_docs s:shard1 r:core_node4 x:tlog_replica_test_add_docs_shard1_replica_t2] o.a.s.r.ManagedResourceStorage Configured ZooKeeperStorageIO with znodeBase: /configs/conf
   [junit4]   2> 1694173 INFO  (qtp1948262564-21340) [n:127.0.0.1:39955_solr c:tlog_replica_test_add_docs s:shard1 r:core_node3 x:tlog_replica_test_add_docs_shard1_replica_t1] o.a.s.r.ManagedResourceStorage Loaded null at path _rest_managed.json using ZooKeeperStorageIO:path=/configs/conf
   [junit4]   2> 1694173 INFO  (qtp1767646854-21328) [n:127.0.0.1:32857_solr c:tlog_replica_test_add_docs s:shard1 r:core_node4 x:tlog_replica_test_add_docs_shard1_replica_t2] o.a.s.r.ManagedResourceStorage Loaded null at path _rest_managed.json using ZooKeeperStorageIO:path=/configs/conf
   [junit4]   2> 1694173 INFO  (qtp1948262564-21340) [n:127.0.0.1:39955_solr c:tlog_replica_test_add_docs s:shard1 r:core_node3 x:tlog_replica_test_add_docs_shard1_replica_t1] o.a.s.h.ReplicationHandler Commits will be reserved for 10000ms.
   [junit4]   2> 1694173 INFO  (qtp1767646854-21328) [n:127.0.0.1:32857_solr c:tlog_replica_test_add_docs s:shard1 r:core_node4 x:tlog_replica_test_add_docs_shard1_replica_t2] o.a.s.h.ReplicationHandler Commits will be reserved for 10000ms.
   [junit4]   2> 1694173 INFO  (qtp1948262564-21340) [n:127.0.0.1:39955_solr c:tlog_replica_test_add_docs s:shard1 r:core_node3 x:tlog_replica_test_add_docs_shard1_replica_t1] o.a.s.u.UpdateLog Could not find max version in index or recent updates, using new clock 1615835980973998080
   [junit4]   2> 1694173 INFO  (qtp1767646854-21328) [n:127.0.0.1:32857_solr c:tlog_replica_test_add_docs s:shard1 r:core_node4 x:tlog_replica_test_add_docs_shard1_replica_t2] o.a.s.u.UpdateLog Could not find max version in index or recent updates, using new clock 1615835980973998080
   [junit4]   2> 1694173 INFO  (searcherExecutor-7357-thread-1-processing-n:127.0.0.1:39955_solr x:tlog_replica_test_add_docs_shard1_replica_t1 c:tlog_replica_test_add_docs s:shard1 r:core_node3) [n:127.0.0.1:39955_solr c:tlog_replica_test_add_docs s:shard1 r:core_node3 x:tlog_replica_test_add_docs_shard1_replica_t1] o.a.s.c.SolrCore [tlog_replica_test_add_docs_shard1_replica_t1] Registered new searcher Searcher@5ac223e5[tlog_replica_test_add_docs_shard1_replica_t1] main{ExitableDirectoryReader(UninvertingDirectoryReader())}
   [junit4]   2> 1694173 INFO  (searcherExecutor-7358-thread-1-processing-n:127.0.0.1:32857_solr x:tlog_replica_test_add_docs_shard1_replica_t2 c:tlog_replica_test_add_docs s:shard1 r:core_node4) [n:127.0.0.1:32857_solr c:tlog_replica_test_add_docs s:shard1 r:core_node4 x:tlog_replica_test_add_docs_shard1_replica_t2] o.a.s.c.SolrCore [tlog_replica_test_add_docs_shard1_replica_t2] Registered new searcher Searcher@4aca316[tlog_replica_test_add_docs_shard1_replica_t2] main{ExitableDirectoryReader(UninvertingDirectoryReader())}
   [junit4]   2> 1694176 INFO  (qtp1767646854-21328) [n:127.0.0.1:32857_solr c:tlog_replica_test_add_docs s:shard1 r:core_node4 x:tlog_replica_test_add_docs_shard1_replica_t2] o.a.s.c.ZkShardTerms Successful update of terms at /collections/tlog_replica_test_add_docs/terms/shard1 to Terms{values={core_node4=0}, version=0}
   [junit4]   2> 1694176 INFO  (qtp1948262564-21340) [n:127.0.0.1:39955_solr c:tlog_replica_test_add_docs s:shard1 r:core_node3 x:tlog_replica_test_add_docs_shard1_replica_t1] o.a.s.c.ZkShardTerms Failed to save terms, version is not a match, retrying
   [junit4]   2> 1694177 INFO  (qtp1948262564-21340) [n:127.0.0.1:39955_solr c:tlog_replica_test_add_docs s:shard1 r:core_node3 x:tlog_replica_test_add_docs_shard1_replica_t1] o.a.s.c.ZkShardTerms Successful update of terms at /collections/tlog_replica_test_add_docs/terms/shard1 to Terms{values={core_node3=0, core_node4=0}, version=1}
   [junit4]   2> 1694179 INFO  (qtp1767646854-21328) [n:127.0.0.1:32857_solr c:tlog_replica_test_add_docs s:shard1 r:core_node4 x:tlog_replica_test_add_docs_shard1_replica_t2] o.a.s.c.ShardLeaderElectionContext Enough replicas found to continue.
   [junit4]   2> 1694179 INFO  (qtp1767646854-21328) [n:127.0.0.1:32857_solr c:tlog_replica_test_add_docs s:shard1 r:core_node4 x:tlog_replica_test_add_docs_shard1_replica_t2] o.a.s.c.ShardLeaderElectionContext I may be the new leader - try and sync
   [junit4]   2> 1694179 INFO  (qtp1767646854-21328) [n:127.0.0.1:32857_solr c:tlog_replica_test_add_docs s:shard1 r:core_node4 x:tlog_replica_test_add_docs_shard1_replica_t2] o.a.s.c.SyncStrategy Sync replicas to https://127.0.0.1:32857/solr/tlog_replica_test_add_docs_shard1_replica_t2/
   [junit4]   2> 1694179 INFO  (qtp1767646854-21328) [n:127.0.0.1:32857_solr c:tlog_replica_test_add_docs s:shard1 r:core_node4 x:tlog_replica_test_add_docs_shard1_replica_t2] o.a.s.u.PeerSync PeerSync: core=tlog_replica_test_add_docs_shard1_replica_t2 url=https://127.0.0.1:32857/solr START replicas=[https://127.0.0.1:39955/solr/tlog_replica_test_add_docs_shard1_replica_t1/] nUpdates=100
   [junit4]   2> 1694179 INFO  (qtp1767646854-21328) [n:127.0.0.1:32857_solr c:tlog_replica_test_add_docs s:shard1 r:core_node4 x:tlog_replica_test_add_docs_shard1_replica_t2] o.a.s.u.PeerSync PeerSync: core=tlog_replica_test_add_docs_shard1_replica_t2 url=https://127.0.0.1:32857/solr DONE.  We have no versions.  sync failed.
   [junit4]   2> 1694180 INFO  (qtp1948262564-21339) [n:127.0.0.1:39955_solr c:tlog_replica_test_add_docs s:shard1 r:core_node3 x:tlog_replica_test_add_docs_shard1_replica_t1] o.a.s.c.S.Request [tlog_replica_test_add_docs_shard1_replica_t1]  webapp=/solr path=/get params={distrib=false&qt=/get&fingerprint=false&getVersions=100&wt=javabin&version=2} status=0 QTime=0
   [junit4]   2> 1694180 INFO  (qtp1767646854-21328) [n:127.0.0.1:32857_solr c:tlog_replica_test_add_docs s:shard1 r:core_node4 x:tlog_replica_test_add_docs_shard1_replica_t2] o.a.s.c.SyncStrategy Leader's attempt to sync with shard failed, moving to the next candidate
   [junit4]   2> 1694180 INFO  (qtp1767646854-21328) [n:127.0.0.1:32857_solr c:tlog_replica_test_add_docs s:shard1 r:core_node4 x:tlog_replica_test_add_docs_shard1_replica_t2] o.a.s.c.ShardLeaderElectionContext We failed sync, but we have no versions - we can't sync in that case - we were active before, so become leader anyway
   [junit4]   2> 1694180 INFO  (qtp1767646854-21328) [n:127.0.0.1:32857_solr c:tlog_replica_test_add_docs s:shard1 r:core_node4 x:tlog_replica_test_add_docs_shard1_replica_t2] o.a.s.c.ZkController tlog_replica_test_add_docs_shard1_replica_t2 stopping background replication from leader
   [junit4]   2> 1694180 DEBUG (OverseerStateUpdate-72080893740056582-127.0.0.1:32857_solr-n_0000000000) [n:127.0.0.1:32857_solr    ] o.a.s.c.Overseer processMessage: queueSize: 1, message = {
   [junit4]   2>   "operation":"leader",
   [junit4]   2>   "shard":"shard1",
   [junit4]   2>   "collection":"tlog_replica_test_add_docs"} current state version: 0
   [junit4]   2> 1694182 INFO  (qtp1767646854-21328) [n:127.0.0.1:32857_solr c:tlog_replica_test_add_docs s:shard1 r:core_node4 x:tlog_replica_test_add_docs_shard1_replica_t2] o.a.s.c.ShardLeaderElectionContext I am the new leader: https://127.0.0.1:32857/solr/tlog_replica_test_add_docs_shard1_replica_t2/ shard1
   [junit4]   2> 1694182 DEBUG (OverseerStateUpdate-72080893740056582-127.0.0.1:32857_solr-n_0000000000) [n:127.0.0.1:32857_solr    ] o.a.s.c.Overseer processMessage: queueSize: 2, message = {
   [junit4]   2>   "operation":"leader",
   [junit4]   2>   "shard":"shard1",
   [junit4]   2>   "collection":"tlog_replica_test_add_docs",
   [junit4]   2>   "base_url":"https://127.0.0.1:32857/solr",
   [junit4]   2>   "core":"tlog_replica_test_add_docs_shard1_replica_t2",
   [junit4]   2>   "state":"active"} current state version: 0
   [junit4]   2> 1694283 INFO  (qtp1767646854-21328) [n:127.0.0.1:32857_solr c:tlog_replica_test_add_docs s:shard1 r:core_node4 x:tlog_replica_test_add_docs_shard1_replica_t2] o.a.s.c.ZkController I am the leader, no recovery necessary
   [junit4]   2> 1694283 DEBUG (OverseerStateUpdate-72080893740056582-127.0.0.1:32857_solr-n_0000000000) [n:127.0.0.1:32857_solr    ] o.a.s.c.Overseer processMessage: queueSize: 1, message = {
   [junit4]   2>   "core":"tlog_replica_test_add_docs_shard1_replica_t2",
   [junit4]   2>   "core_node_name":"core_node4",
   [junit4]   2>   "roles":null,
   [junit4]   2>   "base_url":"https://127.0.0.1:32857/solr",
   [junit4]   2>   "node_name":"127.0.0.1:32857_solr",
   [junit4]   2>   "numShards":"1",
   [junit4]   2>   "state":"active",
   [junit4]   2>   "shard":"shard1",
   [junit4]   2>   "collection":"tlog_replica_test_add_docs",
   [junit4]   2>   "type":"TLOG",
   [junit4]   2>   "force_set_state":"false",
   [junit4]   2>   "operation":"state"} current state version: 0
   [junit4]   2> 1694327 INFO  (qtp1767646854-21328) [n:127.0.0.1:32857_solr c:tlog_replica_test_add_docs s:shard1 r:core_node4 x:tlog_replica_test_add_docs_shard1_replica_t2] o.a.s.s.HttpSolrCall [admin] webapp=null path=/admin/cores params={qt=/admin/cores&coreNodeName=core_node4&collection.configName=conf&newCollection=true&name=tlog_replica_test_add_docs_shard1_replica_t2&action=CREATE&numShards=1&collection=tlog_replica_test_add_docs&shard=shard1&wt=javabin&version=2&replicaType=TLOG} status=0 QTime=1202
   [junit4]   2> 1694384 INFO  (zkCallback-7461-thread-1) [    ] o.a.s.c.c.ZkStateReader A cluster state change: [WatchedEvent state:SyncConnected type:NodeDataChanged path:/collections/tlog_replica_test_add_docs/state.json] for collection [tlog_replica_test_add_docs] has occurred - updating... (live nodes size: [2])
   [junit4]   2> 1694709 DEBUG (ScheduledTrigger-7346-thread-4) [    ] o.a.s.c.a.NodeLostTrigger Running NodeLostTrigger: .auto_add_replicas with currently live nodes: 2
   [junit4]   2> 1695179 INFO  (qtp1948262564-21340) [n:127.0.0.1:39955_solr c:tlog_replica_test_add_docs s:shard1 r:core_node3 x:tlog_replica_test_add_docs_shard1_replica_t1] o.a.s.c.ZkController tlog_replica_test_add_docs_shard1_replica_t1 starting background replication from leader
   [junit4]   2> 1695179 INFO  (qtp1948262564-21340) [n:127.0.0.1:39955_solr c:tlog_replica_test_add_docs s:shard1 r:core_node3 x:tlog_replica_test_add_docs_shard1_replica_t1] o.a.s.c.ReplicateFromLeader Will start replication from leader with poll interval: 00:00:03
   [junit4]   2> 1695179 INFO  (qtp1948262564-21340) [n:127.0.0.1:39955_solr c:tlog_replica_test_add_docs s:shard1 r:core_node3 x:tlog_replica_test_add_docs_shard1_replica_t1] o.a.s.h.ReplicationHandler Poll scheduled at an interval of 3000ms
   [junit4]   2> 1695179 INFO  (qtp1948262564-21340) [n:127.0.0.1:39955_solr c:tlog_replica_test_add_docs s:shard1 r:core_node3 x:tlog_replica_test_add_docs_shard1_replica_t1] o.a.s.h.ReplicationHandler Commits will be reserved for 10000ms.
   [junit4]   2> 1695180 DEBUG (OverseerStateUpdate-72080893740056582-127.0.0.1:32857_solr-n_0000000000) [n:127.0.0.1:32857_solr    ] o.a.s.c.Overseer processMessage: queueSize: 1, message = {
   [junit4]   2>   "core":"tlog_replica_test_add_docs_shard1_replica_t1",
   [junit4]   2>   "core_node_name":"core_node3",
   [junit4]   2>   "roles":null,
   [junit4]   2>   "base_url":"https://127.0.0.1:39955/solr",
   [junit4]   2>   "node_name":"127.0.0.1:39955_solr",
   [junit4]   2>   "numShards":"1",
   [junit4]   2>   "state":"active",
   [junit4]   2>   "shard":"shard1",
   [junit4]   2>   "collection":"tlog_replica_test_add_docs",
   [junit4]   2>   "type":"TLOG",
   [junit4]   2>   "force_set_state":"false",
   [junit4]   2>   "operation":"state"} current state version: 0
   [junit4]   2> 1695251 INFO  (qtp1948262564-21340) [n:127.0.0.1:39955_solr c:tlog_replica_test_add_docs s:shard1 r:core_node3 x:tlog_replica_test_add_docs_shard1_replica_t1] o.a.s.s.HttpSolrCall [admin] webapp=null path=/admin/cores params={qt=/admin/cores&coreNodeName=core_node3&collection.configName=conf&newCollection=true&name=tlog_replica_test_add_docs_shard1_replica_t1&action=CREATE&numShards=1&collection=tlog_replica_test_add_docs&shard=shard1&wt=javabin&version=2&replicaType=TLOG} status=0 QTime=2126
   [junit4]   2> 1695253 INFO  (qtp1767646854-21338) [n:127.0.0.1:32857_solr    ] o.a.s.h.a.CollectionsHandler Wait for new collection to be active for at most 30 seconds. Check all shard replicas
   [junit4]   2> 1695281 INFO  (zkCallback-7461-thread-2) [    ] o.a.s.c.c.ZkStateReader A cluster state change: [WatchedEvent state:SyncConnected type:NodeDataChanged path:/collections/tlog_replica_test_add_docs/state.json] for collection [tlog_replica_test_add_docs] has occurred - updating... (live nodes size: [2])
   [junit4]   2> 1695281 INFO  (zkCallback-7453-thread-1) [    ] o.a.s.c.c.ZkStateReader A cluster state change: [WatchedEvent state:SyncConnected type:NodeDataChanged path:/collections/tlog_replica_test_add_docs/state.json] for collection [tlog_replica_test_add_docs] has occurred - updating... (live nodes size: [2])
   [junit4]   2> 1695709 DEBUG (ScheduledTrigger-7346-thread-3) [    ] o.a.s.c.a.NodeLostTrigger Running NodeLostTrigger: .auto_add_replicas with currently live nodes: 2
   [junit4]   2> 1696253 INFO  (qtp1767646854-21338) [n:127.0.0.1:32857_solr    ] o.a.s.s.HttpSolrCall [admin] webapp=null path=/admin/collections params={pullReplicas=0&collection.configName=conf&maxShardsPerNode=100&name=tlog_replica_test_add_docs&nrtReplicas=0&action=CREATE&numShards=1&tlogReplicas=2&wt=javabin&version=2} status=0 QTime=3453
   [junit4]   2> 1696257 INFO  (qtp1767646854-21336) [n:127.0.0.1:32857_solr c:tlog_replica_test_add_docs s:shard1 r:core_node4 x:tlog_replica_test_add_docs_shard1_replica_t2] o.a.s.c.ZkShardTerms Successful update of terms at /collections/tlog_replica_test_add_docs/terms/shard1 to Terms{values={core_node3=1, core_node4=1}, version=2}
   [junit4]   2> 1696259 INFO  (qtp1948262564-21340) [n:127.0.0.1:39955_solr c:tlog_replica_test_add_docs s:shard1 r:core_node3 x:tlog_replica_test_add_docs_shard1_replica_t1] o.a.s.u.p.LogUpdateProcessorFactory [tlog_replica_test_add_docs_shard1_replica_t1]  webapp=/solr path=/update params={update.distrib=FROMLEADER&distrib.from=https://127.0.0.1:32857/solr/tlog_replica_test_add_docs_shard1_replica_t2/&wt=javabin&version=2}{add=[1 (1615835983158181888)]} 0 0
   [junit4]   2> 1696259 INFO  (qtp1767646854-21336) [n:127.0.0.1:32857_solr c:tlog_replica_test_add_docs s:shard1 r:core_node4 x:tlog_replica_test_add_docs_shard1_replica_t2] o.a.s.u.p.LogUpdateProcessorFactory [tlog_replica_test_add_docs_shard1_replica_t2]  webapp=/solr path=/update params={wt=javabin&version=2}{add=[1 (1615835983158181888)]} 0 3
   [junit4]   2> 1696260 INFO  (qtp1948262564-21339) [n:127.0.0.1:39955_solr c:tlog_replica_test_add_docs s:shard1 r:core_node3 x:tlog_replica_test_add_docs_shard1_replica_t1] o.a.s.u.p.LogUpdateProcessorFactory [tlog_replica_test_add_docs_shard1_replica_t1]  webapp=/solr path=/update params={update.distrib=FROMLEADER&waitSearcher=true&openSearcher=true&commit=true&softCommit=false&distrib.from=https://127.0.0.1:32857/solr/tlog_replica_test_add_docs_shard1_replica_t2/&commit_end_point=true&wt=javabin&version=2&expungeDeletes=false}{commit=} 0 0
   [junit4]   2> 1696263 INFO  (qtp1767646854-21328) [n:127.0.0.1:32857_solr c:tlog_replica_test_add_docs s:shard1 r:core_node4 x:tlog_replica_test_add_docs_shard1_replica_t2] o.a.s.u.DirectUpdateHandler2 start commit{_version_=1615835983165521920,optimize=false,openSearcher=true,waitSearcher=true,expungeDeletes=false,softCommit=false,prepareCommit=false}
   [junit4]   2> 1696263 INFO  (qtp1767646854-21328) [n:127.0.0.1:32857_solr c:tlog_replica_test_add_docs s:shard1 r:core_node4 x:tlog_replica_test_add_docs_shard1_replica_t2] o.a.s.u.SolrIndexWriter Calling setCommitData with IW:org.apache.solr.update.SolrIndexWriter@1e63951b commitCommandVersion:1615835983165521920
   [junit4]   2> 1696265 INFO  (qtp1767646854-21328) [n:127.0.0.1:32857_solr c:tlog_replica_test_add_docs s:shard1 r:core_node4 x:tlog_replica_test_add_docs_shard1_replica_t2] o.a.s.s.SolrIndexSearcher Opening [Searcher@eac5cc[tlog_replica_test_add_docs_shard1_replica_t2] main]
   [junit4]   2> 1696265 INFO  (qtp1767646854-21328) [n:127.0.0.1:32857_solr c:tlog_replica_test_add_docs s:shard1 r:core_node4 x:tlog_replica_test_add_docs_shard1_replica_t2] o.a.s.u.DirectUpdateHandler2 end_commit_flush
   [junit4]   2> 1696266 INFO  (searcherExecutor-7358-thread-1-processing-n:127.0.0.1:32857_solr x:tlog_replica_test_add_docs_shard1_replica_t2 c:tlog_replica_test_add_docs s:shard1 r:core_node4) [n:127.0.0.1:32857_solr c:tlog_replica_test_add_docs s:shard1 r:core_node4 x:tlog_replica_test_add_docs_shard1_replica_t2] o.a.s.c.SolrCore [tlog_replica_test_add_docs_shard1_replica_t2] Registered new searcher Searcher@eac5cc[tlog_replica_test_add_docs_shard1_replica_t2] main{ExitableDirectoryReader(UninvertingDirectoryReader(Uninverting(_0(8.0.0):C1)))}
   [junit4]   2> 1696266 INFO  (qtp1767646854-21328) [n:127.0.0.1:32857_solr c:tlog_replica_test_add_docs s:shard1 r:core_node4 x:tlog_replica_test_add_docs_shard1_replica_t2] o.a.s.u.p.LogUpdateProcessorFactory [tlog_replica_test_add_docs_shard1_replica_t2]  webapp=/solr path=/update params={update.distrib=FROMLEADER&waitSearcher=true&openSearcher=true&commit=true&softCommit=false&distrib.from=https://127.0.0.1:32857/solr/tlog_replica_test_add_docs_shard1_replica_t2/&commit_end_point=true&wt=javabin&version=2&expungeDeletes=false}{commit=} 0 3
   [junit4]   2> 1696266 INFO  (qtp1767646854-21338) [n:127.0.0.1:32857_solr c:tlog_replica_test_add_docs s:shard1 r:core_node4 x:tlog_replica_test_add_docs_shard1_replica_t2] o.a.s.u.p.LogUpdateProcessorFactory [tlog_replica_test_add_docs_shard1_replica_t2]  webapp=/solr path=/update params={_stateVer_=tlog_replica_test_add_docs:5&waitSearcher=true&commit=true&softCommit=false&wt=javabin&version=2}{commit=} 0 7
   [junit4]   2> 1696269 INFO  (qtp1767646854-21338) [n:127.0.0.1:32857_solr c:tlog_replica_test_add_docs s:shard1 r:core_node4 x:tlog_replica_test_add_docs_shard1_replica_t2] o.a.s.c.S.Request [tlog_replica_test_add_docs_shard1_replica_t2]  webapp=/solr path=/select params={q=*:*&wt=javabin&version=2} hits=1 status=0 QTime=0
   [junit4]   2> 1696272 INFO  (qtp1948262564-21339) [n:127.0.0.1:39955_solr c:tlog_replica_test_add_docs s:shard1 r:core_node3 x:tlog_replica_test_add_docs_shard1_replica_t1] o.a.s.c.S.Request [tlog_replica_test_add_docs_shard1_replica_t1]  webapp=/solr path=/select params={q=*:*&wt=javabin&version=2} hits=0 status=0 QTime=0
   [junit4]   2> 1696372 INFO  (qtp1948262564-21329) [n:127.0.0.1:39955_solr c:tlog_replica_test_add_docs s:shard1 r:core_node3 x:tlog_replica_test_add_docs_shard1_replica_t1] o.a.s.c.S.Request [tlog_replica_test_add_docs_shard1_replica_t1]  webapp=/solr path=/select params={q=*:*&wt=javabin&version=2} hits=0 status=0 QTime=0
   [junit4]   2> 1696473 INFO  (qtp1948262564-21339) [n:127.0.0.1:39955_solr c:tlog_replica_test_add_docs s:shard1 r:core_node3 x:tlog_replica_test_add_docs_shard1_replica_t1] o.a.s.c.S.Request [tlog_replica_test_add_docs_shard1_replica_t1]  webapp=/solr path=/select params={q=*:*&wt=javabin&version=2} hits=0 status=0 QTime=0
   [junit4]   2> 1696574 INFO  (qtp1948262564-21329) [n:127.0.0.1:39955_solr c:tlog_replica_test_add_docs s:shard1 r:core_node3 x:tlog_replica_test_add_docs_shard1_replica_t1] o.a.s.c.S.Request [tlog_replica_test_add_docs_shard1_replica_t1]  webapp=/solr path=/select params={q=*:*&wt=javabin&version=2} hits=0 status=0 QTime=0
   [junit4]   2> 1696675 INFO  (qtp1948262564-21339) [n:127.0.0.1:39955_solr c:tlog_replica_test_add_docs s:shard1 r:core_node3 x:tlog_replica_test_add_docs_shard1_replica_t1] o.a.s.c.S.Request [tlog_replica_test_add_docs_shard1_replica_t1]  webapp=/solr path=/select params={q=*:*&wt=javabin&version=2} hits=0 status=0 QTime=0
   [junit4]   2> 1696710 DEBUG (ScheduledTrigger-7346-thread-4) [    ] o.a.s.c.a.NodeLostTrigger Running NodeLostTrigger: .auto_add_replicas with currently live nodes: 2
   [junit4]   2> 1696776 INFO  (qtp1948262564-21329) [n:127.0.0.1:39955_solr c:tlog_replica_test_add_docs s:shard1 r:core_node3 x:tlog_replica_test_add_docs_shard1_replica_t1] o.a.s.c.S.Request [tlog_replica_test_add_docs_shard1_replica_t1]  webapp=/solr path=/select params={q=*:*&wt=javabin&version=2} hits=0 status=0 QTime=0
   [junit4]   2> 1696802 INFO  (OverseerCollectionConfigSetProcessor-72080893740056582-127.0.0.1:32857_solr-n_0000000000) [n:127.0.0.1:32857_solr    ] o.a.s.c.OverseerTaskQueue Response ZK path: /overseer/collection-queue-work/qnr-0000000000 doesn't exist.  Requestor may have disconnected from ZooKeeper
   [junit4]   2> 1696876 INFO  (qtp1948262564-21339) [n:127.0.0.1:39955_solr c:tlog_replica_test_add_docs s:shard1 r:core_node3 x:tlog_replica_test_add_docs_shard1_replica_t1] o.a.s.c.S.Request [tlog_replica_test_add_docs_shard1_replica_t1]  webapp=/solr path=/select params={q=*:*&wt=javabin&version=2} hits=0 status=0 QTime=0
   [junit4]   2> 1696977 INFO  (qtp1948262564-21339) [n:127.0.0.1:39955_solr c:tlog_replica_test_add_docs s:shard1 r:core_node3 x:tlog_replica_test_add_docs_shard1_replica_t1] o.a.s.c.S.Request [tlog_replica_test_add_docs_shard1_replica_t1]  webapp=/solr path=/select params={q=*:*&wt=javabin&version=2} hits=0 status=0 QTime=0
   [junit4]   2> 1697078 INFO  (qtp1948262564-21329) [n:127.0.0.1:39955_solr c:tlog_replica_test_add_docs s:shard1 r:core_node3 x:tlog_replica_test_add_docs_shard1_replica_t1] o.a.s.c.S.Request [tlog_replica_test_add_docs_shard1_replica_t1]  webapp=/solr path=/select params={q=*:*&wt=javabin&version=2} hits=0 status=0 QTime=0
   [junit4]   2> 1697115 INFO  (indexFetcher-7368-thread-1) [    ] o.a.s.h.IndexFetcher Updated masterUrl to https://127.0.0.1:32857/solr/tlog_replica_test_add_docs_shard1_replica_t2/
   [junit4]   2> 1697116 INFO  (qtp1767646854-21336) [n:127.0.0.1:32857_solr c:tlog_replica_test_add_docs s:shard1 r:core_node4 x:tlog_replica_test_add_docs_shard1_replica_t2] o.a.s.c.S.Request [tlog_replica_test_add_docs_shard1_replica_t2]  webapp=/solr path=/replication params={qt=/replication&wt=javabin&version=2&command=indexversion} status=0 QTime=0
   [junit4]   2> 1697116 INFO  (indexFetcher-7368-thread-1) [    ] o.a.s.h.IndexFetcher Master's generation: 2
   [junit4]   2> 1697116 INFO  (indexFetcher-7368-thread-1) [    ] o.a.s.h.IndexFetcher Master's version: 1540981276670
   [junit4]   2> 1697116 INFO  (indexFetcher-7368-thread-1) [    ] o.a.s.h.IndexFetcher Slave's generation: 1
   [junit4]   2> 1697116 INFO  (indexFetcher-7368-thread-1) [    ] o.a.s.h.IndexFetcher Slave's version: 0
   [junit4]   2> 1697116 INFO  (indexFetcher-7368-thread-1) [    ] o.a.s.h.IndexFetcher Starting replication process
   [junit4]   2> 1697117 INFO  (qtp1767646854-21403) [n:127.0.0.1:32857_solr c:tlog_replica_test_add_docs s:shard1 r:core_node4 x:tlog_replica_test_add_docs_shard1_replica_t2] o.a.s.c.S.Request [tlog_replica_test_add_docs_shard1_replica_t2]  webapp=/solr path=/replication params={generation=2&qt=/replication&tlogFiles=false&wt=javabin&version=2&command=filelist} status=0 QTime=0
   [junit4]   2> 1697117 INFO  (indexFetcher-7368-thread-1) [    ] o.a.s.h.IndexFetcher Number of files in latest index in master: 19
   [junit4]   2> 1697118 INFO  (indexFetcher-7368-thread-1) [    ] o.a.s.h.IndexFetcher Starting download (fullCopy=false) to MockDirectoryWrapper(RAMDirectory@559eb1ee lockFactory=org.apache.lucene.store.SingleInstanceLockFactory@4764889f)
   [junit4]   2> 1697119 INFO  (qtp1767646854-21336) [n:127.0.0.1:32857_solr c:tlog_replica_test_add_docs s:shard1 r:core_node4 x:tlog_replica_test_add_docs_shard1_replica_t2] o.a.s.c.S.Request [tlog_replica_test_add_docs_shard1_replica_t2]  webapp=/solr path=/replication params={generation=2&qt=/replication&file=_0.si&checksum=true&wt=filestream&command=filecontent} status=0 QTime=0
   [junit4]   2> 1697120 INFO  (qtp1767646854-21403) [n:127.0.0.1:32857_solr c:tlog_replica_test_add_docs s:shard1 r:core_node4 x:tlog_replica_test_add_docs_shard1_replica_t2] o.a.s.c.S.Request [tlog_replica_test_add_docs_shard1_replica_t2]  webapp=/solr path=/replication params={generation=2&qt=/replication&file=_0_Direct_0.doc&checksum=true&wt=filestream&command=filecontent} status=0 QTime=0
   [junit4]   2> 1697121 INFO  (qtp1767646854-21336) [n:127.0.0.1:32857_solr c:tlog_replica_test_add_docs s:shard1 r:core_node4 x:tlog_replica_test_add_docs_shard1_replica_t2] o.a.s.c.S.Request [tlog_replica_test_add_docs_shard1_replica_t2]  webapp=/solr path=/replication params={generation=2&qt=/replication&file=_0_Direct_0.tim&checksum=true&wt=filestream&command=filecontent} status=0 QTime=0
   [junit4]   2> 1697122 INFO  (qtp1767646854-21403) [n:127.0.0.1:32857_solr c:tlog_replica_test_add_docs s:shard1 r:core_node4 x:tlog_replica_test_add_docs_shard1_replica_t2] o.a.s.c.S.Request [tlog_replica_test_add_docs_shard1_replica_t2]  webapp=/solr path=/replication params={generation=2&qt=/replication&file=_0_Direct_0.tip&checksum=true&wt=filestream&command=filecontent} status=0 QTime=0
   [junit4]   2> 1697122 INFO  (qtp1767646854-21336) [n:127.0.0.1:32857_solr c:tlog_replica_test_add_docs s:shard1 r:core_node4 x:tlog_replica_test_add_docs_shard1_replica_t2] o.a.s.c.S.Request [tlog_replica_test_add_docs_shard1_replica_t2]  webapp=/solr path=/replication params={generation=2&qt=/replication&file=_0_LuceneVarGapFixedInterval_0.tiv&checksum=true&wt=filestream&command=filecontent} status=0 QTime=0
   [junit4]   2> 1697123 INFO  (qtp1767646854-21403) [n:127.0.0.1:32857_solr c:tlog_replica_test_add_docs s:shard1 r:core_node4 x:tlog_replica_test_add_docs_shard1_replica_t2] o.a.s.c.S.Request [tlog_replica_test_add_docs_shard1_replica_t2]  webapp=/solr path=/replication params={generation=2&qt=/replication&file=_0.nvd&checksum=true&wt=filestream&command=filecontent} status=0 QTime=0
   [junit4]   2> 1697123 INFO  (qtp1767646854-21336) [n:127.0.0.1:32857_solr c:tlog_replica_test_add_docs s:shard1 r:core_node4 x:tlog_replica_test_add_docs_shard1_replica_t2] o.a.s.c.S.Request [tlog_replica_test_add_docs_shard1_replica_t2]  webapp=/solr path=/replication params={generation=2&qt=/replication&file=_0_LuceneVarGapFixedInterval_0.pos&checksum=true&wt=filestream&command=filecontent} status=0 QTime=0
   [junit4]   2> 1697124 INFO  (qtp1767646854-21403) [n:127.0.0.1:32857_solr c:tlog_replica_test_add_docs s:shard1 r:core_node4 x:tlog_replica_test_add_docs_shard1_replica_t2] o.a.s.c.S.Request [tlog_replica_test_add_docs_shard1_replica_t2]  webapp=/solr path=/replication params={generation=2&qt=/replication&file=_0.fdx&checksum=true&wt=filestream&command=filecontent} status=0 QTime=0
   [junit4]   2> 1697124 INFO  (qtp1767646854-21336) [n:127.0.0.1:32857_solr c:tlog_replica_test_add_docs s:shard1 r:core_node4 x:tlog_replica_test_add_docs_shard1_replica_t2] o.a.s.c.S.Request [tlog_replica_test_add_docs_shard1_replica_t2]  webapp=/solr path=/replication params={generation=2&qt=/replication&file=_0_LuceneVarGapFixedInterval_0.doc&checksum=true&wt=filestream&command=filecontent} status=0 QTime=0
   [junit4]   2> 1697125 INFO  (qtp1767646854-21403) [n:127.0.0.1:32857_solr c:tlog_replica_test_add_docs s:shard1 r:core_node4 x:tlog_replica_test_add_docs_shard1_replica_t2] o.a.s.c.S.Request [tlog_replica_test_add_docs_shard1_replica_t2]  webapp=/solr path=/replication params={generation=2&qt=/replication&file=_0.fdt&checksum=true&wt=filestream&command=filecontent} status=0 QTime=0
   [junit4]   2> 1697126 INFO  (qtp1767646854-21336) [n:127.0.0.1:32857_solr c:tlog_replica_test_add_docs s:shard1 r:core_node4 x:tlog_replica_test_add_docs_shard1_replica_t2] o.a.s.c.S.Request [tlog_replica_test_add_docs_shard1_replica_t2]  webapp=/solr path=/replication params={generation=2&qt=/replication&file=_0_Lucene70_0.dvm&checksum=true&wt=filestream&command=filecontent} status=0 QTime=0
   [junit4]   2> 1697126 INFO  (qtp1767646854-21403) [n:127.0.0.1:32857_solr c:tlog_replica_test_add_docs s:shard1 r:core_node4 x:tlog_replica_test_add_docs_shard1_replica_t2] o.a.s.c.S.Request [tlog_replica_test_add_docs_shard1_replica_t2]  webapp=/solr path=/replication params={generation=2&qt=/replication&file=_0_Asserting_0.dvd&checksum=true&wt=filestream&command=filecontent} status=0 QTime=0
   [junit4]   2> 1697127 INFO  (qtp1767646854-21336) [n:127.0.0.1:32857_solr c:tlog_replica_test_add_docs s:shard1 r:core_node4 x:tlog_replica_test_add_docs_shard1_replica_t2] o.a.s.c.S.Request [tlog_replica_test_add_docs_shard1_replica_t2]  webapp=/solr path=/replication params={generation=2&qt=/replication&file=_0_LuceneVarGapFixedInterval_0.tib&checksum=true&wt=filestream&command=filecontent} status=0 QTime=0
   [junit4]   2> 1697127 INFO  (qtp1767646854-21403) [n:127.0.0.1:32857_solr c:tlog_replica_test_add_docs s:shard1 r:core_node4 x:tlog_replica_test_add_docs_shard1_replica_t2] o.a.s.c.S.Request [tlog_replica_test_add_docs_shard1_replica_t2]  webapp=/solr path=/replication params={generation=2&qt=/replication&file=_0_Lucene70_0.dvd&checksum=true&wt=filestream&command=filecontent} status=0 QTime=0
   [junit4]   2> 1697128 INFO  (qtp1767646854-21336) [n:127.0.0.1:32857_solr c:tlog_replica_test_add_docs s:shard1 r:core_node4 x:tlog_replica_test_add_docs_shard1_replica_t2] o.a.s.c.S.Request [tlog_replica_test_add_docs_shard1_replica_t2]  webapp=/solr path=/replication params={generation=2&qt=/replication&file=_0_Asserting_0.dvm&checksum=true&wt=filestream&command=filecontent} status=0 QTime=0
   [junit4]   2> 1697128 INFO  (qtp1767646854-21403) [n:127.0.0.1:32857_solr c:tlog_replica_test_add_docs s:shard1 r:core_node4 x:tlog_replica_test_add_docs_shard1_replica_t2] o.a.s.c.S.Request [tlog_replica_test_add_docs_shard1_replica_t2]  webapp=/solr path=/replication params={generation=2&qt=/replication&file=_0.nvm&checksum=true&wt=filestream&command=filecontent} status=0 QTime=0
   [junit4]   2> 1697128 INFO  (qtp1767646854-21336) [n:127.0.0.1:32857_solr c:tlog_replica_test_add_docs s:shard1 r:core_node4 x:tlog_replica_test_add_docs_shard1_replica_t2] o.a.s.c.S.Request [tlog_replica_test_add_docs_shard1_replica_t2]  webapp=/solr path=/replication params={generation=2&qt=/replication&file=_0_Direct_0.pos&checksum=true&wt=filestream&command=filecontent} status=0 QTime=0
   [junit4]   2> 1697129 INFO  (qtp1767646854-21403) [n:127.0.0.1:32857_solr c:tlog_replica_test_add_docs s:shard1 r:core_node4 x:tlog_replica_test_add_docs_shard1_replica_t2] o.a.s.c.S.Request [tlog_replica_test_add_docs_shard1_replica_t2]  webapp=/solr path=/replication params={generation=2&qt=/replication&file=_0.fnm&checksum=true&wt=filestream&command=filecontent} status=0 QTime=0
   [junit4]   2> 1697129 INFO  (qtp1767646854-21336) [n:127.0.0.1:32857_solr c:tlog_replica_test_add_docs s:shard1 r:core_node4 x:tlog_replica_test_add_docs_shard1_replica_t2] o.a.s.c.S.Request [tlog_replica_test_add_docs_shard1_replica_t2]  webapp=/solr path=/replication params={generation=2&qt=/replication&file=segments_2&checksum=true&wt=filestream&command=filecontent} status=0 QTime=0
   [junit4]   2> 1697129 INFO  (indexFetcher-7368-thread-1) [    ] o.a.s.h.IndexFetcher Bytes downloaded: 3207, Bytes skipped downloading: 0
   [junit4]   2> 1697130 INFO  (indexFetcher-7368-thread-1) [    ] o.a.s.h.IndexFetcher Total time taken for download (fullCopy=false,bytesDownloaded=3207) : 0 secs (null bytes/sec) to MockDirectoryWrapper(RAMDirectory@559eb1ee lockFactory=org.apache.lucene.store.SingleInstanceLockFactory@4764889f)
   [junit4]   2> 1697131 INFO  (indexFetcher-7368-thread-1) [    ] o.a.s.u.DefaultSolrCoreState New IndexWriter is ready to be used.
   [junit4]   2> 1697131 INFO  (indexFetcher-7368-thread-1) [    ] o.a.s.s.SolrIndexSearcher Opening [Searcher@4912f9af[tlog_replica_test_add_docs_shard1_replica_t1] main]
   [junit4]   2> 1697132 INFO  (searcherExecutor-7357-thread-1) [    ] o.a.s.c.SolrCore [tlog_replica_test_add_docs_shard1_replica_t1] Registered new searcher Searcher@4912f9af[tlog_replica_test_add_docs_shard1_replica_t1] main{ExitableDirectoryReader(UninvertingDirectoryReader(Uninverting(_0(8.0.0):C1)))}
   [junit4]   2> 1697179 INFO  (qtp1948262564-21339) [n:127.0.0.1:39955_solr c:tlog_replica_test_add_docs s:shard1 r:core_node3 x:tlog_replica_test_add_docs_shard1_replica_t1] o.a.s.c.S.Request [tlog_replica_test_add_docs_shard1_replica_t1]  webapp=/solr path=/select params={q=*:*&wt=javabin&version=2} hits=1 status=0 QTime=0
   [junit4]   2> 1697182 INFO  (qtp1948262564-21329) [n:127.0.0.1:39955_solr c:tlog_replica_test_add_docs s:shard1 r:core_node3 x:tlog_replica_test_add_docs_shard1_replica_t1] o.a.s.c.S.Request [tlog_replica_test_add_docs_shard1_replica_t1]  webapp=/solr path=/admin/plugins params={qt=/admin/plugins&stats=true&wt=javabin&version=2} status=0 QTime=2
   [junit4]   2> 1697185 INFO  (qtp1767646854-21336) [n:127.0.0.1:32857_solr c:tlog_replica_test_add_docs s:shard1 r:core_node4 x:tlog_replica_test_add_docs_shard1_replica_t2] o.a.s.c.S.Request [tlog_replica_test_add_docs_shard1_replica_t2]  webapp=/solr path=/select params={q=*:*&wt=javabin&version=2} hits=1 status=0 QTime=0
   [junit4]   2> 1697187 INFO  (qtp1767646854-21341) [n:127.0.0.1:32857_solr c:tlog_replica_test_add_docs s:shard1 r:core_node4 x:tlog_replica_test_add_docs_shard1_replica_t2] o.a.s.c.S.Request [tlog_replica_test_add_docs_shard1_replica_t2]  webapp=/solr path=/admin/plugins params={qt=/admin/plugins&stats=true&wt=javabin&version=2} status=0 QTime=2
   [junit4]   2> 1697189 INFO  (TEST-TestTlogReplica.testAddDocs-seed#[5D7DFA0B2B8D19AA]) [    ] o.a.s.c.TestTlogReplica tearDown deleting collection
   [junit4]   2> 1697189 INFO  (qtp1767646854-21338) [n:127.0.0.1:32857_solr    ] o.a.s.h.a.CollectionsHandler Invoked Collection Action :delete with params name=tlog_replica_test_add_docs&action=DELETE&wt=javabin&version=2 and sendToOCPQueue=true
   [junit4]   2> 1697190 INFO  (OverseerThreadFactory-7348-thread-2-processing-n:127.0.0.1:32857_solr) [n:127.0.0.1:32857_solr    ] o.a.s.c.a.c.OverseerCollectionMessageHandler Executing Collection Cmd=action=UNLOAD&deleteInstanceDir=true&deleteDataDir=true&deleteMetricsHistory=true, asyncId=null
   [junit4]   2> 1697191 INFO  (qtp1767646854-21341) [n:127.0.0.1:32857_solr    x:tlog_replica_test_add_docs_shard1_replica_t2] o.a.s.m.SolrMetricManager Closing metric reporters for registry=solr.core.tlog_replica_test_add_docs.shard1.replica_t2, tag=null
   [junit4]   2> 1697191 INFO  (qtp1948262564-21407) [n:127.0.0.1:39955_solr    x:tlog_replica_test_add_docs_shard1_replica_t1] o.a.s.m.SolrMetricManager Closing metric reporters for registry=solr.core.tlog_replica_test_add_docs.shard1.replica_t1, tag=null
   [junit4]   2> 1697191 INFO  (qtp1767646854-21341) [n:127.0.0.1:32857_solr    x:tlog_replica_test_add_docs_shard1_replica_t2] o.a.s.m.r.SolrJmxReporter Closing reporter [org.apache.solr.metrics.reporters.SolrJmxReporter@7cdc4f2e: rootName = solr_32857, domain = solr.core.tlog_replica_test_add_docs.shard1.replica_t2, service url = null, agent id = null] for registry solr.core.tlog_replica_test_add_docs.shard1.replica_t2 / com.codahale.metrics.MetricRegistry@1a9717b5
   [junit4]   2> 1697191 INFO  (qtp1948262564-21407) [n:127.0.0.1:39955_solr    x:tlog_replica_test_add_docs_shard1_replica_t1] o.a.s.m.r.SolrJmxReporter Closing reporter [org.apache.solr.metrics.reporters.SolrJmxReporter@7b55036a: rootName = solr_39955, domain = solr.core.tlog_replica_test_add_docs.shard1.replica_t1, service url = null, agent id = null] for registry solr.core.tlog_replica_test_add_docs.shard1.replica_t1 / com.codahale.metrics.MetricRegistry@1eccd11a
   [junit4]   2> 1697204 INFO  (qtp1948262564-21407) [n:127.0.0.1:39955_solr    x:tlog_replica_test_add_docs_shard1_replica_t1] o.a.s.c.ZkController tlog_replica_test_add_docs_shard1_replica_t1 stopping background replication from leader
   [junit4]   2> 1697205 INFO  (qtp1767646854-21341) [n:127.0.0.1:32857_solr    x:tlog_replica_test_add_docs_shard1_replica_t2] o.a.s.c.ZkController tlog_replica_test_add_docs_shard1_replica_t2 stopping background replication from leader
   [junit4]   2> 1697205 INFO  (qtp1767646854-21341) [n:127.0.0.1:32857_solr    x:tlog_replica_test_add_docs_shard1_replica_t2] o.a.s.c.SolrCore [tlog_replica_test_add_docs_shard1_replica_t2]  CLOSING SolrCore org.apache.solr.core.SolrCore@d9ce64e
   [junit4]   2> 1697205 INFO  (qtp1767646854-21341) [n:127.0.0.1:32857_solr    x:tlog_replica_test_add_docs_shard1_replica_t2] o.a.s.m.SolrMetricManager Closing metric reporters for registry=solr.core.tlog_replica_test_add_docs.shard1.replica_t2, tag=d9ce64e
   [junit4]   2> 1697205 INFO  (qtp1948262564-21407) [n:127.0.0.1:39955_solr    x:tlog_replica_test_add_docs_shard1_replica_t1] o.a.s.c.SolrCore [tlog_replica_test_add_docs_shard1_replica_t1]  CLOSING SolrCore org.apache.solr.core.SolrCore@f57e4c2
   [junit4]   2> 1697205 INFO  (qtp1767646854-21341) [n:127.0.0.1:32857_solr    x:tlog_replica_test_add_docs_shard1_replica_t2] o.a.s.m.SolrMetricManager Closing metric reporters for registry=solr.collection.tlog_replica_test_add_docs.shard1.leader, tag=d9ce64e
   [junit4]   2> 1697205 INFO  (qtp1948262564-21407) [n:127.0.0.1:39955_solr    x:tlog_replica_test_add_docs_shard1_replica_t1] o.a.s.m.SolrMetricManager Closing metric reporters for registry=solr.core.tlog_replica_test_add_docs.shard1.replica_t1, tag=f57e4c2
   [junit4]   2> 1697205 INFO  (qtp1948262564-21407) [n:127.0.0.1:39955_solr    x:tlog_replica_test_add_docs_shard1_replica_t1] o.a.s.m.SolrMetricManager Closing metric reporters for registry=solr.collection.tlog_replica_test_add_docs.shard1.leader, tag=f57e4c2
   [junit4]   2> 1697207 INFO  (qtp1948262564-21407) [n:127.0.0.1:39955_solr    x:tlog_replica_test_add_docs_shard1_replica_t1] o.a.s.c.ZkShardTerms Successful update of terms at /collections/tlog_replica_test_add_docs/terms/shard1 to Terms{values={core_node4=1}, version=3}
   [junit4]   2> 1697207 INFO  (qtp1767646854-21341) [n:127.0.0.1:32857_solr    x:tlog_replica_test_add_docs_shard1_replica_t2] o.a.s.c.ZkShardTerms Failed to save terms, version is not a match, retrying
   [junit4]   2> 1697207 INFO  (qtp1948262564-21407) [n:127.0.0.1:39955_solr    x:tlog_replica_test_add_docs_shard1_replica_t1] o.a.s.c.ShardLeaderElectionContextBase No version found for ephemeral leader parent node, won't remove previous leader registration.
   [junit4]   2> 1697207 INFO  (qtp1767646854-21341) [n:127.0.0.1:32857_solr    x:tlog_replica_test_add_docs_shard1_replica_t2] o.a.s.c.ZkShardTerms Successful update of terms at /collections/tlog_replica_test_add_docs/terms/shard1 to Terms{values={}, version=4}
   [junit4]   2> 1697207 INFO  (qtp1948262564-21407) [n:127.0.0.1:39955_solr    x:tlog_replica_test_add_docs_shard1_replica_t1] o.a.s.s.HttpSolrCall [admin] webapp=null path=/admin/cores params={deleteInstanceDir=true&deleteMetricsHistory=true&core=tlog_replica_test_add_docs_shard1_replica_t1&qt=/admin/cores&deleteDataDir=true&action=UNLOAD&wt=javabin&version=2} status=0 QTime=16
   [junit4]   2> 1697207 WARN  (zkCallback-7453-thread-1) [    ] o.a.s.c.LeaderElector Our node is no longer in line to be leader
   [junit4]   2> 1697207 DEBUG (OverseerStateUpdate-72080893740056582-127.0.0.1:32857_solr-n_0000000000) [n:127.0.0.1:32857_solr    ] o.a.s.c.Overseer processMessage: queueSize: 1, message = {
   [junit4]   2>   "operation":"deletecore",
   [junit4]   2>   "core":"tlog_replica_test_add_docs_shard1_replica_t1",
   [junit4]   2>   "node_name":"127.0.0.1:39955_solr",
   [junit4]   2>   "collection":"tlog_replica_test_add_docs",
   [junit4]   2>   "base_url":"https://127.0.0.1:39955/solr",
   [junit4]   2>   "core_node_name":"core_node3"} current state version: 0
   [junit4]   2> 1697208 INFO  (qtp1767646854-21341) [n:127.0.0.1:32857_solr    x:tlog_replica_test_add_docs_shard1_replica_t2] o.a.s.s.HttpSolrCall [admin] webapp=null path=/admin/cores params={deleteInstanceDir=true&deleteMetricsHistory=true&core=tlog_replica_test_add_docs_shard1_replica_t2&qt=/admin/cores&deleteDataDir=true&action=UNLOAD&wt=javabin&version=2} status=0 QTime=16
   [junit4]   2> 1697208 DEBUG (OverseerStateUpdate-72080893740056582-127.0.0.1:32857_solr-n_0000000000) [n:127.0.0.1:32857_solr    ] o.a.s.c.Overseer processMessage: queueSize: 2, message = {
   [junit4]   2>   "operation":"deletecore",
   [junit4]   2>   "core":"tlog_replica_test_add_docs_shard1_replica_t2",
   [junit4]   2>   "node_name":"127.0.0.1:32857_solr",
   [junit4]   2>   "collection":"tlog_replica_test_add_docs",
   [junit4]   2>   "base_url":"https://127.0.0.1:32857/solr",
   [junit4]   2>   "core_node_name":"core_node4"} current state version: 0
   [junit4]   2> 1697208 DEBUG (OverseerStateUpdate-72080893740056582-127.0.0.1:32857_solr-n_0000000000) [n:127.0.0.1:32857_solr    ] o.a.s.c.Overseer processMessage: queueSize: 3, message = {
   [junit4]   2>   "operation":"delete",
   [junit4]   2>   "name":"tlog_replica_test_add_docs"} current state version: 0
   [junit4]   2> 1697309 INFO  (zkCallback-7461-thread-2) [    ] o.a.s.c.c.ZkStateReader A cluster state change: [WatchedEvent state:SyncConnected type:NodeDeleted path:/collections/tlog_replica_test_add_docs/state.json] for collection [tlog_replica_test_add_docs] has occurred - updating... (live nodes size: [2])
   [junit4]   2> 1697309 INFO  (zkCallback-7453-thread-1) [    ] o.a.s.c.c.ZkStateReader A cluster state change: [WatchedEvent state:SyncConnected type:NodeDeleted path:/collections/tlog_replica_test_add_docs/state.json] for collection [tlog_replica_test_add_docs] has occurred - updating... (live nodes size: [2])
   [junit4]  

[...truncated too long message...]

 Updated live nodes from ZooKeeper... (2) -> (1)
   [junit4]   2> 213953 INFO  (zkCallback-244-thread-1) [    ] o.a.s.c.c.ZkStateReader Updated live nodes from ZooKeeper... (1) -> (0)
   [junit4]   2> 213953 INFO  (jetty-closer-134-thread-2) [    ] o.a.s.m.SolrMetricManager Closing metric reporters for registry=solr.cluster, tag=null
   [junit4]   2> 213953 INFO  (zkCallback-254-thread-3) [    ] o.a.s.c.c.ZkStateReader Updated live nodes from ZooKeeper... (1) -> (0)
   [junit4]   2> 213953 INFO  (zkCallback-237-thread-3) [    ] o.a.s.c.c.ZkStateReader Updated live nodes from ZooKeeper... (1) -> (0)
   [junit4]   2> 213953 INFO  (zkCallback-261-thread-1) [    ] o.a.s.c.c.ZkStateReader Updated live nodes from ZooKeeper... (1) -> (0)
   [junit4]   2> 213954 INFO  (jetty-closer-134-thread-1) [    ] o.a.s.c.Overseer Overseer (id=72080978707677209-127.0.0.1:32795_solr-n_0000000005) closing
   [junit4]   2> 213954 INFO  (OverseerStateUpdate-72080978707677209-127.0.0.1:32795_solr-n_0000000005) [n:127.0.0.1:32795_solr    ] o.a.s.c.Overseer Overseer Loop exiting : 127.0.0.1:32795_solr
   [junit4]   2> 213955 WARN  (OverseerAutoScalingTriggerThread-72080978707677209-127.0.0.1:32795_solr-n_0000000005) [    ] o.a.s.c.a.OverseerTriggerThread OverseerTriggerThread woken up but we are closed, exiting.
   [junit4]   2> 213961 WARN  (NIOServerCxn.Factory:0.0.0.0/0.0.0.0:0) [    ] o.a.z.s.NIOServerCnxn Unable to read additional data from client sessionid 0x1001544aaef001e, likely client has closed socket
   [junit4]   2> 213961 INFO  (zkCallback-254-thread-3) [    ] o.a.s.c.OverseerElectionContext I am going to be the leader 127.0.0.1:41483_solr
   [junit4]   2> 213962 WARN  (NIOServerCxn.Factory:0.0.0.0/0.0.0.0:0) [    ] o.a.z.s.NIOServerCnxn Unable to read additional data from client sessionid 0x1001544aaef0019, likely client has closed socket
   [junit4]   2> 213963 INFO  (jetty-closer-134-thread-1) [    ] o.e.j.s.h.ContextHandler Stopped o.e.j.s.ServletContextHandler@719beaab{/solr,null,UNAVAILABLE}
   [junit4]   2> 213964 INFO  (jetty-closer-134-thread-1) [    ] o.e.j.s.session node0 Stopped scavenging
   [junit4]   2> 215463 INFO  (jetty-closer-134-thread-2) [    ] o.e.j.s.h.ContextHandler Stopped o.e.j.s.ServletContextHandler@4066d160{/solr,null,UNAVAILABLE}
   [junit4]   2> 215463 INFO  (jetty-closer-134-thread-2) [    ] o.e.j.s.session node0 Stopped scavenging
   [junit4]   2> 215464 ERROR (SUITE-TestTlogReplica-seed#[5D7DFA0B2B8D19AA]-worker) [    ] o.a.z.s.ZooKeeperServer ZKShutdownHandler is not registered, so ZooKeeper server won't take any action on ERROR or SHUTDOWN server state changes
   [junit4]   2> 215464 INFO  (SUITE-TestTlogReplica-seed#[5D7DFA0B2B8D19AA]-worker) [    ] o.a.s.c.ZkTestServer connecting to 127.0.0.1:40327 40327
   [junit4]   2> 215490 INFO  (Thread-97) [    ] o.a.s.c.ZkTestServer connecting to 127.0.0.1:40327 40327
   [junit4]   2> 215491 WARN  (Thread-97) [    ] o.a.s.c.ZkTestServer Watch limit violations: 
   [junit4]   2> Maximum concurrent create/delete watches above limit:
   [junit4]   2> 
   [junit4]   2> 	32	/solr/configs/conf
   [junit4]   2> 	31	/solr/collections/tlog_replica_test_create_delete/terms/shard1
   [junit4]   2> 	29	/solr/collections/tlog_replica_test_create_delete/terms/shard2
   [junit4]   2> 	19	/solr/collections/tlog_replica_test_real_time_get/terms/shard1
   [junit4]   2> 	19	/solr/collections/tlog_replica_test_remove_leader/terms/shard1
   [junit4]   2> 	17	/solr/collections/tlog_replica_test_recovery/terms/shard1
   [junit4]   2> 	16	/solr/collections/tlog_replica_test_basic_leader_election/terms/shard1
   [junit4]   2> 	16	/solr/collections/tlog_replica_test_kill_leader/terms/shard1
   [junit4]   2> 	16	/solr/collections/tlog_replica_test_kill_tlog_replica/terms/shard1
   [junit4]   2> 	15	/solr/aliases.json
   [junit4]   2> 	10	/solr/collections/tlog_replica_test_add_docs/terms/shard1
   [junit4]   2> 	10	/solr/collections/tlog_replica_test_delete_by_id/terms/shard1
   [junit4]   2> 	10	/solr/collections/tlog_replica_test_only_leader_indexes/terms/shard1
   [junit4]   2> 	9	/solr/collections/tlog_replica_test_out_of_order_db_qwith_in_place_updates/terms/shard1
   [junit4]   2> 	7	/solr/security.json
   [junit4]   2> 	6	/solr/collections/tlog_replica_test_add_remove_tlog_replica/terms/shard2
   [junit4]   2> 	5	/solr/collections/tlog_replica_test_add_remove_tlog_replica/terms/shard1
   [junit4]   2> 
   [junit4]   2> Maximum concurrent data watches above limit:
   [junit4]   2> 
   [junit4]   2> 	25	/solr/collections/tlog_replica_test_create_delete/state.json
   [junit4]   2> 	15	/solr/collections/tlog_replica_test_out_of_order_db_qwith_in_place_updates/state.json
   [junit4]   2> 	15	/solr/clusterstate.json
   [junit4]   2> 	15	/solr/clusterprops.json
   [junit4]   2> 	13	/solr/collections/tlog_replica_test_recovery/state.json
   [junit4]   2> 	13	/solr/collections/tlog_replica_test_basic_leader_election/state.json
   [junit4]   2> 	12	/solr/collections/tlog_replica_test_kill_tlog_replica/state.json
   [junit4]   2> 	9	/solr/collections/tlog_replica_test_remove_leader/state.json
   [junit4]   2> 	8	/solr/collections/tlog_replica_test_kill_leader/state.json
   [junit4]   2> 	7	/solr/collections/tlog_replica_test_real_time_get/state.json
   [junit4]   2> 	4	/solr/autoscaling.json
   [junit4]   2> 	3	/solr/collections/tlog_replica_test_add_docs/state.json
   [junit4]   2> 	3	/solr/collections/tlog_replica_test_add_remove_tlog_replica/state.json
   [junit4]   2> 	3	/solr/overseer_elect/election/72080978707677190-127.0.0.1:41483_solr-n_0000000000
   [junit4]   2> 	3	/solr/collections/tlog_replica_test_only_leader_indexes/state.json
   [junit4]   2> 	3	/solr/collections/tlog_replica_test_delete_by_id/state.json
   [junit4]   2> 	2	/solr/collections/tlog_replica_test_create_delete/leader_elect/shard1/election/72080978707677190-core_node9-n_0000000000
   [junit4]   2> 	2	/solr/collections/tlog_replica_test_recovery/leader_elect/shard1/election/72080978707677201-core_node4-n_0000000000
   [junit4]   2> 	2	/solr/collections/tlog_replica_test_create_delete/leader_elect/shard2/election/72080978707677201-core_node13-n_0000000001
   [junit4]   2> 	2	/solr/collections/tlog_replica_test_real_time_get/leader_elect/shard1/election/72080978707677213-core_node3-n_0000000001
   [junit4]   2> 
   [junit4]   2> Maximum concurrent children watches above limit:
   [junit4]   2> 
   [junit4]   2> 	15	/solr/live_nodes
   [junit4]   2> 	15	/solr/collections
   [junit4]   2> 	4	/solr/overseer/queue
   [junit4]   2> 	4	/solr/autoscaling/events/.scheduled_maintenance
   [junit4]   2> 	4	/solr/autoscaling/events/.auto_add_replicas
   [junit4]   2> 	4	/solr/overseer/queue-work
   [junit4]   2> 	4	/solr/overseer/collection-queue-work
   [junit4]   2> 
   [junit4]   2> NOTE: leaving temporary files on disk at: /home/jenkins/workspace/Lucene-Solr-master-Linux/solr/build/solr-core/test/J2/temp/solr.cloud.TestTlogReplica_5D7DFA0B2B8D19AA-002
   [junit4]   2> Oct 31, 2018 10:44:29 AM com.carrotsearch.randomizedtesting.ThreadLeakControl checkThreadLeaks
   [junit4]   2> WARNING: Will linger awaiting termination of 1 leaked thread(s).
   [junit4]   2> NOTE: test params are: codec=Asserting(Lucene80): {foo=PostingsFormat(name=Direct), title_s=Lucene50(blocksize=128), id=PostingsFormat(name=LuceneVarGapFixedInterval), foo_s=PostingsFormat(name=Direct)}, docValues:{_version_=DocValuesFormat(name=Lucene70), id=DocValuesFormat(name=Asserting), inplace_updatable_int=DocValuesFormat(name=Lucene70)}, maxPointsInLeafNode=1500, maxMBSortInHeap=5.457176470631149, sim=Asserting(org.apache.lucene.search.similarities.AssertingSimilarity@1b2b2528), locale=en-KN, timezone=America/Kentucky/Louisville
   [junit4]   2> NOTE: Linux 4.15.0-38-generic amd64/Oracle Corporation 10.0.1 (64-bit)/cpus=8,threads=1,free=114272264,total=501743616
   [junit4]   2> NOTE: All tests run in this JVM: [TestTlogReplica, TestTlogReplica]
   [junit4] Completed [5/5 (5!)] on J2 in 100.33s, 13 tests, 1 failure <<< FAILURES!

[...truncated 15 lines...]
BUILD FAILED
/home/jenkins/workspace/Lucene-Solr-master-Linux/lucene/common-build.xml:1567: The following error occurred while executing this line:
/home/jenkins/workspace/Lucene-Solr-master-Linux/lucene/common-build.xml:1092: There were test failures: 5 suites, 65 tests, 5 failures [seed: 5D7DFA0B2B8D19AA]

Total time: 3 minutes 38 seconds

[repro] Setting last failure code to 256

[repro] Failures:
[repro]   5/5 failed: org.apache.solr.cloud.TestTlogReplica
[repro] Exiting with code 256
+ mv lucene/build lucene/build.repro
+ mv solr/build solr/build.repro
+ mv lucene/build.orig lucene/build
+ mv solr/build.orig solr/build
Archiving artifacts
Setting ANT_1_8_2_HOME=/var/lib/jenkins/tools/hudson.tasks.Ant_AntInstallation/ANT_1.8.2
[WARNINGS] Parsing warnings in console log with parser Java Compiler (javac)
Setting ANT_1_8_2_HOME=/var/lib/jenkins/tools/hudson.tasks.Ant_AntInstallation/ANT_1.8.2
Setting ANT_1_8_2_HOME=/var/lib/jenkins/tools/hudson.tasks.Ant_AntInstallation/ANT_1.8.2
<Git Blamer> Using GitBlamer to create author and commit information for all warnings.
<Git Blamer> GIT_COMMIT=856e28d8cf07cc34bc1361784bf00e7aceb3af97, workspace=/var/lib/jenkins/workspace/Lucene-Solr-master-Linux
[WARNINGS] Computing warning deltas based on reference build #23126
Recording test results
Setting ANT_1_8_2_HOME=/var/lib/jenkins/tools/hudson.tasks.Ant_AntInstallation/ANT_1.8.2
Build step 'Publish JUnit test result report' changed build result to UNSTABLE
Email was triggered for: Unstable (Test Failures)
Sending email for trigger: Unstable (Test Failures)
Setting ANT_1_8_2_HOME=/var/lib/jenkins/tools/hudson.tasks.Ant_AntInstallation/ANT_1.8.2
Setting ANT_1_8_2_HOME=/var/lib/jenkins/tools/hudson.tasks.Ant_AntInstallation/ANT_1.8.2
Setting ANT_1_8_2_HOME=/var/lib/jenkins/tools/hudson.tasks.Ant_AntInstallation/ANT_1.8.2
Setting ANT_1_8_2_HOME=/var/lib/jenkins/tools/hudson.tasks.Ant_AntInstallation/ANT_1.8.2

Mime
View raw message