lucene-dev mailing list archives

Site index · List index
Message view « Date » · « Thread »
Top « Date » · « Thread »
From Policeman Jenkins Server <jenk...@thetaphi.de>
Subject [JENKINS] Lucene-Solr-7.x-Windows (64bit/jdk-9.0.4) - Build # 863 - Unstable!
Date Wed, 31 Oct 2018 12:22:48 GMT
Build: https://jenkins.thetaphi.de/job/Lucene-Solr-7.x-Windows/863/
Java: 64bit/jdk-9.0.4 -XX:-UseCompressedOops -XX:+UseConcMarkSweepGC

5 tests failed.
FAILED:  org.apache.solr.cloud.autoscaling.TriggerSetPropertiesIntegrationTest.testSetProperties

Error Message:


Stack Trace:
java.lang.AssertionError
	at __randomizedtesting.SeedInfo.seed([F51A11C2AC8D0113:9E7EC68B1FA09497]:0)
	at org.junit.Assert.fail(Assert.java:92)
	at org.junit.Assert.assertTrue(Assert.java:43)
	at org.junit.Assert.assertTrue(Assert.java:54)
	at org.apache.solr.cloud.autoscaling.TriggerSetPropertiesIntegrationTest.testSetProperties(TriggerSetPropertiesIntegrationTest.java:111)
	at java.base/jdk.internal.reflect.NativeMethodAccessorImpl.invoke0(Native Method)
	at java.base/jdk.internal.reflect.NativeMethodAccessorImpl.invoke(NativeMethodAccessorImpl.java:62)
	at java.base/jdk.internal.reflect.DelegatingMethodAccessorImpl.invoke(DelegatingMethodAccessorImpl.java:43)
	at java.base/java.lang.reflect.Method.invoke(Method.java:564)
	at com.carrotsearch.randomizedtesting.RandomizedRunner.invoke(RandomizedRunner.java:1742)
	at com.carrotsearch.randomizedtesting.RandomizedRunner$8.evaluate(RandomizedRunner.java:935)
	at com.carrotsearch.randomizedtesting.RandomizedRunner$9.evaluate(RandomizedRunner.java:971)
	at com.carrotsearch.randomizedtesting.RandomizedRunner$10.evaluate(RandomizedRunner.java:985)
	at com.carrotsearch.randomizedtesting.rules.SystemPropertiesRestoreRule$1.evaluate(SystemPropertiesRestoreRule.java:57)
	at org.apache.lucene.util.TestRuleSetupTeardownChained$1.evaluate(TestRuleSetupTeardownChained.java:49)
	at org.apache.lucene.util.AbstractBeforeAfterRule$1.evaluate(AbstractBeforeAfterRule.java:45)
	at org.apache.lucene.util.TestRuleThreadAndTestName$1.evaluate(TestRuleThreadAndTestName.java:48)
	at org.apache.lucene.util.TestRuleIgnoreAfterMaxFailures$1.evaluate(TestRuleIgnoreAfterMaxFailures.java:64)
	at org.apache.lucene.util.TestRuleMarkFailure$1.evaluate(TestRuleMarkFailure.java:47)
	at com.carrotsearch.randomizedtesting.rules.StatementAdapter.evaluate(StatementAdapter.java:36)
	at com.carrotsearch.randomizedtesting.ThreadLeakControl$StatementRunner.run(ThreadLeakControl.java:368)
	at com.carrotsearch.randomizedtesting.ThreadLeakControl.forkTimeoutingTask(ThreadLeakControl.java:817)
	at com.carrotsearch.randomizedtesting.ThreadLeakControl$3.evaluate(ThreadLeakControl.java:468)
	at com.carrotsearch.randomizedtesting.RandomizedRunner.runSingleTest(RandomizedRunner.java:944)
	at com.carrotsearch.randomizedtesting.RandomizedRunner$5.evaluate(RandomizedRunner.java:830)
	at com.carrotsearch.randomizedtesting.RandomizedRunner$6.evaluate(RandomizedRunner.java:880)
	at com.carrotsearch.randomizedtesting.RandomizedRunner$7.evaluate(RandomizedRunner.java:891)
	at com.carrotsearch.randomizedtesting.rules.StatementAdapter.evaluate(StatementAdapter.java:36)
	at com.carrotsearch.randomizedtesting.rules.SystemPropertiesRestoreRule$1.evaluate(SystemPropertiesRestoreRule.java:57)
	at org.apache.lucene.util.AbstractBeforeAfterRule$1.evaluate(AbstractBeforeAfterRule.java:45)
	at com.carrotsearch.randomizedtesting.rules.StatementAdapter.evaluate(StatementAdapter.java:36)
	at org.apache.lucene.util.TestRuleStoreClassName$1.evaluate(TestRuleStoreClassName.java:41)
	at com.carrotsearch.randomizedtesting.rules.NoShadowingOrOverridesOnMethodsRule$1.evaluate(NoShadowingOrOverridesOnMethodsRule.java:40)
	at com.carrotsearch.randomizedtesting.rules.NoShadowingOrOverridesOnMethodsRule$1.evaluate(NoShadowingOrOverridesOnMethodsRule.java:40)
	at com.carrotsearch.randomizedtesting.rules.StatementAdapter.evaluate(StatementAdapter.java:36)
	at com.carrotsearch.randomizedtesting.rules.StatementAdapter.evaluate(StatementAdapter.java:36)
	at org.apache.lucene.util.TestRuleAssertionsRequired$1.evaluate(TestRuleAssertionsRequired.java:53)
	at org.apache.lucene.util.TestRuleMarkFailure$1.evaluate(TestRuleMarkFailure.java:47)
	at org.apache.lucene.util.TestRuleIgnoreAfterMaxFailures$1.evaluate(TestRuleIgnoreAfterMaxFailures.java:64)
	at org.apache.lucene.util.TestRuleIgnoreTestSuites$1.evaluate(TestRuleIgnoreTestSuites.java:54)
	at com.carrotsearch.randomizedtesting.rules.StatementAdapter.evaluate(StatementAdapter.java:36)
	at com.carrotsearch.randomizedtesting.ThreadLeakControl$StatementRunner.run(ThreadLeakControl.java:368)
	at java.base/java.lang.Thread.run(Thread.java:844)


FAILED:  org.apache.solr.cloud.autoscaling.TriggerSetPropertiesIntegrationTest.testSetProperties

Error Message:


Stack Trace:
java.lang.AssertionError
	at __randomizedtesting.SeedInfo.seed([F51A11C2AC8D0113:9E7EC68B1FA09497]:0)
	at org.junit.Assert.fail(Assert.java:92)
	at org.junit.Assert.assertTrue(Assert.java:43)
	at org.junit.Assert.assertTrue(Assert.java:54)
	at org.apache.solr.cloud.autoscaling.TriggerSetPropertiesIntegrationTest.testSetProperties(TriggerSetPropertiesIntegrationTest.java:111)
	at java.base/jdk.internal.reflect.NativeMethodAccessorImpl.invoke0(Native Method)
	at java.base/jdk.internal.reflect.NativeMethodAccessorImpl.invoke(NativeMethodAccessorImpl.java:62)
	at java.base/jdk.internal.reflect.DelegatingMethodAccessorImpl.invoke(DelegatingMethodAccessorImpl.java:43)
	at java.base/java.lang.reflect.Method.invoke(Method.java:564)
	at com.carrotsearch.randomizedtesting.RandomizedRunner.invoke(RandomizedRunner.java:1742)
	at com.carrotsearch.randomizedtesting.RandomizedRunner$8.evaluate(RandomizedRunner.java:935)
	at com.carrotsearch.randomizedtesting.RandomizedRunner$9.evaluate(RandomizedRunner.java:971)
	at com.carrotsearch.randomizedtesting.RandomizedRunner$10.evaluate(RandomizedRunner.java:985)
	at com.carrotsearch.randomizedtesting.rules.SystemPropertiesRestoreRule$1.evaluate(SystemPropertiesRestoreRule.java:57)
	at org.apache.lucene.util.TestRuleSetupTeardownChained$1.evaluate(TestRuleSetupTeardownChained.java:49)
	at org.apache.lucene.util.AbstractBeforeAfterRule$1.evaluate(AbstractBeforeAfterRule.java:45)
	at org.apache.lucene.util.TestRuleThreadAndTestName$1.evaluate(TestRuleThreadAndTestName.java:48)
	at org.apache.lucene.util.TestRuleIgnoreAfterMaxFailures$1.evaluate(TestRuleIgnoreAfterMaxFailures.java:64)
	at org.apache.lucene.util.TestRuleMarkFailure$1.evaluate(TestRuleMarkFailure.java:47)
	at com.carrotsearch.randomizedtesting.rules.StatementAdapter.evaluate(StatementAdapter.java:36)
	at com.carrotsearch.randomizedtesting.ThreadLeakControl$StatementRunner.run(ThreadLeakControl.java:368)
	at com.carrotsearch.randomizedtesting.ThreadLeakControl.forkTimeoutingTask(ThreadLeakControl.java:817)
	at com.carrotsearch.randomizedtesting.ThreadLeakControl$3.evaluate(ThreadLeakControl.java:468)
	at com.carrotsearch.randomizedtesting.RandomizedRunner.runSingleTest(RandomizedRunner.java:944)
	at com.carrotsearch.randomizedtesting.RandomizedRunner$5.evaluate(RandomizedRunner.java:830)
	at com.carrotsearch.randomizedtesting.RandomizedRunner$6.evaluate(RandomizedRunner.java:880)
	at com.carrotsearch.randomizedtesting.RandomizedRunner$7.evaluate(RandomizedRunner.java:891)
	at com.carrotsearch.randomizedtesting.rules.StatementAdapter.evaluate(StatementAdapter.java:36)
	at com.carrotsearch.randomizedtesting.rules.SystemPropertiesRestoreRule$1.evaluate(SystemPropertiesRestoreRule.java:57)
	at org.apache.lucene.util.AbstractBeforeAfterRule$1.evaluate(AbstractBeforeAfterRule.java:45)
	at com.carrotsearch.randomizedtesting.rules.StatementAdapter.evaluate(StatementAdapter.java:36)
	at org.apache.lucene.util.TestRuleStoreClassName$1.evaluate(TestRuleStoreClassName.java:41)
	at com.carrotsearch.randomizedtesting.rules.NoShadowingOrOverridesOnMethodsRule$1.evaluate(NoShadowingOrOverridesOnMethodsRule.java:40)
	at com.carrotsearch.randomizedtesting.rules.NoShadowingOrOverridesOnMethodsRule$1.evaluate(NoShadowingOrOverridesOnMethodsRule.java:40)
	at com.carrotsearch.randomizedtesting.rules.StatementAdapter.evaluate(StatementAdapter.java:36)
	at com.carrotsearch.randomizedtesting.rules.StatementAdapter.evaluate(StatementAdapter.java:36)
	at org.apache.lucene.util.TestRuleAssertionsRequired$1.evaluate(TestRuleAssertionsRequired.java:53)
	at org.apache.lucene.util.TestRuleMarkFailure$1.evaluate(TestRuleMarkFailure.java:47)
	at org.apache.lucene.util.TestRuleIgnoreAfterMaxFailures$1.evaluate(TestRuleIgnoreAfterMaxFailures.java:64)
	at org.apache.lucene.util.TestRuleIgnoreTestSuites$1.evaluate(TestRuleIgnoreTestSuites.java:54)
	at com.carrotsearch.randomizedtesting.rules.StatementAdapter.evaluate(StatementAdapter.java:36)
	at com.carrotsearch.randomizedtesting.ThreadLeakControl$StatementRunner.run(ThreadLeakControl.java:368)
	at java.base/java.lang.Thread.run(Thread.java:844)


FAILED:  org.apache.solr.cloud.autoscaling.TriggerSetPropertiesIntegrationTest.testSetProperties

Error Message:


Stack Trace:
java.lang.AssertionError
	at __randomizedtesting.SeedInfo.seed([F51A11C2AC8D0113:9E7EC68B1FA09497]:0)
	at org.junit.Assert.fail(Assert.java:92)
	at org.junit.Assert.assertTrue(Assert.java:43)
	at org.junit.Assert.assertTrue(Assert.java:54)
	at org.apache.solr.cloud.autoscaling.TriggerSetPropertiesIntegrationTest.testSetProperties(TriggerSetPropertiesIntegrationTest.java:111)
	at java.base/jdk.internal.reflect.NativeMethodAccessorImpl.invoke0(Native Method)
	at java.base/jdk.internal.reflect.NativeMethodAccessorImpl.invoke(NativeMethodAccessorImpl.java:62)
	at java.base/jdk.internal.reflect.DelegatingMethodAccessorImpl.invoke(DelegatingMethodAccessorImpl.java:43)
	at java.base/java.lang.reflect.Method.invoke(Method.java:564)
	at com.carrotsearch.randomizedtesting.RandomizedRunner.invoke(RandomizedRunner.java:1742)
	at com.carrotsearch.randomizedtesting.RandomizedRunner$8.evaluate(RandomizedRunner.java:935)
	at com.carrotsearch.randomizedtesting.RandomizedRunner$9.evaluate(RandomizedRunner.java:971)
	at com.carrotsearch.randomizedtesting.RandomizedRunner$10.evaluate(RandomizedRunner.java:985)
	at com.carrotsearch.randomizedtesting.rules.SystemPropertiesRestoreRule$1.evaluate(SystemPropertiesRestoreRule.java:57)
	at org.apache.lucene.util.TestRuleSetupTeardownChained$1.evaluate(TestRuleSetupTeardownChained.java:49)
	at org.apache.lucene.util.AbstractBeforeAfterRule$1.evaluate(AbstractBeforeAfterRule.java:45)
	at org.apache.lucene.util.TestRuleThreadAndTestName$1.evaluate(TestRuleThreadAndTestName.java:48)
	at org.apache.lucene.util.TestRuleIgnoreAfterMaxFailures$1.evaluate(TestRuleIgnoreAfterMaxFailures.java:64)
	at org.apache.lucene.util.TestRuleMarkFailure$1.evaluate(TestRuleMarkFailure.java:47)
	at com.carrotsearch.randomizedtesting.rules.StatementAdapter.evaluate(StatementAdapter.java:36)
	at com.carrotsearch.randomizedtesting.ThreadLeakControl$StatementRunner.run(ThreadLeakControl.java:368)
	at com.carrotsearch.randomizedtesting.ThreadLeakControl.forkTimeoutingTask(ThreadLeakControl.java:817)
	at com.carrotsearch.randomizedtesting.ThreadLeakControl$3.evaluate(ThreadLeakControl.java:468)
	at com.carrotsearch.randomizedtesting.RandomizedRunner.runSingleTest(RandomizedRunner.java:944)
	at com.carrotsearch.randomizedtesting.RandomizedRunner$5.evaluate(RandomizedRunner.java:830)
	at com.carrotsearch.randomizedtesting.RandomizedRunner$6.evaluate(RandomizedRunner.java:880)
	at com.carrotsearch.randomizedtesting.RandomizedRunner$7.evaluate(RandomizedRunner.java:891)
	at com.carrotsearch.randomizedtesting.rules.StatementAdapter.evaluate(StatementAdapter.java:36)
	at com.carrotsearch.randomizedtesting.rules.SystemPropertiesRestoreRule$1.evaluate(SystemPropertiesRestoreRule.java:57)
	at org.apache.lucene.util.AbstractBeforeAfterRule$1.evaluate(AbstractBeforeAfterRule.java:45)
	at com.carrotsearch.randomizedtesting.rules.StatementAdapter.evaluate(StatementAdapter.java:36)
	at org.apache.lucene.util.TestRuleStoreClassName$1.evaluate(TestRuleStoreClassName.java:41)
	at com.carrotsearch.randomizedtesting.rules.NoShadowingOrOverridesOnMethodsRule$1.evaluate(NoShadowingOrOverridesOnMethodsRule.java:40)
	at com.carrotsearch.randomizedtesting.rules.NoShadowingOrOverridesOnMethodsRule$1.evaluate(NoShadowingOrOverridesOnMethodsRule.java:40)
	at com.carrotsearch.randomizedtesting.rules.StatementAdapter.evaluate(StatementAdapter.java:36)
	at com.carrotsearch.randomizedtesting.rules.StatementAdapter.evaluate(StatementAdapter.java:36)
	at org.apache.lucene.util.TestRuleAssertionsRequired$1.evaluate(TestRuleAssertionsRequired.java:53)
	at org.apache.lucene.util.TestRuleMarkFailure$1.evaluate(TestRuleMarkFailure.java:47)
	at org.apache.lucene.util.TestRuleIgnoreAfterMaxFailures$1.evaluate(TestRuleIgnoreAfterMaxFailures.java:64)
	at org.apache.lucene.util.TestRuleIgnoreTestSuites$1.evaluate(TestRuleIgnoreTestSuites.java:54)
	at com.carrotsearch.randomizedtesting.rules.StatementAdapter.evaluate(StatementAdapter.java:36)
	at com.carrotsearch.randomizedtesting.ThreadLeakControl$StatementRunner.run(ThreadLeakControl.java:368)
	at java.base/java.lang.Thread.run(Thread.java:844)


FAILED:  org.apache.solr.cloud.autoscaling.TriggerSetPropertiesIntegrationTest.testSetProperties

Error Message:


Stack Trace:
java.lang.AssertionError
	at __randomizedtesting.SeedInfo.seed([F51A11C2AC8D0113:9E7EC68B1FA09497]:0)
	at org.junit.Assert.fail(Assert.java:92)
	at org.junit.Assert.assertTrue(Assert.java:43)
	at org.junit.Assert.assertTrue(Assert.java:54)
	at org.apache.solr.cloud.autoscaling.TriggerSetPropertiesIntegrationTest.testSetProperties(TriggerSetPropertiesIntegrationTest.java:111)
	at java.base/jdk.internal.reflect.NativeMethodAccessorImpl.invoke0(Native Method)
	at java.base/jdk.internal.reflect.NativeMethodAccessorImpl.invoke(NativeMethodAccessorImpl.java:62)
	at java.base/jdk.internal.reflect.DelegatingMethodAccessorImpl.invoke(DelegatingMethodAccessorImpl.java:43)
	at java.base/java.lang.reflect.Method.invoke(Method.java:564)
	at com.carrotsearch.randomizedtesting.RandomizedRunner.invoke(RandomizedRunner.java:1742)
	at com.carrotsearch.randomizedtesting.RandomizedRunner$8.evaluate(RandomizedRunner.java:935)
	at com.carrotsearch.randomizedtesting.RandomizedRunner$9.evaluate(RandomizedRunner.java:971)
	at com.carrotsearch.randomizedtesting.RandomizedRunner$10.evaluate(RandomizedRunner.java:985)
	at com.carrotsearch.randomizedtesting.rules.SystemPropertiesRestoreRule$1.evaluate(SystemPropertiesRestoreRule.java:57)
	at org.apache.lucene.util.TestRuleSetupTeardownChained$1.evaluate(TestRuleSetupTeardownChained.java:49)
	at org.apache.lucene.util.AbstractBeforeAfterRule$1.evaluate(AbstractBeforeAfterRule.java:45)
	at org.apache.lucene.util.TestRuleThreadAndTestName$1.evaluate(TestRuleThreadAndTestName.java:48)
	at org.apache.lucene.util.TestRuleIgnoreAfterMaxFailures$1.evaluate(TestRuleIgnoreAfterMaxFailures.java:64)
	at org.apache.lucene.util.TestRuleMarkFailure$1.evaluate(TestRuleMarkFailure.java:47)
	at com.carrotsearch.randomizedtesting.rules.StatementAdapter.evaluate(StatementAdapter.java:36)
	at com.carrotsearch.randomizedtesting.ThreadLeakControl$StatementRunner.run(ThreadLeakControl.java:368)
	at com.carrotsearch.randomizedtesting.ThreadLeakControl.forkTimeoutingTask(ThreadLeakControl.java:817)
	at com.carrotsearch.randomizedtesting.ThreadLeakControl$3.evaluate(ThreadLeakControl.java:468)
	at com.carrotsearch.randomizedtesting.RandomizedRunner.runSingleTest(RandomizedRunner.java:944)
	at com.carrotsearch.randomizedtesting.RandomizedRunner$5.evaluate(RandomizedRunner.java:830)
	at com.carrotsearch.randomizedtesting.RandomizedRunner$6.evaluate(RandomizedRunner.java:880)
	at com.carrotsearch.randomizedtesting.RandomizedRunner$7.evaluate(RandomizedRunner.java:891)
	at com.carrotsearch.randomizedtesting.rules.StatementAdapter.evaluate(StatementAdapter.java:36)
	at com.carrotsearch.randomizedtesting.rules.SystemPropertiesRestoreRule$1.evaluate(SystemPropertiesRestoreRule.java:57)
	at org.apache.lucene.util.AbstractBeforeAfterRule$1.evaluate(AbstractBeforeAfterRule.java:45)
	at com.carrotsearch.randomizedtesting.rules.StatementAdapter.evaluate(StatementAdapter.java:36)
	at org.apache.lucene.util.TestRuleStoreClassName$1.evaluate(TestRuleStoreClassName.java:41)
	at com.carrotsearch.randomizedtesting.rules.NoShadowingOrOverridesOnMethodsRule$1.evaluate(NoShadowingOrOverridesOnMethodsRule.java:40)
	at com.carrotsearch.randomizedtesting.rules.NoShadowingOrOverridesOnMethodsRule$1.evaluate(NoShadowingOrOverridesOnMethodsRule.java:40)
	at com.carrotsearch.randomizedtesting.rules.StatementAdapter.evaluate(StatementAdapter.java:36)
	at com.carrotsearch.randomizedtesting.rules.StatementAdapter.evaluate(StatementAdapter.java:36)
	at org.apache.lucene.util.TestRuleAssertionsRequired$1.evaluate(TestRuleAssertionsRequired.java:53)
	at org.apache.lucene.util.TestRuleMarkFailure$1.evaluate(TestRuleMarkFailure.java:47)
	at org.apache.lucene.util.TestRuleIgnoreAfterMaxFailures$1.evaluate(TestRuleIgnoreAfterMaxFailures.java:64)
	at org.apache.lucene.util.TestRuleIgnoreTestSuites$1.evaluate(TestRuleIgnoreTestSuites.java:54)
	at com.carrotsearch.randomizedtesting.rules.StatementAdapter.evaluate(StatementAdapter.java:36)
	at com.carrotsearch.randomizedtesting.ThreadLeakControl$StatementRunner.run(ThreadLeakControl.java:368)
	at java.base/java.lang.Thread.run(Thread.java:844)


FAILED:  org.apache.solr.cloud.autoscaling.TriggerSetPropertiesIntegrationTest.testSetProperties

Error Message:


Stack Trace:
java.lang.AssertionError
	at __randomizedtesting.SeedInfo.seed([F51A11C2AC8D0113:9E7EC68B1FA09497]:0)
	at org.junit.Assert.fail(Assert.java:92)
	at org.junit.Assert.assertTrue(Assert.java:43)
	at org.junit.Assert.assertTrue(Assert.java:54)
	at org.apache.solr.cloud.autoscaling.TriggerSetPropertiesIntegrationTest.testSetProperties(TriggerSetPropertiesIntegrationTest.java:111)
	at java.base/jdk.internal.reflect.NativeMethodAccessorImpl.invoke0(Native Method)
	at java.base/jdk.internal.reflect.NativeMethodAccessorImpl.invoke(NativeMethodAccessorImpl.java:62)
	at java.base/jdk.internal.reflect.DelegatingMethodAccessorImpl.invoke(DelegatingMethodAccessorImpl.java:43)
	at java.base/java.lang.reflect.Method.invoke(Method.java:564)
	at com.carrotsearch.randomizedtesting.RandomizedRunner.invoke(RandomizedRunner.java:1742)
	at com.carrotsearch.randomizedtesting.RandomizedRunner$8.evaluate(RandomizedRunner.java:935)
	at com.carrotsearch.randomizedtesting.RandomizedRunner$9.evaluate(RandomizedRunner.java:971)
	at com.carrotsearch.randomizedtesting.RandomizedRunner$10.evaluate(RandomizedRunner.java:985)
	at com.carrotsearch.randomizedtesting.rules.SystemPropertiesRestoreRule$1.evaluate(SystemPropertiesRestoreRule.java:57)
	at org.apache.lucene.util.TestRuleSetupTeardownChained$1.evaluate(TestRuleSetupTeardownChained.java:49)
	at org.apache.lucene.util.AbstractBeforeAfterRule$1.evaluate(AbstractBeforeAfterRule.java:45)
	at org.apache.lucene.util.TestRuleThreadAndTestName$1.evaluate(TestRuleThreadAndTestName.java:48)
	at org.apache.lucene.util.TestRuleIgnoreAfterMaxFailures$1.evaluate(TestRuleIgnoreAfterMaxFailures.java:64)
	at org.apache.lucene.util.TestRuleMarkFailure$1.evaluate(TestRuleMarkFailure.java:47)
	at com.carrotsearch.randomizedtesting.rules.StatementAdapter.evaluate(StatementAdapter.java:36)
	at com.carrotsearch.randomizedtesting.ThreadLeakControl$StatementRunner.run(ThreadLeakControl.java:368)
	at com.carrotsearch.randomizedtesting.ThreadLeakControl.forkTimeoutingTask(ThreadLeakControl.java:817)
	at com.carrotsearch.randomizedtesting.ThreadLeakControl$3.evaluate(ThreadLeakControl.java:468)
	at com.carrotsearch.randomizedtesting.RandomizedRunner.runSingleTest(RandomizedRunner.java:944)
	at com.carrotsearch.randomizedtesting.RandomizedRunner$5.evaluate(RandomizedRunner.java:830)
	at com.carrotsearch.randomizedtesting.RandomizedRunner$6.evaluate(RandomizedRunner.java:880)
	at com.carrotsearch.randomizedtesting.RandomizedRunner$7.evaluate(RandomizedRunner.java:891)
	at com.carrotsearch.randomizedtesting.rules.StatementAdapter.evaluate(StatementAdapter.java:36)
	at com.carrotsearch.randomizedtesting.rules.SystemPropertiesRestoreRule$1.evaluate(SystemPropertiesRestoreRule.java:57)
	at org.apache.lucene.util.AbstractBeforeAfterRule$1.evaluate(AbstractBeforeAfterRule.java:45)
	at com.carrotsearch.randomizedtesting.rules.StatementAdapter.evaluate(StatementAdapter.java:36)
	at org.apache.lucene.util.TestRuleStoreClassName$1.evaluate(TestRuleStoreClassName.java:41)
	at com.carrotsearch.randomizedtesting.rules.NoShadowingOrOverridesOnMethodsRule$1.evaluate(NoShadowingOrOverridesOnMethodsRule.java:40)
	at com.carrotsearch.randomizedtesting.rules.NoShadowingOrOverridesOnMethodsRule$1.evaluate(NoShadowingOrOverridesOnMethodsRule.java:40)
	at com.carrotsearch.randomizedtesting.rules.StatementAdapter.evaluate(StatementAdapter.java:36)
	at com.carrotsearch.randomizedtesting.rules.StatementAdapter.evaluate(StatementAdapter.java:36)
	at org.apache.lucene.util.TestRuleAssertionsRequired$1.evaluate(TestRuleAssertionsRequired.java:53)
	at org.apache.lucene.util.TestRuleMarkFailure$1.evaluate(TestRuleMarkFailure.java:47)
	at org.apache.lucene.util.TestRuleIgnoreAfterMaxFailures$1.evaluate(TestRuleIgnoreAfterMaxFailures.java:64)
	at org.apache.lucene.util.TestRuleIgnoreTestSuites$1.evaluate(TestRuleIgnoreTestSuites.java:54)
	at com.carrotsearch.randomizedtesting.rules.StatementAdapter.evaluate(StatementAdapter.java:36)
	at com.carrotsearch.randomizedtesting.ThreadLeakControl$StatementRunner.run(ThreadLeakControl.java:368)
	at java.base/java.lang.Thread.run(Thread.java:844)




Build Log:
[...truncated 1938 lines...]
   [junit4] JVM J1: stderr was not empty, see: C:\Users\jenkins\workspace\Lucene-Solr-7.x-Windows\lucene\build\core\test\temp\junit4-J1-20181031_103948_8599937736063088657456.syserr
   [junit4] >>> JVM J1 emitted unexpected output (verbatim) ----
   [junit4] OpenJDK 64-Bit Server VM warning: Option UseConcMarkSweepGC was deprecated in version 9.0 and will likely be removed in a future release.
   [junit4] <<< JVM J1: EOF ----

[...truncated 5 lines...]
   [junit4] JVM J0: stderr was not empty, see: C:\Users\jenkins\workspace\Lucene-Solr-7.x-Windows\lucene\build\core\test\temp\junit4-J0-20181031_103948_8601943067654348176976.syserr
   [junit4] >>> JVM J0 emitted unexpected output (verbatim) ----
   [junit4] OpenJDK 64-Bit Server VM warning: Option UseConcMarkSweepGC was deprecated in version 9.0 and will likely be removed in a future release.
   [junit4] <<< JVM J0: EOF ----

[...truncated 319 lines...]
   [junit4] JVM J1: stderr was not empty, see: C:\Users\jenkins\workspace\Lucene-Solr-7.x-Windows\lucene\build\test-framework\test\temp\junit4-J1-20181031_104531_2633278527155469195588.syserr
   [junit4] >>> JVM J1 emitted unexpected output (verbatim) ----
   [junit4] OpenJDK 64-Bit Server VM warning: Option UseConcMarkSweepGC was deprecated in version 9.0 and will likely be removed in a future release.
   [junit4] <<< JVM J1: EOF ----

   [junit4] JVM J0: stderr was not empty, see: C:\Users\jenkins\workspace\Lucene-Solr-7.x-Windows\lucene\build\test-framework\test\temp\junit4-J0-20181031_104531_2634612238528945308227.syserr
   [junit4] >>> JVM J0 emitted unexpected output (verbatim) ----
   [junit4] OpenJDK 64-Bit Server VM warning: Option UseConcMarkSweepGC was deprecated in version 9.0 and will likely be removed in a future release.
   [junit4] <<< JVM J0: EOF ----

[...truncated 1081 lines...]
   [junit4] JVM J1: stderr was not empty, see: C:\Users\jenkins\workspace\Lucene-Solr-7.x-Windows\lucene\build\analysis\common\test\temp\junit4-J1-20181031_104620_4516119740006011521802.syserr
   [junit4] >>> JVM J1 emitted unexpected output (verbatim) ----
   [junit4] OpenJDK 64-Bit Server VM warning: Option UseConcMarkSweepGC was deprecated in version 9.0 and will likely be removed in a future release.
   [junit4] <<< JVM J1: EOF ----

[...truncated 3 lines...]
   [junit4] JVM J0: stderr was not empty, see: C:\Users\jenkins\workspace\Lucene-Solr-7.x-Windows\lucene\build\analysis\common\test\temp\junit4-J0-20181031_104620_45114157506312599393331.syserr
   [junit4] >>> JVM J0 emitted unexpected output (verbatim) ----
   [junit4] OpenJDK 64-Bit Server VM warning: Option UseConcMarkSweepGC was deprecated in version 9.0 and will likely be removed in a future release.
   [junit4] <<< JVM J0: EOF ----

[...truncated 257 lines...]
   [junit4] JVM J0: stderr was not empty, see: C:\Users\jenkins\workspace\Lucene-Solr-7.x-Windows\lucene\build\analysis\icu\test\temp\junit4-J0-20181031_104827_40616544501121728313406.syserr
   [junit4] >>> JVM J0 emitted unexpected output (verbatim) ----
   [junit4] OpenJDK 64-Bit Server VM warning: Option UseConcMarkSweepGC was deprecated in version 9.0 and will likely be removed in a future release.
   [junit4] <<< JVM J0: EOF ----

[...truncated 3 lines...]
   [junit4] JVM J1: stderr was not empty, see: C:\Users\jenkins\workspace\Lucene-Solr-7.x-Windows\lucene\build\analysis\icu\test\temp\junit4-J1-20181031_104827_4065044220948224930287.syserr
   [junit4] >>> JVM J1 emitted unexpected output (verbatim) ----
   [junit4] OpenJDK 64-Bit Server VM warning: Option UseConcMarkSweepGC was deprecated in version 9.0 and will likely be removed in a future release.
   [junit4] <<< JVM J1: EOF ----

[...truncated 254 lines...]
   [junit4] JVM J1: stderr was not empty, see: C:\Users\jenkins\workspace\Lucene-Solr-7.x-Windows\lucene\build\analysis\kuromoji\test\temp\junit4-J1-20181031_104840_106166763821310788109.syserr
   [junit4] >>> JVM J1 emitted unexpected output (verbatim) ----
   [junit4] OpenJDK 64-Bit Server VM warning: Option UseConcMarkSweepGC was deprecated in version 9.0 and will likely be removed in a future release.
   [junit4] <<< JVM J1: EOF ----

[...truncated 3 lines...]
   [junit4] JVM J0: stderr was not empty, see: C:\Users\jenkins\workspace\Lucene-Solr-7.x-Windows\lucene\build\analysis\kuromoji\test\temp\junit4-J0-20181031_104840_1061166774326241729044.syserr
   [junit4] >>> JVM J0 emitted unexpected output (verbatim) ----
   [junit4] OpenJDK 64-Bit Server VM warning: Option UseConcMarkSweepGC was deprecated in version 9.0 and will likely be removed in a future release.
   [junit4] <<< JVM J0: EOF ----

[...truncated 163 lines...]
   [junit4] JVM J0: stderr was not empty, see: C:\Users\jenkins\workspace\Lucene-Solr-7.x-Windows\lucene\build\analysis\morfologik\test\temp\junit4-J0-20181031_104907_8773319666777849631490.syserr
   [junit4] >>> JVM J0 emitted unexpected output (verbatim) ----
   [junit4] OpenJDK 64-Bit Server VM warning: Option UseConcMarkSweepGC was deprecated in version 9.0 and will likely be removed in a future release.
   [junit4] <<< JVM J0: EOF ----

[...truncated 3 lines...]
   [junit4] JVM J1: stderr was not empty, see: C:\Users\jenkins\workspace\Lucene-Solr-7.x-Windows\lucene\build\analysis\morfologik\test\temp\junit4-J1-20181031_104907_8775141071236338795252.syserr
   [junit4] >>> JVM J1 emitted unexpected output (verbatim) ----
   [junit4] OpenJDK 64-Bit Server VM warning: Option UseConcMarkSweepGC was deprecated in version 9.0 and will likely be removed in a future release.
   [junit4] <<< JVM J1: EOF ----

[...truncated 208 lines...]
   [junit4] JVM J0: stderr was not empty, see: C:\Users\jenkins\workspace\Lucene-Solr-7.x-Windows\lucene\build\analysis\nori\test\temp\junit4-J0-20181031_104912_19514628804356667238605.syserr
   [junit4] >>> JVM J0 emitted unexpected output (verbatim) ----
   [junit4] OpenJDK 64-Bit Server VM warning: Option UseConcMarkSweepGC was deprecated in version 9.0 and will likely be removed in a future release.
   [junit4] <<< JVM J0: EOF ----

[...truncated 3 lines...]
   [junit4] JVM J1: stderr was not empty, see: C:\Users\jenkins\workspace\Lucene-Solr-7.x-Windows\lucene\build\analysis\nori\test\temp\junit4-J1-20181031_104912_19512101336300109119797.syserr
   [junit4] >>> JVM J1 emitted unexpected output (verbatim) ----
   [junit4] OpenJDK 64-Bit Server VM warning: Option UseConcMarkSweepGC was deprecated in version 9.0 and will likely be removed in a future release.
   [junit4] <<< JVM J1: EOF ----

[...truncated 169 lines...]
   [junit4] JVM J0: stderr was not empty, see: C:\Users\jenkins\workspace\Lucene-Solr-7.x-Windows\lucene\build\analysis\opennlp\test\temp\junit4-J0-20181031_104921_21217276578094755237276.syserr
   [junit4] >>> JVM J0 emitted unexpected output (verbatim) ----
   [junit4] OpenJDK 64-Bit Server VM warning: Option UseConcMarkSweepGC was deprecated in version 9.0 and will likely be removed in a future release.
   [junit4] <<< JVM J0: EOF ----

[...truncated 3 lines...]
   [junit4] JVM J1: stderr was not empty, see: C:\Users\jenkins\workspace\Lucene-Solr-7.x-Windows\lucene\build\analysis\opennlp\test\temp\junit4-J1-20181031_104921_21210126116819131735062.syserr
   [junit4] >>> JVM J1 emitted unexpected output (verbatim) ----
   [junit4] OpenJDK 64-Bit Server VM warning: Option UseConcMarkSweepGC was deprecated in version 9.0 and will likely be removed in a future release.
   [junit4] <<< JVM J1: EOF ----

[...truncated 180 lines...]
   [junit4] JVM J0: stderr was not empty, see: C:\Users\jenkins\workspace\Lucene-Solr-7.x-Windows\lucene\build\analysis\phonetic\test\temp\junit4-J0-20181031_104924_53177018329901725925.syserr
   [junit4] >>> JVM J0 emitted unexpected output (verbatim) ----
   [junit4] OpenJDK 64-Bit Server VM warning: Option UseConcMarkSweepGC was deprecated in version 9.0 and will likely be removed in a future release.
   [junit4] <<< JVM J0: EOF ----

   [junit4] JVM J1: stderr was not empty, see: C:\Users\jenkins\workspace\Lucene-Solr-7.x-Windows\lucene\build\analysis\phonetic\test\temp\junit4-J1-20181031_104924_5315413706710295880803.syserr
   [junit4] >>> JVM J1 emitted unexpected output (verbatim) ----
   [junit4] OpenJDK 64-Bit Server VM warning: Option UseConcMarkSweepGC was deprecated in version 9.0 and will likely be removed in a future release.
   [junit4] <<< JVM J1: EOF ----

[...truncated 160 lines...]
   [junit4] JVM J0: stderr was not empty, see: C:\Users\jenkins\workspace\Lucene-Solr-7.x-Windows\lucene\build\analysis\smartcn\test\temp\junit4-J0-20181031_104932_0185678397237641540463.syserr
   [junit4] >>> JVM J0 emitted unexpected output (verbatim) ----
   [junit4] OpenJDK 64-Bit Server VM warning: Option UseConcMarkSweepGC was deprecated in version 9.0 and will likely be removed in a future release.
   [junit4] <<< JVM J0: EOF ----

[...truncated 3 lines...]
   [junit4] JVM J1: stderr was not empty, see: C:\Users\jenkins\workspace\Lucene-Solr-7.x-Windows\lucene\build\analysis\smartcn\test\temp\junit4-J1-20181031_104932_0181936234888873641829.syserr
   [junit4] >>> JVM J1 emitted unexpected output (verbatim) ----
   [junit4] OpenJDK 64-Bit Server VM warning: Option UseConcMarkSweepGC was deprecated in version 9.0 and will likely be removed in a future release.
   [junit4] <<< JVM J1: EOF ----

[...truncated 168 lines...]
   [junit4] JVM J0: stderr was not empty, see: C:\Users\jenkins\workspace\Lucene-Solr-7.x-Windows\lucene\build\analysis\stempel\test\temp\junit4-J0-20181031_104937_2822029592574567708667.syserr
   [junit4] >>> JVM J0 emitted unexpected output (verbatim) ----
   [junit4] OpenJDK 64-Bit Server VM warning: Option UseConcMarkSweepGC was deprecated in version 9.0 and will likely be removed in a future release.
   [junit4] <<< JVM J0: EOF ----

   [junit4] JVM J1: stderr was not empty, see: C:\Users\jenkins\workspace\Lucene-Solr-7.x-Windows\lucene\build\analysis\stempel\test\temp\junit4-J1-20181031_104937_2822825105284978426045.syserr
   [junit4] >>> JVM J1 emitted unexpected output (verbatim) ----
   [junit4] OpenJDK 64-Bit Server VM warning: Option UseConcMarkSweepGC was deprecated in version 9.0 and will likely be removed in a future release.
   [junit4] <<< JVM J1: EOF ----

[...truncated 204 lines...]
   [junit4] JVM J0: stderr was not empty, see: C:\Users\jenkins\workspace\Lucene-Solr-7.x-Windows\lucene\build\backward-codecs\test\temp\junit4-J0-20181031_104941_28210787006830296436187.syserr
   [junit4] >>> JVM J0 emitted unexpected output (verbatim) ----
   [junit4] OpenJDK 64-Bit Server VM warning: Option UseConcMarkSweepGC was deprecated in version 9.0 and will likely be removed in a future release.
   [junit4] <<< JVM J0: EOF ----

[...truncated 28 lines...]
   [junit4] JVM J1: stderr was not empty, see: C:\Users\jenkins\workspace\Lucene-Solr-7.x-Windows\lucene\build\backward-codecs\test\temp\junit4-J1-20181031_104941_28016765940708645278221.syserr
   [junit4] >>> JVM J1 emitted unexpected output (verbatim) ----
   [junit4] OpenJDK 64-Bit Server VM warning: Option UseConcMarkSweepGC was deprecated in version 9.0 and will likely be removed in a future release.
   [junit4] <<< JVM J1: EOF ----

[...truncated 1570 lines...]
   [junit4] JVM J0: stderr was not empty, see: C:\Users\jenkins\workspace\Lucene-Solr-7.x-Windows\lucene\build\benchmark\test\temp\junit4-J0-20181031_105101_8888305730984112274814.syserr
   [junit4] >>> JVM J0 emitted unexpected output (verbatim) ----
   [junit4] OpenJDK 64-Bit Server VM warning: Option UseConcMarkSweepGC was deprecated in version 9.0 and will likely be removed in a future release.
   [junit4] <<< JVM J0: EOF ----

   [junit4] JVM J1: stderr was not empty, see: C:\Users\jenkins\workspace\Lucene-Solr-7.x-Windows\lucene\build\benchmark\test\temp\junit4-J1-20181031_105101_8886905445798538483990.syserr
   [junit4] >>> JVM J1 emitted unexpected output (verbatim) ----
   [junit4] OpenJDK 64-Bit Server VM warning: Option UseConcMarkSweepGC was deprecated in version 9.0 and will likely be removed in a future release.
   [junit4] <<< JVM J1: EOF ----

[...truncated 252 lines...]
   [junit4] JVM J0: stderr was not empty, see: C:\Users\jenkins\workspace\Lucene-Solr-7.x-Windows\lucene\build\classification\test\temp\junit4-J0-20181031_105111_9608819393424140276244.syserr
   [junit4] >>> JVM J0 emitted unexpected output (verbatim) ----
   [junit4] OpenJDK 64-Bit Server VM warning: Option UseConcMarkSweepGC was deprecated in version 9.0 and will likely be removed in a future release.
   [junit4] <<< JVM J0: EOF ----

[...truncated 3 lines...]
   [junit4] JVM J1: stderr was not empty, see: C:\Users\jenkins\workspace\Lucene-Solr-7.x-Windows\lucene\build\classification\test\temp\junit4-J1-20181031_105111_9608367316659692167987.syserr
   [junit4] >>> JVM J1 emitted unexpected output (verbatim) ----
   [junit4] OpenJDK 64-Bit Server VM warning: Option UseConcMarkSweepGC was deprecated in version 9.0 and will likely be removed in a future release.
   [junit4] <<< JVM J1: EOF ----

[...truncated 268 lines...]
   [junit4] JVM J1: stderr was not empty, see: C:\Users\jenkins\workspace\Lucene-Solr-7.x-Windows\lucene\build\codecs\test\temp\junit4-J1-20181031_105123_16212308206356714431506.syserr
   [junit4] >>> JVM J1 emitted unexpected output (verbatim) ----
   [junit4] OpenJDK 64-Bit Server VM warning: Option UseConcMarkSweepGC was deprecated in version 9.0 and will likely be removed in a future release.
   [junit4] <<< JVM J1: EOF ----

[...truncated 3 lines...]
   [junit4] JVM J0: stderr was not empty, see: C:\Users\jenkins\workspace\Lucene-Solr-7.x-Windows\lucene\build\codecs\test\temp\junit4-J0-20181031_105123_1617149901540963085649.syserr
   [junit4] >>> JVM J0 emitted unexpected output (verbatim) ----
   [junit4] OpenJDK 64-Bit Server VM warning: Option UseConcMarkSweepGC was deprecated in version 9.0 and will likely be removed in a future release.
   [junit4] <<< JVM J0: EOF ----

[...truncated 235 lines...]
   [junit4] JVM J0: stderr was not empty, see: C:\Users\jenkins\workspace\Lucene-Solr-7.x-Windows\lucene\build\demo\test\temp\junit4-J0-20181031_105238_1398698464977105741485.syserr
   [junit4] >>> JVM J0 emitted unexpected output (verbatim) ----
   [junit4] OpenJDK 64-Bit Server VM warning: Option UseConcMarkSweepGC was deprecated in version 9.0 and will likely be removed in a future release.
   [junit4] <<< JVM J0: EOF ----

   [junit4] JVM J1: stderr was not empty, see: C:\Users\jenkins\workspace\Lucene-Solr-7.x-Windows\lucene\build\demo\test\temp\junit4-J1-20181031_105238_1392104865335053429207.syserr
   [junit4] >>> JVM J1 emitted unexpected output (verbatim) ----
   [junit4] OpenJDK 64-Bit Server VM warning: Option UseConcMarkSweepGC was deprecated in version 9.0 and will likely be removed in a future release.
   [junit4] <<< JVM J1: EOF ----

[...truncated 177 lines...]
   [junit4] JVM J0: stderr was not empty, see: C:\Users\jenkins\workspace\Lucene-Solr-7.x-Windows\lucene\build\expressions\test\temp\junit4-J0-20181031_105243_77012459966920643542933.syserr
   [junit4] >>> JVM J0 emitted unexpected output (verbatim) ----
   [junit4] OpenJDK 64-Bit Server VM warning: Option UseConcMarkSweepGC was deprecated in version 9.0 and will likely be removed in a future release.
   [junit4] <<< JVM J0: EOF ----

   [junit4] JVM J1: stderr was not empty, see: C:\Users\jenkins\workspace\Lucene-Solr-7.x-Windows\lucene\build\expressions\test\temp\junit4-J1-20181031_105243_77014876200019253235288.syserr
   [junit4] >>> JVM J1 emitted unexpected output (verbatim) ----
   [junit4] OpenJDK 64-Bit Server VM warning: Option UseConcMarkSweepGC was deprecated in version 9.0 and will likely be removed in a future release.
   [junit4] <<< JVM J1: EOF ----

[...truncated 235 lines...]
   [junit4] JVM J1: stderr was not empty, see: C:\Users\jenkins\workspace\Lucene-Solr-7.x-Windows\lucene\build\facet\test\temp\junit4-J1-20181031_105253_03112326031838730599879.syserr
   [junit4] >>> JVM J1 emitted unexpected output (verbatim) ----
   [junit4] OpenJDK 64-Bit Server VM warning: Option UseConcMarkSweepGC was deprecated in version 9.0 and will likely be removed in a future release.
   [junit4] <<< JVM J1: EOF ----

[...truncated 3 lines...]
   [junit4] JVM J0: stderr was not empty, see: C:\Users\jenkins\workspace\Lucene-Solr-7.x-Windows\lucene\build\facet\test\temp\junit4-J0-20181031_105253_0319897298303446285375.syserr
   [junit4] >>> JVM J0 emitted unexpected output (verbatim) ----
   [junit4] OpenJDK 64-Bit Server VM warning: Option UseConcMarkSweepGC was deprecated in version 9.0 and will likely be removed in a future release.
   [junit4] <<< JVM J0: EOF ----

[...truncated 183 lines...]
   [junit4] JVM J0: stderr was not empty, see: C:\Users\jenkins\workspace\Lucene-Solr-7.x-Windows\lucene\build\grouping\test\temp\junit4-J0-20181031_105329_2239541045559908734052.syserr
   [junit4] >>> JVM J0 emitted unexpected output (verbatim) ----
   [junit4] OpenJDK 64-Bit Server VM warning: Option UseConcMarkSweepGC was deprecated in version 9.0 and will likely be removed in a future release.
   [junit4] <<< JVM J0: EOF ----

[...truncated 3 lines...]
   [junit4] JVM J1: stderr was not empty, see: C:\Users\jenkins\workspace\Lucene-Solr-7.x-Windows\lucene\build\grouping\test\temp\junit4-J1-20181031_105329_22312458627451506019897.syserr
   [junit4] >>> JVM J1 emitted unexpected output (verbatim) ----
   [junit4] OpenJDK 64-Bit Server VM warning: Option UseConcMarkSweepGC was deprecated in version 9.0 and will likely be removed in a future release.
   [junit4] <<< JVM J1: EOF ----

[...truncated 249 lines...]
   [junit4] JVM J0: stderr was not empty, see: C:\Users\jenkins\workspace\Lucene-Solr-7.x-Windows\lucene\build\highlighter\test\temp\junit4-J0-20181031_105338_0191012372231024852473.syserr
   [junit4] >>> JVM J0 emitted unexpected output (verbatim) ----
   [junit4] OpenJDK 64-Bit Server VM warning: Option UseConcMarkSweepGC was deprecated in version 9.0 and will likely be removed in a future release.
   [junit4] <<< JVM J0: EOF ----

[...truncated 3 lines...]
   [junit4] JVM J1: stderr was not empty, see: C:\Users\jenkins\workspace\Lucene-Solr-7.x-Windows\lucene\build\highlighter\test\temp\junit4-J1-20181031_105338_0195465708694301740329.syserr
   [junit4] >>> JVM J1 emitted unexpected output (verbatim) ----
   [junit4] OpenJDK 64-Bit Server VM warning: Option UseConcMarkSweepGC was deprecated in version 9.0 and will likely be removed in a future release.
   [junit4] <<< JVM J1: EOF ----

[...truncated 167 lines...]
   [junit4] JVM J0: stderr was not empty, see: C:\Users\jenkins\workspace\Lucene-Solr-7.x-Windows\lucene\build\join\test\temp\junit4-J0-20181031_105356_8225474024725336780951.syserr
   [junit4] >>> JVM J0 emitted unexpected output (verbatim) ----
   [junit4] OpenJDK 64-Bit Server VM warning: Option UseConcMarkSweepGC was deprecated in version 9.0 and will likely be removed in a future release.
   [junit4] <<< JVM J0: EOF ----

[...truncated 3 lines...]
   [junit4] JVM J1: stderr was not empty, see: C:\Users\jenkins\workspace\Lucene-Solr-7.x-Windows\lucene\build\join\test\temp\junit4-J1-20181031_105356_82217082129656672448128.syserr
   [junit4] >>> JVM J1 emitted unexpected output (verbatim) ----
   [junit4] OpenJDK 64-Bit Server VM warning: Option UseConcMarkSweepGC was deprecated in version 9.0 and will likely be removed in a future release.
   [junit4] <<< JVM J1: EOF ----

[...truncated 156 lines...]
   [junit4] JVM J0: stderr was not empty, see: C:\Users\jenkins\workspace\Lucene-Solr-7.x-Windows\lucene\build\memory\test\temp\junit4-J0-20181031_105405_07918334056125151480576.syserr
   [junit4] >>> JVM J0 emitted unexpected output (verbatim) ----
   [junit4] OpenJDK 64-Bit Server VM warning: Option UseConcMarkSweepGC was deprecated in version 9.0 and will likely be removed in a future release.
   [junit4] <<< JVM J0: EOF ----

[...truncated 3 lines...]
   [junit4] JVM J1: stderr was not empty, see: C:\Users\jenkins\workspace\Lucene-Solr-7.x-Windows\lucene\build\memory\test\temp\junit4-J1-20181031_105405_079258000844004396787.syserr
   [junit4] >>> JVM J1 emitted unexpected output (verbatim) ----
   [junit4] OpenJDK 64-Bit Server VM warning: Option UseConcMarkSweepGC was deprecated in version 9.0 and will likely be removed in a future release.
   [junit4] <<< JVM J1: EOF ----

[...truncated 196 lines...]
   [junit4] JVM J1: stderr was not empty, see: C:\Users\jenkins\workspace\Lucene-Solr-7.x-Windows\lucene\build\misc\test\temp\junit4-J1-20181031_105410_1897047216792877336961.syserr
   [junit4] >>> JVM J1 emitted unexpected output (verbatim) ----
   [junit4] OpenJDK 64-Bit Server VM warning: Option UseConcMarkSweepGC was deprecated in version 9.0 and will likely be removed in a future release.
   [junit4] <<< JVM J1: EOF ----

[...truncated 3 lines...]
   [junit4] JVM J0: stderr was not empty, see: C:\Users\jenkins\workspace\Lucene-Solr-7.x-Windows\lucene\build\misc\test\temp\junit4-J0-20181031_105410_18912448182659850898131.syserr
   [junit4] >>> JVM J0 emitted unexpected output (verbatim) ----
   [junit4] OpenJDK 64-Bit Server VM warning: Option UseConcMarkSweepGC was deprecated in version 9.0 and will likely be removed in a future release.
   [junit4] <<< JVM J0: EOF ----

[...truncated 342 lines...]
   [junit4] JVM J0: stderr was not empty, see: C:\Users\jenkins\workspace\Lucene-Solr-7.x-Windows\lucene\build\queries\test\temp\junit4-J0-20181031_105423_4047641682271861193718.syserr
   [junit4] >>> JVM J0 emitted unexpected output (verbatim) ----
   [junit4] OpenJDK 64-Bit Server VM warning: Option UseConcMarkSweepGC was deprecated in version 9.0 and will likely be removed in a future release.
   [junit4] <<< JVM J0: EOF ----

   [junit4] JVM J1: stderr was not empty, see: C:\Users\jenkins\workspace\Lucene-Solr-7.x-Windows\lucene\build\queries\test\temp\junit4-J1-20181031_105423_40416648901305995374044.syserr
   [junit4] >>> JVM J1 emitted unexpected output (verbatim) ----
   [junit4] OpenJDK 64-Bit Server VM warning: Option UseConcMarkSweepGC was deprecated in version 9.0 and will likely be removed in a future release.
   [junit4] <<< JVM J1: EOF ----

[...truncated 235 lines...]
   [junit4] JVM J0: stderr was not empty, see: C:\Users\jenkins\workspace\Lucene-Solr-7.x-Windows\lucene\build\queryparser\test\temp\junit4-J0-20181031_105429_98012945469149708100659.syserr
   [junit4] >>> JVM J0 emitted unexpected output (verbatim) ----
   [junit4] OpenJDK 64-Bit Server VM warning: Option UseConcMarkSweepGC was deprecated in version 9.0 and will likely be removed in a future release.
   [junit4] <<< JVM J0: EOF ----

   [junit4] JVM J1: stderr was not empty, see: C:\Users\jenkins\workspace\Lucene-Solr-7.x-Windows\lucene\build\queryparser\test\temp\junit4-J1-20181031_105429_98016303651105918148519.syserr
   [junit4] >>> JVM J1 emitted unexpected output (verbatim) ----
   [junit4] OpenJDK 64-Bit Server VM warning: Option UseConcMarkSweepGC was deprecated in version 9.0 and will likely be removed in a future release.
   [junit4] <<< JVM J1: EOF ----

[...truncated 217 lines...]
   [junit4] JVM J1: stderr was not empty, see: C:\Users\jenkins\workspace\Lucene-Solr-7.x-Windows\lucene\build\replicator\test\temp\junit4-J1-20181031_105435_1684323941349579044336.syserr
   [junit4] >>> JVM J1 emitted unexpected output (verbatim) ----
   [junit4] OpenJDK 64-Bit Server VM warning: Option UseConcMarkSweepGC was deprecated in version 9.0 and will likely be removed in a future release.
   [junit4] <<< JVM J1: EOF ----

[...truncated 3 lines...]
   [junit4] JVM J0: stderr was not empty, see: C:\Users\jenkins\workspace\Lucene-Solr-7.x-Windows\lucene\build\replicator\test\temp\junit4-J0-20181031_105435_1689436795858650924595.syserr
   [junit4] >>> JVM J0 emitted unexpected output (verbatim) ----
   [junit4] OpenJDK 64-Bit Server VM warning: Option UseConcMarkSweepGC was deprecated in version 9.0 and will likely be removed in a future release.
   [junit4] <<< JVM J0: EOF ----

[...truncated 215 lines...]
   [junit4] JVM J1: stderr was not empty, see: C:\Users\jenkins\workspace\Lucene-Solr-7.x-Windows\lucene\build\sandbox\test\temp\junit4-J1-20181031_105446_5746823538105362604520.syserr
   [junit4] >>> JVM J1 emitted unexpected output (verbatim) ----
   [junit4] OpenJDK 64-Bit Server VM warning: Option UseConcMarkSweepGC was deprecated in version 9.0 and will likely be removed in a future release.
   [junit4] <<< JVM J1: EOF ----

[...truncated 5 lines...]
   [junit4] JVM J0: stderr was not empty, see: C:\Users\jenkins\workspace\Lucene-Solr-7.x-Windows\lucene\build\sandbox\test\temp\junit4-J0-20181031_105446_57411881022638037210962.syserr
   [junit4] >>> JVM J0 emitted unexpected output (verbatim) ----
   [junit4] OpenJDK 64-Bit Server VM warning: Option UseConcMarkSweepGC was deprecated in version 9.0 and will likely be removed in a future release.
   [junit4] <<< JVM J0: EOF ----

[...truncated 300 lines...]
   [junit4] JVM J1: stderr was not empty, see: C:\Users\jenkins\workspace\Lucene-Solr-7.x-Windows\lucene\build\spatial-extras\test\temp\junit4-J1-20181031_105644_7156320046768563312114.syserr
   [junit4] >>> JVM J1 emitted unexpected output (verbatim) ----
   [junit4] OpenJDK 64-Bit Server VM warning: Option UseConcMarkSweepGC was deprecated in version 9.0 and will likely be removed in a future release.
   [junit4] <<< JVM J1: EOF ----

[...truncated 3 lines...]
   [junit4] JVM J0: stderr was not empty, see: C:\Users\jenkins\workspace\Lucene-Solr-7.x-Windows\lucene\build\spatial-extras\test\temp\junit4-J0-20181031_105644_7153568060533336592215.syserr
   [junit4] >>> JVM J0 emitted unexpected output (verbatim) ----
   [junit4] OpenJDK 64-Bit Server VM warning: Option UseConcMarkSweepGC was deprecated in version 9.0 and will likely be removed in a future release.
   [junit4] <<< JVM J0: EOF ----

[...truncated 193 lines...]
   [junit4] JVM J1: stderr was not empty, see: C:\Users\jenkins\workspace\Lucene-Solr-7.x-Windows\lucene\build\spatial3d\test\temp\junit4-J1-20181031_105725_30412866490978278711820.syserr
   [junit4] >>> JVM J1 emitted unexpected output (verbatim) ----
   [junit4] OpenJDK 64-Bit Server VM warning: Option UseConcMarkSweepGC was deprecated in version 9.0 and will likely be removed in a future release.
   [junit4] <<< JVM J1: EOF ----

[...truncated 5 lines...]
   [junit4] JVM J0: stderr was not empty, see: C:\Users\jenkins\workspace\Lucene-Solr-7.x-Windows\lucene\build\spatial3d\test\temp\junit4-J0-20181031_105725_3012743426350732579043.syserr
   [junit4] >>> JVM J0 emitted unexpected output (verbatim) ----
   [junit4] OpenJDK 64-Bit Server VM warning: Option UseConcMarkSweepGC was deprecated in version 9.0 and will likely be removed in a future release.
   [junit4] <<< JVM J0: EOF ----

[...truncated 152 lines...]
   [junit4] JVM J0: stderr was not empty, see: C:\Users\jenkins\workspace\Lucene-Solr-7.x-Windows\lucene\build\spatial\test\temp\junit4-J0-20181031_105750_84213864309768215404636.syserr
   [junit4] >>> JVM J0 emitted unexpected output (verbatim) ----
   [junit4] OpenJDK 64-Bit Server VM warning: Option UseConcMarkSweepGC was deprecated in version 9.0 and will likely be removed in a future release.
   [junit4] <<< JVM J0: EOF ----

[...truncated 256 lines...]
   [junit4] JVM J0: stderr was not empty, see: C:\Users\jenkins\workspace\Lucene-Solr-7.x-Windows\lucene\build\suggest\test\temp\junit4-J0-20181031_105756_4564519579837529631496.syserr
   [junit4] >>> JVM J0 emitted unexpected output (verbatim) ----
   [junit4] OpenJDK 64-Bit Server VM warning: Option UseConcMarkSweepGC was deprecated in version 9.0 and will likely be removed in a future release.
   [junit4] <<< JVM J0: EOF ----

[...truncated 3 lines...]
   [junit4] JVM J1: stderr was not empty, see: C:\Users\jenkins\workspace\Lucene-Solr-7.x-Windows\lucene\build\suggest\test\temp\junit4-J1-20181031_105756_4569178407366620267907.syserr
   [junit4] >>> JVM J1 emitted unexpected output (verbatim) ----
   [junit4] OpenJDK 64-Bit Server VM warning: Option UseConcMarkSweepGC was deprecated in version 9.0 and will likely be removed in a future release.
   [junit4] <<< JVM J1: EOF ----

[...truncated 3708 lines...]
   [junit4] Suite: org.apache.solr.cloud.autoscaling.TriggerSetPropertiesIntegrationTest
   [junit4]   2> Creating dataDir: C:\Users\jenkins\workspace\Lucene-Solr-7.x-Windows\solr\build\solr-core\test\J0\temp\solr.cloud.autoscaling.TriggerSetPropertiesIntegrationTest_F51A11C2AC8D0113-001\init-core-data-001
   [junit4]   2> 3084419 INFO  (SUITE-TriggerSetPropertiesIntegrationTest-seed#[F51A11C2AC8D0113]-worker) [    ] o.a.s.SolrTestCaseJ4 Using PointFields (NUMERIC_POINTS_SYSPROP=true) w/NUMERIC_DOCVALUES_SYSPROP=true
   [junit4]   2> 3084420 INFO  (SUITE-TriggerSetPropertiesIntegrationTest-seed#[F51A11C2AC8D0113]-worker) [    ] o.a.s.SolrTestCaseJ4 Randomized ssl (false) and clientAuth (false) via: @org.apache.solr.util.RandomizeSSL(reason="", value=0.0/0.0, ssl=0.0/0.0, clientAuth=0.0/0.0)
   [junit4]   2> 3084420 INFO  (SUITE-TriggerSetPropertiesIntegrationTest-seed#[F51A11C2AC8D0113]-worker) [    ] o.a.s.SolrTestCaseJ4 SecureRandom sanity checks: test.solr.allowed.securerandom=null & java.security.egd=file:/dev/./urandom
   [junit4]   2> 3084422 INFO  (SUITE-TriggerSetPropertiesIntegrationTest-seed#[F51A11C2AC8D0113]-worker) [    ] o.a.s.c.MiniSolrCloudCluster Starting cluster of 2 servers in C:\Users\jenkins\workspace\Lucene-Solr-7.x-Windows\solr\build\solr-core\test\J0\temp\solr.cloud.autoscaling.TriggerSetPropertiesIntegrationTest_F51A11C2AC8D0113-001\tempDir-001
   [junit4]   2> 3084422 INFO  (SUITE-TriggerSetPropertiesIntegrationTest-seed#[F51A11C2AC8D0113]-worker) [    ] o.a.s.c.ZkTestServer STARTING ZK TEST SERVER
   [junit4]   2> 3084423 INFO  (Thread-4802) [    ] o.a.s.c.ZkTestServer client port:0.0.0.0/0.0.0.0:0
   [junit4]   2> 3084423 INFO  (Thread-4802) [    ] o.a.s.c.ZkTestServer Starting server
   [junit4]   2> 3084426 ERROR (Thread-4802) [    ] o.a.z.s.ZooKeeperServer ZKShutdownHandler is not registered, so ZooKeeper server won't take any action on ERROR or SHUTDOWN server state changes
   [junit4]   2> 3084521 INFO  (SUITE-TriggerSetPropertiesIntegrationTest-seed#[F51A11C2AC8D0113]-worker) [    ] o.a.s.c.ZkTestServer start zk server on port:64765
   [junit4]   2> 3084524 INFO  (zkConnectionManagerCallback-10537-thread-1) [    ] o.a.s.c.c.ConnectionManager zkClient has connected
   [junit4]   2> 3084527 INFO  (jetty-launcher-10534-thread-2) [    ] o.e.j.s.Server jetty-9.4.11.v20180605; built: 2018-06-05T18:24:03.829Z; git: d5fc0523cfa96bfebfbda19606cad384d772f04c; jvm 9.0.4+11
   [junit4]   2> 3084527 INFO  (jetty-launcher-10534-thread-1) [    ] o.e.j.s.Server jetty-9.4.11.v20180605; built: 2018-06-05T18:24:03.829Z; git: d5fc0523cfa96bfebfbda19606cad384d772f04c; jvm 9.0.4+11
   [junit4]   2> 3084528 INFO  (jetty-launcher-10534-thread-2) [    ] o.e.j.s.session DefaultSessionIdManager workerName=node0
   [junit4]   2> 3084528 INFO  (jetty-launcher-10534-thread-2) [    ] o.e.j.s.session No SessionScavenger set, using defaults
   [junit4]   2> 3084528 INFO  (jetty-launcher-10534-thread-2) [    ] o.e.j.s.session node0 Scavenging every 600000ms
   [junit4]   2> 3084528 INFO  (jetty-launcher-10534-thread-2) [    ] o.e.j.s.h.ContextHandler Started o.e.j.s.ServletContextHandler@76ae4963{/solr,null,AVAILABLE}
   [junit4]   2> 3084528 INFO  (jetty-launcher-10534-thread-1) [    ] o.e.j.s.session DefaultSessionIdManager workerName=node0
   [junit4]   2> 3084528 INFO  (jetty-launcher-10534-thread-1) [    ] o.e.j.s.session No SessionScavenger set, using defaults
   [junit4]   2> 3084528 INFO  (jetty-launcher-10534-thread-1) [    ] o.e.j.s.session node0 Scavenging every 600000ms
   [junit4]   2> 3084528 INFO  (jetty-launcher-10534-thread-1) [    ] o.e.j.s.h.ContextHandler Started o.e.j.s.ServletContextHandler@6bdca772{/solr,null,AVAILABLE}
   [junit4]   2> 3084531 INFO  (jetty-launcher-10534-thread-1) [    ] o.e.j.s.AbstractConnector Started ServerConnector@2c3b427{HTTP/1.1,[http/1.1]}{127.0.0.1:?????}
   [junit4]   2> 3084531 INFO  (jetty-launcher-10534-thread-1) [    ] o.e.j.s.Server Started @???????ms
   [junit4]   2> 3084531 INFO  (jetty-launcher-10534-thread-2) [    ] o.e.j.s.AbstractConnector Started ServerConnector@3749ffcf{HTTP/1.1,[http/1.1]}{127.0.0.1:?????}
   [junit4]   2> 3084531 INFO  (jetty-launcher-10534-thread-2) [    ] o.e.j.s.Server Started @???????ms
   [junit4]   2> 3084531 INFO  (jetty-launcher-10534-thread-1) [    ] o.a.s.c.s.e.JettySolrRunner Jetty properties: {hostContext=/solr, hostPort=64771}
   [junit4]   2> 3084531 INFO  (jetty-launcher-10534-thread-2) [    ] o.a.s.c.s.e.JettySolrRunner Jetty properties: {hostContext=/solr, hostPort=64769}
   [junit4]   2> 3084531 ERROR (jetty-launcher-10534-thread-2) [    ] o.a.s.u.StartupLoggingUtils Missing Java Option solr.log.dir. Logging may be missing or incomplete.
   [junit4]   2> 3084531 INFO  (jetty-launcher-10534-thread-2) [    ] o.a.s.s.SolrDispatchFilter Using logger factory org.apache.logging.slf4j.Log4jLoggerFactory
   [junit4]   2> 3084531 ERROR (jetty-launcher-10534-thread-1) [    ] o.a.s.u.StartupLoggingUtils Missing Java Option solr.log.dir. Logging may be missing or incomplete.
   [junit4]   2> 3084532 INFO  (jetty-launcher-10534-thread-1) [    ] o.a.s.s.SolrDispatchFilter Using logger factory org.apache.logging.slf4j.Log4jLoggerFactory
   [junit4]   2> 3084532 INFO  (jetty-launcher-10534-thread-2) [    ] o.a.s.s.SolrDispatchFilter  ___      _       Welcome to Apache Solr? version 7.6.0
   [junit4]   2> 3084532 INFO  (jetty-launcher-10534-thread-1) [    ] o.a.s.s.SolrDispatchFilter  ___      _       Welcome to Apache Solr? version 7.6.0
   [junit4]   2> 3084532 INFO  (jetty-launcher-10534-thread-2) [    ] o.a.s.s.SolrDispatchFilter / __| ___| |_ _   Starting in cloud mode on port null
   [junit4]   2> 3084532 INFO  (jetty-launcher-10534-thread-2) [    ] o.a.s.s.SolrDispatchFilter \__ \/ _ \ | '_|  Install dir: null
   [junit4]   2> 3084532 INFO  (jetty-launcher-10534-thread-1) [    ] o.a.s.s.SolrDispatchFilter / __| ___| |_ _   Starting in cloud mode on port null
   [junit4]   2> 3084532 INFO  (jetty-launcher-10534-thread-2) [    ] o.a.s.s.SolrDispatchFilter |___/\___/_|_|    Start time: 2018-10-31T11:51:27.381784600Z
   [junit4]   2> 3084532 INFO  (jetty-launcher-10534-thread-1) [    ] o.a.s.s.SolrDispatchFilter \__ \/ _ \ | '_|  Install dir: null
   [junit4]   2> 3084532 INFO  (jetty-launcher-10534-thread-1) [    ] o.a.s.s.SolrDispatchFilter |___/\___/_|_|    Start time: 2018-10-31T11:51:27.381784600Z
   [junit4]   2> 3084534 INFO  (zkConnectionManagerCallback-10541-thread-1) [    ] o.a.s.c.c.ConnectionManager zkClient has connected
   [junit4]   2> 3084535 INFO  (zkConnectionManagerCallback-10539-thread-1) [    ] o.a.s.c.c.ConnectionManager zkClient has connected
   [junit4]   2> 3084535 INFO  (jetty-launcher-10534-thread-2) [    ] o.a.s.s.SolrDispatchFilter solr.xml found in ZooKeeper. Loading...
   [junit4]   2> 3084535 INFO  (jetty-launcher-10534-thread-1) [    ] o.a.s.s.SolrDispatchFilter solr.xml found in ZooKeeper. Loading...
   [junit4]   2> 3084545 WARN  (NIOServerCxn.Factory:0.0.0.0/0.0.0.0:0) [    ] o.a.z.s.NIOServerCnxn Unable to read additional data from client sessionid 0x1000ff8d7890002, likely client has closed socket
   [junit4]   2> 3084681 INFO  (jetty-launcher-10534-thread-2) [    ] o.a.s.c.ZkContainer Zookeeper client=127.0.0.1:64765/solr
   [junit4]   2> 3084683 INFO  (zkConnectionManagerCallback-10545-thread-1) [    ] o.a.s.c.c.ConnectionManager zkClient has connected
   [junit4]   2> 3084684 WARN  (NIOServerCxn.Factory:0.0.0.0/0.0.0.0:0) [    ] o.a.z.s.NIOServerCnxn Unable to read additional data from client sessionid 0x1000ff8d7890003, likely client has closed socket
   [junit4]   2> 3084686 INFO  (zkConnectionManagerCallback-10547-thread-1) [    ] o.a.s.c.c.ConnectionManager zkClient has connected
   [junit4]   2> 3084759 INFO  (jetty-launcher-10534-thread-1) [    ] o.a.s.c.ZkContainer Zookeeper client=127.0.0.1:64765/solr
   [junit4]   2> 3084761 INFO  (zkConnectionManagerCallback-10553-thread-1) [    ] o.a.s.c.c.ConnectionManager zkClient has connected
   [junit4]   2> 3084763 INFO  (zkConnectionManagerCallback-10555-thread-1) [    ] o.a.s.c.c.ConnectionManager zkClient has connected
   [junit4]   2> 3084765 INFO  (jetty-launcher-10534-thread-2) [n:127.0.0.1:64769_solr    ] o.a.s.c.OverseerElectionContext I am going to be the leader 127.0.0.1:64769_solr
   [junit4]   2> 3084766 INFO  (jetty-launcher-10534-thread-2) [n:127.0.0.1:64769_solr    ] o.a.s.c.Overseer Overseer (id=72075155480313860-127.0.0.1:64769_solr-n_0000000000) starting
   [junit4]   2> 3084772 INFO  (zkConnectionManagerCallback-10562-thread-1) [    ] o.a.s.c.c.ConnectionManager zkClient has connected
   [junit4]   2> 3084772 INFO  (jetty-launcher-10534-thread-1) [n:127.0.0.1:64771_solr    ] o.a.s.c.ZkController Register node as live in ZooKeeper:/live_nodes/127.0.0.1:64771_solr
   [junit4]   2> 3084773 INFO  (jetty-launcher-10534-thread-2) [n:127.0.0.1:64769_solr    ] o.a.s.c.c.ZkStateReader Updated live nodes from ZooKeeper... (0) -> (1)
   [junit4]   2> 3084773 INFO  (zkCallback-10546-thread-1) [    ] o.a.s.c.c.ZkStateReader Updated live nodes from ZooKeeper... (0) -> (1)
   [junit4]   2> 3084773 INFO  (zkCallback-10554-thread-1) [    ] o.a.s.c.c.ZkStateReader Updated live nodes from ZooKeeper... (0) -> (1)
   [junit4]   2> 3084774 INFO  (jetty-launcher-10534-thread-2) [n:127.0.0.1:64769_solr    ] o.a.s.c.s.i.ZkClientClusterStateProvider Cluster at 127.0.0.1:64765/solr ready
   [junit4]   2> 3084774 INFO  (OverseerStateUpdate-72075155480313860-127.0.0.1:64769_solr-n_0000000000) [n:127.0.0.1:64769_solr    ] o.a.s.c.Overseer Starting to work on the main queue : 127.0.0.1:64769_solr
   [junit4]   2> 3084775 DEBUG (OverseerAutoScalingTriggerThread-72075155480313860-127.0.0.1:64769_solr-n_0000000000) [    ] o.a.s.c.a.OverseerTriggerThread Adding .auto_add_replicas and .scheduled_maintenance triggers
   [junit4]   2> 3084775 DEBUG (OverseerAutoScalingTriggerThread-72075155480313860-127.0.0.1:64769_solr-n_0000000000) [    ] o.a.s.c.a.OverseerTriggerThread Refreshing /autoscaling.json with znode version 1
   [junit4]   2> 3084775 INFO  (jetty-launcher-10534-thread-2) [n:127.0.0.1:64769_solr    ] o.a.s.c.TransientSolrCoreCacheDefault Allocating transient cache for 2147483647 transient cores
   [junit4]   2> 3084775 INFO  (jetty-launcher-10534-thread-2) [n:127.0.0.1:64769_solr    ] o.a.s.c.ZkController Register node as live in ZooKeeper:/live_nodes/127.0.0.1:64769_solr
   [junit4]   2> 3084776 DEBUG (OverseerAutoScalingTriggerThread-72075155480313860-127.0.0.1:64769_solr-n_0000000000) [    ] o.a.s.c.a.OverseerTriggerThread Current znodeVersion 1, lastZnodeVersion -1
   [junit4]   2> 3084776 DEBUG (OverseerAutoScalingTriggerThread-72075155480313860-127.0.0.1:64769_solr-n_0000000000) [    ] o.a.s.c.a.OverseerTriggerThread Processed trigger updates upto znodeVersion 1
   [junit4]   2> 3084777 INFO  (zkCallback-10546-thread-1) [    ] o.a.s.c.c.ZkStateReader Updated live nodes from ZooKeeper... (1) -> (2)
   [junit4]   2> 3084777 INFO  (zkCallback-10554-thread-1) [    ] o.a.s.c.c.ZkStateReader Updated live nodes from ZooKeeper... (1) -> (2)
   [junit4]   2> 3084779 DEBUG (OverseerAutoScalingTriggerThread-72075155480313860-127.0.0.1:64769_solr-n_0000000000) [    ] o.a.s.c.a.NodeLostTrigger NodeLostTrigger .auto_add_replicas - Initial livenodes: [127.0.0.1:64771_solr]
   [junit4]   2> 3084779 DEBUG (OverseerAutoScalingTriggerThread-72075155480313860-127.0.0.1:64769_solr-n_0000000000) [    ] o.a.s.c.a.OverseerTriggerThread -- clean old nodeAdded markers
   [junit4]   2> 3084781 DEBUG (OverseerAutoScalingTriggerThread-72075155480313860-127.0.0.1:64769_solr-n_0000000000) [    ] o.a.s.c.a.OverseerTriggerThread Current znodeVersion 1, lastZnodeVersion 1
   [junit4]   2> 3084781 INFO  (zkCallback-10561-thread-1) [    ] o.a.s.c.c.ZkStateReader Updated live nodes from ZooKeeper... (1) -> (2)
   [junit4]   2> 3084782 DEBUG (ScheduledTrigger-11133-thread-1) [    ] o.a.s.c.a.NodeLostTrigger Running NodeLostTrigger: .auto_add_replicas with currently live nodes: 2
   [junit4]   2> 3084797 INFO  (jetty-launcher-10534-thread-2) [n:127.0.0.1:64769_solr    ] o.a.s.h.a.MetricsHistoryHandler No .system collection, keeping metrics history in memory.
   [junit4]   2> 3084799 INFO  (zkConnectionManagerCallback-10568-thread-1) [    ] o.a.s.c.c.ConnectionManager zkClient has connected
   [junit4]   2> 3084800 INFO  (jetty-launcher-10534-thread-1) [n:127.0.0.1:64771_solr    ] o.a.s.c.c.ZkStateReader Updated live nodes from ZooKeeper... (0) -> (2)
   [junit4]   2> 3084807 INFO  (jetty-launcher-10534-thread-1) [n:127.0.0.1:64771_solr    ] o.a.s.c.s.i.ZkClientClusterStateProvider Cluster at 127.0.0.1:64765/solr ready
   [junit4]   2> 3084807 INFO  (jetty-launcher-10534-thread-1) [n:127.0.0.1:64771_solr    ] o.a.s.h.a.MetricsHistoryHandler No .system collection, keeping metrics history in memory.
   [junit4]   2> 3084823 INFO  (jetty-launcher-10534-thread-2) [n:127.0.0.1:64769_solr    ] o.a.s.m.r.SolrJmxReporter JMX monitoring for 'solr_64769.solr.node' (registry 'solr.node') enabled at server: com.sun.jmx.mbeanserver.JmxMBeanServer@6bf11642
   [junit4]   2> 3084823 INFO  (jetty-launcher-10534-thread-1) [n:127.0.0.1:64771_solr    ] o.a.s.m.r.SolrJmxReporter JMX monitoring for 'solr_64771.solr.node' (registry 'solr.node') enabled at server: com.sun.jmx.mbeanserver.JmxMBeanServer@6bf11642
   [junit4]   2> 3084828 INFO  (jetty-launcher-10534-thread-2) [n:127.0.0.1:64769_solr    ] o.a.s.m.r.SolrJmxReporter JMX monitoring for 'solr_64769.solr.jvm' (registry 'solr.jvm') enabled at server: com.sun.jmx.mbeanserver.JmxMBeanServer@6bf11642
   [junit4]   2> 3084828 INFO  (jetty-launcher-10534-thread-2) [n:127.0.0.1:64769_solr    ] o.a.s.m.r.SolrJmxReporter JMX monitoring for 'solr_64769.solr.jetty' (registry 'solr.jetty') enabled at server: com.sun.jmx.mbeanserver.JmxMBeanServer@6bf11642
   [junit4]   2> 3084828 INFO  (jetty-launcher-10534-thread-1) [n:127.0.0.1:64771_solr    ] o.a.s.m.r.SolrJmxReporter JMX monitoring for 'solr_64771.solr.jvm' (registry 'solr.jvm') enabled at server: com.sun.jmx.mbeanserver.JmxMBeanServer@6bf11642
   [junit4]   2> 3084828 INFO  (jetty-launcher-10534-thread-1) [n:127.0.0.1:64771_solr    ] o.a.s.m.r.SolrJmxReporter JMX monitoring for 'solr_64771.solr.jetty' (registry 'solr.jetty') enabled at server: com.sun.jmx.mbeanserver.JmxMBeanServer@6bf11642
   [junit4]   2> 3084830 INFO  (jetty-launcher-10534-thread-2) [n:127.0.0.1:64769_solr    ] o.a.s.c.CorePropertiesLocator Found 0 core definitions underneath C:\Users\jenkins\workspace\Lucene-Solr-7.x-Windows\solr\build\solr-core\test\J0\temp\solr.cloud.autoscaling.TriggerSetPropertiesIntegrationTest_F51A11C2AC8D0113-001\tempDir-001\node2\.
   [junit4]   2> 3084830 INFO  (jetty-launcher-10534-thread-1) [n:127.0.0.1:64771_solr    ] o.a.s.c.CorePropertiesLocator Found 0 core definitions underneath C:\Users\jenkins\workspace\Lucene-Solr-7.x-Windows\solr\build\solr-core\test\J0\temp\solr.cloud.autoscaling.TriggerSetPropertiesIntegrationTest_F51A11C2AC8D0113-001\tempDir-001\node1\.
   [junit4]   2> 3084867 INFO  (zkConnectionManagerCallback-10571-thread-1) [    ] o.a.s.c.c.ConnectionManager zkClient has connected
   [junit4]   2> 3084870 INFO  (zkConnectionManagerCallback-10576-thread-1) [    ] o.a.s.c.c.ConnectionManager zkClient has connected
   [junit4]   2> 3084871 INFO  (SUITE-TriggerSetPropertiesIntegrationTest-seed#[F51A11C2AC8D0113]-worker) [    ] o.a.s.c.c.ZkStateReader Updated live nodes from ZooKeeper... (0) -> (2)
   [junit4]   2> 3084872 INFO  (SUITE-TriggerSetPropertiesIntegrationTest-seed#[F51A11C2AC8D0113]-worker) [    ] o.a.s.c.s.i.ZkClientClusterStateProvider Cluster at 127.0.0.1:64765/solr ready
   [junit4]   2> 3084881 INFO  (qtp481290259-30618) [n:127.0.0.1:64771_solr    ] o.a.s.s.HttpSolrCall [admin] webapp=null path=/admin/metrics params={prefix=CONTAINER.fs.usableSpace,CONTAINER.fs.totalSpace,CORE.coreName&wt=javabin&version=2&group=solr.node,solr.core} status=0 QTime=2
   [junit4]   2> 3084885 INFO  (qtp1404079934-30619) [n:127.0.0.1:64769_solr    ] o.a.s.s.HttpSolrCall [admin] webapp=null path=/admin/metrics params={prefix=CONTAINER.fs.usableSpace,CONTAINER.fs.totalSpace,CORE.coreName&wt=javabin&version=2&group=solr.node,solr.core} status=0 QTime=2
   [junit4]   2> 3084885 DEBUG (qtp481290259-30630) [n:127.0.0.1:64771_solr    ] o.a.s.c.a.AutoScalingHandler Verified autoscaling configuration
   [junit4]   2> 3084886 INFO  (qtp481290259-30630) [n:127.0.0.1:64771_solr    ] o.a.s.s.HttpSolrCall [admin] webapp=null path=/admin/autoscaling params={wt=javabin&version=2} status=0 QTime=8
   [junit4]   2> 3084886 DEBUG (zkCallback-10561-thread-1) [    ] o.a.s.c.a.OverseerTriggerThread Refreshing /autoscaling.json with znode version 2
   [junit4]   2> 3084887 DEBUG (OverseerAutoScalingTriggerThread-72075155480313860-127.0.0.1:64769_solr-n_0000000000) [    ] o.a.s.c.a.OverseerTriggerThread Processed trigger updates upto znodeVersion 2
   [junit4]   2> 3084891 DEBUG (OverseerAutoScalingTriggerThread-72075155480313860-127.0.0.1:64769_solr-n_0000000000) [    ] o.a.s.c.a.OverseerTriggerThread -- clean old nodeAdded markers
   [junit4]   2> 3084892 DEBUG (OverseerAutoScalingTriggerThread-72075155480313860-127.0.0.1:64769_solr-n_0000000000) [    ] o.a.s.c.a.OverseerTriggerThread Current znodeVersion 2, lastZnodeVersion 2
   [junit4]   2> 3084898 INFO  (TEST-TriggerSetPropertiesIntegrationTest.testSetProperties-seed#[F51A11C2AC8D0113]) [    ] o.a.s.SolrTestCaseJ4 ###Starting testSetProperties
   [junit4]   2> 3085763 DEBUG (ScheduledTrigger-11133-thread-1) [    ] o.a.s.c.a.NodeLostTrigger Running NodeLostTrigger: .auto_add_replicas with currently live nodes: 2
   [junit4]   2> 3085883 DEBUG (TEST-TriggerSetPropertiesIntegrationTest.testSetProperties-seed#[F51A11C2AC8D0113]) [    ] o.a.s.c.a.ScheduledTriggers Shutting down scheduled thread pool executor now
   [junit4]   2> 3085883 DEBUG (TEST-TriggerSetPropertiesIntegrationTest.testSetProperties-seed#[F51A11C2AC8D0113]) [    ] o.a.s.c.a.ScheduledTriggers Shutting down action executor now
   [junit4]   2> 3085883 DEBUG (TEST-TriggerSetPropertiesIntegrationTest.testSetProperties-seed#[F51A11C2AC8D0113]) [    ] o.a.s.c.a.ScheduledTriggers Awaiting termination for action executor
   [junit4]   2> 3085883 DEBUG (TEST-TriggerSetPropertiesIntegrationTest.testSetProperties-seed#[F51A11C2AC8D0113]) [    ] o.a.s.c.a.ScheduledTriggers Awaiting termination for scheduled thread pool executor
   [junit4]   2> 3085883 DEBUG (TEST-TriggerSetPropertiesIntegrationTest.testSetProperties-seed#[F51A11C2AC8D0113]) [    ] o.a.s.c.a.ScheduledTriggers ScheduledTriggers closed completely
   [junit4]   2> 3085884 INFO  (TEST-TriggerSetPropertiesIntegrationTest.testSetProperties-seed#[F51A11C2AC8D0113]) [    ] o.a.s.SolrTestCaseJ4 ###Ending testSetProperties
   [junit4]   2> NOTE: reproduce with: ant test  -Dtestcase=TriggerSetPropertiesIntegrationTest -Dtests.method=testSetProperties -Dtests.seed=F51A11C2AC8D0113 -Dtests.slow=true -Dtests.locale=ks -Dtests.timezone=Zulu -Dtests.asserts=true -Dtests.file.encoding=ISO-8859-1
   [junit4] FAILURE 1.00s J0 | TriggerSetPropertiesIntegrationTest.testSetProperties <<<
   [junit4]    > Throwable #1: java.lang.AssertionError
   [junit4]    > 	at __randomizedtesting.SeedInfo.seed([F51A11C2AC8D0113:9E7EC68B1FA09497]:0)
   [junit4]    > 	at org.apache.solr.cloud.autoscaling.TriggerSetPropertiesIntegrationTest.testSetProperties(TriggerSetPropertiesIntegrationTest.java:111)
   [junit4]    > 	at java.base/jdk.internal.reflect.NativeMethodAccessorImpl.invoke0(Native Method)
   [junit4]    > 	at java.base/jdk.internal.reflect.NativeMethodAccessorImpl.invoke(NativeMethodAccessorImpl.java:62)
   [junit4]    > 	at java.base/jdk.internal.reflect.DelegatingMethodAccessorImpl.invoke(DelegatingMethodAccessorImpl.java:43)
   [junit4]    > 	at java.base/java.lang.reflect.Method.invoke(Method.java:564)
   [junit4]    > 	at java.base/java.lang.Thread.run(Thread.java:844)
   [junit4]   2> 3085886 WARN  (NIOServerCxn.Factory:0.0.0.0/0.0.0.0:0) [    ] o.a.z.s.NIOServerCnxn Unable to read additional data from client sessionid 0x1000ff8d789000a, likely client has closed socket
   [junit4]   2> 3085888 INFO  (jetty-closer-10535-thread-2) [    ] o.e.j.s.AbstractConnector Stopped ServerConnector@2c3b427{HTTP/1.1,[http/1.1]}{127.0.0.1:?}
   [junit4]   2> 3085888 INFO  (jetty-closer-10535-thread-1) [    ] o.e.j.s.AbstractConnector Stopped ServerConnector@3749ffcf{HTTP/1.1,[http/1.1]}{127.0.0.1:?}
   [junit4]   2> 3085889 INFO  (jetty-closer-10535-thread-1) [    ] o.a.s.c.CoreContainer Shutting down CoreContainer instance=595865385
   [junit4]   2> 3085889 INFO  (jetty-closer-10535-thread-1) [    ] o.a.s.m.SolrMetricManager Closing metric reporters for registry=solr.node, tag=null
   [junit4]   2> 3085889 INFO  (jetty-closer-10535-thread-1) [    ] o.a.s.m.r.SolrJmxReporter Closing reporter [org.apache.solr.metrics.reporters.SolrJmxReporter@67ddc2de: rootName = solr_64769, domain = solr.node, service url = null, agent id = null] for registry solr.node / com.codahale.metrics.MetricRegistry@2291fe62
   [junit4]   2> 3085889 INFO  (jetty-closer-10535-thread-2) [    ] o.a.s.c.CoreContainer Shutting down CoreContainer instance=1504041697
   [junit4]   2> 3085890 INFO  (jetty-closer-10535-thread-2) [    ] o.a.s.m.SolrMetricManager Closing metric reporters for registry=solr.node, tag=null
   [junit4]   2> 3085890 INFO  (jetty-closer-10535-thread-2) [    ] o.a.s.m.r.SolrJmxReporter Closing reporter [org.apache.solr.metrics.reporters.SolrJmxReporter@41168783: rootName = solr_64771, domain = solr.node, service url = null, agent id = null] for registry solr.node / com.codahale.metrics.MetricRegistry@499410c7
   [junit4]   2> 3085894 INFO  (jetty-closer-10535-thread-1) [    ] o.a.s.m.SolrMetricManager Closing metric reporters for registry=solr.jvm, tag=null
   [junit4]   2> 3085894 INFO  (jetty-closer-10535-thread-1) [    ] o.a.s.m.r.SolrJmxReporter Closing reporter [org.apache.solr.metrics.reporters.SolrJmxReporter@7a482ad8: rootName = solr_64769, domain = solr.jvm, service url = null, agent id = null] for registry solr.jvm / com.codahale.metrics.MetricRegistry@32565950
   [junit4]   2> 3085895 INFO  (jetty-closer-10535-thread-2) [    ] o.a.s.m.SolrMetricManager Closing metric reporters for registry=solr.jvm, tag=null
   [junit4]   2> 3085895 INFO  (jetty-closer-10535-thread-2) [    ] o.a.s.m.r.SolrJmxReporter Closing reporter [org.apache.solr.metrics.reporters.SolrJmxReporter@2d57cc1c: rootName = solr_64771, domain = solr.jvm, service url = null, agent id = null] for registry solr.jvm / com.codahale.metrics.MetricRegistry@32565950
   [junit4]   2> 3085897 INFO  (jetty-closer-10535-thread-1) [    ] o.a.s.m.SolrMetricManager Closing metric reporters for registry=solr.jetty, tag=null
   [junit4]   2> 3085897 INFO  (jetty-closer-10535-thread-1) [    ] o.a.s.m.r.SolrJmxReporter Closing reporter [org.apache.solr.metrics.reporters.SolrJmxReporter@336a7057: rootName = solr_64769, domain = solr.jetty, service url = null, agent id = null] for registry solr.jetty / com.codahale.metrics.MetricRegistry@63ead534
   [junit4]   2> 3085897 INFO  (jetty-closer-10535-thread-2) [    ] o.a.s.m.SolrMetricManager Closing metric reporters for registry=solr.jetty, tag=null
   [junit4]   2> 3085897 INFO  (jetty-closer-10535-thread-2) [    ] o.a.s.m.r.SolrJmxReporter Closing reporter [org.apache.solr.metrics.reporters.SolrJmxReporter@7ce9cc1e: rootName = solr_64771, domain = solr.jetty, service url = null, agent id = null] for registry solr.jetty / com.codahale.metrics.MetricRegistry@63ead534
   [junit4]   2> 3085898 INFO  (jetty-closer-10535-thread-1) [    ] o.a.s.c.ZkController Remove node as live in ZooKeeper:/live_nodes/127.0.0.1:64769_solr
   [junit4]   2> 3085899 INFO  (jetty-closer-10535-thread-2) [    ] o.a.s.c.ZkController Remove node as live in ZooKeeper:/live_nodes/127.0.0.1:64771_solr
   [junit4]   2> 3085899 INFO  (jetty-closer-10535-thread-1) [    ] o.a.s.m.SolrMetricManager Closing metric reporters for registry=solr.cluster, tag=null
   [junit4]   2> 3085900 INFO  (jetty-closer-10535-thread-1) [    ] o.a.s.c.Overseer Overseer (id=72075155480313860-127.0.0.1:64769_solr-n_0000000000) closing
   [junit4]   2> 3085900 WARN  (OverseerAutoScalingTriggerThread-72075155480313860-127.0.0.1:64769_solr-n_0000000000) [    ] o.a.s.c.a.OverseerTriggerThread OverseerTriggerThread woken up but we are closed, exiting.
   [junit4]   2> 3085901 INFO  (zkCallback-10561-thread-1) [    ] o.a.s.c.c.ZkStateReader Updated live nodes from ZooKeeper... (2) -> (1)
   [junit4]   2> 3085901 INFO  (OverseerStateUpdate-72075155480313860-127.0.0.1:64769_solr-n_0000000000) [n:127.0.0.1:64769_solr    ] o.a.s.c.Overseer Overseer Loop exiting : 127.0.0.1:64769_solr
   [junit4]   2> 3085901 INFO  (zkCallback-10546-thread-1) [    ] o.a.s.c.c.ZkStateReader Updated live nodes from ZooKeeper... (2) -> (1)
   [junit4]   2> 3085901 INFO  (jetty-closer-10535-thread-2) [    ] o.a.s.m.SolrMetricManager Closing metric reporters for registry=solr.cluster, tag=null
   [junit4]   2> 3085901 INFO  (jetty-closer-10535-thread-2) [    ] o.a.s.c.TransientSolrCoreCacheDefault Allocating transient cache for 2147483647 transient cores
   [junit4]   2> 3085901 INFO  (zkCallback-10554-thread-1) [    ] o.a.s.c.c.ZkStateReader Updated live nodes from ZooKeeper... (2) -> (0)
   [junit4]   2> 3085901 INFO  (zkCallback-10567-thread-1) [    ] o.a.s.c.c.ZkStateReader Updated live nodes from ZooKeeper... (2) -> (0)
   [junit4]   2> 3085902 DEBUG (jetty-closer-10535-thread-1) [    ] o.a.s.c.a.ScheduledTriggers Shutting down scheduled thread pool executor now
   [junit4]   2> 3085902 DEBUG (jetty-closer-10535-thread-1) [    ] o.a.s.c.a.ScheduledTriggers Shutting down action executor now
   [junit4]   2> 3085902 DEBUG (jetty-closer-10535-thread-1) [    ] o.a.s.c.a.ScheduledTriggers Awaiting termination for action executor
   [junit4]   2> 3085902 DEBUG (jetty-closer-10535-thread-1) [    ] o.a.s.c.a.ScheduledTriggers Awaiting termination for scheduled thread pool executor
   [junit4]   2> 3085902 INFO  (zkCallback-10546-thread-1) [    ] o.a.s.c.c.ZkStateReader Updated live nodes from ZooKeeper... (1) -> (0)
   [junit4]   2> 3085903 INFO  (zkCallback-10561-thread-1) [    ] o.a.s.c.c.ZkStateReader Updated live nodes from ZooKeeper... (1) -> (0)
   [junit4]   2> 3085904 DEBUG (jetty-closer-10535-thread-1) [    ] o.a.s.c.a.ScheduledTriggers ScheduledTriggers closed completely
   [junit4]   2> 3085904 DEBUG (jetty-closer-10535-thread-1) [    ] o.a.s.c.a.OverseerTriggerThread OverseerTriggerThread has been closed explicitly
   [junit4]   2> 3085904 WARN  (NIOServerCxn.Factory:0.0.0.0/0.0.0.0:0) [    ] o.a.z.s.NIOServerCnxn Unable to read additional data from client sessionid 0x1000ff8d7890007, likely client has closed socket
   [junit4]   2> 3085905 INFO  (jetty-closer-10535-thread-2) [    ] o.e.j.s.h.ContextHandler Stopped o.e.j.s.ServletContextHandler@6bdca772{/solr,null,UNAVAILABLE}
   [junit4]   2> 3085905 INFO  (jetty-closer-10535-thread-2) [    ] o.e.j.s.session node0 Stopped scavenging
   [junit4]   2> 3085906 INFO  (jetty-closer-10535-thread-1) [    ] o.e.j.s.h.ContextHandler Stopped o.e.j.s.ServletContextHandler@76ae4963{/solr,null,UNAVAILABLE}
   [junit4]   2> 3085906 INFO  (jetty-closer-10535-thread-1) [    ] o.e.j.s.session node0 Stopped scavenging
   [junit4]   2> 3085907 ERROR (SUITE-TriggerSetPropertiesIntegrationTest-seed#[F51A11C2AC8D0113]-worker) [    ] o.a.z.s.ZooKeeperServer ZKShutdownHandler is not registered, so ZooKeeper server won't take any action on ERROR or SHUTDOWN server state changes
   [junit4]   2> 3085908 INFO  (SUITE-TriggerSetPropertiesIntegrationTest-seed#[F51A11C2AC8D0113]-worker) [    ] o.a.s.c.ZkTestServer connecting to 127.0.0.1:64765 64765
   [junit4]   2> 3085908 INFO  (Thread-4802) [    ] o.a.s.c.ZkTestServer connecting to 127.0.0.1:64765 64765
   [junit4]   2> 3085908 WARN  (Thread-4802) [    ] o.a.s.c.ZkTestServer Watch limit violations: 
   [junit4]   2> Maximum concurrent create/delete watches above limit:
   [junit4]   2> 
   [junit4]   2> 	5	/solr/aliases.json
   [junit4]   2> 	5	/solr/clusterprops.json
   [junit4]   2> 	2	/solr/security.json
   [junit4]   2> 
   [junit4]   2> Maximum concurrent data watches above limit:
   [junit4]   2> 
   [junit4]   2> 	5	/solr/clusterstate.json
   [junit4]   2> 
   [junit4]   2> Maximum concurrent children watches above limit:
   [junit4]   2> 
   [junit4]   2> 	5	/solr/live_nodes
   [junit4]   2> 	5	/solr/collections
   [junit4]   2> 
   [junit4]   2> NOTE: leaving temporary files on disk at: C:\Users\jenkins\workspace\Lucene-Solr-7.x-Windows\solr\build\solr-core\test\J0\temp\solr.cloud.autoscaling.TriggerSetPropertiesIntegrationTest_F51A11C2AC8D0113-001
   [junit4]   2> Oct 31, 2018 11:51:28 AM com.carrotsearch.randomizedtesting.ThreadLeakControl checkThreadLeaks
   [junit4]   2> WARNING: Will linger awaiting termination of 6 leaked thread(s).
   [junit4]   2> NOTE: test params are: codec=Asserting(Lucene70): {}, docValues:{}, maxPointsInLeafNode=1899, maxMBSortInHeap=6.334276221107308, sim=RandomSimilarity(queryNorm=true): {}, locale=ks, timezone=Zulu
   [junit4]   2> NOTE: Windows 10 10.0 amd64/Oracle Corporation 9.0.4 (64-bit)/cpus=3,threads=1,free=127395408,total=518979584
   [junit4]   2> NOTE: All tests run in this JVM: [UnloadDistributedZkTest, ScriptEngineTest, BlockDirectoryTest, TestLazyCores, ScheduledTriggerTest, TestBinaryField, SolrMetricManagerTest, TestCloudSearcherWarming, TestSolrCoreParser, ProtectedTermFilterFactoryTest, CloneFieldUpdateProcessorFactoryTest, SolrCloudExampleTest, BasicDistributedZkTest, ConnectionManagerTest, TestHdfsCloudBackupRestore, CdcrUpdateLogTest, TestRangeQuery, AsyncCallRequestStatusResponseTest, DistributedFacetPivotSmallAdvancedTest, RuleEngineTest, TestExpandComponent, TestBadConfig, NodeAddedTriggerIntegrationTest, OpenCloseCoreStressTest, TestPushWriter, TaggingAttributeTest, TestRequestForwarding, NoCacheHeaderTest, TestMultiWordSynonyms, TestNumericRangeQuery64, TestSchemaVersionResource, DistributedFacetPivotLargeTest, TestPolicyCloud, TestRandomRequestDistribution, DistributedFacetPivotWhiteBoxTest, TestDynamicFieldResource, TlogReplayBufferedWhileIndexingTest, TestTlogReplica, AnalysisAfterCoreReloadTest, RequiredFieldsTest, HttpTriggerListenerTest, HdfsRecoveryZkTest, TestSolrConfigHandler, ZkCLITest, CdcrWithNodesRestartsTest, BadCopyFieldTest, TestScoreJoinQPNoScore, TestDistributedSearch, DistributedFacetSimpleRefinementLongTailTest, TestClusterStateMutator, CustomCollectionTest, TestNestedUpdateProcessor, TestDFRSimilarityFactory, CreateRoutedAliasTest, LegacyCloudClusterPropTest, BasicAuthIntegrationTest, PeerSyncReplicationTest, TestMacros, ShardRoutingTest, UUIDUpdateProcessorFallbackTest, CloudExitableDirectoryReaderTest, TestCollationField, TestRandomFaceting, BlockJoinFacetSimpleTest, SolrRequestParserTest, TestRecovery, TestAuthenticationFramework, SpellCheckComponentTest, TestCollapseQParserPlugin, TestExportWriter, ReplaceNodeNoTargetTest, TestCollectionAPIs, ConcurrentCreateRoutedAliasTest, TestSolrJ, ReplicationFactorTest, TestRTGBase, TestXmlQParser, TestLegacyFieldCache, TestJettySolrRunner, SoftAutoCommitTest, HdfsBasicDistributedZk2Test, SimpleFacetsTest, AssignTest, PeerSyncWithBufferUpdatesTest, TestSegmentSorting, ShowFileRequestHandlerTest, TestPivotHelperCode, ScheduledMaintenanceTriggerTest, TestDocTermOrds, CoreAdminOperationTest, TestSimComputePlanAction, TestCustomSort, TestSolrCLIRunExample, TimeZoneUtilsTest, OverseerTaskQueueTest, TestHdfsUpdateLog, DocValuesNotIndexedTest, DocValuesMissingTest, SpatialHeatmapFacetsTest, TestCoreAdminApis, DistribDocExpirationUpdateProcessorTest, TestFilteredDocIdSet, TestOverriddenPrefixQueryForCustomFieldType, TestPKIAuthenticationPlugin, DocValuesTest, TestFunctionQuery, NodeLostTriggerIntegrationTest, TestConfigReload, LeaderFailoverAfterPartitionTest, TestTestInjection, DebugComponentTest, FullSolrCloudDistribCmdsTest, WordBreakSolrSpellCheckerTest, MetricsConfigTest, TestZkAclsWithHadoopAuth, TestMultiValuedNumericRangeQuery, ChaosMonkeyNothingIsSafeTest, TestLuceneMatchVersion, PreAnalyzedUpdateProcessorTest, TestRestManager, TestPullReplicaErrorHandling, TestSortableTextField, TestHdfsBackupRestoreCore, BinaryUpdateRequestHandlerTest, TestCollectionAPI, TestPerFieldSimilarityWithDefaultOverride, TestNRTOpen, TestSchemaResource, TestConfigSetImmutable, TestLRUCache, CoreSorterTest, CopyFieldTest, TestAnalyzedSuggestions, TestUniqueKeyFieldResource, TestRTimerTree, TestExclusionRuleCollectionAccess, LIRRollingUpdatesTest, TestSimDistributedQueue, SpatialRPTFieldTypeTest, SearchHandlerTest, ExitableDirectoryReaderTest, AddSchemaFieldsUpdateProcessorFactoryTest, AutoScalingHandlerTest, MigrateRouteKeyTest, DirectSolrConnectionTest, NumberUtilsTest, TestPostingsSolrHighlighter, DateFieldTest, MetricTriggerIntegrationTest, SOLR749Test, SuggesterTSTTest, CachingDirectoryFactoryTest, TestDocBasedVersionConstraints, TestSha256AuthenticationProvider, PolyFieldTest, TestIntervalFaceting, ConvertedLegacyTest, TestSolrCloudWithSecureImpersonation, IndexSchemaTest, TestCloudPseudoReturnFields, SuggesterWFSTTest, TestSort, SolrGraphiteReporterTest, SpellingQueryConverterTest, ZkFailoverTest, FieldMutatingUpdateProcessorTest, SaslZkACLProviderTest, TermsComponentTest, DistributedQueryComponentCustomSortTest, TestCloudPhrasesIdentificationComponent, TestConfigSets, DistributedQueryElevationComponentTest, TestInitParams, TestTolerantUpdateProcessorRandomCloud, TestRawTransformer, AlternateDirectoryTest, TestEmbeddedSolrServerConstructors, SecurityConfHandlerTest, TestGroupingSearch, TestChildDocTransformerHierarchy, SolrInfoBeanTest, MultiThreadedOCPTest, TestSolrCloudWithDelegationTokens, TestSubQueryTransformerCrossCore, TestSimLargeCluster, TestImplicitCoreProperties, AutoAddReplicasIntegrationTest, FastVectorHighlighterTest, CollectionsAPIDistributedZkTest, TestSimNodeLostTrigger, V2ApiIntegrationTest, FacetPivotSmallTest, ExternalFileFieldSortTest, SparseHLLTest, AtomicUpdatesTest, TestReplicaProperties, BlockJoinFacetDistribTest, DOMUtilTest, TestLegacyField, EchoParamsTest, DistributedSuggestComponentTest, DistribCursorPagingTest, DistributedQueueTest, DistributedVersionInfoTest, LeaderElectionTest, MultiSolrCloudTestCaseTest, OutOfBoxZkACLAndCredentialsProvidersTest, OverriddenZkACLAndCredentialsProvidersTest, OverseerCollectionConfigSetProcessorTest, OverseerModifyCollectionTest, OverseerRolesTest, OverseerStatusTest, RecoveryZkTest, SSLMigrationTest, SliceStateTest, SolrCLIZkUtilsTest, SplitShardTest, SyncSliceTest, TestConfigSetsAPIExclusivity, TestConfigSetsAPIZkFailure, TestCryptoKeys, TestLeaderElectionWithEmptyReplica, TestOnReconnectListenerSupport, TestPrepRecovery, TestSizeLimitedDistributedMap, TestSkipOverseerOperations, TestStressInPlaceUpdates, TestStressLiveNodes, TestWithCollection, CollectionsAPIAsyncDistributedZkTest, SimpleCollectionCreateDeleteTest, ExecutePlanActionTest, HdfsAutoAddReplicasIntegrationTest, NodeMarkersRegistrationTest, RestoreTriggerStateTest, SearchRateTriggerTest, SystemLogListenerTest, TriggerEventQueueTest, TriggerIntegrationTest, TriggerSetPropertiesIntegrationTest]
   [junit4] Completed [518/836 (1!)] on J0 in 1.75s, 1 test, 1 failure <<< FAILURES!

[...truncated 1081 lines...]
   [junit4] JVM J1: stderr was not empty, see: C:\Users\jenkins\workspace\Lucene-Solr-7.x-Windows\solr\build\solr-core\test\temp\junit4-J1-20181031_110002_68317910912325257877287.syserr
   [junit4] >>> JVM J1 emitted unexpected output (verbatim) ----
   [junit4] OpenJDK 64-Bit Server VM warning: Option UseConcMarkSweepGC was deprecated in version 9.0 and will likely be removed in a future release.
   [junit4] <<< JVM J1: EOF ----

[...truncated 5 lines...]
   [junit4] JVM J0: stderr was not empty, see: C:\Users\jenkins\workspace\Lucene-Solr-7.x-Windows\solr\build\solr-core\test\temp\junit4-J0-20181031_110002_68310484936955678309645.syserr
   [junit4] >>> JVM J0 emitted unexpected output (verbatim) ----
   [junit4] OpenJDK 64-Bit Server VM warning: Option UseConcMarkSweepGC was deprecated in version 9.0 and will likely be removed in a future release.
   [junit4] <<< JVM J0: EOF ----

[...truncated 1094 lines...]
   [junit4] JVM J0: stderr was not empty, see: C:\Users\jenkins\workspace\Lucene-Solr-7.x-Windows\solr\build\solr-solrj\test\temp\junit4-J0-20181031_120445_25712036120935585189915.syserr
   [junit4] >>> JVM J0 emitted unexpected output (verbatim) ----
   [junit4] OpenJDK 64-Bit Server VM warning: Option UseConcMarkSweepGC was deprecated in version 9.0 and will likely be removed in a future release.
   [junit4] <<< JVM J0: EOF ----

   [junit4] JVM J1: stderr was not empty, see: C:\Users\jenkins\workspace\Lucene-Solr-7.x-Windows\solr\build\solr-solrj\test\temp\junit4-J1-20181031_120445_2578331457053899745016.syserr
   [junit4] >>> JVM J1 emitted unexpected output (verbatim) ----
   [junit4] OpenJDK 64-Bit Server VM warning: Option UseConcMarkSweepGC was deprecated in version 9.0 and will likely be removed in a future release.
   [junit4] <<< JVM J1: EOF ----

[...truncated 1513 lines...]
   [junit4] JVM J0: stderr was not empty, see: C:\Users\jenkins\workspace\Lucene-Solr-7.x-Windows\solr\build\contrib\solr-analysis-extras\test\temp\junit4-J0-20181031_120940_0628009541143667672005.syserr
   [junit4] >>> JVM J0 emitted unexpected output (verbatim) ----
   [junit4] OpenJDK 64-Bit Server VM warning: Option UseConcMarkSweepGC was deprecated in version 9.0 and will likely be removed in a future release.
   [junit4] <<< JVM J0: EOF ----

[...truncated 3 lines...]
   [junit4] JVM J1: stderr was not empty, see: C:\Users\jenkins\workspace\Lucene-Solr-7.x-Windows\solr\build\contrib\solr-analysis-extras\test\temp\junit4-J1-20181031_120940_06210665082705527506302.syserr
   [junit4] >>> JVM J1 emitted unexpected output (verbatim) ----
   [junit4] OpenJDK 64-Bit Server VM warning: Option UseConcMarkSweepGC was deprecated in version 9.0 and will likely be removed in a future release.
   [junit4] <<< JVM J1: EOF ----

[...truncated 801 lines...]
   [junit4] JVM J1: stderr was not empty, see: C:\Users\jenkins\workspace\Lucene-Solr-7.x-Windows\solr\build\contrib\solr-analytics\test\temp\junit4-J1-20181031_121007_422153601651806066381.syserr
   [junit4] >>> JVM J1 emitted unexpected output (verbatim) ----
   [junit4] OpenJDK 64-Bit Server VM warning: Option UseConcMarkSweepGC was deprecated in version 9.0 and will likely be removed in a future release.
   [junit4] <<< JVM J1: EOF ----

[...truncated 3 lines...]
   [junit4] JVM J0: stderr was not empty, see: C:\Users\jenkins\workspace\Lucene-Solr-7.x-Windows\solr\build\contrib\solr-analytics\test\temp\junit4-J0-20181031_121007_4221504818886230929661.syserr
   [junit4] >>> JVM J0 emitted unexpected output (verbatim) ----
   [junit4] OpenJDK 64-Bit Server VM warning: Option UseConcMarkSweepGC was deprecated in version 9.0 and will likely be removed in a future release.
   [junit4] <<< JVM J0: EOF ----

[...truncated 572 lines...]
   [junit4] JVM J0: stderr was not empty, see: C:\Users\jenkins\workspace\Lucene-Solr-7.x-Windows\solr\build\contrib\solr-clustering\test\temp\junit4-J0-20181031_121131_14316239525994688233921.syserr
   [junit4] >>> JVM J0 emitted unexpected output (verbatim) ----
   [junit4] OpenJDK 64-Bit Server VM warning: Option UseConcMarkSweepGC was deprecated in version 9.0 and will likely be removed in a future release.
   [junit4] <<< JVM J0: EOF ----

[...truncated 3 lines...]
   [junit4] JVM J1: stderr was not empty, see: C:\Users\jenkins\workspace\Lucene-Solr-7.x-Windows\solr\build\contrib\solr-clustering\test\temp\junit4-J1-20181031_121131_142725632535775672387.syserr
   [junit4] >>> JVM J1 emitted unexpected out

[...truncated too long message...]

]   2> 21351 INFO  (jetty-closer-45-thread-1) [    ] o.a.s.m.r.SolrJmxReporter Closing reporter [org.apache.solr.metrics.reporters.SolrJmxReporter@6a7385b0: rootName = solr_59047, domain = solr.jetty, service url = null, agent id = null] for registry solr.jetty / com.codahale.metrics.MetricRegistry@3452911a
   [junit4]   2> 21354 INFO  (jetty-closer-45-thread-1) [    ] o.a.s.c.ZkController Remove node as live in ZooKeeper:/live_nodes/127.0.0.1:59047_solr
   [junit4]   2> 21355 INFO  (jetty-closer-45-thread-1) [    ] o.a.s.m.SolrMetricManager Closing metric reporters for registry=solr.cluster, tag=null
   [junit4]   2> 21355 INFO  (jetty-closer-45-thread-2) [    ] o.a.s.m.SolrMetricManager Closing metric reporters for registry=solr.jetty, tag=null
   [junit4]   2> 21356 INFO  (jetty-closer-45-thread-2) [    ] o.a.s.m.r.SolrJmxReporter Closing reporter [org.apache.solr.metrics.reporters.SolrJmxReporter@15738d20: rootName = solr_59044, domain = solr.jetty, service url = null, agent id = null] for registry solr.jetty / com.codahale.metrics.MetricRegistry@3452911a
   [junit4]   2> 21358 INFO  (jetty-closer-45-thread-1) [    ] o.a.s.c.Overseer Overseer (id=72075271226589190-127.0.0.1:59047_solr-n_0000000000) closing
   [junit4]   2> 21358 WARN  (OverseerAutoScalingTriggerThread-72075271226589190-127.0.0.1:59047_solr-n_0000000000) [    ] o.a.s.c.a.OverseerTriggerThread OverseerTriggerThread woken up but we are closed, exiting.
   [junit4]   2> 21358 DEBUG (jetty-closer-45-thread-1) [    ] o.a.s.c.a.ScheduledTriggers Shutting down scheduled thread pool executor now
   [junit4]   2> 21359 INFO  (OverseerStateUpdate-72075271226589190-127.0.0.1:59047_solr-n_0000000000) [n:127.0.0.1:59047_solr    ] o.a.s.c.Overseer Overseer Loop exiting : 127.0.0.1:59047_solr
   [junit4]   2> 21359 DEBUG (jetty-closer-45-thread-1) [    ] o.a.s.c.a.ScheduledTriggers Shutting down action executor now
   [junit4]   2> 21359 DEBUG (jetty-closer-45-thread-1) [    ] o.a.s.c.a.ScheduledTriggers Awaiting termination for action executor
   [junit4]   2> 21359 DEBUG (jetty-closer-45-thread-1) [    ] o.a.s.c.a.ScheduledTriggers Awaiting termination for scheduled thread pool executor
   [junit4]   2> 21359 INFO  (zkCallback-60-thread-1) [    ] o.a.s.c.c.ZkStateReader Updated live nodes from ZooKeeper... (2) -> (1)
   [junit4]   2> 21361 DEBUG (jetty-closer-45-thread-1) [    ] o.a.s.c.a.ScheduledTriggers ScheduledTriggers closed completely
   [junit4]   2> 21361 DEBUG (jetty-closer-45-thread-1) [    ] o.a.s.c.a.OverseerTriggerThread OverseerTriggerThread has been closed explicitly
   [junit4]   2> 21359 INFO  (zkCallback-62-thread-1) [    ] o.a.s.c.c.ZkStateReader Updated live nodes from ZooKeeper... (2) -> (1)
   [junit4]   2> 21359 INFO  (zkCallback-71-thread-1) [    ] o.a.s.c.c.ZkStateReader Updated live nodes from ZooKeeper... (2) -> (1)
   [junit4]   2> 21360 INFO  (zkCallback-76-thread-1) [    ] o.a.s.c.c.ZkStateReader Updated live nodes from ZooKeeper... (2) -> (1)
   [junit4]   2> 21364 INFO  (jetty-closer-45-thread-2) [    ] o.a.s.c.ZkController Remove node as live in ZooKeeper:/live_nodes/127.0.0.1:59044_solr
   [junit4]   2> 21367 INFO  (jetty-closer-45-thread-2) [    ] o.a.s.m.SolrMetricManager Closing metric reporters for registry=solr.cluster, tag=null
   [junit4]   2> 21367 INFO  (jetty-closer-45-thread-2) [    ] o.a.s.c.TransientSolrCoreCacheDefault Allocating transient cache for 2147483647 transient cores
   [junit4]   2> 21373 INFO  (jetty-closer-45-thread-1) [    ] o.e.j.s.h.ContextHandler Stopped o.e.j.s.ServletContextHandler@1acec994{/solr,null,UNAVAILABLE}
   [junit4]   2> 21374 INFO  (zkCallback-60-thread-1) [    ] o.a.s.c.OverseerElectionContext I am going to be the leader 127.0.0.1:59044_solr
   [junit4]   2> 21374 WARN  (zkCallback-76-thread-1) [    ] o.a.s.c.c.ZkStateReader ZooKeeper watch triggered, but Solr cannot talk to ZK: [KeeperErrorCode = Session expired for /live_nodes]
   [junit4]   2> 21374 INFO  (jetty-closer-45-thread-1) [    ] o.e.j.s.session node0 Stopped scavenging
   [junit4]   2> 21374 INFO  (zkCallback-60-thread-2) [    ] o.a.s.c.c.ZkStateReader Updated live nodes from ZooKeeper... (1) -> (0)
   [junit4]   2> 22819 INFO  (jetty-closer-45-thread-2) [    ] o.e.j.s.h.ContextHandler Stopped o.e.j.s.ServletContextHandler@61915245{/solr,null,UNAVAILABLE}
   [junit4]   2> 22819 INFO  (jetty-closer-45-thread-2) [    ] o.e.j.s.session node0 Stopped scavenging
   [junit4]   2> 22821 ERROR (SUITE-TriggerSetPropertiesIntegrationTest-seed#[F51A11C2AC8D0113]-worker) [    ] o.a.z.s.ZooKeeperServer ZKShutdownHandler is not registered, so ZooKeeper server won't take any action on ERROR or SHUTDOWN server state changes
   [junit4]   2> 22822 INFO  (SUITE-TriggerSetPropertiesIntegrationTest-seed#[F51A11C2AC8D0113]-worker) [    ] o.a.s.c.ZkTestServer connecting to 127.0.0.1:59040 59040
   [junit4]   2> 22823 INFO  (Thread-20) [    ] o.a.s.c.ZkTestServer connecting to 127.0.0.1:59040 59040
   [junit4]   2> 22824 WARN  (Thread-20) [    ] o.a.s.c.ZkTestServer Watch limit violations: 
   [junit4]   2> Maximum concurrent create/delete watches above limit:
   [junit4]   2> 
   [junit4]   2> 	5	/solr/aliases.json
   [junit4]   2> 	5	/solr/clusterprops.json
   [junit4]   2> 	2	/solr/security.json
   [junit4]   2> 
   [junit4]   2> Maximum concurrent data watches above limit:
   [junit4]   2> 
   [junit4]   2> 	5	/solr/clusterstate.json
   [junit4]   2> 
   [junit4]   2> Maximum concurrent children watches above limit:
   [junit4]   2> 
   [junit4]   2> 	5	/solr/live_nodes
   [junit4]   2> 	5	/solr/collections
   [junit4]   2> 
   [junit4]   2> NOTE: leaving temporary files on disk at: C:\Users\jenkins\workspace\Lucene-Solr-7.x-Windows\solr\build\solr-core\test\J1\temp\solr.cloud.autoscaling.TriggerSetPropertiesIntegrationTest_F51A11C2AC8D0113-002
   [junit4]   2> Oct 31, 2018 12:21:17 PM com.carrotsearch.randomizedtesting.ThreadLeakControl checkThreadLeaks
   [junit4]   2> WARNING: Will linger awaiting termination of 1 leaked thread(s).
   [junit4]   2> NOTE: test params are: codec=Asserting(Lucene70): {}, docValues:{}, maxPointsInLeafNode=1899, maxMBSortInHeap=6.334276221107308, sim=RandomSimilarity(queryNorm=true): {}, locale=ks, timezone=Zulu
   [junit4]   2> NOTE: Windows 10 10.0 amd64/Oracle Corporation 9.0.4 (64-bit)/cpus=3,threads=1,free=52802840,total=97320960
   [junit4]   2> NOTE: All tests run in this JVM: [TriggerSetPropertiesIntegrationTest, TriggerSetPropertiesIntegrationTest]
   [junit4] Completed [5/5 (5!)] on J1 in 3.45s, 1 test, 1 failure <<< FAILURES!

[...truncated 1 lines...]
   [junit4] JVM J0: stderr was not empty, see: C:\Users\jenkins\workspace\Lucene-Solr-7.x-Windows\solr\build\solr-core\test\temp\junit4-J0-20181031_122054_1581035986353049553142.syserr
   [junit4] >>> JVM J0 emitted unexpected output (verbatim) ----
   [junit4] OpenJDK 64-Bit Server VM warning: Option UseConcMarkSweepGC was deprecated in version 9.0 and will likely be removed in a future release.
   [junit4] <<< JVM J0: EOF ----

   [junit4] JVM J1: stderr was not empty, see: C:\Users\jenkins\workspace\Lucene-Solr-7.x-Windows\solr\build\solr-core\test\temp\junit4-J1-20181031_122054_15218092162983867821322.syserr
   [junit4] >>> JVM J1 emitted unexpected output (verbatim) ----
   [junit4] OpenJDK 64-Bit Server VM warning: Option UseConcMarkSweepGC was deprecated in version 9.0 and will likely be removed in a future release.
   [junit4] <<< JVM J1: EOF ----

[...truncated 13 lines...]
BUILD FAILED
C:\Users\jenkins\workspace\Lucene-Solr-7.x-Windows\lucene\common-build.xml:1567: The following error occurred while executing this line:
C:\Users\jenkins\workspace\Lucene-Solr-7.x-Windows\lucene\common-build.xml:1092: There were test failures: 5 suites, 5 tests, 5 failures [seed: F51A11C2AC8D0113]

Total time: 25 seconds

[repro] Setting last failure code to 1

[repro] Failures:
[repro]   5/5 failed: org.apache.solr.cloud.autoscaling.TriggerSetPropertiesIntegrationTest
[repro] Exiting with code 1

C:\Users\jenkins\workspace\Lucene-Solr-7.x-Windows>IF EXIST lucene\build move /y lucene\build lucene\build.repro 
        1 dir(s) moved.

C:\Users\jenkins\workspace\Lucene-Solr-7.x-Windows>IF EXIST solr\build move /y solr\build solr\build.repro 
        1 dir(s) moved.

C:\Users\jenkins\workspace\Lucene-Solr-7.x-Windows>IF EXIST lucene\build.orig move /y lucene\build.orig lucene\build 
        1 dir(s) moved.

C:\Users\jenkins\workspace\Lucene-Solr-7.x-Windows>IF EXIST solr\build.orig move /y solr\build.orig solr\build 
        1 dir(s) moved.

C:\Users\jenkins\workspace\Lucene-Solr-7.x-Windows>exit 0 
Archiving artifacts
Setting ANT_1_8_2_HOME=C:\Users\jenkins\tools\hudson.tasks.Ant_AntInstallation\ANT_1.8.2
[WARNINGS] Parsing warnings in console log with parser Java Compiler (javac)
Setting ANT_1_8_2_HOME=C:\Users\jenkins\tools\hudson.tasks.Ant_AntInstallation\ANT_1.8.2
Setting ANT_1_8_2_HOME=C:\Users\jenkins\tools\hudson.tasks.Ant_AntInstallation\ANT_1.8.2
<Git Blamer> Using GitBlamer to create author and commit information for all warnings.
<Git Blamer> GIT_COMMIT=e8503da7c43b8ff3eb968c631ca2ac718a2c736b, workspace=C:\Users\jenkins\workspace\Lucene-Solr-7.x-Windows
[WARNINGS] Computing warning deltas based on reference build #862
Recording test results
Setting ANT_1_8_2_HOME=C:\Users\jenkins\tools\hudson.tasks.Ant_AntInstallation\ANT_1.8.2
Build step 'Publish JUnit test result report' changed build result to UNSTABLE
Email was triggered for: Unstable (Test Failures)
Sending email for trigger: Unstable (Test Failures)
Setting ANT_1_8_2_HOME=C:\Users\jenkins\tools\hudson.tasks.Ant_AntInstallation\ANT_1.8.2
Setting ANT_1_8_2_HOME=C:\Users\jenkins\tools\hudson.tasks.Ant_AntInstallation\ANT_1.8.2
Setting ANT_1_8_2_HOME=C:\Users\jenkins\tools\hudson.tasks.Ant_AntInstallation\ANT_1.8.2
Setting ANT_1_8_2_HOME=C:\Users\jenkins\tools\hudson.tasks.Ant_AntInstallation\ANT_1.8.2

Mime
View raw message