lucene-dev mailing list archives

Site index · List index
Message view « Date » · « Thread »
Top « Date » · « Thread »
From Apache Jenkins Server <jenk...@builds.apache.org>
Subject [JENKINS] Lucene-Solr-Tests-master - Build # 2835 - Unstable
Date Mon, 01 Oct 2018 04:48:34 GMT
Build: https://builds.apache.org/job/Lucene-Solr-Tests-master/2835/

1 tests failed.
FAILED:  org.apache.solr.cloud.autoscaling.sim.TestSimTriggerIntegration.testNodeLostTriggerRestoreState

Error Message:
java.util.concurrent.TimeoutException: last ClusterState: znodeVersion: 35 live nodes:[127.0.0.1:10012_solr, 127.0.0.1:10011_solr] collections:{collection1=DocCollection(collection1//clusterstate.json/35)={"shards":{}}, .system=DocCollection(.system//clusterstate.json/35)={"shards":{}}}, last coll state: DocCollection(.system//clusterstate.json/35)={"shards":{}}

Stack Trace:
java.io.IOException: java.util.concurrent.TimeoutException: last ClusterState: znodeVersion: 35
live nodes:[127.0.0.1:10012_solr, 127.0.0.1:10011_solr]
collections:{collection1=DocCollection(collection1//clusterstate.json/35)={"shards":{}}, .system=DocCollection(.system//clusterstate.json/35)={"shards":{}}}, last coll state: DocCollection(.system//clusterstate.json/35)={"shards":{}}
	at __randomizedtesting.SeedInfo.seed([E0F0767337D3CD52:CB0FA328ADABD882]:0)
	at org.apache.solr.cloud.autoscaling.sim.SimClusterStateProvider.createSystemCollection(SimClusterStateProvider.java:1344)
	at org.apache.solr.cloud.autoscaling.sim.TestSimTriggerIntegration.setupTest(TestSimTriggerIntegration.java:156)
	at sun.reflect.NativeMethodAccessorImpl.invoke0(Native Method)
	at sun.reflect.NativeMethodAccessorImpl.invoke(NativeMethodAccessorImpl.java:62)
	at sun.reflect.DelegatingMethodAccessorImpl.invoke(DelegatingMethodAccessorImpl.java:43)
	at java.lang.reflect.Method.invoke(Method.java:498)
	at com.carrotsearch.randomizedtesting.RandomizedRunner.invoke(RandomizedRunner.java:1742)
	at com.carrotsearch.randomizedtesting.RandomizedRunner$9.evaluate(RandomizedRunner.java:969)
	at com.carrotsearch.randomizedtesting.RandomizedRunner$10.evaluate(RandomizedRunner.java:985)
	at com.carrotsearch.randomizedtesting.rules.SystemPropertiesRestoreRule$1.evaluate(SystemPropertiesRestoreRule.java:57)
	at org.apache.lucene.util.TestRuleSetupTeardownChained$1.evaluate(TestRuleSetupTeardownChained.java:49)
	at org.apache.lucene.util.AbstractBeforeAfterRule$1.evaluate(AbstractBeforeAfterRule.java:45)
	at org.apache.lucene.util.TestRuleThreadAndTestName$1.evaluate(TestRuleThreadAndTestName.java:48)
	at org.apache.lucene.util.TestRuleIgnoreAfterMaxFailures$1.evaluate(TestRuleIgnoreAfterMaxFailures.java:64)
	at org.apache.lucene.util.TestRuleMarkFailure$1.evaluate(TestRuleMarkFailure.java:47)
	at com.carrotsearch.randomizedtesting.rules.StatementAdapter.evaluate(StatementAdapter.java:36)
	at com.carrotsearch.randomizedtesting.ThreadLeakControl$StatementRunner.run(ThreadLeakControl.java:368)
	at com.carrotsearch.randomizedtesting.ThreadLeakControl.forkTimeoutingTask(ThreadLeakControl.java:817)
	at com.carrotsearch.randomizedtesting.ThreadLeakControl$3.evaluate(ThreadLeakControl.java:468)
	at com.carrotsearch.randomizedtesting.RandomizedRunner.runSingleTest(RandomizedRunner.java:944)
	at com.carrotsearch.randomizedtesting.RandomizedRunner$5.evaluate(RandomizedRunner.java:830)
	at com.carrotsearch.randomizedtesting.RandomizedRunner$6.evaluate(RandomizedRunner.java:880)
	at com.carrotsearch.randomizedtesting.RandomizedRunner$7.evaluate(RandomizedRunner.java:891)
	at com.carrotsearch.randomizedtesting.rules.StatementAdapter.evaluate(StatementAdapter.java:36)
	at com.carrotsearch.randomizedtesting.rules.SystemPropertiesRestoreRule$1.evaluate(SystemPropertiesRestoreRule.java:57)
	at org.apache.lucene.util.AbstractBeforeAfterRule$1.evaluate(AbstractBeforeAfterRule.java:45)
	at com.carrotsearch.randomizedtesting.rules.StatementAdapter.evaluate(StatementAdapter.java:36)
	at org.apache.lucene.util.TestRuleStoreClassName$1.evaluate(TestRuleStoreClassName.java:41)
	at com.carrotsearch.randomizedtesting.rules.NoShadowingOrOverridesOnMethodsRule$1.evaluate(NoShadowingOrOverridesOnMethodsRule.java:40)
	at com.carrotsearch.randomizedtesting.rules.NoShadowingOrOverridesOnMethodsRule$1.evaluate(NoShadowingOrOverridesOnMethodsRule.java:40)
	at com.carrotsearch.randomizedtesting.rules.StatementAdapter.evaluate(StatementAdapter.java:36)
	at com.carrotsearch.randomizedtesting.rules.StatementAdapter.evaluate(StatementAdapter.java:36)
	at com.carrotsearch.randomizedtesting.rules.StatementAdapter.evaluate(StatementAdapter.java:36)
	at org.apache.lucene.util.TestRuleAssertionsRequired$1.evaluate(TestRuleAssertionsRequired.java:53)
	at org.apache.lucene.util.TestRuleMarkFailure$1.evaluate(TestRuleMarkFailure.java:47)
	at org.apache.lucene.util.TestRuleIgnoreAfterMaxFailures$1.evaluate(TestRuleIgnoreAfterMaxFailures.java:64)
	at org.apache.lucene.util.TestRuleIgnoreTestSuites$1.evaluate(TestRuleIgnoreTestSuites.java:54)
	at com.carrotsearch.randomizedtesting.rules.StatementAdapter.evaluate(StatementAdapter.java:36)
	at com.carrotsearch.randomizedtesting.ThreadLeakControl$StatementRunner.run(ThreadLeakControl.java:368)
	at java.lang.Thread.run(Thread.java:748)
Caused by: java.util.concurrent.TimeoutException: last ClusterState: znodeVersion: 35
live nodes:[127.0.0.1:10012_solr, 127.0.0.1:10011_solr]
collections:{collection1=DocCollection(collection1//clusterstate.json/35)={"shards":{}}, .system=DocCollection(.system//clusterstate.json/35)={"shards":{}}}, last coll state: DocCollection(.system//clusterstate.json/35)={"shards":{}}
	at org.apache.solr.cloud.CloudTestUtils.waitForState(CloudTestUtils.java:112)
	at org.apache.solr.cloud.autoscaling.sim.SimClusterStateProvider.createSystemCollection(SimClusterStateProvider.java:1341)
	... 39 more




Build Log:
[...truncated 14368 lines...]
   [junit4] Suite: org.apache.solr.cloud.autoscaling.sim.TestSimTriggerIntegration
   [junit4]   2> Creating dataDir: /home/jenkins/jenkins-slave/workspace/Lucene-Solr-Tests-master/solr/build/solr-core/test/J2/temp/solr.cloud.autoscaling.sim.TestSimTriggerIntegration_E0F0767337D3CD52-001/init-core-data-001
   [junit4]   2> 4112655 WARN  (SUITE-TestSimTriggerIntegration-seed#[E0F0767337D3CD52]-worker) [    ] o.a.s.SolrTestCaseJ4 startTrackingSearchers: numOpens=32 numCloses=32
   [junit4]   2> 4112656 INFO  (SUITE-TestSimTriggerIntegration-seed#[E0F0767337D3CD52]-worker) [    ] o.a.s.SolrTestCaseJ4 Using PointFields (NUMERIC_POINTS_SYSPROP=true) w/NUMERIC_DOCVALUES_SYSPROP=false
   [junit4]   2> 4112657 INFO  (SUITE-TestSimTriggerIntegration-seed#[E0F0767337D3CD52]-worker) [    ] o.a.s.SolrTestCaseJ4 Randomized ssl (true) and clientAuth (false) via: @org.apache.solr.util.RandomizeSSL(reason=, ssl=NaN, value=NaN, clientAuth=NaN)
   [junit4]   2> 4112657 INFO  (SUITE-TestSimTriggerIntegration-seed#[E0F0767337D3CD52]-worker) [    ] o.a.s.SolrTestCaseJ4 SecureRandom sanity checks: test.solr.allowed.securerandom=null & java.security.egd=file:/dev/./urandom
   [junit4]   2> 4112720 DEBUG (Simulated OverseerAutoScalingTriggerThread) [    ] o.a.s.c.a.OverseerTriggerThread Adding .auto_add_replicas and .scheduled_maintenance triggers
   [junit4]   2> 4112721 DEBUG (Simulated OverseerAutoScalingTriggerThread) [    ] o.a.s.c.a.OverseerTriggerThread Refreshing /autoscaling.json with znode version 0
   [junit4]   2> 4112721 DEBUG (Simulated OverseerAutoScalingTriggerThread) [    ] o.a.s.c.a.OverseerTriggerThread Current znodeVersion 0, lastZnodeVersion -1
   [junit4]   2> 4112721 DEBUG (Simulated OverseerAutoScalingTriggerThread) [    ] o.a.s.c.a.OverseerTriggerThread Processed trigger updates upto znodeVersion 0
   [junit4]   2> 4112722 DEBUG (Simulated OverseerAutoScalingTriggerThread) [    ] o.a.s.c.a.NodeLostTrigger NodeLostTrigger .auto_add_replicas - Initial livenodes: [127.0.0.1:10007_solr]
   [junit4]   2> 4112722 DEBUG (SUITE-TestSimTriggerIntegration-seed#[E0F0767337D3CD52]-worker) [    ] o.a.s.c.a.s.SimClusterStateProvider --- new Overseer leader: 127.0.0.1:10007_solr
   [junit4]   2> 4112722 DEBUG (Simulated OverseerAutoScalingTriggerThread) [    ] o.a.s.c.a.OverseerTriggerThread -- clean old nodeAdded markers
   [junit4]   2> 4112722 DEBUG (Simulated OverseerAutoScalingTriggerThread) [    ] o.a.s.c.a.OverseerTriggerThread Current znodeVersion 0, lastZnodeVersion 0
   [junit4]   2> 4112722 DEBUG (ScheduledTrigger-7437-thread-2) [    ] o.a.s.c.a.NodeLostTrigger Running NodeLostTrigger: .auto_add_replicas with currently live nodes: 1
   [junit4]   2> 4112722 DEBUG (SUITE-TestSimTriggerIntegration-seed#[E0F0767337D3CD52]-worker) [    ] o.a.s.c.a.s.SimClusterStateProvider ** creating new collection states
   [junit4]   2> 4112723 DEBUG (SUITE-TestSimTriggerIntegration-seed#[E0F0767337D3CD52]-worker) [    ] o.a.s.c.a.s.SimClusterStateProvider ** saved cluster state version -1
   [junit4]   2> 4112723 INFO  (SUITE-TestSimTriggerIntegration-seed#[E0F0767337D3CD52]-worker) [    ] o.a.s.h.a.MetricsHistoryHandler No .system collection, keeping metrics history in memory.
   [junit4]   2> 4112726 INFO  (TEST-TestSimTriggerIntegration.testEventFromRestoredState-seed#[E0F0767337D3CD52]) [    ] o.a.s.SolrTestCaseJ4 ###Starting testEventFromRestoredState
   [junit4]   2> 4112726 DEBUG (TEST-TestSimTriggerIntegration.testEventFromRestoredState-seed#[E0F0767337D3CD52]) [    ] o.a.s.c.a.OverseerTriggerThread Refreshing /autoscaling.json with znode version 1
   [junit4]   2> 4112726 DEBUG (Simulated OverseerAutoScalingTriggerThread) [    ] o.a.s.c.a.OverseerTriggerThread Processed trigger updates upto znodeVersion 1
   [junit4]   2> 4112726 INFO  (TEST-TestSimTriggerIntegration.testEventFromRestoredState-seed#[E0F0767337D3CD52]) [    ] o.a.s.c.a.s.SimCloudManager === Restarting OverseerTriggerThread and clearing object cache...
   [junit4]   2> 4112726 DEBUG (Simulated OverseerAutoScalingTriggerThread) [    ] o.a.s.c.a.OverseerTriggerThread -- clean old nodeLost markers
   [junit4]   2> 4112726 DEBUG (TEST-TestSimTriggerIntegration.testEventFromRestoredState-seed#[E0F0767337D3CD52]) [    ] o.a.s.c.a.ScheduledTriggers Shutting down scheduled thread pool executor now
   [junit4]   2> 4112727 DEBUG (Simulated OverseerAutoScalingTriggerThread) [    ] o.a.s.c.a.OverseerTriggerThread -- clean old nodeAdded markers
   [junit4]   2> 4112727 WARN  (Simulated OverseerAutoScalingTriggerThread) [    ] o.a.s.c.a.OverseerTriggerThread Interrupted
   [junit4]   2> java.lang.InterruptedException: null
   [junit4]   2> 	at java.util.concurrent.locks.AbstractQueuedSynchronizer.acquireInterruptibly(AbstractQueuedSynchronizer.java:1220) ~[?:1.8.0_172]
   [junit4]   2> 	at java.util.concurrent.locks.ReentrantLock.lockInterruptibly(ReentrantLock.java:335) ~[?:1.8.0_172]
   [junit4]   2> 	at org.apache.solr.cloud.autoscaling.OverseerTriggerThread.run(OverseerTriggerThread.java:177) [java/:?]
   [junit4]   2> 	at java.lang.Thread.run(Thread.java:748) [?:1.8.0_172]
   [junit4]   2> 4112739 DEBUG (TEST-TestSimTriggerIntegration.testEventFromRestoredState-seed#[E0F0767337D3CD52]) [    ] o.a.s.c.a.ScheduledTriggers Shutting down action executor now
   [junit4]   2> 4112741 DEBUG (TEST-TestSimTriggerIntegration.testEventFromRestoredState-seed#[E0F0767337D3CD52]) [    ] o.a.s.c.a.ScheduledTriggers Awaiting termination for action executor
   [junit4]   2> 4112741 DEBUG (TEST-TestSimTriggerIntegration.testEventFromRestoredState-seed#[E0F0767337D3CD52]) [    ] o.a.s.c.a.ScheduledTriggers Awaiting termination for scheduled thread pool executor
   [junit4]   2> 4112741 DEBUG (TEST-TestSimTriggerIntegration.testEventFromRestoredState-seed#[E0F0767337D3CD52]) [    ] o.a.s.c.a.ScheduledTriggers ScheduledTriggers closed completely
   [junit4]   2> 4112741 DEBUG (TEST-TestSimTriggerIntegration.testEventFromRestoredState-seed#[E0F0767337D3CD52]) [    ] o.a.s.c.a.OverseerTriggerThread OverseerTriggerThread has been closed explicitly
   [junit4]   2> 4112741 DEBUG (Simulated OverseerAutoScalingTriggerThread) [    ] o.a.s.c.a.OverseerTriggerThread Adding .auto_add_replicas and .scheduled_maintenance triggers
   [junit4]   2> 4112742 DEBUG (Simulated OverseerAutoScalingTriggerThread) [    ] o.a.s.c.a.OverseerTriggerThread Refreshing /autoscaling.json with znode version 2
   [junit4]   2> 4112742 DEBUG (Simulated OverseerAutoScalingTriggerThread) [    ] o.a.s.c.a.OverseerTriggerThread Current znodeVersion 2, lastZnodeVersion -1
   [junit4]   2> 4112742 DEBUG (Simulated OverseerAutoScalingTriggerThread) [    ] o.a.s.c.a.OverseerTriggerThread Processed trigger updates upto znodeVersion 2
   [junit4]   2> 4112742 DEBUG (Simulated OverseerAutoScalingTriggerThread) [    ] o.a.s.c.a.NodeLostTrigger NodeLostTrigger .auto_add_replicas - Initial livenodes: [127.0.0.1:10008_solr, 127.0.0.1:10007_solr]
   [junit4]   2> 4112742 DEBUG (Simulated OverseerAutoScalingTriggerThread) [    ] o.a.s.c.a.OverseerTriggerThread -- clean old nodeAdded markers
   [junit4]   2> 4112742 DEBUG (Simulated OverseerAutoScalingTriggerThread) [    ] o.a.s.c.a.OverseerTriggerThread Current znodeVersion 2, lastZnodeVersion 2
   [junit4]   2> 4112742 DEBUG (ScheduledTrigger-7442-thread-2) [    ] o.a.s.c.a.NodeLostTrigger Running NodeLostTrigger: .auto_add_replicas with currently live nodes: 2
   [junit4]   2> 4112769 DEBUG (ScheduledTrigger-7442-thread-3) [    ] o.a.s.c.a.NodeLostTrigger Running NodeLostTrigger: .auto_add_replicas with currently live nodes: 2
   [junit4]   2> 4112789 DEBUG (ScheduledTrigger-7442-thread-4) [    ] o.a.s.c.a.NodeLostTrigger Running NodeLostTrigger: .auto_add_replicas with currently live nodes: 2
   [junit4]   2> 4112810 DEBUG (ScheduledTrigger-7442-thread-3) [    ] o.a.s.c.a.NodeLostTrigger Running NodeLostTrigger: .auto_add_replicas with currently live nodes: 2
   [junit4]   2> 4112830 DEBUG (ScheduledTrigger-7442-thread-4) [    ] o.a.s.c.a.NodeLostTrigger Running NodeLostTrigger: .auto_add_replicas with currently live nodes: 2
   [junit4]   2> 4112843 DEBUG (simCloudManagerPool-7441-thread-1) [    ] o.a.s.c.a.s.SimClusterStateProvider ** creating new collection states
   [junit4]   2> 4112844 DEBUG (simCloudManagerPool-7441-thread-1) [    ] o.a.s.c.a.s.SimClusterStateProvider ** saved cluster state version 0
   [junit4]   2> 4112844 DEBUG (simCloudManagerPool-7441-thread-1) [    ] o.a.s.c.a.AutoScalingHandler Verified autoscaling configuration
   [junit4]   2> 4112844 DEBUG (simCloudManagerPool-7441-thread-1) [    ] o.a.s.c.a.OverseerTriggerThread Refreshing /autoscaling.json with znode version 3
   [junit4]   2> 4112847 DEBUG (Simulated OverseerAutoScalingTriggerThread) [    ] o.a.s.c.a.OverseerTriggerThread Processed trigger updates upto znodeVersion 3
   [junit4]   2> 4112850 DEBUG (Simulated OverseerAutoScalingTriggerThread) [    ] o.a.s.c.a.OverseerTriggerThread -- clean old nodeAdded markers
   [junit4]   2> 4112850 DEBUG (Simulated OverseerAutoScalingTriggerThread) [    ] o.a.s.c.a.OverseerTriggerThread Current znodeVersion 3, lastZnodeVersion 3
   [junit4]   2> 4112850 DEBUG (ScheduledTrigger-7442-thread-2) [    ] o.a.s.c.a.NodeLostTrigger Running NodeLostTrigger: .auto_add_replicas with currently live nodes: 2
   [junit4]   2> 4112850 DEBUG (TEST-TestSimTriggerIntegration.testEventFromRestoredState-seed#[E0F0767337D3CD52]) [    ] o.a.s.c.a.s.SimClusterStateProvider ** creating new collection states
   [junit4]   2> 4112850 DEBUG (TEST-TestSimTriggerIntegration.testEventFromRestoredState-seed#[E0F0767337D3CD52]) [    ] o.a.s.c.a.s.SimClusterStateProvider ** saved cluster state version 1
   [junit4]   2> 4112870 DEBUG (ScheduledTrigger-7442-thread-2) [    ] o.a.s.c.a.NodeLostTrigger Running NodeLostTrigger: .auto_add_replicas with currently live nodes: 2
   [junit4]   2> 4112898 DEBUG (ScheduledTrigger-7442-thread-2) [    ] o.a.s.c.a.NodeLostTrigger Running NodeLostTrigger: .auto_add_replicas with currently live nodes: 2
   [junit4]   2> 4112919 DEBUG (ScheduledTrigger-7442-thread-2) [    ] o.a.s.c.a.NodeLostTrigger Running NodeLostTrigger: .auto_add_replicas with currently live nodes: 2
   [junit4]   2> 4112937 DEBUG (simCloudManagerPool-7441-thread-2) [    ] o.a.s.c.a.s.SimClusterStateProvider ** creating new collection states
   [junit4]   2> 4112938 DEBUG (simCloudManagerPool-7441-thread-2) [    ] o.a.s.c.a.s.SimClusterStateProvider ** saved cluster state version 2
   [junit4]   2> 4112955 DEBUG (ScheduledTrigger-7442-thread-2) [    ] o.a.s.c.a.NodeLostTrigger Running NodeLostTrigger: .auto_add_replicas with currently live nodes: 2
   [junit4]   2> 4112979 DEBUG (ScheduledTrigger-7442-thread-1) [    ] o.a.s.c.a.NodeLostTrigger Running NodeLostTrigger: .auto_add_replicas with currently live nodes: 2
   [junit4]   2> 4112995 DEBUG (simCloudManagerPool-7441-thread-3) [    ] o.a.s.c.a.s.SimClusterStateProvider -- elected new leader for .system / shard1: {"core_node1":{
   [junit4]   2>     "core":".system_shard1_replica_n1",
   [junit4]   2>     "shard":"shard1",
   [junit4]   2>     "collection":".system",
   [junit4]   2>     "node_name":"127.0.0.1:10008_solr",
   [junit4]   2>     "type":"NRT",
   [junit4]   2>     "leader":"true",
   [junit4]   2>     "SEARCHER.searcher.maxDoc":0,
   [junit4]   2>     "SEARCHER.searcher.deletedDocs":0,
   [junit4]   2>     "INDEX.sizeInBytes":10240,
   [junit4]   2>     "state":"active",
   [junit4]   2>     "INDEX.sizeInGB":9.5367431640625E-6,
   [junit4]   2>     "SEARCHER.searcher.numDocs":0}}
   [junit4]   2> 4112996 DEBUG (TEST-TestSimTriggerIntegration.testEventFromRestoredState-seed#[E0F0767337D3CD52]) [    ] o.a.s.c.a.s.SimClusterStateProvider ** creating new collection states
   [junit4]   2> 4112996 DEBUG (TEST-TestSimTriggerIntegration.testEventFromRestoredState-seed#[E0F0767337D3CD52]) [    ] o.a.s.c.a.s.SimClusterStateProvider ** saved cluster state version 3
   [junit4]   2> 4113015 DEBUG (ScheduledTrigger-7442-thread-1) [    ] o.a.s.c.a.NodeLostTrigger Running NodeLostTrigger: .auto_add_replicas with currently live nodes: 2
   [junit4]   2> 4113018 DEBUG (simCloudManagerPool-7441-thread-4) [    ] o.a.s.c.a.AutoScalingHandler Verified autoscaling configuration
   [junit4]   2> 4113018 DEBUG (simCloudManagerPool-7441-thread-4) [    ] o.a.s.c.a.OverseerTriggerThread Refreshing /autoscaling.json with znode version 4
   [junit4]   2> 4113032 DEBUG (Simulated OverseerAutoScalingTriggerThread) [    ] o.a.s.c.a.OverseerTriggerThread Processed trigger updates upto znodeVersion 4
   [junit4]   2> 4113032 INFO  (Simulated OverseerAutoScalingTriggerThread) [    ] o.a.s.c.a.s.TestSimTriggerIntegration TestTriggerAction init
   [junit4]   2> 4113032 DEBUG (Simulated OverseerAutoScalingTriggerThread) [    ] o.a.s.c.a.NodeAddedTrigger NodeAddedTrigger node_added_trigger - Initial livenodes: [127.0.0.1:10008_solr, 127.0.0.1:10007_solr]
   [junit4]   2> 4113032 DEBUG (Simulated OverseerAutoScalingTriggerThread) [    ] o.a.s.c.a.NodeAddedTrigger NodeAddedTrigger node_added_trigger instantiated with properties: {event=nodeAdded, waitFor=10, actions=[{name=test, class=org.apache.solr.cloud.autoscaling.sim.TestSimTriggerIntegration$TestTriggerAction}], enabled=true}
   [junit4]   2> 4113032 DEBUG (Simulated OverseerAutoScalingTriggerThread) [    ] o.a.s.c.a.OverseerTriggerThread Current znodeVersion 4, lastZnodeVersion 4
   [junit4]   2> 4113034 DEBUG (ScheduledTrigger-7442-thread-4) [    ] o.a.s.c.a.NodeAddedTrigger Running NodeAddedTrigger node_added_trigger
   [junit4]   2> 4113034 DEBUG (ScheduledTrigger-7442-thread-4) [    ] o.a.s.c.a.NodeAddedTrigger Found livenodes: 3
   [junit4]   2> 4113034 DEBUG (ScheduledTrigger-7442-thread-4) [    ] o.a.s.c.a.NodeAddedTrigger Tracking new node: 127.0.0.1:10009_solr at time 20877580308158750
   [junit4]   2> 4113048 DEBUG (ScheduledTrigger-7442-thread-2) [    ] o.a.s.c.a.NodeLostTrigger Running NodeLostTrigger: .auto_add_replicas with currently live nodes: 3
   [junit4]   2> 4113054 DEBUG (ScheduledTrigger-7442-thread-4) [    ] o.a.s.c.a.NodeAddedTrigger Running NodeAddedTrigger node_added_trigger
   [junit4]   2> 4113054 DEBUG (ScheduledTrigger-7442-thread-4) [    ] o.a.s.c.a.NodeAddedTrigger Found livenodes: 3
   [junit4]   2> 4113070 DEBUG (ScheduledTrigger-7442-thread-1) [    ] o.a.s.c.a.NodeLostTrigger Running NodeLostTrigger: .auto_add_replicas with currently live nodes: 3
   [junit4]   2> 4113089 DEBUG (ScheduledTrigger-7442-thread-4) [    ] o.a.s.c.a.NodeAddedTrigger Running NodeAddedTrigger node_added_trigger
   [junit4]   2> 4113089 DEBUG (ScheduledTrigger-7442-thread-4) [    ] o.a.s.c.a.NodeAddedTrigger Found livenodes: 3
   [junit4]   2> 4113090 DEBUG (ScheduledTrigger-7442-thread-3) [    ] o.a.s.c.a.NodeLostTrigger Running NodeLostTrigger: .auto_add_replicas with currently live nodes: 3
   [junit4]   2> 4113125 DEBUG (ScheduledTrigger-7442-thread-4) [    ] o.a.s.c.a.NodeAddedTrigger Running NodeAddedTrigger node_added_trigger
   [junit4]   2> 4113125 DEBUG (ScheduledTrigger-7442-thread-4) [    ] o.a.s.c.a.NodeAddedTrigger Found livenodes: 3
   [junit4]   2> 4113125 DEBUG (ScheduledTrigger-7442-thread-4) [    ] o.a.s.c.a.NodeLostTrigger Running NodeLostTrigger: .auto_add_replicas with currently live nodes: 3
   [junit4]   2> 4113162 DEBUG (ScheduledTrigger-7442-thread-4) [    ] o.a.s.c.a.NodeAddedTrigger Running NodeAddedTrigger node_added_trigger
   [junit4]   2> 4113162 DEBUG (ScheduledTrigger-7442-thread-4) [    ] o.a.s.c.a.NodeAddedTrigger Found livenodes: 3
   [junit4]   2> 4113162 DEBUG (ScheduledTrigger-7442-thread-4) [    ] o.a.s.c.a.NodeLostTrigger Running NodeLostTrigger: .auto_add_replicas with currently live nodes: 3
   [junit4]   2> 4113198 DEBUG (ScheduledTrigger-7442-thread-4) [    ] o.a.s.c.a.NodeAddedTrigger Running NodeAddedTrigger node_added_trigger
   [junit4]   2> 4113198 DEBUG (ScheduledTrigger-7442-thread-4) [    ] o.a.s.c.a.NodeAddedTrigger Found livenodes: 3
   [junit4]   2> 4113198 DEBUG (ScheduledTrigger-7442-thread-4) [    ] o.a.s.c.a.NodeLostTrigger Running NodeLostTrigger: .auto_add_replicas with currently live nodes: 3
   [junit4]   2> 4113235 DEBUG (ScheduledTrigger-7442-thread-2) [    ] o.a.s.c.a.NodeLostTrigger Running NodeLostTrigger: .auto_add_replicas with currently live nodes: 3
   [junit4]   2> 4113219 DEBUG (ScheduledTrigger-7442-thread-4) [    ] o.a.s.c.a.NodeAddedTrigger Running NodeAddedTrigger node_added_trigger
   [junit4]   2> 4113252 DEBUG (ScheduledTrigger-7442-thread-4) [    ] o.a.s.c.a.NodeAddedTrigger Found livenodes: 3
   [junit4]   2> 4113252 DEBUG (ScheduledTrigger-7442-thread-4) [    ] o.a.s.c.a.NodeAddedTrigger NodeAddedTrigger node_added_trigger firing registered processor for nodes: [127.0.0.1:10009_solr] added at times [20877580308158750], now=20877591228867150
   [junit4]   2> 4113253 DEBUG (ScheduledTrigger-7442-thread-4) [    ] o.a.s.c.a.ScheduledTriggers ++++++++ Cooldown inactive - processing event: {
   [junit4]   2>   "id":"4a2c0c7609991eT30g0hwi6dfuaafsmw6v7oxj6v",
   [junit4]   2>   "source":"node_added_trigger",
   [junit4]   2>   "eventTime":20877580308158750,
   [junit4]   2>   "eventType":"NODEADDED",
   [junit4]   2>   "properties":{
   [junit4]   2>     "eventTimes":[20877580308158750],
   [junit4]   2>     "preferredOperation":"movereplica",
   [junit4]   2>     "nodeNames":["127.0.0.1:10009_solr"]}}
   [junit4]   2> 4113287 DEBUG (ScheduledTrigger-7442-thread-4) [    ] o.a.s.c.a.ScheduledTriggers Pausing all triggers: [.auto_add_replicas, node_added_trigger]
   [junit4]   2> 4113314 DEBUG (ScheduledTrigger-7442-thread-4) [    ] o.a.s.c.a.NodeAddedTrigger NodeAddedTrigger node_added_trigger - removing marker path: /autoscaling/nodeAdded/127.0.0.1:10009_solr
   [junit4]   2> 4113315 DEBUG (AutoscalingActionExecutor-7443-thread-1) [    ] o.a.s.c.a.ScheduledTriggers -- processing actions for {
   [junit4]   2>   "id":"4a2c0c7609991eT30g0hwi6dfuaafsmw6v7oxj6v",
   [junit4]   2>   "source":"node_added_trigger",
   [junit4]   2>   "eventTime":20877580308158750,
   [junit4]   2>   "eventType":"NODEADDED",
   [junit4]   2>   "properties":{
   [junit4]   2>     "eventTimes":[20877580308158750],
   [junit4]   2>     "preferredOperation":"movereplica",
   [junit4]   2>     "_enqueue_time_":20877592974820550,
   [junit4]   2>     "nodeNames":["127.0.0.1:10009_solr"]}}
   [junit4]   2> 4113316 DEBUG (AutoscalingActionExecutor-7443-thread-1) [    ] o.a.s.c.a.ScheduledTriggers Resuming trigger: .auto_add_replicas after 100ms
   [junit4]   2> 4113316 DEBUG (AutoscalingActionExecutor-7443-thread-1) [    ] o.a.s.c.a.ScheduledTriggers Resuming trigger: node_added_trigger after 100ms
   [junit4]   2> 4113316 DEBUG (AutoscalingActionExecutor-7443-thread-1) [    ] o.a.s.c.a.ScheduledTriggers -- processing took 57 ms for event id=4a2c0c7609991eT30g0hwi6dfuaafsmw6v7oxj6v
   [junit4]   2> 4113416 DEBUG (ScheduledTrigger-7442-thread-1) [    ] o.a.s.c.a.NodeLostTrigger Running NodeLostTrigger: .auto_add_replicas with currently live nodes: 4
   [junit4]   2> 4113455 DEBUG (ScheduledTrigger-7442-thread-1) [    ] o.a.s.c.a.NodeAddedTrigger Running NodeAddedTrigger node_added_trigger
   [junit4]   2> 4113455 DEBUG (ScheduledTrigger-7442-thread-1) [    ] o.a.s.c.a.NodeAddedTrigger Found livenodes: 4
   [junit4]   2> 4113455 DEBUG (ScheduledTrigger-7442-thread-1) [    ] o.a.s.c.a.NodeAddedTrigger Tracking new node: 127.0.0.1:10010_solr at time 20877601352238550
   [junit4]   2> 4113458 DEBUG (ScheduledTrigger-7442-thread-2) [    ] o.a.s.c.a.NodeLostTrigger Running NodeLostTrigger: .auto_add_replicas with currently live nodes: 4
   [junit4]   2> 4113475 DEBUG (ScheduledTrigger-7442-thread-1) [    ] o.a.s.c.a.NodeAddedTrigger Running NodeAddedTrigger node_added_trigger
   [junit4]   2> 4113475 DEBUG (ScheduledTrigger-7442-thread-1) [    ] o.a.s.c.a.NodeAddedTrigger Found livenodes: 4
   [junit4]   2> 4113479 DEBUG (ScheduledTrigger-7442-thread-4) [    ] o.a.s.c.a.NodeLostTrigger Running NodeLostTrigger: .auto_add_replicas with currently live nodes: 4
   [junit4]   2> 4113495 DEBUG (ScheduledTrigger-7442-thread-3) [    ] o.a.s.c.a.NodeAddedTrigger Running NodeAddedTrigger node_added_trigger
   [junit4]   2> 4113495 DEBUG (ScheduledTrigger-7442-thread-3) [    ] o.a.s.c.a.NodeAddedTrigger Found livenodes: 4
   [junit4]   2> 4113529 INFO  (TEST-TestSimTriggerIntegration.testEventFromRestoredState-seed#[E0F0767337D3CD52]) [    ] o.a.s.c.a.s.SimCloudManager === Restarting OverseerTriggerThread and clearing object cache...
   [junit4]   2> 4113529 WARN  (Simulated OverseerAutoScalingTriggerThread) [    ] o.a.s.c.a.OverseerTriggerThread OverseerTriggerThread woken up but we are closed, exiting.
   [junit4]   2> 4113529 DEBUG (TEST-TestSimTriggerIntegration.testEventFromRestoredState-seed#[E0F0767337D3CD52]) [    ] o.a.s.c.a.ScheduledTriggers Shutting down scheduled thread pool executor now
   [junit4]   2> 4113529 DEBUG (TEST-TestSimTriggerIntegration.testEventFromRestoredState-seed#[E0F0767337D3CD52]) [    ] o.a.s.c.a.ScheduledTriggers Shutting down action executor now
   [junit4]   2> 4113530 DEBUG (TEST-TestSimTriggerIntegration.testEventFromRestoredState-seed#[E0F0767337D3CD52]) [    ] o.a.s.c.a.ScheduledTriggers Awaiting termination for action executor
   [junit4]   2> 4113530 DEBUG (TEST-TestSimTriggerIntegration.testEventFromRestoredState-seed#[E0F0767337D3CD52]) [    ] o.a.s.c.a.ScheduledTriggers Awaiting termination for scheduled thread pool executor
   [junit4]   2> 4113539 DEBUG (TEST-TestSimTriggerIntegration.testEventFromRestoredState-seed#[E0F0767337D3CD52]) [    ] o.a.s.c.a.ScheduledTriggers ScheduledTriggers closed completely
   [junit4]   2> 4113539 DEBUG (TEST-TestSimTriggerIntegration.testEventFromRestoredState-seed#[E0F0767337D3CD52]) [    ] o.a.s.c.a.OverseerTriggerThread OverseerTriggerThread has been closed explicitly
   [junit4]   2> 4113564 DEBUG (Simulated OverseerAutoScalingTriggerThread) [    ] o.a.s.c.a.OverseerTriggerThread Refreshing /autoscaling.json with znode version 4
   [junit4]   2> 4113564 DEBUG (Simulated OverseerAutoScalingTriggerThread) [    ] o.a.s.c.a.OverseerTriggerThread Current znodeVersion 4, lastZnodeVersion -1
   [junit4]   2> 4113564 DEBUG (Simulated OverseerAutoScalingTriggerThread) [    ] o.a.s.c.a.OverseerTriggerThread Processed trigger updates upto znodeVersion 4
   [junit4]   2> 4113564 DEBUG (Simulated OverseerAutoScalingTriggerThread) [    ] o.a.s.c.a.NodeLostTrigger NodeLostTrigger .auto_add_replicas - Initial livenodes: [127.0.0.1:10010_solr, 127.0.0.1:10009_solr, 127.0.0.1:10008_solr, 127.0.0.1:10007_solr]
   [junit4]   2> 4113565 INFO  (Simulated OverseerAutoScalingTriggerThread) [    ] o.a.s.c.a.s.TestSimTriggerIntegration TestTriggerAction init
   [junit4]   2> 4113565 DEBUG (Simulated OverseerAutoScalingTriggerThread) [    ] o.a.s.c.a.NodeAddedTrigger NodeAddedTrigger node_added_trigger - Initial livenodes: [127.0.0.1:10010_solr, 127.0.0.1:10009_solr, 127.0.0.1:10008_solr, 127.0.0.1:10007_solr]
   [junit4]   2> 4113565 DEBUG (Simulated OverseerAutoScalingTriggerThread) [    ] o.a.s.c.a.NodeAddedTrigger NodeAddedTrigger node_added_trigger instantiated with properties: {event=nodeAdded, waitFor=10, actions=[{name=test, class=org.apache.solr.cloud.autoscaling.sim.TestSimTriggerIntegration$TestTriggerAction}], enabled=true}
   [junit4]   2> 4113565 DEBUG (Simulated OverseerAutoScalingTriggerThread) [    ] o.a.s.c.a.NodeAddedTrigger Adding node from marker path: 127.0.0.1:10010_solr
   [junit4]   2> 4113565 DEBUG (Simulated OverseerAutoScalingTriggerThread) [    ] o.a.s.c.a.NodeAddedTrigger NodeAddedTrigger node_added_trigger - removing marker path: /autoscaling/nodeAdded/127.0.0.1:10010_solr
   [junit4]   2> 4113565 DEBUG (ScheduledTrigger-7445-thread-1) [    ] o.a.s.c.a.NodeLostTrigger Running NodeLostTrigger: .auto_add_replicas with currently live nodes: 4
   [junit4]   2> 4113565 DEBUG (Simulated OverseerAutoScalingTriggerThread) [    ] o.a.s.c.a.OverseerTriggerThread Current znodeVersion 4, lastZnodeVersion 4
   [junit4]   2> 4113565 DEBUG (ScheduledTrigger-7445-thread-2) [    ] o.a.s.c.a.NodeAddedTrigger Running NodeAddedTrigger node_added_trigger
   [junit4]   2> 4113565 DEBUG (ScheduledTrigger-7445-thread-2) [    ] o.a.s.c.a.NodeAddedTrigger Found livenodes: 4
   [junit4]   2> 4113585 DEBUG (ScheduledTrigger-7445-thread-1) [    ] o.a.s.c.a.NodeLostTrigger Running NodeLostTrigger: .auto_add_replicas with currently live nodes: 4
   [junit4]   2> 4113597 DEBUG (ScheduledTrigger-7445-thread-1) [    ] o.a.s.c.a.NodeAddedTrigger Running NodeAddedTrigger node_added_trigger
   [junit4]   2> 4113597 DEBUG (ScheduledTrigger-7445-thread-1) [    ] o.a.s.c.a.NodeAddedTrigger Found livenodes: 4
   [junit4]   2> 4113621 DEBUG (ScheduledTrigger-7445-thread-4) [    ] o.a.s.c.a.NodeAddedTrigger Running NodeAddedTrigger node_added_trigger
   [junit4]   2> 4113621 DEBUG (ScheduledTrigger-7445-thread-4) [    ] o.a.s.c.a.NodeAddedTrigger Found livenodes: 4
   [junit4]   2> 4113621 DEBUG (ScheduledTrigger-7445-thread-2) [    ] o.a.s.c.a.NodeLostTrigger Running NodeLostTrigger: .auto_add_replicas with currently live nodes: 4
   [junit4]   2> 4113661 DEBUG (ScheduledTrigger-7445-thread-4) [    ] o.a.s.c.a.NodeAddedTrigger Running NodeAddedTrigger node_added_trigger
   [junit4]   2> 4113661 DEBUG (ScheduledTrigger-7445-thread-4) [    ] o.a.s.c.a.NodeAddedTrigger Found livenodes: 4
   [junit4]   2> 4113661 DEBUG (ScheduledTrigger-7445-thread-4) [    ] o.a.s.c.a.NodeAddedTrigger NodeAddedTrigger node_added_trigger firing registered processor for nodes: [127.0.0.1:10010_solr] added at times [20877601352238550], now=20877611672447250
   [junit4]   2> 4113661 DEBUG (ScheduledTrigger-7445-thread-4) [    ] o.a.s.c.a.ScheduledTriggers ++++++++ Cooldown inactive - processing event: {
   [junit4]   2>   "id":"4a2c115c5cc5d6T30g0hwi6dfuaafsmw6v7oxj6y",
   [junit4]   2>   "source":"node_added_trigger",
   [junit4]   2>   "eventTime":20877601352238550,
   [junit4]   2>   "eventType":"NODEADDED",
   [junit4]   2>   "properties":{
   [junit4]   2>     "eventTimes":[20877601352238550],
   [junit4]   2>     "preferredOperation":"movereplica",
   [junit4]   2>     "nodeNames":["127.0.0.1:10010_solr"]}}
   [junit4]   2> 4113662 DEBUG (ScheduledTrigger-7445-thread-4) [    ] o.a.s.c.a.ScheduledTriggers Pausing all triggers: [.auto_add_replicas, node_added_trigger]
   [junit4]   2> 4113710 DEBUG (ScheduledTrigger-7445-thread-4) [    ] o.a.s.c.a.NodeAddedTrigger NodeAddedTrigger node_added_trigger - removing marker path: /autoscaling/nodeAdded/127.0.0.1:10010_solr
   [junit4]   2> 4113710 DEBUG (AutoscalingActionExecutor-7446-thread-1) [    ] o.a.s.c.a.ScheduledTriggers -- processing actions for {
   [junit4]   2>   "id":"4a2c115c5cc5d6T30g0hwi6dfuaafsmw6v7oxj6y",
   [junit4]   2>   "source":"node_added_trigger",
   [junit4]   2>   "eventTime":20877601352238550,
   [junit4]   2>   "eventType":"NODEADDED",
   [junit4]   2>   "properties":{
   [junit4]   2>     "eventTimes":[20877601352238550],
   [junit4]   2>     "preferredOperation":"movereplica",
   [junit4]   2>     "_enqueue_time_":20877611697460600,
   [junit4]   2>     "nodeNames":["127.0.0.1:10010_solr"]}}
   [junit4]   2> 4113711 INFO  (TEST-TestSimTriggerIntegration.testEventFromRestoredState-seed#[E0F0767337D3CD52]) [    ] o.a.s.SolrTestCaseJ4 ###Ending testEventFromRestoredState
   [junit4]   2> 4113712 DEBUG (TEST-TestSimTriggerIntegration.testEventFromRestoredState-seed#[E0F0767337D3CD52]) [    ] o.a.s.c.a.s.SimClusterStateProvider ** creating new collection states
   [junit4]   2> 4113712 DEBUG (TEST-TestSimTriggerIntegration.testEventFromRestoredState-seed#[E0F0767337D3CD52]) [    ] o.a.s.c.a.s.SimClusterStateProvider ** saved cluster state version 4
   [junit4]   2> 4113967 DEBUG (AutoscalingActionExecutor-7446-thread-1) [    ] o.a.s.c.a.ScheduledTriggers Resuming trigger: .auto_add_replicas after 100ms
   [junit4]   2> 4113967 DEBUG (AutoscalingActionExecutor-7446-thread-1) [    ] o.a.s.c.a.ScheduledTriggers Resuming trigger: node_added_trigger after 100ms
   [junit4]   2> 4113967 DEBUG (AutoscalingActionExecutor-7446-thread-1) [    ] o.a.s.c.a.ScheduledTriggers -- processing took 12860 ms for event id=4a2c115c5cc5d6T30g0hwi6dfuaafsmw6v7oxj6y
   [junit4]   2> 4113969 INFO  (TEST-TestSimTriggerIntegration.testEventFromRestoredState-seed#[E0F0767337D3CD52]) [    ] o.a.s.c.a.s.SimSolrCloudTestCase #######################################
   [junit4]   2> ############ CLUSTER STATE ############
   [junit4]   2> #######################################
   [junit4]   2> ## Live nodes:		4
   [junit4]   2> ## Empty nodes:	3
   [junit4]   2> ## Dead nodes:		0
   [junit4]   2> ## Collections:
   [junit4]   2> ##  * .system
   [junit4]   2> ##    shardsTotal	1
   [junit4]   2> ##    shardsState	{active=1}
   [junit4]   2> ##      shardsWithoutLeader	0
   [junit4]   2> ##    totalReplicas	1
   [junit4]   2> ##      activeReplicas	1
   [junit4]   2> ##      inactiveReplicas	0
   [junit4]   2> ##    totalActiveDocs	3
   [junit4]   2> ##      bufferedDocs	0
   [junit4]   2> ##      maxActiveSliceDocs	3
   [junit4]   2> ##      minActiveSliceDocs	3
   [junit4]   2> ##      avgActiveSliceDocs	3
   [junit4]   2> ##    totalInactiveDocs	0
   [junit4]   2> ##      maxInactiveSliceDocs	0
   [junit4]   2> ##      minInactiveSliceDocs	0
   [junit4]   2> ##      avgInactiveSliceDocs	NaN
   [junit4]   2> ##    totalActiveBytes	11,740
   [junit4]   2> ##      maxActiveSliceBytes	11,740
   [junit4]   2> ##      minActiveSliceBytes	11,740
   [junit4]   2> ##      avgActiveSliceBytes	11,740
   [junit4]   2> ##    totalInactiveBytes	0
   [junit4]   2> ##      maxInactiveSliceBytes	0
   [junit4]   2> ##      minInactiveSliceBytes	0
   [junit4]   2> ##      avgInactiveSliceBytes	NaN
   [junit4]   2> ##    totalActiveDeletedDocs	0
   [junit4]   2> ## Max replicas per node:	1
   [junit4]   2> ## Min replicas per node:	0
   [junit4]   2> ## Total replicas:		1
   [junit4]   2> ## * .system		1
   [junit4]   2> ##		- active           1
   [junit4]   2> ######### Solr op counts ##########
   [junit4]   2> ##		- autoscaling        2
   [junit4]   2> ##		- update             4
   [junit4]   2> ######### Autoscaling event counts ###########
   [junit4]   2> ## * Trigger: node_added_trigger
   [junit4]   2> ##		- STARTED         2
   [junit4]   2> ##		- SUCCEEDED       2
   [junit4]   2> 
   [junit4]   2> 4114034 INFO  (TEST-TestSimTriggerIntegration.testNodeLostTrigger-seed#[E0F0767337D3CD52]) [    ] o.a.s.SolrTestCaseJ4 ###Starting testNodeLostTrigger
   [junit4]   2> 4114034 DEBUG (TEST-TestSimTriggerIntegration.testNodeLostTrigger-seed#[E0F0767337D3CD52]) [    ] o.a.s.c.a.OverseerTriggerThread Refreshing /autoscaling.json with znode version 5
   [junit4]   2> 4114034 DEBUG (TEST-TestSimTriggerIntegration.testNodeLostTrigger-seed#[E0F0767337D3CD52]) [    ] o.a.s.c.a.s.SimNodeStateProvider --removing value for 127.0.0.1:10009_solr
   [junit4]   2> 4114034 DEBUG (TEST-TestSimTriggerIntegration.testNodeLostTrigger-seed#[E0F0767337D3CD52]) [    ] o.a.s.c.a.s.SimNodeStateProvider --removing value for 127.0.0.1:10010_solr
   [junit4]   2> 4114034 INFO  (TEST-TestSimTriggerIntegration.testNodeLostTrigger-seed#[E0F0767337D3CD52]) [    ] o.a.s.c.a.s.SimCloudManager === Restarting OverseerTriggerThread and clearing object cache...
   [junit4]   2> 4114035 DEBUG (TEST-TestSimTriggerIntegration.testNodeLostTrigger-seed#[E0F0767337D3CD52]) [    ] o.a.s.c.a.ScheduledTriggers Shutting down scheduled thread pool executor now
   [junit4]   2> 4114035 DEBUG (TEST-TestSimTriggerIntegration.testNodeLostTrigger-seed#[E0F0767337D3CD52]) [    ] o.a.s.c.a.ScheduledTriggers Shutting down action executor now
   [junit4]   2> 4114035 DEBUG (TEST-TestSimTriggerIntegration.testNodeLostTrigger-seed#[E0F0767337D3CD52]) [    ] o.a.s.c.a.ScheduledTriggers Awaiting termination for action executor
   [junit4]   2> 4114039 WARN  (Simulated OverseerAutoScalingTriggerThread) [    ] o.a.s.c.a.OverseerTriggerThread OverseerTriggerThread woken up but we are closed, exiting.
   [junit4]   2> 4114047 DEBUG (TEST-TestSimTriggerIntegration.testNodeLostTrigger-seed#[E0F0767337D3CD52]) [    ] o.a.s.c.a.ScheduledTriggers Awaiting termination for scheduled thread pool executor
   [junit4]   2> 4114047 DEBUG (TEST-TestSimTriggerIntegration.testNodeLostTrigger-seed#[E0F0767337D3CD52]) [    ] o.a.s.c.a.ScheduledTriggers ScheduledTriggers closed completely
   [junit4]   2> 4114047 DEBUG (TEST-TestSimTriggerIntegration.testNodeLostTrigger-seed#[E0F0767337D3CD52]) [    ] o.a.s.c.a.OverseerTriggerThread OverseerTriggerThread has been closed explicitly
   [junit4]   2> 4114100 DEBUG (Simulated OverseerAutoScalingTriggerThread) [    ] o.a.s.c.a.OverseerTriggerThread Adding .auto_add_replicas and .scheduled_maintenance triggers
   [junit4]   2> 4114121 DEBUG (Simulated OverseerAutoScalingTriggerThread) [    ] o.a.s.c.a.OverseerTriggerThread Refreshing /autoscaling.json with znode version 6
   [junit4]   2> 4114121 DEBUG (Simulated OverseerAutoScalingTriggerThread) [    ] o.a.s.c.a.OverseerTriggerThread Current znodeVersion 6, lastZnodeVersion -1
   [junit4]   2> 4114121 DEBUG (Simulated OverseerAutoScalingTriggerThread) [    ] o.a.s.c.a.OverseerTriggerThread Processed trigger updates upto znodeVersion 6
   [junit4]   2> 4114157 DEBUG (Simulated OverseerAutoScalingTriggerThread) [    ] o.a.s.c.a.NodeLostTrigger NodeLostTrigger .auto_add_replicas - Initial livenodes: [127.0.0.1:10008_solr, 127.0.0.1:10007_solr]
   [junit4]   2> 4114173 DEBUG (Simulated OverseerAutoScalingTriggerThread) [    ] o.a.s.c.a.OverseerTriggerThread -- clean old nodeAdded markers
   [junit4]   2> 4114173 DEBUG (Simulated OverseerAutoScalingTriggerThread) [    ] o.a.s.c.a.OverseerTriggerThread Current znodeVersion 6, lastZnodeVersion 6
   [junit4]   2> 4114186 DEBUG (ScheduledTrigger-7448-thread-2) [    ] o.a.s.c.a.NodeLostTrigger Running NodeLostTrigger: .auto_add_replicas with currently live nodes: 2
   [junit4]   2> 4114268 DEBUG (ScheduledTrigger-7448-thread-1) [    ] o.a.s.c.a.NodeLostTrigger Running NodeLostTrigger: .auto_add_replicas with currently live nodes: 2
   [junit4]   2> 4114268 DEBUG (simCloudManagerPool-7447-thread-1) [    ] o.a.s.c.a.s.SimClusterStateProvider ** creating new collection states
   [junit4]   2> 4114268 DEBUG (simCloudManagerPool-7447-thread-1) [    ] o.a.s.c.a.s.SimClusterStateProvider ** saved cluster state version 5
   [junit4]   2> 4114268 DEBUG (simCloudManagerPool-7447-thread-1) [    ] o.a.s.c.a.AutoScalingHandler Verified autoscaling configuration
   [junit4]   2> 4114268 DEBUG (simCloudManagerPool-7447-thread-1) [    ] o.a.s.c.a.OverseerTriggerThread Refreshing /autoscaling.json with znode version 7
   [junit4]   2> 4114303 DEBUG (Simulated OverseerAutoScalingTriggerThread) [    ] o.a.s.c.a.OverseerTriggerThread Processed trigger updates upto znodeVersion 7
   [junit4]   2> 4114304 DEBUG (Simulated OverseerAutoScalingTriggerThread) [    ] o.a.s.c.a.OverseerTriggerThread -- clean old nodeAdded markers
   [junit4]   2> 4114304 DEBUG (Simulated OverseerAutoScalingTriggerThread) [    ] o.a.s.c.a.OverseerTriggerThread Current znodeVersion 7, lastZnodeVersion 7
   [junit4]   2> 4114304 DEBUG (TEST-TestSimTriggerIntegration.testNodeLostTrigger-seed#[E0F0767337D3CD52]) [    ] o.a.s.c.a.s.SimClusterStateProvider ** creating new collection states
   [junit4]   2> 4114304 DEBUG (TEST-TestSimTriggerIntegration.testNodeLostTrigger-seed#[E0F0767337D3CD52]) [    ] o.a.s.c.a.s.SimClusterStateProvider ** saved cluster state version 6
   [junit4]   2> 4114304 DEBUG (ScheduledTrigger-7448-thread-2) [    ] o.a.s.c.a.NodeLostTrigger Running NodeLostTrigger: .auto_add_replicas with currently live nodes: 2
   [junit4]   2> 4114340 DEBUG (ScheduledTrigger-7448-thread-2) [    ] o.a.s.c.a.NodeLostTrigger Running NodeLostTrigger: .auto_add_replicas with currently live nodes: 2
   [junit4]   2> 4114376 DEBUG (ScheduledTrigger-7448-thread-2) [    ] o.a.s.c.a.NodeLostTrigger Running NodeLostTrigger: .auto_add_replicas with currently live nodes: 2
   [junit4]   2> 4114388 DEBUG (simCloudManagerPool-7447-thread-2) [    ] o.a.s.c.a.s.SimClusterStateProvider ** creating new collection states
   [junit4]   2> 4114389 DEBUG (simCloudManagerPool-7447-thread-2) [    ] o.a.s.c.a.s.SimClusterStateProvider ** saved cluster state version 7
   [junit4]   2> 4114413 DEBUG (ScheduledTrigger-7448-thread-2) [    ] o.a.s.c.a.NodeLostTrigger Running NodeLostTrigger: .auto_add_replicas with currently live nodes: 2
   [junit4]   2> 4114417 DEBUG (simCloudManagerPool-7447-thread-3) [    ] o.a.s.c.a.s.SimClusterStateProvider -- elected new leader for .system / shard1: {"core_node2":{
   [junit4]   2>     "core":".system_shard1_replica_n1",
   [junit4]   2>     "shard":"shard1",
   [junit4]   2>     "collection":".system",
   [junit4]   2>     "node_name":"127.0.0.1:10008_solr",
   [junit4]   2>     "type":"NRT",
   [junit4]   2>     "leader":"true",
   [junit4]   2>     "SEARCHER.searcher.maxDoc":0,
   [junit4]   2>     "SEARCHER.searcher.deletedDocs":0,
   [junit4]   2>     "INDEX.sizeInBytes":10240,
   [junit4]   2>     "state":"active",
   [junit4]   2>     "INDEX.sizeInGB":9.5367431640625E-6,
   [junit4]   2>     "SEARCHER.searcher.numDocs":0}}
   [junit4]   2> 4114425 DEBUG (TEST-TestSimTriggerIntegration.testNodeLostTrigger-seed#[E0F0767337D3CD52]) [    ] o.a.s.c.a.s.SimClusterStateProvider ** creating new collection states
   [junit4]   2> 4114425 DEBUG (TEST-TestSimTriggerIntegration.testNodeLostTrigger-seed#[E0F0767337D3CD52]) [    ] o.a.s.c.a.s.SimClusterStateProvider ** saved cluster state version 8
   [junit4]   2> 4114430 DEBUG (simCloudManagerPool-7447-thread-4) [    ] o.a.s.c.a.AutoScalingHandler Verified autoscaling configuration
   [junit4]   2> 4114430 DEBUG (simCloudManagerPool-7447-thread-4) [    ] o.a.s.c.a.OverseerTriggerThread Refreshing /autoscaling.json with znode version 8
   [junit4]   2> 4114431 DEBUG (Simulated OverseerAutoScalingTriggerThread) [    ] o.a.s.c.a.OverseerTriggerThread Processed trigger updates upto znodeVersion 8
   [junit4]   2> 4114431 INFO  (Simulated OverseerAutoScalingTriggerThread) [    ] o.a.s.c.a.s.TestSimTriggerIntegration TestTriggerAction init
   [junit4]   2> 4114431 DEBUG (Simulated OverseerAutoScalingTriggerThread) [    ] o.a.s.c.a.NodeLostTrigger NodeLostTrigger node_lost_trigger - Initial livenodes: [127.0.0.1:10008_solr, 127.0.0.1:10007_solr]
   [junit4]   2> 4114431 DEBUG (Simulated OverseerAutoScalingTriggerThread) [    ] o.a.s.c.a.OverseerTriggerThread -- clean old nodeAdded markers
   [junit4]   2> 4114431 DEBUG (Simulated OverseerAutoScalingTriggerThread) [    ] o.a.s.c.a.OverseerTriggerThread Current znodeVersion 8, lastZnodeVersion 8
   [junit4]   2> 4114431 DEBUG (TEST-TestSimTriggerIntegration.testNodeLostTrigger-seed#[E0F0767337D3CD52]) [    ] o.a.s.c.a.s.SimClusterStateProvider ** creating new collection states
   [junit4]   2> 4114431 DEBUG (ScheduledTrigger-7448-thread-1) [    ] o.a.s.c.a.NodeLostTrigger Running NodeLostTrigger: node_lost_trigger with currently live nodes: 1
   [junit4]   2> 4114431 DEBUG (ScheduledTrigger-7448-thread-1) [    ] o.a.s.c.a.NodeLostTrigger Tracking lost node: 127.0.0.1:10008_solr
   [junit4]   2> 4114431 DEBUG (TEST-TestSimTriggerIntegration.testNodeLostTrigger-seed#[E0F0767337D3CD52]) [    ] o.a.s.c.a.s.SimClusterStateProvider ** saved cluster state version 9
   [junit4]   2> 4114432 WARN  (simCloudManagerPool-7447-thread-5) [    ] o.a.s.c.a.s.SimClusterStateProvider Can't find any active replicas for .system / shard1: shard1:{
   [junit4]   2>   "replicas":{"core_node2":{
   [junit4]   2>       "core":".system_shard1_replica_n1",
   [junit4]   2>       "SEARCHER.searcher.maxDoc":0,
   [junit4]   2>       "SEARCHER.searcher.deletedDocs":0,
   [junit4]   2>       "INDEX.sizeInBytes":10240,
   [junit4]   2>       "node_name":"127.0.0.1:10008_solr",
   [junit4]   2>       "state":"down",
   [junit4]   2>       "type":"NRT",
   [junit4]   2>       "INDEX.sizeInGB":9.5367431640625E-6,
   [junit4]   2>       "SEARCHER.searcher.numDocs":0}},
   [junit4]   2>   "range":"80000000-7fffffff",
   [junit4]   2>   "state":"active"}
   [junit4]   2> 4114432 DEBUG (simCloudManagerPool-7447-thread-5) [    ] o.a.s.c.a.s.SimClusterStateProvider -- liveNodes: [127.0.0.1:10007_solr]
   [junit4]   2> 4114433 DEBUG (ScheduledTrigger-7448-thread-2) [    ] o.a.s.c.a.NodeLostTrigger Running NodeLostTrigger: .auto_add_replicas with currently live nodes: 1
   [junit4]   2> 4114433 DEBUG (ScheduledTrigger-7448-thread-2) [    ] o.a.s.c.a.NodeLostTrigger Tracking lost node: 127.0.0.1:10008_solr
   [junit4]   2> 4114466 DEBUG (ScheduledTrigger-7448-thread-1) [    ] o.a.s.c.a.NodeLostTrigger Running NodeLostTrigger: node_lost_trigger with currently live nodes: 1
   [junit4]   2> 4114466 DEBUG (ScheduledTrigger-7448-thread-1) [    ] o.a.s.c.a.NodeLostTrigger Running NodeLostTrigger: .auto_add_replicas with currently live nodes: 1
   [junit4]   2> 4114486 DEBUG (ScheduledTrigger-7448-thread-1) [    ] o.a.s.c.a.NodeLostTrigger Running NodeLostTrigger: node_lost_trigger with currently live nodes: 1
   [junit4]   2> 4114486 DEBUG (ScheduledTrigger-7448-thread-1) [    ] o.a.s.c.a.NodeLostTrigger Running NodeLostTrigger: .auto_add_replicas with currently live nodes: 1
   [junit4]   2> 4114506 DEBUG (ScheduledTrigger-7448-thread-1) [    ] o.a.s.c.a.NodeLostTrigger Running NodeLostTrigger: node_lost_trigger with currently live nodes: 1
   [junit4]   2> 4114506 DEBUG (ScheduledTrigger-7448-thread-1) [    ] o.a.s.c.a.NodeLostTrigger NodeLostTrigger firing registered processor for lost nodes: [127.0.0.1:10008_solr]
   [junit4]   2> 4114506 DEBUG (ScheduledTrigger-7448-thread-1) [    ] o.a.s.c.a.ScheduledTriggers ++++++++ Cooldown inactive - processing event: {
   [junit4]   2>   "id":"4a2c1cb9eaa820T30g0hwi6dfuaafsmw6v7oxj71",
   [junit4]   2>   "source":"node_lost_trigger",
   [junit4]   2>   "eventTime":20877650166458400,
   [junit4]   2>   "eventType":"NODELOST",
   [junit4]   2>   "properties":{
   [junit4]   2>     "eventTimes":[20877650166458400],
   [junit4]   2>     "preferredOperation":"movereplica",
   [junit4]   2>     "nodeNames":["127.0.0.1:10008_solr"]}}
   [junit4]   2> 4114507 DEBUG (ScheduledTrigger-7448-thread-1) [    ] o.a.s.c.a.ScheduledTriggers Pausing all triggers: [.auto_add_replicas, node_lost_trigger]
   [junit4]   2> 4114507 DEBUG (simCloudManagerPool-7447-thread-6) [    ] o.a.s.c.a.s.SimClusterStateProvider -- no leader in shard1:{
   [junit4]   2>   "replicas":{"core_node2":{
   [junit4]   2>       "core":".system_shard1_replica_n1",
   [junit4]   2>       "SEARCHER.searcher.maxDoc":0,
   [junit4]   2>       "SEARCHER.searcher.deletedDocs":0,
   [junit4]   2>       "INDEX.sizeInBytes":10240,
   [junit4]   2>       "node_name":"127.0.0.1:10008_solr",
   [junit4]   2>       "state":"down",
   [junit4]   2>       "type":"NRT",
   [junit4]   2>       "INDEX.sizeInGB":9.5367431640625E-6,
   [junit4]   2>       "SEARCHER.searcher.numDocs":0}},
   [junit4]   2>   "range":"80000000-7fffffff",
   [junit4]   2>   "state":"active"}
   [junit4]   2> 4114508 DEBUG (AutoscalingActionExecutor-7449-thread-1) [    ] o.a.s.c.a.ScheduledTriggers -- processing actions for {
   [junit4]   2>   "id":"4a2c1cb9eaa820T30g0hwi6dfuaafsmw6v7oxj71",
   [junit4]   2>   "source":"node_lost_trigger",
   [junit4]   2>   "eventTime":20877650166458400,
   [junit4]   2>   "eventType":"NODELOST",
   [junit4]   2>   "properties":{
   [junit4]   2>     "eventTimes":[20877650166458400],
   [junit4]   2>     "preferredOperation":"movereplica",
   [junit4]   2>     "_enqueue_time_":20877653950027300,
   [junit4]   2>     "nodeNames":["127.0.0.1:10008_solr"]}}
   [junit4]   2> 4114509 DEBUG (simCloudManagerPool-7447-thread-7) [    ] o.a.s.c.a.AutoScalingHandler Verified autoscaling configuration
   [junit4]   2> 4114509 DEBUG (simCloudManagerPool-7447-thread-7) [    ] o.a.s.c.a.OverseerTriggerThread Refreshing /autoscaling.json with znode version 9
   [junit4]   2> 4114510 DEBUG (simCloudManagerPool-7447-thread-8) [    ] o.a.s.c.a.s.SimClusterStateProvider -- no leader in shard1:{
   [junit4]   2>   "replicas":{"core_node2":{
   [junit4]   2>       "core":".system_shard1_replica_n1",
   [junit4]   2>       "SEARCHER.searcher.maxDoc":0,
   [junit4]   2>       "SEARCHER.searcher.deletedDocs":0,
   [junit4]   2>       "INDEX.sizeInBytes":10240,
   [junit4]   2>       "node_name":"127.0.0.1:10008_solr",
   [junit4]   2>       "state":"down",
   [junit4]   2>       "type":"NRT",
   [junit4]   2>       "INDEX.sizeInGB":9.5367431640625E-6,
   [junit4]   2>       "SEARCHER.searcher.numDocs":0}},
   [junit4]   2>   "range":"80000000-7fffffff",
   [junit4]   2>   "state":"active"}
   [junit4]   2> 4114510 DEBUG (AutoscalingActionExecutor-7449-thread-1) [    ] o.a.s.c.a.ScheduledTriggers Resuming trigger: .auto_add_replicas after 100ms
   [junit4]   2> 4114510 DEBUG (AutoscalingActionExecutor-7449-thread-1) [    ] o.a.s.c.a.ScheduledTriggers Resuming trigger: node_lost_trigger after 100ms
   [junit4]   2> 4114510 DEBUG (AutoscalingActionExecutor-7449-thread-1) [    ] o.a.s.c.a.ScheduledTriggers -- processing took 96 ms for event id=4a2c1cb9eaa820T30g0hwi6dfuaafsmw6v7oxj71
   [junit4]   2> 4114523 DEBUG (Simulated OverseerAutoScalingTriggerThread) [    ] o.a.s.c.a.OverseerTriggerThread Processed trigger updates upto znodeVersion 9
   [junit4]   2> 4114523 DEBUG (Simulated OverseerAutoScalingTriggerThread) [    ] o.a.s.c.a.OverseerTriggerThread -- clean old nodeAdded markers
   [junit4]   2> 4114523 DEBUG (Simulated OverseerAutoScalingTriggerThread) [    ] o.a.s.c.a.OverseerTriggerThread Current znodeVersion 9, lastZnodeVersion 9
   [junit4]   2> 4114550 INFO  (TEST-TestSimTriggerIntegration.testNodeLostTrigger-seed#[E0F0767337D3CD52]) [    ] o.a.s.SolrTestCaseJ4 ###Ending testNodeLostTrigger
   [junit4]   2> 4114550 DEBUG (TEST-TestSimTriggerIntegration.testNodeLostTrigger-seed#[E0F0767337D3CD52]) [    ] o.a.s.c.a.s.SimClusterStateProvider ** creating new collection states
   [junit4]   2> 4114550 DEBUG (TEST-TestSimTriggerIntegration.testNodeLostTrigger-seed#[E0F0767337D3CD52]) [    ] o.a.s.c.a.s.SimClusterStateProvider ** saved cluster state version 10
   [junit4]   2> 4114551 INFO  (TEST-TestSimTriggerIntegration.testNodeLostTrigger-seed#[E0F0767337D3CD52]) [    ] o.a.s.c.a.s.SimSolrCloudTestCase #######################################
   [junit4]   2> ############ CLUSTER STATE ############
   [junit4]   2> #######################################
   [junit4]   2> ## Live nodes:		1
   [junit4]   2> ## Empty nodes:	1
   [junit4]   2> ## Dead nodes:		1
   [junit4]   2> ##		127.0.0.1:10008_solr
   [junit4]   2> ## Collections:
   [junit4]   2> ##  * .system
   [junit4]   2> ##    shardsTotal	1
   [junit4]   2> ##    shardsState	{active=1}
   [junit4]   2> ##      shardsWithoutLeader	1
   [junit4]   2> ##    totalReplicas	1
   [junit4]   2> ##      activeReplicas	1
   [junit4]   2> ##      inactiveReplicas	0
   [junit4]   2> ##    totalActiveDocs	0
   [junit4]   2> ##      bufferedDocs	0
   [junit4]   2> ##      maxActiveSliceDocs	0
   [junit4]   2> ##      minActiveSliceDocs	0
   [junit4]   2> ##      avgActiveSliceDocs	0
   [junit4]   2> ##    totalInactiveDocs	0
   [junit4]   2> ##      maxInactiveSliceDocs	0
   [junit4]   2> ##      minInactiveSliceDocs	0
   [junit4]   2> ##      avgInactiveSliceDocs	NaN
   [junit4]   2> ##    totalActiveBytes	10,240
   [junit4]   2> ##      maxActiveSliceBytes	10,240
   [junit4]   2> ##      minActiveSliceBytes	10,240
   [junit4]   2> ##      avgActiveSliceBytes	10,240
   [junit4]   2> ##    totalInactiveBytes	0
   [junit4]   2> ##      maxInactiveSliceBytes	0
   [junit4]   2> ##      minInactiveSliceBytes	0
   [junit4]   2> ##      avgInactiveSliceBytes	NaN
   [junit4]   2> ##    totalActiveDeletedDocs	0
   [junit4]   2> ## Max replicas per node:	0
   [junit4]   2> ## Min replicas per node:	0
   [junit4]   2> ## Total replicas:		0
   [junit4]   2> ######### Solr op counts ##########
   [junit4]   2> ##		- autoscaling        3
   [junit4]   2> ##		- update             2
   [junit4]   2> ######### Autoscaling event counts ###########
   [junit4]   2> ## * Trigger: node_added_trigger
   [junit4]   2> ##		- STARTED         2
   [junit4]   2> ##		- SUCCEEDED       2
   [junit4]   2> ## * Trigger: node_lost_trigger
   [junit4]   2> ##		- STARTED         1
   [junit4]   2> ##		- SUCCEEDED       1
   [junit4]   2> 
   [junit4] IGNOR/A 0.00s J2 | TestSimTriggerIntegration.testTriggerThrottling
   [junit4]    > Assumption #1: 'badapple' test group is disabled (@BadApple(bugUrl=https://issues.apache.org/jira/browse/SOLR-12028))
   [junit4]   2> 4114555 INFO  (TEST-TestSimTriggerIntegration.testEventQueue-seed#[E0F0767337D3CD52]) [    ] o.a.s.SolrTestCaseJ4 ###Starting testEventQueue
   [junit4]   2> 4114555 DEBUG (TEST-TestSimTriggerIntegration.testEventQueue-seed#[E0F0767337D3CD52]) [    ] o.a.s.c.a.OverseerTriggerThread Refreshing /autoscaling.json with znode version 10
   [junit4]   2> 4114555 DEBUG (TEST-TestSimTriggerIntegration.testEventQueue-seed#[E0F0767337D3CD52]) [    ] o.a.s.c.a.s.SimNodeStateProvider - removing dead node values: 127.0.0.1:10008_solr
   [junit4]   2> 4114555 INFO  (TEST-TestSimTriggerIntegration.testEventQueue-seed#[E0F0767337D3CD52]) [    ] o.a.s.c.a.s.SimCloudManager === Restarting OverseerTriggerThread and clearing object cache...
   [junit4]   2> 4114556 DEBUG (TEST-TestSimTriggerIntegration.testEventQueue-seed#[E0F0767337D3CD52]) [    ] o.a.s.c.a.ScheduledTriggers Shutting down scheduled thread pool executor now
   [junit4]   2> 4114556 DEBUG (TEST-TestSimTriggerIntegration.testEventQueue-seed#[E0F0767337D3CD52]) [    ] o.a.s.c.a.ScheduledTriggers Shutting down action executor now
   [junit4]   2> 4114556 DEBUG (TEST-TestSimTriggerIntegration.testEventQueue-seed#[E0F0767337D3CD52]) [    ] o.a.s.c.a.ScheduledTriggers Awaiting termination for action executor
   [junit4]   2> 4114556 DEBUG (TEST-TestSimTriggerIntegration.testEventQueue-seed#[E0F0767337D3CD52]) [    ] o.a.s.c.a.ScheduledTriggers Awaiting termination for scheduled thread pool executor
   [junit4]   2> 4114559 WARN  (Simulated OverseerAutoScalingTriggerThread) [    ] o.a.s.c.a.OverseerTriggerThread OverseerTriggerThread woken up but we are closed, exiting.
   [junit4]   2> 4114577 DEBUG (TEST-TestSimTriggerIntegration.testEventQueue-seed#[E0F0767337D3CD52]) [    ] o.a.s.c.a.ScheduledTriggers ScheduledTriggers closed completely
   [junit4]   2> 4114577 DEBUG (TEST-TestSimTriggerIntegration.testEventQueue-seed#[E0F0767337D3CD52]) [    ] o.a.s.c.a.OverseerTriggerThread OverseerTriggerThread has been closed explicitly
   [junit4]   2> 4114601 DEBUG (Simulated OverseerAutoScalingTriggerThread) [    ] o.a.s.c.a.OverseerTriggerThread Adding .auto_add_replicas and .scheduled_maintenance triggers
   [junit4]   2> 4114601 DEBUG (Simulated OverseerAutoScalingTriggerThread) [    ] o.a.s.c.a.OverseerTriggerThread Refreshing /autoscaling.json with znode version 11
   [junit4]   2> 4114601 DEBUG (Simulated OverseerAutoScalingTriggerThread) [    ] o.a.s.c.a.OverseerTriggerThread Current znodeVersion 11, lastZnodeVersion -1
   [junit4]   2> 4114601 DEBUG (Simulated OverseerAutoScalingTriggerThread) [    ] o.a.s.c.a.OverseerTriggerThread Processed trigger updates upto znodeVersion 11
   [junit4]   2> 4114602 DEBUG (Simulated OverseerAutoScalingTriggerThread) [    ] o.a.s.c.a.NodeLostTrigger NodeLostTrigger .auto_add_replicas - Initial livenodes: [127.0.0.1:10007_solr, 127.0.0.1:10011_solr]
   [junit4]   2> 4114602 DEBUG (ScheduledTrigger-7451-thread-1) [    ] o.a.s.c.a.NodeLostTrigger Running NodeLostTrigger: .auto_add_replicas with currently live nodes: 2
   [junit4]   2> 4114602 DEBUG (Simulated OverseerAutoScalingTriggerThread) [    ] o.a.s.c.a.OverseerTriggerThread -- clean old nodeAdded markers
   [junit4]   2> 4114602 DEBUG (Simulated OverseerAutoScalingTriggerThread) [    ] o.a.s.c.a.OverseerTriggerThread Current znodeVersion 11, lastZnodeVersion 11
   [junit4]   2> 4114622 DEBUG (ScheduledTrigger-7451-thread-1) [    ] o.a.s.c.a.NodeLostTrigger Running NodeLostTrigger: .auto_add_replicas with currently live nodes: 2
   [junit4]   2> 4114642 DEBUG (ScheduledTrigger-7451-thread-1) [    ] o.a.s.c.a.NodeLostTrigger Running NodeLostTrigger: .auto_add_replicas with currently live nodes: 2
   [junit4]   2> 4114663 DEBUG (ScheduledTrigger-7451-thread-3) [    ] o.a.s.c.a.NodeLostTrigger Running NodeLostTrigger: .auto_add_replicas with currently live nodes: 2
   [junit4]   2> 4114683 DEBUG (ScheduledTrigger-7451-thread-3) [    ] o.a.s.c.a.NodeLostTrigger Running NodeLostTrigger: .auto_add_replicas with currently live nodes: 2
   [junit4]   2> 4114701 DEBUG (simCloudManagerPool-7450-thread-1) [    ] o.a.s.c.a.s.SimClusterStateProvider ** creating new collection states
   [junit4]   2> 4114701 DEBUG (simCloudManagerPool-7450-thread-1) [    ] o.a.s.c.a.s.SimClusterStateProvider ** saved cluster state version 11
   [junit4]   2> 4114701 DEBUG (simCloudManagerPool-7450-thread-1) [    ] o.a.s.c.a.AutoScalingHandler Verified autoscaling configuration
   [junit4]   2> 4114702 DEBUG (simCloudManagerPool-7450-thread-1) [    ] o.a.s.c.a.OverseerTriggerThread Refreshing /autoscaling.json with znode version 12
   [junit4]   2> 4114703 DEBUG (ScheduledTrigger-7451-thread-3) [    ] o.a.s.c.a.NodeLostTrigger Running NodeLostTrigger: .auto_add_replicas with currently live nodes: 2
   [junit4]   2> 4114707 DEBUG (Simulated OverseerAutoScalingTriggerThread) [    ] o.a.s.c.a.OverseerTriggerThread Processed trigger updates upto znodeVersion 12
   [junit4]   2> 4114707 DEBUG (Simulated OverseerAutoScalingTriggerThread) [    ] o.a.s.c.a.OverseerTriggerThread -- clean old nodeAdded markers
   [junit4]   2> 4114707 DEBUG (Simulated OverseerAutoScalingTriggerThread) [    ] o.a.s.c.a.OverseerTriggerThread Current znodeVersion 12, lastZnodeVersion 12
   [junit4]   2> 4114707 DEBUG (TEST-TestSimTriggerIntegration.testEventQueue-seed#[E0F0767337D3CD52]) [    ] o.a.s.c.a.s.SimClusterStateProvider ** creating new collection states
   [junit4]   2> 4114707 DEBUG (TEST-TestSimTriggerIntegration.testEventQueue-seed#[E0F0767337D3CD52]) [    ] o.a.s.c.a.s.SimClusterStateProvider ** saved cluster state version 12
   [junit4]   2> 4114724 DEBUG (ScheduledTrigger-7451-thread-3) [    ] o.a.s.c.a.NodeLostTrigger Running NodeLostTrigger: .auto_add_replicas with currently live nodes: 2
   [junit4]   2> 4114732 DEBUG (simCloudManagerPool-7450-thread-2) [    ] o.a.s.c.a.s.SimClusterStateProvider ** creating new collection states
   [junit4]   2> 4114733 DEBUG (simCloudManagerPool-7450-thread-2) [    ] o.a.s.c.a.s.SimClusterStateProvider ** saved cluster state version 13
   [junit4]   2> 4114733 DEBUG (simCloudManagerPool-7450-thread-3) [    ] o.a.s.c.a.s.SimClusterStateProvider -- elected new leader for .system / shard1: {"core_node3":{
   [junit4]   2>     "core":".system_shard1_replica_n1",
   [junit4]   2>     "shard":"shard1",
   [junit4]   2>     "collection":".system",
   [junit4]   2>     "node_name":"127.0.0.1:10011_solr",
   [junit4]   2>     "type":"NRT",
   [junit4]   2>     "leader":"true",
   [junit4]   2>     "SEARCHER.searcher.maxDoc":0,
   [junit4]   2>     "SEARCHER.searcher.deletedDocs":0,
   [junit4]   2>     "INDEX.sizeInBytes":10240,
   [junit4]   2>     "state":"active",
   [junit4]   2>     "INDEX.sizeInGB":9.5367431640625E-6,
   [junit4]   2>     "SEARCHER.searcher.numDocs":0}}
   [junit4]   2> 4114734 DEBUG (TEST-TestSimTriggerIntegration.testEventQueue-seed#[E0F0767337D3CD52]) [    ] o.a.s.c.a.s.SimClusterStateProvider ** creating new collection states
   [junit4]   2> 4114734 DEBUG (TEST-TestSimTriggerIntegration.testEventQueue-seed#[E0F0767337D3CD52]) [    ] o.a.s.c.a.s.SimClusterStateProvider ** saved cluster state version 14
   [junit4]   2> 4114735 INFO  (simCloudManagerPool-7450-thread-4) [    ] o.a.s.c.a.s.TestSimTriggerIntegration TestEventQueueAction instantiated
   [junit4]   2> 4114735 DEBUG (simCloudManagerPool-7450-thread-4) [    ] o.a.s.c.a.s.TestSimTriggerIntegration TestTriggerAction init
   [junit4]   2> 4114736 DEBUG (simCloudManagerPool-7450-thread-4) [    ] o.a.s.c.a.AutoScalingHandler Verified autoscaling configuration
   [junit4]   2> 4114736 DEBUG (simCloudManagerPool-7450-thread-4) [    ] o.a.s.c.a.OverseerTriggerThread Refreshing /autoscaling.json with znode version 13
   [junit4]   2> 4114736 INFO  (simCloudManagerPool-7450-thread-4) [    ] o.a.s.c.a.s.TestSimTriggerIntegration TestEventQueueAction instantiated
   [junit4]   2> 4114736 DEBUG (simCloudManagerPool-7450-thread-4) [    ] o.a.s.c.a.s.TestSimTriggerIntegration TestTriggerAction init
   [junit4]   2> 4114736 DEBUG (Simulated OverseerAutoScalingTriggerThread) [    ] o.a.s.c.a.OverseerTriggerThread Processed trigger updates upto znodeVersion 13
   [junit4]   2> 4114736 DEBUG (Simulated OverseerAutoScalingTriggerThread) [    ] o.a.s.c.a.NodeAddedTrigger NodeAddedTrigger node_added_trigger1 - Initial livenodes: [127.0.0.1:10007_solr, 127.0.0.1:10011_solr]
   [junit4]   2> 4114736 DEBUG (Simulated OverseerAutoScalingTriggerThread) [    ] o.a.s.c.a.NodeAddedTrigger NodeAddedTrigger node_added_trigger1 instantiated with properties: {event=nodeAdded, waitFor=1, actions=[{name=test, class=org.apache.solr.cloud.autoscaling.sim.TestSimTriggerIntegration$TestEventQueueAction}], enabled=true}
   [junit4]   2> 4114736 DEBUG (Simulated OverseerAutoScalingTriggerThread) [    ] o.a.s.c.a.OverseerTriggerThread Current znodeVersion 13, lastZnodeVersion 13
   [junit4]   2> 4114740 DEBUG (ScheduledTrigger-7451-thread-2) [    ] o.a.s.c.a.NodeAddedTrigger Running NodeAddedTrigger node_added_trigger1
   [junit4]   2> 4114740 DEBUG (ScheduledTrigger-7451-thread-2) [    ] o.a.s.c.a.NodeAddedTrigger Found livenodes: 2
   [junit4]   2> 4114744 DEBUG (ScheduledTrigger-7451-thread-4) [    ] o.a.s.c.a.NodeLostTrigger Running NodeLostTrigger: .auto_add_replicas with currently live nodes: 3
   [junit4]   2> 4114760 DEBUG (ScheduledTrigger-7451-thread-4) [    ] o.a.s.c.a.NodeAddedTrigger Running NodeAddedTrigger node_added_trigger1
   [junit4]   2> 4114760 DEBUG (ScheduledTrigger-7451-thread-4) [    ] o.a.s.c.a.NodeAddedTrigger Found livenodes: 3
   [junit4]   2> 4114760 DEBUG (ScheduledTrigger-7451-thread-4) [    ] o.a.s.c.a.NodeAddedTrigger Tracking new node: 127.0.0.1:10012_solr at time 20877666625606850
   [junit4]   2> 4114764 DEBUG (ScheduledTrigger-7451-thread-2) [    ] o.a.s.c.a.NodeLostTrigger Running NodeLostTrigger: .auto_add_replicas with currently live nodes: 3
   [junit4]   2> 4114781 DEBUG (ScheduledTrigger-7451-thread-1) [    ] o.a.s.c.a.NodeAddedTrigger Running NodeAddedTrigger node_added_trigger1
   [junit4]   2> 4114781 DEBUG (ScheduledTrigger-7451-thread-1) [    ] o.a.s.c.a.NodeAddedTrigger Found livenodes: 3
   [junit4]   2> 4114781 DEBUG (ScheduledTrigger-7451-thread-1) [    ] o.a.s.c.a.NodeAddedTrigger NodeAddedTrigger node_added_trigger1 firing registered processor for nodes: [127.0.0.1:10012_solr] added at times [20877666625606850], now=20877667639839900
   [junit4]   2> 4114781 DEBUG (ScheduledTrigger-7451-thread-1) [    ] o.a.s.c.a.ScheduledTriggers ++++++++ Cooldown inactive - processing event: {
   [junit4]   2>   "id":"4a2c208ef554c2T30g0hwi6dfuaafsmw6v7oxj74",
   [junit4]   2>   "source":"node_added_trigger1",
   [junit4]   2>   "eventTime":20877666625606850,
   [junit4]   2>   "eventType":"NODEADDED",
   [junit4]   2>   "properties":{
   [junit4]   2>     "eventTimes":[20877666625606850],
   [junit4]   2>     "preferredOperation":"movereplica",
   [junit4]   2>     "nodeNames":["127.0.0.1:10012_solr"]}}
   [junit4]   2> 4114781 DEBUG (ScheduledTrigger-7451-thread-1) [    ] o.a.s.c.a.ScheduledTriggers Pausing all triggers: [.auto_add_replicas, node_added_trigger1]
   [junit4]   2> 4114782 DEBUG (ScheduledTrigger-7451-thread-1) [    ] o.a.s.c.a.NodeAddedTrigger NodeAddedTrigger node_added_trigger1 - removing marker path: /autoscaling/nodeAdded/127.0.0.1:10012_solr
   [junit4]   2> 4114782 DEBUG (AutoscalingActionExecutor-7452-thread-1) [    ] o.a.s.c.a.ScheduledTriggers -- processing actions for {
   [junit4]   2>   "id":"4a2c208ef554c2T30g0hwi6dfuaafsmw6v7oxj74",
   [junit4]   2>   "source":"node_added_trigger1",
   [junit4]   2>   "eventTime":20877666625606850,
   [junit4]   2>   "eventType":"NODEADDED",
   [junit4]   2>   "properties":{
   [junit4]   2>     "eventTimes":[20877666625606850],
   [junit4]   2>     "preferredOperation":"movereplica",
   [junit4]   2>     "_enqueue_time_":20877667659849700,
   [junit4]   2>     "nodeNames":["127.0.0.1:10012_solr"]}}
   [junit4]   2> 4114782 INFO  (AutoscalingActionExecutor-7452-thread-1) [    ] o.a.s.c.a.s.TestSimTriggerIntegration -- event: {
   [junit4]   2>   "id":"4a2c208ef554c2T30g0hwi6dfuaafsmw6v7oxj74",
   [junit4]   2>   "source":"node_added_trigger1",
   [junit4]   2>   "eventTime":20877666625606850,
   [junit4]   2>   "eventType":"NODEADDED",
   [junit4]   2>   "properties":{
   [junit4]   2>     "eventTimes":[20877666625606850],
   [junit4]   2>     "preferredOperation":"movereplica",
   [junit4]   2>     "_enqueue_time_":20877667659849700,
   [junit4]   2>     "nodeNames":["127.0.0.1:10012_solr"]}}
   [junit4]   2> 4114782 INFO  (TEST-TestSimTriggerIntegration.testEventQueue-seed#[E0F0767337D3CD52]) [    ] o.a.s.c.a.s.SimCloudManager === Restarting OverseerTriggerThread and clearing object cache...
   [junit4]   2> 4114782 DEBUG (TEST-TestSimTriggerIntegration.testEventQueue-seed#[E0F0767337D3CD52]) [    ] o.a.s.c.a.ScheduledTriggers Shutting down scheduled thread pool executor now
   [junit4]   2> 4114782 DEBUG (TEST-TestSimTriggerIntegration.testEventQueue-seed#[E0F0767337D3CD52]) [    ] o.a.s.c.a.ScheduledTriggers Shutting down action executor now
   [junit4]   2> 4114782 DEBUG (TEST-TestSimTriggerIntegration.testEventQueue-seed#[E0F0767337D3CD52]) [    ] o.a.s.c.a.ScheduledTriggers Awaiting termination for action executor
   [junit4]   2> 4114783 WARN  (Simulated OverseerAutoScalingTriggerThread) [    ] o.a.s.c.a.OverseerTriggerThread OverseerTriggerThread woken up but we are closed, exiting.
   [junit4]   2> 4114783 WARN  (AutoscalingActionExecutor-7452-thread-1) [    ] o.a.s.c.a.ScheduledTriggers Unhandled exception executing actions
   [junit4]   2> org.apache.lucene.store.AlreadyClosedException: ScheduledTrigger node_added_trigger1 has been closed.
   [junit4]   2> 	at org.apache.solr.cloud.autoscaling.ScheduledTriggers$TriggerWrapper.dequeue(ScheduledTriggers.java:548) ~[java/:?]
   [junit4]   2> 	at org.apache.solr.cloud.autoscaling.ScheduledTriggers.lambda$null$3(ScheduledTriggers.java:318) ~[java/:?]
   [junit4]   2> 	at java.util.concurrent.Executors$RunnableAdapter.call(Executors.java:511) ~[?:1.8.0_172]
   [junit4]   2> 	at java.util.concurrent.FutureTask.run(FutureTask.java:266) ~[?:1.8.0_172]
   [junit4]   2> 	at org.apache.solr.common.util.ExecutorUtil$MDCAwareThreadPoolExecutor.lambda$execute$0(ExecutorUtil.java:209) ~[java/:?]
   [junit4]   2> 	at java.util.concurrent.ThreadPoolExecutor.runWorker(ThreadPoolExecutor.java:1149) [?:1.8.0_172]
   [junit4]   2> 	at java.util.concurrent.ThreadPoolExecutor$Worker.run(ThreadPoolExecutor.java:624) [?:1.8.0_172]
   [junit4]   2> 	at java.lang.Thread.run(Thread.java:748) [?:1.8.0_172]
   [junit4]   2> 4114784 DEBUG (AutoscalingActionExecutor-7452-thread-1) [    ] o.a.s.c.a.ScheduledTriggers -- processing took 102 ms for event id=4a2c208ef554c2T30g0hwi6dfuaafsmw6v7oxj74
   [junit4]   2> 4114784 DEBUG (TEST-TestSimTriggerIntegration.testEventQueue-seed#[E0F0767337D3CD52]) [    ] o.a.s.c.a.ScheduledTriggers Awaiting termination for scheduled thread pool executor
   [junit4]   2> 4114784 DEBUG (TEST-TestSimTriggerIntegration.testEventQueue-seed#[E0F0767337D3CD52]) [    ] o.a.s.c.a.ScheduledTriggers ScheduledTriggers closed completely
   [junit4]   2> 4114784 DEBUG (TEST-TestSimTriggerIntegration.testEventQueue-seed#[E0F0767337D3CD52]) [    ] o.a.s.c.a.OverseerTriggerThread OverseerTriggerThread has been closed explicitly
   [junit4]   2> 4114784 DEBUG (TEST-TestSimTriggerIntegration.testEventQueue-seed#[E0F0767337D3CD52]) [    ] o.a.s.c.a.s.SimClusterStateProvider --- new Overseer leader: 127.0.0.1:10012_solr
   [junit4]   2> 4114785 DEBUG (Simulated OverseerAutoScalingTriggerThread) [    ] o.a.s.c.a.OverseerTriggerThread Refreshing /autoscaling.json with znode version 13
   [junit4]   2> 4114785 INFO  (Simulated OverseerAutoScalingTriggerThread) [    ] o.a.s.c.a.s.TestSimTriggerIntegration TestEventQueueAction instantiated
   [junit4]   2> 4114785 DEBUG (Simulated OverseerAutoScalingTriggerThread) [    ] o.a.s.c.a.s.TestSimTriggerIntegration TestTriggerAction init
   [junit4]   2> 4114785 DEBUG (Simulated OverseerAutoScalingTriggerThread) [    ] o.a.s.c.a.OverseerTriggerThread Current znodeVersion 13, lastZnodeVersion -1
   [junit4]   2> 4114785 DEBUG (Simulated OverseerAutoScalingTriggerThread) [    ] o.a.s.c.a.OverseerTriggerThread Processed trigger updates upto znodeVersion 13
   [junit4]   2> 4114785 DEBUG (Simulated OverseerAutoScalingTriggerThread) [    ] o.a.s.c.a.NodeLostTrigger NodeLostTrigger .auto_add_replicas - Initial livenodes: [127.0.0.1:10012_solr, 127.0.0.1:10011_solr]
   [junit4]   2> 4114785 DEBUG (Simulated OverseerAutoScalingTriggerThread) [    ] o.a.s.c.a.NodeLostTrigger Adding lost node from marker path: 127.0.0.1:10007_solr
   [junit4]   2> 4114785 DEBUG (Simulated OverseerAutoScalingTriggerThread) [    ] o.a.s.c.a.NodeAddedTrigger NodeAddedTrigger node_added_trigger1 - Initial livenodes: [127.0.0.1:10012_solr, 127.0.0.1:10011_solr]
   [junit4]   2> 4114785 DEBUG (Simulated OverseerAutoScalingTriggerThread) [    ] o.a.s.c.a.NodeAddedTrigger NodeAddedTrigger node_added_trigger1 instantiated with properties: {event=nodeAdded, waitFor=1, actions=[{name=test, class=org.apache.solr.cloud.autoscaling.sim.TestSimTriggerIntegration$TestEventQueueAction}], enabled=true}
   [junit4]   2> 4114786 DEBUG (ScheduledTrigger-7454-thread-1) [    ] o.a.s.c.a.NodeLostTrigger Running NodeLostTrigger: .auto_add_replicas with currently live nodes: 2
   [junit4]   2> 4114786 DEBUG (ScheduledTrigger-7454-thread-1) [    ] o.a.s.c.a.NodeLostTrigger Tracking lost node: 127.0.0.1:10007_solr
   [junit4]   2> 4114789 DEBUG (Simulated OverseerAutoScalingTriggerThread) [    ] o.a.s.c.a.OverseerTriggerThread Current znodeVersion 13, lastZnodeVersion 13
   [junit4]   2> 4114789 DEBUG (ScheduledTrigger-7454-thread-2) [    ] o.a.s.c.a.ScheduledTriggers ++++++++ Cooldown inactive - processing event: {
   [junit4]   2>   "id":"4a2c208ef554c2T30g0hwi6dfuaafsmw6v7oxj74",
   [junit4]   2>   "source":"node_added_trigger1",
   [junit4]   2>   "eventTime":20877666625606850,
   [junit4]   2>   "eventType":"NODEADDED",
   [junit4]   2>   "properties":{
   [junit4]   2>     "eventTimes":[20877666625606850],
   [junit4]   2>     "_dequeue_time_":20877668050162900,
   [junit4]   2>     "preferredOperation":"movereplica",
   [junit4]   2>     "_enqueue_time_":20877667659849700,
   [junit4]   2>     "nodeNames":["127.0.0.1:10012_solr"],
   [junit4]   2>     "replaying":true}}
   [junit4]   2> 4114789 DEBUG (ScheduledTrigger-7454-thread-2) [    ] o.a.s.c.a.ScheduledTriggers Pausing all triggers: [.auto_add_replicas, node_added_trigger1]
   [junit4]   2> 4114790 DEBUG (ScheduledTrigger-7454-thread-2) [    ] o.a.s.c.a.NodeAddedTrigger Running NodeAddedTrigger node_added_trigger1
   [junit4]   2> 4114790 DEBUG (ScheduledTrigger-7454-thread-2) [    ] o.a.s.c.a.NodeAddedTrigger Found livenodes: 2
   [junit4]   2> 4114790 DEBUG (AutoscalingActionExecutor-7455-thread-1) [    ] o.a.s.c.a.ScheduledTriggers -- processing actions for {
   [junit4]   2>   "id":"4a2c208ef554c2T30g0hwi6dfuaafsmw6v7oxj74",
   [junit4]   2>   "source":"node_added_trigger1",
   [junit4]   2>   "eventTime":20877666625606850,
   [junit4]   2>   "eventType":"NODEADDED",
   [junit4]   2>   "properties":{
   [junit4]   2>     "eventTimes":[20877666625606850],
   [junit4]   2>     "_dequeue_time_":20877668050162900,
   [junit4]   2>     "preferredOperation":"movereplica",
   [junit4]   2>     "_enqueue_time_":20877667659849700,
   [junit4]   2>     "nodeNames":["127.0.0.1:10012_solr"],
   [junit4]   2>     "replaying":true}}
   [junit4]   2> 4114790 INFO  (AutoscalingActionExecutor-7455-thread-1) [    ] o.a.s.c.a.s.TestSimTriggerIntegration -- event: {
   [junit4]   2>   "id":"4a2c208ef554c2T30g0hwi6dfuaafsmw6v7oxj74",
   [junit4]   2>   "source":"node_added_trigger1",
   [junit4]   2>   "eventTime":20877666625606850,
   [junit4]   2>   "eventType":"NODEADDED",
   [junit4]   2>   "properties":{
   [junit4]   2>     "eventTimes":[20877666625606850],
   [junit4]   2>     "_dequeue_time_":20877668050162900,
   [junit4]   2>     "preferredOperation":"movereplica",
   [junit4]   2>     "_enqueue_time_":20877667659849700,
   [junit4]   2>     "nodeNames":["127.0.0.1:10012_solr"],
   [junit4]   2>     "replaying":true}}
   [junit4]   2> 4114803 DEBUG (AutoscalingActionExecutor-7455-thread-1) [    ] o.a.s.c.a.ScheduledTriggers Resuming trigger: .auto_add_replicas after 100ms
   [junit4]   2> 4114804 DEBUG (AutoscalingActionExecutor-7455-thread-1) [    ] o.a.s.c.a.ScheduledTriggers Resuming trigger: node_added_trigger1 after 100ms
   [junit4]   2> 4114804 DEBUG (AutoscalingActionExecutor-7455-thread-1) [    ] o.a.s.c.a.ScheduledTriggers -- processing took 675 ms for event id=4a2c208ef554c2T30g0hwi6dfuaafsmw6v7oxj74
   [junit4]   2> 4114885 INFO  (TEST-TestSimTriggerIntegration.testEventQueue-seed#[E0F0767337D3CD52]) [    ] o.a.s.SolrTestCaseJ4 ###Ending testEventQueue
   [junit4]   2> 4114886 DEBUG (TEST-TestSimTriggerIntegration.testEventQueue-seed#[E0F0767337D3CD52]) [    ] o.a.s.c.a.s.SimClusterStateProvider ** creating new collection states
   [junit4]   2> 4114886 DEBUG (TEST-TestSimTriggerIntegration.testEventQueue-seed#[E0F0767337D3CD52]) [    ] o.a.s.c.a.s.SimClusterStateProvider ** saved cluster state version 15
   [junit4]   2> 4114886 INFO  (TEST-TestSimTriggerIntegration.testEventQueue-seed#[E0F0767337D3CD52]) [    ] o.a.s.c.a.s.SimSolrCloudTestCase #######################################
   [junit4]   2> ############ CLUSTER STATE ############
   [junit4]   2> #######################################
   [junit4]   2> ## Live nodes:		2
   [junit4]   2> ## Empty nodes:	1
   [junit4]   2> ## Dead nodes:		1
   [junit4]   2> ##		127.0.0.1:10007_solr
   [junit4]   2> ## Collections:
   [junit4]   2> ##  * .system
   [junit4]   2> ##    shardsTotal	1
   [junit4]   2> ##    shardsState	{active=1}
   [junit4]   2> ##      shardsWithoutLeader	0
   [junit4]   2> ##    totalReplicas	1
   [junit4]   2> ##      activeReplicas	1
   [junit4]   2> ##      inactiveReplicas	0
   [junit4]   2> ##    totalActiveDocs	4
   [junit4]   2> ##      bufferedDocs	0
   [junit4]   2> ##      maxActiveSliceDocs	4
   [junit4]   2> ##      minActiveSliceDocs	4
   [junit4]   2> ##      avgActiveSliceDocs	4
   [junit4]   2> ##    totalInactiveDocs	0
   [junit4]   2> ##      maxInactiveSliceDocs	0
   [junit4]   2> ##      minInactiveSliceDocs	0
   [junit4]   2> ##      avgInactiveSliceDocs	NaN
   [junit4]   2> ##    totalActiveBytes	12,240
   [junit4]   2> ##      maxActiveSliceBytes	12,240
   [junit4]   2> ##      minActiveSliceBytes	12,240
   [junit4]   2> ##      avgActiveSliceBytes	12,240
   [junit4]   2> ##    totalInactiveBytes	0
   [junit4]   2> ##      maxInactiveSliceBytes	0
   [junit4]   2> ##      minInactiveSliceBytes	0
   [junit4]   2> ##      avgInactiveSliceBytes	NaN
   [junit4]   2> ##    totalActiveDeletedDocs	0
   [junit4]   2> ## Max replicas per node:	1
   [junit4]   2> ## Min replicas per node:	0
   [junit4]   2> ## Total replicas:		1
   [junit4]   2> ## * .system		1
   [junit4]   2> ##		- active           1
   [junit4]   2> ######### Solr op counts ##########
   [junit4]   2> ##		- autoscaling        2
   [junit4]   2> ##		- update             4
   [junit4]   2> ######### Autoscaling event counts ###########
   [junit4]   2> ## * Trigger: node_added_trigger
   [junit4]   2> ##		- STARTED         2
   [junit4]   2> ##		- SUCCEEDED       2
   [junit4]   2> ## * Trigger: node_added_trigger1
   [junit4]   2> ##		- FAILED          1
   [junit4]   2> ##		- STARTED         2
   [junit4]   2> ##		- SUCCEEDED       1
   [junit4]   2> ## * Trigger: node_lost_trigger
   [junit4]   2> ##		- STARTED         1
   [junit4]   2> ##		- SUCCEEDED       1
   [junit4]   2> 
   [junit4] IGNOR/A 0.00s J2 | TestSimTriggerIntegration.testCooldown
   [junit4]    > Assumption #1: 'badapple' test group is disabled (@BadApple(bugUrl=https://issues.apache.org/jira/browse/SOLR-12028))
   [junit4]   2> 4115076 DEBUG (ScheduledTrigger-7454-thread-4) [    ] o.a.s.c.a.NodeLostTrigger Running NodeLostTrigger: .auto_add_replicas with currently live nodes: 2
   [junit4]   2> 4115076 DEBUG (ScheduledTrigger-7454-thread-3) [    ] o.a.s.c.a.NodeAddedTrigger Running NodeAddedTrigger node_added_trigger1
   [junit4]   2> 4115076 DEBUG (ScheduledTrigger-7454-thread-3) [    ] o.a.s.c.a.NodeAddedTrigger Found livenodes: 2
   [junit4]   2> 4115078 INFO  (TEST-TestSimTriggerIntegration.testSearchRate-seed#[E0F0767337D3CD52]) [    ] o.a.s.SolrTestCaseJ4 ###Starting testSearchRate
   [junit4]   2> 4115078 DEBUG (TEST-TestSimTriggerIntegration.testSearchRate-seed#[E0F0767337D3CD52]) [    ] o.a.s.c.a.OverseerTriggerThread Refreshing /autoscaling.json with znode version 14
   [junit4]   2> 4115078 DEBUG (TEST-TestSimTriggerIntegration.testSearchRate-seed#[E0F0767337D3CD52]) [    ] o.a.s.c.a.s.SimNodeStateProvider - removing dead node values: 127.0.0.1:10007_solr
   [junit4]   2> 4115078 INFO  (TEST-TestSimTriggerIntegration.testSearchRate-seed#[E0F0767337D3CD52]) [    ] o.a.s.c.a.s.SimCloudManager === Restarting OverseerTriggerThread and clearing object cache...
   [junit4]   2> 4115078 DEBUG (TEST-TestSimTriggerIntegration.testSearchRate-seed#[E0F0767337D3CD52]) [    ] o.a.s.c.a.ScheduledTriggers Shutting down scheduled thread pool executor now
   [junit4]   2> 4115078 DEBUG (TEST-TestSimTriggerIntegration.testSearchRate-seed#[E0F0767337D3CD52]) [    ] o.a.s.c.a.ScheduledTriggers Shutting down action executor now
   [junit4]   2> 4115078 DEBUG (TEST-TestSimTriggerIntegration.testSearchRate-seed#[E0F0767337D3CD52]) [    ] o.a.s.c.a.ScheduledTriggers Awaiting termination for action executor
   [junit4]   2> 4115078 DEBUG (TEST-TestSimTriggerIntegration.testSearchRate-seed#[E0F0767337D3CD52]) [    ] o.a.s.c.a.ScheduledTriggers Awaiting termination for scheduled thread pool executor
   [junit4]   2> 4115079 WARN  (Simulated OverseerAutoScalingTriggerThread) [    ] o.a.s.c.a.OverseerTriggerThread OverseerTriggerThread woken up but we are closed, exiting.
   [junit4]   2> 4115093 DEBUG (TEST-TestSimTriggerIntegration.testSearchRate-seed#[E0F0767337D3CD52]) [    ] o.a.s.c.a.ScheduledTriggers ScheduledTriggers closed completely
   [junit4]   2> 4115093 DEBUG (TEST-TestSimTriggerIntegration.testSearchRate-seed#[E0F0767337D3CD52]) [    ] o.a.s.c.a.OverseerTriggerThread OverseerTriggerThread has been closed explicitly
   [junit4]   2> 4115100 DEBUG (Simulated OverseerAutoScalingTriggerThread) [    ] o.a.s.c.a.OverseerTriggerThread Adding .auto_add_replicas and .scheduled_maintenance triggers
   [junit4]   2> 4115100 DEBUG (Simulated OverseerAutoScalingTriggerThread) [    ] o.a.s.c.a.OverseerTriggerThread Refreshing /autoscaling.json with znode version 15
   [junit4]   2> 4115150 DEBUG (MetricsHistoryHandler-7440-thread-1) [    ] o.a.s.c.a.s.SimClusterStateProvider ** creating new collection states
   [junit4]   2> 4115150 DEBUG (MetricsHistoryHandler-7440-thread-1) [    ] o.a.s.c.a.s.SimClusterStateProvider ** saved cluster state version 16
   [junit4]   2> 4115150 INFO  (MetricsHistoryHandler-7440-thread-1) [    ] o.a.s.h.a.MetricsHistoryHandler No .system collection, keeping metrics history in memory.
   [junit4]   2> 4115153 DEBUG (Simulated OverseerAutoScalingTriggerThread) [    ] o.a.s.c.a.OverseerTriggerThread Current znodeVersion 15, lastZnodeVersion -1
   [junit4]   2> 4115153 DEBUG (Simulated OverseerAutoScalingTriggerThread) [    ] o.a.s.c.a.OverseerTriggerThread Processed trigger updates upto znodeVersion 15
   [junit4]   2> 4115193 DEBUG (simCloudManagerPool-7456-thread-1) [    ] o.a.s.c.a.s.SimClusterStateProvider ** creating new collection states
   [junit4]   2> 4115194 DEBUG (simCloudManagerPool-7456-thread-1) [    ] o.a.s.c.a.s.SimClusterStateProvider ** saved cluster state version 17
   [junit4]   2> 4115194 DEBUG (Simulated OverseerAutoScalingTriggerThread) [    ] o.a.s.c.a.NodeLostTrigger NodeLostTrigger .auto_add_replicas - Initial livenodes: [127.0.0.1:10012_solr, 127.0.0.1:10011_solr]
   [junit4]   2> 4115210 DEBUG (Simulated OverseerAutoScalingTriggerThread) [    ] o.a.s.c.a.OverseerTriggerThread -- clean old nodeAdded markers
   [junit4]   2> 4115210 DEBUG (Simulated OverseerAutoScalingTriggerThread) [    ] o.a.s.c.a.OverseerTriggerThread Current znodeVersion 15, lastZnodeVersion 15
   [junit4]   2> 4115247 DEBUG (simCloudManagerPool-7456-thread-2) [    ] o.a.s.c.a.AutoScalingHandler Verified autoscaling configuration
   [junit4]   2> 4115247 DEBUG (simCloudManagerPool-7456-thread-2) [    ] o.a.s.c.a.OverseerTriggerThread Refreshing /autoscaling.json with znode version 16
   [junit4]   2> 4115247 DEBUG (ScheduledTrigger-7457-thread-2) [    ] o.a.s.c.a.NodeLostTrigger Running NodeLostTrigger: .auto_add_replicas with currently live nodes: 2
   [junit4]   2> 4115441 DEBUG (Simulated OverseerAutoScalingTriggerThread) [    ] o.a.s.c.a.OverseerTriggerThread Processed trigger updates upto znodeVersion 16
   [junit4]   2> 4115441 DEBUG (Simulated OverseerAutoScalingTriggerThread) [    ] o.a.s.c.a.OverseerTriggerThread -- clean old nodeAdded markers
   [junit4]   2> 4115441 DEBUG (Simulated OverseerAutoScalingTriggerThread) [    ] o.a.s.c.a.OverseerTriggerThread Current znodeVersion 16, lastZnodeVersion 16
   [junit4]   2> 4115442 DEBUG (TEST-TestSimTriggerIntegration.testSearchRate-seed#[E0F0767337D3CD52]) [    ] o.a.s.c.a.s.SimClusterStateProvider ** creating new collection states
   [junit4]   2> 4115442 DEBUG (TEST-TestSimTriggerIntegration.testSearchRate-seed#[E0F0767337D3CD52]) [    ] o.a.s.c.a.s.SimClusterStateProvider ** saved cluster state version 18
   [junit4]   2> 4115442 WARN  (TEST-TestSimTriggerIntegration.testSearchRate-seed#[E0F0767337D3CD52]) [    ] o.a.s.c.o.ClusterStateMutator Collection .system already exists. exit
   [junit4]   2> 4115442 WARN  (TEST-TestSimTriggerIntegration.testSearchRate-seed#[E0F0767337D3CD52]) [    ] o.a.s.c.a.s.SimClusterStateProvider Collection .system already exists. exit
   [junit4]   2> 4115466 WARN  (ScheduledTrigger-7457-thread-3) [    ] o.a.s.c.a.ScheduledTrigger ScheduledTrigger ran but was already closed
   [junit4]   2> 4115466 ERROR (ScheduledTrigger-7457-thread-3) [    ] o.a.s.c.a.ScheduledTriggers Unexpected exception from trigger: .scheduled_maintenance
   [junit4]   2> java.lang.RuntimeException: Trigger has been closed
   [junit4]   2> 	at org.apache.solr.cloud.autoscaling.ScheduledTrigger.run(ScheduledTrigger.java:155) ~[java/:?]
   [junit4]   2> 	at org.apache.solr.cloud.autoscaling.ScheduledTriggers$TriggerWrapper.run(ScheduledTriggers.java:591) [java/:?]
   [junit4]   2> 	at java.util.concurrent.Executors$RunnableAdapter.call(Executors.java:511) [?:1.8.0_172]
   [junit4]   2> 	at java.util.concurrent.FutureTask.runAndReset(FutureTask.java:308) [?:1.8.0_172]
   [junit4]   2> 	at java.util.concurrent.ScheduledThreadPoolExecutor$ScheduledFutureTask.access$301(ScheduledThreadPoolExecutor.java:180) [?:1.8.0_172]
   [junit4]   2> 	at java.util.concurrent.ScheduledThreadPoolExecutor$ScheduledFutureTask.run(ScheduledThreadPoolExecutor.java:294) [?:1.8.0_172]
   [junit4]   2> 	at java.util.concurrent.ThreadPoolExecutor.runWorker(ThreadPoolExecutor.java:1149) [?:1.8.0_172]
   [junit4]   2> 	at java.util.concurrent.ThreadPoolExecutor$Worker.run(ThreadPoolExecutor.java:624) [?:1.8.0_172]
   [junit4]   2> 	at java.lang.Thread.run(Thread.java:748) [?:1.8.0_172]
   [junit4]   2> 4115466 DEBUG (ScheduledTrigger-7457-thread-1) [    ] o.a.s.c.a.NodeLostTrigger Running NodeLostTrigger: .auto_add_replicas with currently live nodes: 2
   [junit4]   2> 4115473 DEBUG (simCloudManagerPool-7456-thread-3) [    ] o.a.s.c.a.s.SimClusterStateProvider ** creating new collection states
   [junit4]   2> 4115474 DEBUG (simCloudManagerPool-7456-thread-3) [    ] o.a.s.c.a.s.SimClusterStateProvider ** saved cluster state version 19
   [junit4]   2> 4115502 DEBUG (ScheduledTrigger-7457-thread-1) [    ] o.a.s.c.a.NodeLostTrigger Running NodeLostTrigger: .auto_add_replicas with currently live nodes: 2
   [junit4]   2> 4115510 DEBUG (simCloudManagerPool-7456-thread-4) [    ] o.a.s.c.a.s.SimClusterStateProvider -- elected new leader for .system / shard1: {"core_node4":{
   [junit4]   2>     "core":".system_shard1_replica_n1",
   [junit4]   2>     "shard":"shard1",
   [junit4]   2>     "collection":".system",
   [junit4]   2>     "node_name":"127.0.0.1:10012_solr",
   [junit4]   2>     "type":"NRT",
   [junit4]   2>     "leader":"true",
   [junit4]   2>     "SEARCHER.searcher.maxDoc":0,
   [junit4]   2>     "SEARCHER.searcher.deletedDocs":0,
   [junit4]   2>     "INDEX.sizeInBytes":10240,
   [junit4]   2>     "state":"active",
   [junit4]   2>     "INDEX.sizeInGB":9.5367431640625E-6,
   [junit4]   2>     "SEARCHER.searcher.numDocs":0}}
   [junit4]   2> 4115510 DEBUG (simCloudManagerPool-7456-thread-1) [    ] o.a.s.c.a.s.SimClusterStateProvider ** creating new collection states
   [junit4]   2> 4115510 DEBUG (simCloudManagerPool-7456-thread-1) [    ] o.a.s.c.a.s.SimClusterStateProvider ** saved cluster state version 20
   [junit4]   2> 4115522 DEBUG (ScheduledTrigger-7457-thread-1) [    ] o.a.s.c.a.NodeLostTrigger Running NodeLostTrigger: .auto_add_replicas with currently live nodes: 2
   [junit4]   2> 4115550 DEBUG (ScheduledTrigger-7457-thread-1) [    ] o.a.s.c.a.NodeLostTrigger Running NodeLostTrigger: .auto_add_replicas with currently live nodes: 2
   [junit4]   2> 4115551 DEBUG (simCloudManagerPool-7456-thread-6) [    ] o.a.s.c.a.s.SimClusterStateProvider ** creating new collection states
   [junit4]   2> 4115552 DEBUG (simCloudManagerPool-7456-thread-6) [    ] o.a.s.c.a.s.SimClusterStateProvider ** saved cluster state version 21
   [junit4]   2> 4115571 DEBUG (ScheduledTrigger-7457-thread-1) [    ] o.a.s.c.a.NodeLostTrigger Running NodeLostTrigger: .auto_add_replicas with currently live nodes: 2
   [junit4]   2> 4115585 DEBUG (simCloudManagerPool-7456-thread-8) [    ] o.a.s.c.a.s.SimClusterStateProvider ** creating new collection states
   [junit4]   2> 4115585 DEBUG (simCloudManagerPool-7456-thread-8) [    ] o.a.s.c.a.s.SimClusterStateProvider ** saved cluster state version 22
   [junit4]   2> 4115632 DEBUG (TEST-TestSimTriggerIntegration.testSearchRate-seed#[E0F0767337D3CD52]) [    ] o.a.s.c.a.s.SimClusterStateProvider ** creating new collection states
   [junit4]   2> 4115632 DEBUG (ScheduledTrigger-7457-thread-1) [    ] o.a.s.c.a.NodeLostTrigger Running NodeLostTrigger: .auto_add_replicas with currently live nodes: 2
   [junit4]   2> 4115632 DEBUG (simCloudManagerPool-7456-thread-11) [    ] o.a.s.c.a.s.SimClusterStateProvider -- elected new leader for collection1 / shard1: {"core_node1":{
   [junit4]   2>     "core":"collection1_shard1_replica_n1",
   [junit4]   2>     "shard":"shard1",
   [junit4]   2>     "collection":"collection1",
   [junit4]   2>     "node_name":"127.0.0.1:10012_solr",
   [junit4]   2>     "type":"NRT",
   [junit4]   2>     "leader":"true",
   [junit4]   2>     "SEARCHER.searcher.maxDoc":0,
   [junit4]   2>     "SEARCHER.searcher.deletedDocs":0,
   [junit4]   2>     "INDEX.sizeInBytes":10240,
   [junit4]   2>     "state":"active",
   [junit4]   2>     "INDEX.sizeInGB":9.5367431640625E-6,
   [junit4]   2>     "SEARCHER.searcher.numDocs":0}}
   [junit4]   2> 4115632 DEBUG (TEST-TestSimTriggerIntegration.testSearchRate-seed#[E0F0767337D3CD52]) [    ] o.a.s.c.a.s.SimClusterStateProvider ** saved cluster state version 23
 

[...truncated too long message...]


-ivy-fail-disallowed-ivy-version:

ivy-fail:

ivy-fail:

ivy-configure:
[ivy:configure] :: loading settings :: file = /home/jenkins/jenkins-slave/workspace/Lucene-Solr-Tests-master/lucene/top-level-ivy-settings.xml

resolve:

ivy-availability-check:
[loadresource] Do not set property disallowed.ivy.jars.list as its length is 0.

-ivy-fail-disallowed-ivy-version:

ivy-fail:

ivy-configure:
[ivy:configure] :: loading settings :: file = /home/jenkins/jenkins-slave/workspace/Lucene-Solr-Tests-master/lucene/top-level-ivy-settings.xml

resolve:

ivy-availability-check:
[loadresource] Do not set property disallowed.ivy.jars.list as its length is 0.

-ivy-fail-disallowed-ivy-version:

ivy-fail:

ivy-fail:

ivy-configure:
[ivy:configure] :: loading settings :: file = /home/jenkins/jenkins-slave/workspace/Lucene-Solr-Tests-master/lucene/top-level-ivy-settings.xml

resolve:

ivy-availability-check:
[loadresource] Do not set property disallowed.ivy.jars.list as its length is 0.

-ivy-fail-disallowed-ivy-version:

ivy-fail:

ivy-configure:
[ivy:configure] :: loading settings :: file = /home/jenkins/jenkins-slave/workspace/Lucene-Solr-Tests-master/lucene/top-level-ivy-settings.xml

resolve:

ivy-availability-check:
[loadresource] Do not set property disallowed.ivy.jars.list as its length is 0.

-ivy-fail-disallowed-ivy-version:

ivy-fail:

ivy-fail:

ivy-configure:
[ivy:configure] :: loading settings :: file = /home/jenkins/jenkins-slave/workspace/Lucene-Solr-Tests-master/lucene/top-level-ivy-settings.xml

resolve:

ivy-availability-check:
[loadresource] Do not set property disallowed.ivy.jars.list as its length is 0.

-ivy-fail-disallowed-ivy-version:

ivy-fail:

ivy-fail:

ivy-configure:
[ivy:configure] :: loading settings :: file = /home/jenkins/jenkins-slave/workspace/Lucene-Solr-Tests-master/lucene/top-level-ivy-settings.xml

resolve:

ivy-availability-check:
[loadresource] Do not set property disallowed.ivy.jars.list as its length is 0.

-ivy-fail-disallowed-ivy-version:

ivy-fail:

ivy-fail:

ivy-configure:
[ivy:configure] :: loading settings :: file = /home/jenkins/jenkins-slave/workspace/Lucene-Solr-Tests-master/lucene/top-level-ivy-settings.xml

resolve:

ivy-availability-check:
[loadresource] Do not set property disallowed.ivy.jars.list as its length is 0.

-ivy-fail-disallowed-ivy-version:

ivy-fail:

ivy-fail:

ivy-configure:
[ivy:configure] :: loading settings :: file = /home/jenkins/jenkins-slave/workspace/Lucene-Solr-Tests-master/lucene/top-level-ivy-settings.xml

resolve:

ivy-availability-check:
[loadresource] Do not set property disallowed.ivy.jars.list as its length is 0.

-ivy-fail-disallowed-ivy-version:

ivy-fail:

ivy-fail:

ivy-configure:
[ivy:configure] :: loading settings :: file = /home/jenkins/jenkins-slave/workspace/Lucene-Solr-Tests-master/lucene/top-level-ivy-settings.xml

resolve:

ivy-availability-check:
[loadresource] Do not set property disallowed.ivy.jars.list as its length is 0.

-ivy-fail-disallowed-ivy-version:

ivy-fail:

ivy-fail:

ivy-configure:
[ivy:configure] :: loading settings :: file = /home/jenkins/jenkins-slave/workspace/Lucene-Solr-Tests-master/lucene/top-level-ivy-settings.xml

resolve:

ivy-availability-check:
[loadresource] Do not set property disallowed.ivy.jars.list as its length is 0.

-ivy-fail-disallowed-ivy-version:

ivy-fail:

ivy-fail:

ivy-configure:
[ivy:configure] :: loading settings :: file = /home/jenkins/jenkins-slave/workspace/Lucene-Solr-Tests-master/lucene/top-level-ivy-settings.xml

resolve:

ivy-availability-check:
[loadresource] Do not set property disallowed.ivy.jars.list as its length is 0.

-ivy-fail-disallowed-ivy-version:

ivy-fail:

ivy-fail:

ivy-configure:
[ivy:configure] :: loading settings :: file = /home/jenkins/jenkins-slave/workspace/Lucene-Solr-Tests-master/lucene/top-level-ivy-settings.xml

resolve:

ivy-availability-check:
[loadresource] Do not set property disallowed.ivy.jars.list as its length is 0.

-ivy-fail-disallowed-ivy-version:

ivy-fail:

ivy-fail:

ivy-configure:
[ivy:configure] :: loading settings :: file = /home/jenkins/jenkins-slave/workspace/Lucene-Solr-Tests-master/lucene/top-level-ivy-settings.xml

resolve:

ivy-availability-check:
[loadresource] Do not set property disallowed.ivy.jars.list as its length is 0.

-ivy-fail-disallowed-ivy-version:

ivy-fail:

ivy-fail:

ivy-configure:
[ivy:configure] :: loading settings :: file = /home/jenkins/jenkins-slave/workspace/Lucene-Solr-Tests-master/lucene/top-level-ivy-settings.xml

resolve:

jar-checksums:
    [mkdir] Created dir: /home/jenkins/jenkins-slave/workspace/Lucene-Solr-Tests-master/solr/null408389710
     [copy] Copying 238 files to /home/jenkins/jenkins-slave/workspace/Lucene-Solr-Tests-master/solr/null408389710
   [delete] Deleting directory /home/jenkins/jenkins-slave/workspace/Lucene-Solr-Tests-master/solr/null408389710

check-working-copy:
[ivy:cachepath] :: resolving dependencies :: org.eclipse.jgit#org.eclipse.jgit-caller;working
[ivy:cachepath] 	confs: [default]
[ivy:cachepath] 	found org.eclipse.jgit#org.eclipse.jgit;4.6.0.201612231935-r in public
[ivy:cachepath] 	found com.jcraft#jsch;0.1.53 in public
[ivy:cachepath] 	found com.googlecode.javaewah#JavaEWAH;1.1.6 in public
[ivy:cachepath] 	found org.apache.httpcomponents#httpclient;4.3.6 in public
[ivy:cachepath] 	found org.apache.httpcomponents#httpcore;4.3.3 in public
[ivy:cachepath] 	found commons-logging#commons-logging;1.1.3 in public
[ivy:cachepath] 	found commons-codec#commons-codec;1.6 in public
[ivy:cachepath] 	found org.slf4j#slf4j-api;1.7.2 in public
[ivy:cachepath] :: resolution report :: resolve 90ms :: artifacts dl 13ms
	---------------------------------------------------------------------
	|                  |            modules            ||   artifacts   |
	|       conf       | number| search|dwnlded|evicted|| number|dwnlded|
	---------------------------------------------------------------------
	|      default     |   8   |   0   |   0   |   0   ||   8   |   0   |
	---------------------------------------------------------------------
[wc-checker] Initializing working copy...
[wc-checker] SLF4J: Failed to load class "org.slf4j.impl.StaticLoggerBinder".
[wc-checker] SLF4J: Defaulting to no-operation (NOP) logger implementation
[wc-checker] SLF4J: See http://www.slf4j.org/codes.html#StaticLoggerBinder for further details.
[wc-checker] Checking working copy status...

-jenkins-base:

BUILD SUCCESSFUL
Total time: 215 minutes 46 seconds
Archiving artifacts
java.lang.InterruptedException: no matches found within 10000
	at hudson.FilePath$34.hasMatch(FilePath.java:2678)
	at hudson.FilePath$34.invoke(FilePath.java:2557)
	at hudson.FilePath$34.invoke(FilePath.java:2547)
	at hudson.FilePath$FileCallableWrapper.call(FilePath.java:2918)
Also:   hudson.remoting.Channel$CallSiteStackTrace: Remote call to lucene2
		at hudson.remoting.Channel.attachCallSiteStackTrace(Channel.java:1741)
		at hudson.remoting.UserRequest$ExceptionResponse.retrieve(UserRequest.java:357)
		at hudson.remoting.Channel.call(Channel.java:955)
		at hudson.FilePath.act(FilePath.java:1036)
		at hudson.FilePath.act(FilePath.java:1025)
		at hudson.FilePath.validateAntFileMask(FilePath.java:2547)
		at hudson.tasks.ArtifactArchiver.perform(ArtifactArchiver.java:243)
		at hudson.tasks.BuildStepCompatibilityLayer.perform(BuildStepCompatibilityLayer.java:81)
		at hudson.tasks.BuildStepMonitor$1.perform(BuildStepMonitor.java:20)
		at hudson.model.AbstractBuild$AbstractBuildExecution.perform(AbstractBuild.java:744)
		at hudson.model.AbstractBuild$AbstractBuildExecution.performAllBuildSteps(AbstractBuild.java:690)
		at hudson.model.Build$BuildExecution.post2(Build.java:186)
		at hudson.model.AbstractBuild$AbstractBuildExecution.post(AbstractBuild.java:635)
		at hudson.model.Run.execute(Run.java:1819)
		at hudson.model.FreeStyleBuild.run(FreeStyleBuild.java:43)
		at hudson.model.ResourceController.execute(ResourceController.java:97)
		at hudson.model.Executor.run(Executor.java:429)
Caused: hudson.FilePath$TunneledInterruptedException
	at hudson.FilePath$FileCallableWrapper.call(FilePath.java:2920)
	at hudson.remoting.UserRequest.perform(UserRequest.java:212)
	at hudson.remoting.UserRequest.perform(UserRequest.java:54)
	at hudson.remoting.Request$2.run(Request.java:369)
	at hudson.remoting.InterceptingExecutorService$1.call(InterceptingExecutorService.java:72)
	at java.util.concurrent.FutureTask.run(FutureTask.java:266)
	at java.util.concurrent.ThreadPoolExecutor.runWorker(ThreadPoolExecutor.java:1142)
	at java.util.concurrent.ThreadPoolExecutor$Worker.run(ThreadPoolExecutor.java:617)
	at java.lang.Thread.run(Thread.java:748)
Caused: java.lang.InterruptedException: java.lang.InterruptedException: no matches found within 10000
	at hudson.FilePath.act(FilePath.java:1038)
	at hudson.FilePath.act(FilePath.java:1025)
	at hudson.FilePath.validateAntFileMask(FilePath.java:2547)
	at hudson.tasks.ArtifactArchiver.perform(ArtifactArchiver.java:243)
	at hudson.tasks.BuildStepCompatibilityLayer.perform(BuildStepCompatibilityLayer.java:81)
	at hudson.tasks.BuildStepMonitor$1.perform(BuildStepMonitor.java:20)
	at hudson.model.AbstractBuild$AbstractBuildExecution.perform(AbstractBuild.java:744)
	at hudson.model.AbstractBuild$AbstractBuildExecution.performAllBuildSteps(AbstractBuild.java:690)
	at hudson.model.Build$BuildExecution.post2(Build.java:186)
	at hudson.model.AbstractBuild$AbstractBuildExecution.post(AbstractBuild.java:635)
	at hudson.model.Run.execute(Run.java:1819)
	at hudson.model.FreeStyleBuild.run(FreeStyleBuild.java:43)
	at hudson.model.ResourceController.execute(ResourceController.java:97)
	at hudson.model.Executor.run(Executor.java:429)
No artifacts found that match the file pattern "**/*.events,heapdumps/**,**/hs_err_pid*". Configuration error?
Recording test results
Build step 'Publish JUnit test result report' changed build result to UNSTABLE
Email was triggered for: Unstable (Test Failures)
Sending email for trigger: Unstable (Test Failures)

Mime
View raw message