lucene-dev mailing list archives

Site index · List index
Message view « Date » · « Thread »
Top « Date » · « Thread »
From Policeman Jenkins Server <jenk...@thetaphi.de>
Subject [JENKINS] Lucene-Solr-master-Linux (64bit/jdk-11) - Build # 22953 - Still Unstable!
Date Mon, 01 Oct 2018 03:06:20 GMT
Build: https://jenkins.thetaphi.de/job/Lucene-Solr-master-Linux/22953/
Java: 64bit/jdk-11 -XX:+UseCompressedOops -XX:+UseParallelGC

6 tests failed.
FAILED:  org.apache.solr.client.solrj.impl.CloudSolrClientTest.preferReplicaTypesTest

Error Message:


Stack Trace:
java.lang.AssertionError
	at __randomizedtesting.SeedInfo.seed([291365CCE57A4E66:12F9C67A82E3836A]:0)
	at org.junit.Assert.fail(Assert.java:92)
	at org.junit.Assert.assertTrue(Assert.java:43)
	at org.junit.Assert.assertTrue(Assert.java:54)
	at org.apache.solr.client.solrj.impl.CloudSolrClientTest.queryWithPreferReplicaTypes(CloudSolrClientTest.java:957)
	at org.apache.solr.client.solrj.impl.CloudSolrClientTest.preferReplicaTypesTest(CloudSolrClientTest.java:879)
	at java.base/jdk.internal.reflect.NativeMethodAccessorImpl.invoke0(Native Method)
	at java.base/jdk.internal.reflect.NativeMethodAccessorImpl.invoke(NativeMethodAccessorImpl.java:62)
	at java.base/jdk.internal.reflect.DelegatingMethodAccessorImpl.invoke(DelegatingMethodAccessorImpl.java:43)
	at java.base/java.lang.reflect.Method.invoke(Method.java:566)
	at com.carrotsearch.randomizedtesting.RandomizedRunner.invoke(RandomizedRunner.java:1742)
	at com.carrotsearch.randomizedtesting.RandomizedRunner$8.evaluate(RandomizedRunner.java:935)
	at com.carrotsearch.randomizedtesting.RandomizedRunner$9.evaluate(RandomizedRunner.java:971)
	at com.carrotsearch.randomizedtesting.RandomizedRunner$10.evaluate(RandomizedRunner.java:985)
	at org.junit.rules.ExpectedException$ExpectedExceptionStatement.evaluate(ExpectedException.java:110)
	at com.carrotsearch.randomizedtesting.rules.SystemPropertiesRestoreRule$1.evaluate(SystemPropertiesRestoreRule.java:57)
	at org.apache.lucene.util.TestRuleSetupTeardownChained$1.evaluate(TestRuleSetupTeardownChained.java:49)
	at org.apache.lucene.util.AbstractBeforeAfterRule$1.evaluate(AbstractBeforeAfterRule.java:45)
	at org.apache.lucene.util.TestRuleThreadAndTestName$1.evaluate(TestRuleThreadAndTestName.java:48)
	at org.apache.lucene.util.TestRuleIgnoreAfterMaxFailures$1.evaluate(TestRuleIgnoreAfterMaxFailures.java:64)
	at org.apache.lucene.util.TestRuleMarkFailure$1.evaluate(TestRuleMarkFailure.java:47)
	at com.carrotsearch.randomizedtesting.rules.StatementAdapter.evaluate(StatementAdapter.java:36)
	at com.carrotsearch.randomizedtesting.ThreadLeakControl$StatementRunner.run(ThreadLeakControl.java:368)
	at com.carrotsearch.randomizedtesting.ThreadLeakControl.forkTimeoutingTask(ThreadLeakControl.java:817)
	at com.carrotsearch.randomizedtesting.ThreadLeakControl$3.evaluate(ThreadLeakControl.java:468)
	at com.carrotsearch.randomizedtesting.RandomizedRunner.runSingleTest(RandomizedRunner.java:944)
	at com.carrotsearch.randomizedtesting.RandomizedRunner$5.evaluate(RandomizedRunner.java:830)
	at com.carrotsearch.randomizedtesting.RandomizedRunner$6.evaluate(RandomizedRunner.java:880)
	at com.carrotsearch.randomizedtesting.RandomizedRunner$7.evaluate(RandomizedRunner.java:891)
	at com.carrotsearch.randomizedtesting.rules.StatementAdapter.evaluate(StatementAdapter.java:36)
	at com.carrotsearch.randomizedtesting.rules.SystemPropertiesRestoreRule$1.evaluate(SystemPropertiesRestoreRule.java:57)
	at org.apache.lucene.util.AbstractBeforeAfterRule$1.evaluate(AbstractBeforeAfterRule.java:45)
	at com.carrotsearch.randomizedtesting.rules.StatementAdapter.evaluate(StatementAdapter.java:36)
	at org.apache.lucene.util.TestRuleStoreClassName$1.evaluate(TestRuleStoreClassName.java:41)
	at com.carrotsearch.randomizedtesting.rules.NoShadowingOrOverridesOnMethodsRule$1.evaluate(NoShadowingOrOverridesOnMethodsRule.java:40)
	at com.carrotsearch.randomizedtesting.rules.NoShadowingOrOverridesOnMethodsRule$1.evaluate(NoShadowingOrOverridesOnMethodsRule.java:40)
	at com.carrotsearch.randomizedtesting.rules.StatementAdapter.evaluate(StatementAdapter.java:36)
	at com.carrotsearch.randomizedtesting.rules.StatementAdapter.evaluate(StatementAdapter.java:36)
	at org.apache.lucene.util.TestRuleAssertionsRequired$1.evaluate(TestRuleAssertionsRequired.java:53)
	at org.apache.lucene.util.TestRuleMarkFailure$1.evaluate(TestRuleMarkFailure.java:47)
	at org.apache.lucene.util.TestRuleIgnoreAfterMaxFailures$1.evaluate(TestRuleIgnoreAfterMaxFailures.java:64)
	at org.apache.lucene.util.TestRuleIgnoreTestSuites$1.evaluate(TestRuleIgnoreTestSuites.java:54)
	at com.carrotsearch.randomizedtesting.rules.StatementAdapter.evaluate(StatementAdapter.java:36)
	at com.carrotsearch.randomizedtesting.ThreadLeakControl$StatementRunner.run(ThreadLeakControl.java:368)
	at java.base/java.lang.Thread.run(Thread.java:834)


FAILED:  org.apache.solr.client.solrj.impl.CloudSolrClientTest.preferReplicaTypesTest

Error Message:
IOException occured when talking to server at: https://127.0.0.1:46545/solr/replicaTypesTestColl_shard1_replica_t2

Stack Trace:
org.apache.solr.client.solrj.impl.CloudSolrClient$RouteException: IOException occured when talking to server at: https://127.0.0.1:46545/solr/replicaTypesTestColl_shard1_replica_t2
	at __randomizedtesting.SeedInfo.seed([291365CCE57A4E66:12F9C67A82E3836A]:0)
	at org.apache.solr.client.solrj.impl.CloudSolrClient.directUpdate(CloudSolrClient.java:553)
	at org.apache.solr.client.solrj.impl.CloudSolrClient.sendRequest(CloudSolrClient.java:1016)
	at org.apache.solr.client.solrj.impl.CloudSolrClient.requestWithRetryOnStaleState(CloudSolrClient.java:884)
	at org.apache.solr.client.solrj.impl.CloudSolrClient.request(CloudSolrClient.java:817)
	at org.apache.solr.client.solrj.SolrRequest.process(SolrRequest.java:194)
	at org.apache.solr.client.solrj.request.UpdateRequest.commit(UpdateRequest.java:233)
	at org.apache.solr.client.solrj.impl.CloudSolrClientTest.preferReplicaTypesTest(CloudSolrClientTest.java:876)
	at java.base/jdk.internal.reflect.NativeMethodAccessorImpl.invoke0(Native Method)
	at java.base/jdk.internal.reflect.NativeMethodAccessorImpl.invoke(NativeMethodAccessorImpl.java:62)
	at java.base/jdk.internal.reflect.DelegatingMethodAccessorImpl.invoke(DelegatingMethodAccessorImpl.java:43)
	at java.base/java.lang.reflect.Method.invoke(Method.java:566)
	at com.carrotsearch.randomizedtesting.RandomizedRunner.invoke(RandomizedRunner.java:1742)
	at com.carrotsearch.randomizedtesting.RandomizedRunner$8.evaluate(RandomizedRunner.java:935)
	at com.carrotsearch.randomizedtesting.RandomizedRunner$9.evaluate(RandomizedRunner.java:971)
	at com.carrotsearch.randomizedtesting.RandomizedRunner$10.evaluate(RandomizedRunner.java:985)
	at org.junit.rules.ExpectedException$ExpectedExceptionStatement.evaluate(ExpectedException.java:110)
	at com.carrotsearch.randomizedtesting.rules.SystemPropertiesRestoreRule$1.evaluate(SystemPropertiesRestoreRule.java:57)
	at org.apache.lucene.util.TestRuleSetupTeardownChained$1.evaluate(TestRuleSetupTeardownChained.java:49)
	at org.apache.lucene.util.AbstractBeforeAfterRule$1.evaluate(AbstractBeforeAfterRule.java:45)
	at org.apache.lucene.util.TestRuleThreadAndTestName$1.evaluate(TestRuleThreadAndTestName.java:48)
	at org.apache.lucene.util.TestRuleIgnoreAfterMaxFailures$1.evaluate(TestRuleIgnoreAfterMaxFailures.java:64)
	at org.apache.lucene.util.TestRuleMarkFailure$1.evaluate(TestRuleMarkFailure.java:47)
	at com.carrotsearch.randomizedtesting.rules.StatementAdapter.evaluate(StatementAdapter.java:36)
	at com.carrotsearch.randomizedtesting.ThreadLeakControl$StatementRunner.run(ThreadLeakControl.java:368)
	at com.carrotsearch.randomizedtesting.ThreadLeakControl.forkTimeoutingTask(ThreadLeakControl.java:817)
	at com.carrotsearch.randomizedtesting.ThreadLeakControl$3.evaluate(ThreadLeakControl.java:468)
	at com.carrotsearch.randomizedtesting.RandomizedRunner.runSingleTest(RandomizedRunner.java:944)
	at com.carrotsearch.randomizedtesting.RandomizedRunner$5.evaluate(RandomizedRunner.java:830)
	at com.carrotsearch.randomizedtesting.RandomizedRunner$6.evaluate(RandomizedRunner.java:880)
	at com.carrotsearch.randomizedtesting.RandomizedRunner$7.evaluate(RandomizedRunner.java:891)
	at com.carrotsearch.randomizedtesting.rules.StatementAdapter.evaluate(StatementAdapter.java:36)
	at com.carrotsearch.randomizedtesting.rules.SystemPropertiesRestoreRule$1.evaluate(SystemPropertiesRestoreRule.java:57)
	at org.apache.lucene.util.AbstractBeforeAfterRule$1.evaluate(AbstractBeforeAfterRule.java:45)
	at com.carrotsearch.randomizedtesting.rules.StatementAdapter.evaluate(StatementAdapter.java:36)
	at org.apache.lucene.util.TestRuleStoreClassName$1.evaluate(TestRuleStoreClassName.java:41)
	at com.carrotsearch.randomizedtesting.rules.NoShadowingOrOverridesOnMethodsRule$1.evaluate(NoShadowingOrOverridesOnMethodsRule.java:40)
	at com.carrotsearch.randomizedtesting.rules.NoShadowingOrOverridesOnMethodsRule$1.evaluate(NoShadowingOrOverridesOnMethodsRule.java:40)
	at com.carrotsearch.randomizedtesting.rules.StatementAdapter.evaluate(StatementAdapter.java:36)
	at com.carrotsearch.randomizedtesting.rules.StatementAdapter.evaluate(StatementAdapter.java:36)
	at org.apache.lucene.util.TestRuleAssertionsRequired$1.evaluate(TestRuleAssertionsRequired.java:53)
	at org.apache.lucene.util.TestRuleMarkFailure$1.evaluate(TestRuleMarkFailure.java:47)
	at org.apache.lucene.util.TestRuleIgnoreAfterMaxFailures$1.evaluate(TestRuleIgnoreAfterMaxFailures.java:64)
	at org.apache.lucene.util.TestRuleIgnoreTestSuites$1.evaluate(TestRuleIgnoreTestSuites.java:54)
	at com.carrotsearch.randomizedtesting.rules.StatementAdapter.evaluate(StatementAdapter.java:36)
	at com.carrotsearch.randomizedtesting.ThreadLeakControl$StatementRunner.run(ThreadLeakControl.java:368)
	at java.base/java.lang.Thread.run(Thread.java:834)
Caused by: org.apache.solr.client.solrj.SolrServerException: IOException occured when talking to server at: https://127.0.0.1:46545/solr/replicaTypesTestColl_shard1_replica_t2
	at org.apache.solr.client.solrj.impl.HttpSolrClient.executeMethod(HttpSolrClient.java:657)
	at org.apache.solr.client.solrj.impl.HttpSolrClient.request(HttpSolrClient.java:255)
	at org.apache.solr.client.solrj.impl.HttpSolrClient.request(HttpSolrClient.java:244)
	at org.apache.solr.client.solrj.impl.LBHttpSolrClient.doRequest(LBHttpSolrClient.java:483)
	at org.apache.solr.client.solrj.impl.LBHttpSolrClient.request(LBHttpSolrClient.java:413)
	at org.apache.solr.client.solrj.impl.CloudSolrClient.lambda$directUpdate$0(CloudSolrClient.java:528)
	at java.base/java.util.concurrent.FutureTask.run(FutureTask.java:264)
	at org.apache.solr.common.util.ExecutorUtil$MDCAwareThreadPoolExecutor.lambda$execute$0(ExecutorUtil.java:209)
	at java.base/java.util.concurrent.ThreadPoolExecutor.runWorker(ThreadPoolExecutor.java:1128)
	at java.base/java.util.concurrent.ThreadPoolExecutor$Worker.run(ThreadPoolExecutor.java:628)
	... 1 more
Caused by: javax.net.ssl.SSLException: Received fatal alert: internal_error
	at java.base/sun.security.ssl.Alert.createSSLException(Alert.java:129)
	at java.base/sun.security.ssl.Alert.createSSLException(Alert.java:117)
	at java.base/sun.security.ssl.TransportContext.fatal(TransportContext.java:308)
	at java.base/sun.security.ssl.Alert$AlertConsumer.consume(Alert.java:279)
	at java.base/sun.security.ssl.TransportContext.dispatch(TransportContext.java:181)
	at java.base/sun.security.ssl.SSLTransport.decode(SSLTransport.java:164)
	at java.base/sun.security.ssl.SSLSocketImpl.decode(SSLSocketImpl.java:1152)
	at java.base/sun.security.ssl.SSLSocketImpl.readHandshakeRecord(SSLSocketImpl.java:1063)
	at java.base/sun.security.ssl.SSLSocketImpl.startHandshake(SSLSocketImpl.java:402)
	at org.apache.http.conn.ssl.SSLConnectionSocketFactory.createLayeredSocket(SSLConnectionSocketFactory.java:396)
	at org.apache.http.conn.ssl.SSLConnectionSocketFactory.connectSocket(SSLConnectionSocketFactory.java:355)
	at org.apache.http.impl.conn.DefaultHttpClientConnectionOperator.connect(DefaultHttpClientConnectionOperator.java:142)
	at org.apache.http.impl.conn.PoolingHttpClientConnectionManager.connect(PoolingHttpClientConnectionManager.java:359)
	at org.apache.http.impl.execchain.MainClientExec.establishRoute(MainClientExec.java:381)
	at org.apache.http.impl.execchain.MainClientExec.execute(MainClientExec.java:237)
	at org.apache.http.impl.execchain.ProtocolExec.execute(ProtocolExec.java:185)
	at org.apache.http.impl.execchain.RetryExec.execute(RetryExec.java:89)
	at org.apache.http.impl.execchain.RedirectExec.execute(RedirectExec.java:111)
	at org.apache.http.impl.client.InternalHttpClient.doExecute(InternalHttpClient.java:185)
	at org.apache.http.impl.client.CloseableHttpClient.execute(CloseableHttpClient.java:83)
	at org.apache.http.impl.client.CloseableHttpClient.execute(CloseableHttpClient.java:56)
	at org.apache.solr.client.solrj.impl.HttpSolrClient.executeMethod(HttpSolrClient.java:542)
	... 10 more


FAILED:  org.apache.solr.schema.TestPointFields.testIntPointFieldSortAndFunction

Error Message:
Exception during query

Stack Trace:
java.lang.RuntimeException: Exception during query
	at __randomizedtesting.SeedInfo.seed([E7AB050900E7AC47:839B80921A9C4030]:0)
	at org.apache.solr.SolrTestCaseJ4.assertQ(SolrTestCaseJ4.java:917)
	at org.apache.solr.SolrTestCaseJ4.assertQ(SolrTestCaseJ4.java:877)
	at org.apache.solr.schema.TestPointFields.doTestIntPointFunctionQuery(TestPointFields.java:2547)
	at org.apache.solr.schema.TestPointFields.testIntPointFieldSortAndFunction(TestPointFields.java:166)
	at java.base/jdk.internal.reflect.NativeMethodAccessorImpl.invoke0(Native Method)
	at java.base/jdk.internal.reflect.NativeMethodAccessorImpl.invoke(NativeMethodAccessorImpl.java:62)
	at java.base/jdk.internal.reflect.DelegatingMethodAccessorImpl.invoke(DelegatingMethodAccessorImpl.java:43)
	at java.base/java.lang.reflect.Method.invoke(Method.java:566)
	at com.carrotsearch.randomizedtesting.RandomizedRunner.invoke(RandomizedRunner.java:1742)
	at com.carrotsearch.randomizedtesting.RandomizedRunner$8.evaluate(RandomizedRunner.java:935)
	at com.carrotsearch.randomizedtesting.RandomizedRunner$9.evaluate(RandomizedRunner.java:971)
	at com.carrotsearch.randomizedtesting.RandomizedRunner$10.evaluate(RandomizedRunner.java:985)
	at com.carrotsearch.randomizedtesting.rules.SystemPropertiesRestoreRule$1.evaluate(SystemPropertiesRestoreRule.java:57)
	at org.apache.lucene.util.TestRuleSetupTeardownChained$1.evaluate(TestRuleSetupTeardownChained.java:49)
	at org.apache.lucene.util.AbstractBeforeAfterRule$1.evaluate(AbstractBeforeAfterRule.java:45)
	at org.apache.lucene.util.TestRuleThreadAndTestName$1.evaluate(TestRuleThreadAndTestName.java:48)
	at org.apache.lucene.util.TestRuleIgnoreAfterMaxFailures$1.evaluate(TestRuleIgnoreAfterMaxFailures.java:64)
	at org.apache.lucene.util.TestRuleMarkFailure$1.evaluate(TestRuleMarkFailure.java:47)
	at com.carrotsearch.randomizedtesting.rules.StatementAdapter.evaluate(StatementAdapter.java:36)
	at com.carrotsearch.randomizedtesting.ThreadLeakControl$StatementRunner.run(ThreadLeakControl.java:368)
	at com.carrotsearch.randomizedtesting.ThreadLeakControl.forkTimeoutingTask(ThreadLeakControl.java:817)
	at com.carrotsearch.randomizedtesting.ThreadLeakControl$3.evaluate(ThreadLeakControl.java:468)
	at com.carrotsearch.randomizedtesting.RandomizedRunner.runSingleTest(RandomizedRunner.java:944)
	at com.carrotsearch.randomizedtesting.RandomizedRunner$5.evaluate(RandomizedRunner.java:830)
	at com.carrotsearch.randomizedtesting.RandomizedRunner$6.evaluate(RandomizedRunner.java:880)
	at com.carrotsearch.randomizedtesting.RandomizedRunner$7.evaluate(RandomizedRunner.java:891)
	at com.carrotsearch.randomizedtesting.rules.StatementAdapter.evaluate(StatementAdapter.java:36)
	at com.carrotsearch.randomizedtesting.rules.SystemPropertiesRestoreRule$1.evaluate(SystemPropertiesRestoreRule.java:57)
	at org.apache.lucene.util.AbstractBeforeAfterRule$1.evaluate(AbstractBeforeAfterRule.java:45)
	at com.carrotsearch.randomizedtesting.rules.StatementAdapter.evaluate(StatementAdapter.java:36)
	at org.apache.lucene.util.TestRuleStoreClassName$1.evaluate(TestRuleStoreClassName.java:41)
	at com.carrotsearch.randomizedtesting.rules.NoShadowingOrOverridesOnMethodsRule$1.evaluate(NoShadowingOrOverridesOnMethodsRule.java:40)
	at com.carrotsearch.randomizedtesting.rules.NoShadowingOrOverridesOnMethodsRule$1.evaluate(NoShadowingOrOverridesOnMethodsRule.java:40)
	at com.carrotsearch.randomizedtesting.rules.StatementAdapter.evaluate(StatementAdapter.java:36)
	at com.carrotsearch.randomizedtesting.rules.StatementAdapter.evaluate(StatementAdapter.java:36)
	at org.apache.lucene.util.TestRuleAssertionsRequired$1.evaluate(TestRuleAssertionsRequired.java:53)
	at org.apache.lucene.util.TestRuleMarkFailure$1.evaluate(TestRuleMarkFailure.java:47)
	at org.apache.lucene.util.TestRuleIgnoreAfterMaxFailures$1.evaluate(TestRuleIgnoreAfterMaxFailures.java:64)
	at org.apache.lucene.util.TestRuleIgnoreTestSuites$1.evaluate(TestRuleIgnoreTestSuites.java:54)
	at com.carrotsearch.randomizedtesting.rules.StatementAdapter.evaluate(StatementAdapter.java:36)
	at com.carrotsearch.randomizedtesting.ThreadLeakControl$StatementRunner.run(ThreadLeakControl.java:368)
	at java.base/java.lang.Thread.run(Thread.java:834)
Caused by: java.lang.RuntimeException: REQUEST FAILED: xpath=//result/doc[24]/int[@name='number_p_i_dv_sml'][.='-1562090388']
	xml response was: <?xml version="1.0" encoding="UTF-8"?>
<response>
<lst name="responseHeader"><int name="status">0</int><int name="QTime">0</int></lst><result name="response" numFound="30" start="0"><doc><str name="id">R</str><int name="number_p_i_dv_sml">2012409951</int></doc><doc><str name="id">I</str><int name="number_p_i_dv_sml">1996013463</int></doc><doc><str name="id">P</str><int name="number_p_i_dv_sml">1954065694</int></doc><doc><str name="id">J</str><int name="number_p_i_dv_sml">1753974609</int></doc><doc><str name="id">Q</str><int name="number_p_i_dv_sml">1706241224</int></doc><doc><str name="id">X</str><int name="number_p_i_dv_sml">1679916326</int></doc><doc><str name="id">C</str><int name="number_p_i_dv_sml">1666526097</int></doc><doc><str name="id">W</str><int name="number_p_i_dv_sml">872938326</int></doc><doc><str name="id">D</str><int name="number_p_i_dv_sml">826820678</int></doc><doc><str name="id">M</str><int name="number_p_i_dv_sml">797909837</int></doc><doc><str name="id">N</str><int name="number_p_i_dv_sml">522763383</int></doc><doc><str name="id">Y</str><int name="number_p_i_dv_sml">458258037</int></doc><doc><str name="id">G</str><int name="number_p_i_dv_sml">326192740</int></doc><doc><str name="id">V</str><int name="number_p_i_dv_sml">-271328149</int></doc><doc><str name="id">L</str><int name="number_p_i_dv_sml">-331652139</int></doc><doc><str name="id">O</str><int name="number_p_i_dv_sml">-355898366</int></doc><doc><str name="id">A</str><int name="number_p_i_dv_sml">-464192352</int></doc><doc><str name="id">F</str><int name="number_p_i_dv_sml">-479633553</int></doc><doc><str name="id">Z</str><int name="number_p_i_dv_sml">-573873718</int></doc><doc><str name="id">[</str><int name="number_p_i_dv_sml">-574660573</int></doc><doc><str name="id">S</str><int name="number_p_i_dv_sml">-951407310</int></doc><doc><str name="id">K</str><int name="number_p_i_dv_sml">-1192759055</int></doc><doc><str name="id">^</str><int name="number_p_i_dv_sml">-1457364845</int></doc><doc><str name="id">\</str><int name="number_p_i_dv_sml">-1562090420</int></doc><doc><str name="id">]</str><int name="number_p_i_dv_sml">-1562090388</int></doc><doc><str name="id">T</str><int name="number_p_i_dv_sml">-1683540077</int></doc><doc><str name="id">E</str><int name="number_p_i_dv_sml">-1711761420</int></doc><doc><str name="id">U</str><int name="number_p_i_dv_sml">-1809272606</int></doc><doc><str name="id">H</str><int name="number_p_i_dv_sml">-1992435150</int></doc><doc><str name="id">B</str><int name="number_p_i_dv_sml">-2108818256</int></doc></result>
</response>

	request was:q=*:*&fl=id,+number_p_i_dv_sml&sort=product(-1,number_p_i_dv_sml)+asc&rows=30&wt=xml
	at org.apache.solr.SolrTestCaseJ4.assertQ(SolrTestCaseJ4.java:910)
	... 41 more


FAILED:  org.apache.solr.schema.TestPointFields.testIntPointFieldSortAndFunction

Error Message:
Exception during query

Stack Trace:
java.lang.RuntimeException: Exception during query
	at __randomizedtesting.SeedInfo.seed([E7AB050900E7AC47:839B80921A9C4030]:0)
	at org.apache.solr.SolrTestCaseJ4.assertQ(SolrTestCaseJ4.java:917)
	at org.apache.solr.SolrTestCaseJ4.assertQ(SolrTestCaseJ4.java:877)
	at org.apache.solr.schema.TestPointFields.doTestIntPointFunctionQuery(TestPointFields.java:2547)
	at org.apache.solr.schema.TestPointFields.testIntPointFieldSortAndFunction(TestPointFields.java:166)
	at java.base/jdk.internal.reflect.NativeMethodAccessorImpl.invoke0(Native Method)
	at java.base/jdk.internal.reflect.NativeMethodAccessorImpl.invoke(NativeMethodAccessorImpl.java:62)
	at java.base/jdk.internal.reflect.DelegatingMethodAccessorImpl.invoke(DelegatingMethodAccessorImpl.java:43)
	at java.base/java.lang.reflect.Method.invoke(Method.java:566)
	at com.carrotsearch.randomizedtesting.RandomizedRunner.invoke(RandomizedRunner.java:1742)
	at com.carrotsearch.randomizedtesting.RandomizedRunner$8.evaluate(RandomizedRunner.java:935)
	at com.carrotsearch.randomizedtesting.RandomizedRunner$9.evaluate(RandomizedRunner.java:971)
	at com.carrotsearch.randomizedtesting.RandomizedRunner$10.evaluate(RandomizedRunner.java:985)
	at com.carrotsearch.randomizedtesting.rules.SystemPropertiesRestoreRule$1.evaluate(SystemPropertiesRestoreRule.java:57)
	at org.apache.lucene.util.TestRuleSetupTeardownChained$1.evaluate(TestRuleSetupTeardownChained.java:49)
	at org.apache.lucene.util.AbstractBeforeAfterRule$1.evaluate(AbstractBeforeAfterRule.java:45)
	at org.apache.lucene.util.TestRuleThreadAndTestName$1.evaluate(TestRuleThreadAndTestName.java:48)
	at org.apache.lucene.util.TestRuleIgnoreAfterMaxFailures$1.evaluate(TestRuleIgnoreAfterMaxFailures.java:64)
	at org.apache.lucene.util.TestRuleMarkFailure$1.evaluate(TestRuleMarkFailure.java:47)
	at com.carrotsearch.randomizedtesting.rules.StatementAdapter.evaluate(StatementAdapter.java:36)
	at com.carrotsearch.randomizedtesting.ThreadLeakControl$StatementRunner.run(ThreadLeakControl.java:368)
	at com.carrotsearch.randomizedtesting.ThreadLeakControl.forkTimeoutingTask(ThreadLeakControl.java:817)
	at com.carrotsearch.randomizedtesting.ThreadLeakControl$3.evaluate(ThreadLeakControl.java:468)
	at com.carrotsearch.randomizedtesting.RandomizedRunner.runSingleTest(RandomizedRunner.java:944)
	at com.carrotsearch.randomizedtesting.RandomizedRunner$5.evaluate(RandomizedRunner.java:830)
	at com.carrotsearch.randomizedtesting.RandomizedRunner$6.evaluate(RandomizedRunner.java:880)
	at com.carrotsearch.randomizedtesting.RandomizedRunner$7.evaluate(RandomizedRunner.java:891)
	at com.carrotsearch.randomizedtesting.rules.StatementAdapter.evaluate(StatementAdapter.java:36)
	at com.carrotsearch.randomizedtesting.rules.SystemPropertiesRestoreRule$1.evaluate(SystemPropertiesRestoreRule.java:57)
	at org.apache.lucene.util.AbstractBeforeAfterRule$1.evaluate(AbstractBeforeAfterRule.java:45)
	at com.carrotsearch.randomizedtesting.rules.StatementAdapter.evaluate(StatementAdapter.java:36)
	at org.apache.lucene.util.TestRuleStoreClassName$1.evaluate(TestRuleStoreClassName.java:41)
	at com.carrotsearch.randomizedtesting.rules.NoShadowingOrOverridesOnMethodsRule$1.evaluate(NoShadowingOrOverridesOnMethodsRule.java:40)
	at com.carrotsearch.randomizedtesting.rules.NoShadowingOrOverridesOnMethodsRule$1.evaluate(NoShadowingOrOverridesOnMethodsRule.java:40)
	at com.carrotsearch.randomizedtesting.rules.StatementAdapter.evaluate(StatementAdapter.java:36)
	at com.carrotsearch.randomizedtesting.rules.StatementAdapter.evaluate(StatementAdapter.java:36)
	at org.apache.lucene.util.TestRuleAssertionsRequired$1.evaluate(TestRuleAssertionsRequired.java:53)
	at org.apache.lucene.util.TestRuleMarkFailure$1.evaluate(TestRuleMarkFailure.java:47)
	at org.apache.lucene.util.TestRuleIgnoreAfterMaxFailures$1.evaluate(TestRuleIgnoreAfterMaxFailures.java:64)
	at org.apache.lucene.util.TestRuleIgnoreTestSuites$1.evaluate(TestRuleIgnoreTestSuites.java:54)
	at com.carrotsearch.randomizedtesting.rules.StatementAdapter.evaluate(StatementAdapter.java:36)
	at com.carrotsearch.randomizedtesting.ThreadLeakControl$StatementRunner.run(ThreadLeakControl.java:368)
	at java.base/java.lang.Thread.run(Thread.java:834)
Caused by: java.lang.RuntimeException: REQUEST FAILED: xpath=//result/doc[24]/int[@name='number_p_i_dv_sml'][.='-1562090388']
	xml response was: <?xml version="1.0" encoding="UTF-8"?>
<response>
<lst name="responseHeader"><int name="status">0</int><int name="QTime">0</int></lst><result name="response" numFound="30" start="0"><doc><str name="id">R</str><int name="number_p_i_dv_sml">2012409951</int></doc><doc><str name="id">I</str><int name="number_p_i_dv_sml">1996013463</int></doc><doc><str name="id">P</str><int name="number_p_i_dv_sml">1954065694</int></doc><doc><str name="id">J</str><int name="number_p_i_dv_sml">1753974609</int></doc><doc><str name="id">Q</str><int name="number_p_i_dv_sml">1706241224</int></doc><doc><str name="id">X</str><int name="number_p_i_dv_sml">1679916326</int></doc><doc><str name="id">C</str><int name="number_p_i_dv_sml">1666526097</int></doc><doc><str name="id">W</str><int name="number_p_i_dv_sml">872938326</int></doc><doc><str name="id">D</str><int name="number_p_i_dv_sml">826820678</int></doc><doc><str name="id">M</str><int name="number_p_i_dv_sml">797909837</int></doc><doc><str name="id">N</str><int name="number_p_i_dv_sml">522763383</int></doc><doc><str name="id">Y</str><int name="number_p_i_dv_sml">458258037</int></doc><doc><str name="id">G</str><int name="number_p_i_dv_sml">326192740</int></doc><doc><str name="id">V</str><int name="number_p_i_dv_sml">-271328149</int></doc><doc><str name="id">L</str><int name="number_p_i_dv_sml">-331652139</int></doc><doc><str name="id">O</str><int name="number_p_i_dv_sml">-355898366</int></doc><doc><str name="id">A</str><int name="number_p_i_dv_sml">-464192352</int></doc><doc><str name="id">F</str><int name="number_p_i_dv_sml">-479633553</int></doc><doc><str name="id">Z</str><int name="number_p_i_dv_sml">-573873718</int></doc><doc><str name="id">[</str><int name="number_p_i_dv_sml">-574660573</int></doc><doc><str name="id">S</str><int name="number_p_i_dv_sml">-951407310</int></doc><doc><str name="id">K</str><int name="number_p_i_dv_sml">-1192759055</int></doc><doc><str name="id">^</str><int name="number_p_i_dv_sml">-1457364845</int></doc><doc><str name="id">\</str><int name="number_p_i_dv_sml">-1562090420</int></doc><doc><str name="id">]</str><int name="number_p_i_dv_sml">-1562090388</int></doc><doc><str name="id">T</str><int name="number_p_i_dv_sml">-1683540077</int></doc><doc><str name="id">E</str><int name="number_p_i_dv_sml">-1711761420</int></doc><doc><str name="id">U</str><int name="number_p_i_dv_sml">-1809272606</int></doc><doc><str name="id">H</str><int name="number_p_i_dv_sml">-1992435150</int></doc><doc><str name="id">B</str><int name="number_p_i_dv_sml">-2108818256</int></doc></result>
</response>

	request was:q=*:*&fl=id,+number_p_i_dv_sml&sort=product(-1,number_p_i_dv_sml)+asc&rows=30&wt=xml
	at org.apache.solr.SolrTestCaseJ4.assertQ(SolrTestCaseJ4.java:910)
	... 41 more


FAILED:  org.apache.solr.schema.TestPointFields.testIntPointFieldSortAndFunction

Error Message:
Exception during query

Stack Trace:
java.lang.RuntimeException: Exception during query
	at __randomizedtesting.SeedInfo.seed([E7AB050900E7AC47:839B80921A9C4030]:0)
	at org.apache.solr.SolrTestCaseJ4.assertQ(SolrTestCaseJ4.java:917)
	at org.apache.solr.SolrTestCaseJ4.assertQ(SolrTestCaseJ4.java:877)
	at org.apache.solr.schema.TestPointFields.doTestIntPointFunctionQuery(TestPointFields.java:2547)
	at org.apache.solr.schema.TestPointFields.testIntPointFieldSortAndFunction(TestPointFields.java:166)
	at java.base/jdk.internal.reflect.NativeMethodAccessorImpl.invoke0(Native Method)
	at java.base/jdk.internal.reflect.NativeMethodAccessorImpl.invoke(NativeMethodAccessorImpl.java:62)
	at java.base/jdk.internal.reflect.DelegatingMethodAccessorImpl.invoke(DelegatingMethodAccessorImpl.java:43)
	at java.base/java.lang.reflect.Method.invoke(Method.java:566)
	at com.carrotsearch.randomizedtesting.RandomizedRunner.invoke(RandomizedRunner.java:1742)
	at com.carrotsearch.randomizedtesting.RandomizedRunner$8.evaluate(RandomizedRunner.java:935)
	at com.carrotsearch.randomizedtesting.RandomizedRunner$9.evaluate(RandomizedRunner.java:971)
	at com.carrotsearch.randomizedtesting.RandomizedRunner$10.evaluate(RandomizedRunner.java:985)
	at com.carrotsearch.randomizedtesting.rules.SystemPropertiesRestoreRule$1.evaluate(SystemPropertiesRestoreRule.java:57)
	at org.apache.lucene.util.TestRuleSetupTeardownChained$1.evaluate(TestRuleSetupTeardownChained.java:49)
	at org.apache.lucene.util.AbstractBeforeAfterRule$1.evaluate(AbstractBeforeAfterRule.java:45)
	at org.apache.lucene.util.TestRuleThreadAndTestName$1.evaluate(TestRuleThreadAndTestName.java:48)
	at org.apache.lucene.util.TestRuleIgnoreAfterMaxFailures$1.evaluate(TestRuleIgnoreAfterMaxFailures.java:64)
	at org.apache.lucene.util.TestRuleMarkFailure$1.evaluate(TestRuleMarkFailure.java:47)
	at com.carrotsearch.randomizedtesting.rules.StatementAdapter.evaluate(StatementAdapter.java:36)
	at com.carrotsearch.randomizedtesting.ThreadLeakControl$StatementRunner.run(ThreadLeakControl.java:368)
	at com.carrotsearch.randomizedtesting.ThreadLeakControl.forkTimeoutingTask(ThreadLeakControl.java:817)
	at com.carrotsearch.randomizedtesting.ThreadLeakControl$3.evaluate(ThreadLeakControl.java:468)
	at com.carrotsearch.randomizedtesting.RandomizedRunner.runSingleTest(RandomizedRunner.java:944)
	at com.carrotsearch.randomizedtesting.RandomizedRunner$5.evaluate(RandomizedRunner.java:830)
	at com.carrotsearch.randomizedtesting.RandomizedRunner$6.evaluate(RandomizedRunner.java:880)
	at com.carrotsearch.randomizedtesting.RandomizedRunner$7.evaluate(RandomizedRunner.java:891)
	at com.carrotsearch.randomizedtesting.rules.StatementAdapter.evaluate(StatementAdapter.java:36)
	at com.carrotsearch.randomizedtesting.rules.SystemPropertiesRestoreRule$1.evaluate(SystemPropertiesRestoreRule.java:57)
	at org.apache.lucene.util.AbstractBeforeAfterRule$1.evaluate(AbstractBeforeAfterRule.java:45)
	at com.carrotsearch.randomizedtesting.rules.StatementAdapter.evaluate(StatementAdapter.java:36)
	at org.apache.lucene.util.TestRuleStoreClassName$1.evaluate(TestRuleStoreClassName.java:41)
	at com.carrotsearch.randomizedtesting.rules.NoShadowingOrOverridesOnMethodsRule$1.evaluate(NoShadowingOrOverridesOnMethodsRule.java:40)
	at com.carrotsearch.randomizedtesting.rules.NoShadowingOrOverridesOnMethodsRule$1.evaluate(NoShadowingOrOverridesOnMethodsRule.java:40)
	at com.carrotsearch.randomizedtesting.rules.StatementAdapter.evaluate(StatementAdapter.java:36)
	at com.carrotsearch.randomizedtesting.rules.StatementAdapter.evaluate(StatementAdapter.java:36)
	at org.apache.lucene.util.TestRuleAssertionsRequired$1.evaluate(TestRuleAssertionsRequired.java:53)
	at org.apache.lucene.util.TestRuleMarkFailure$1.evaluate(TestRuleMarkFailure.java:47)
	at org.apache.lucene.util.TestRuleIgnoreAfterMaxFailures$1.evaluate(TestRuleIgnoreAfterMaxFailures.java:64)
	at org.apache.lucene.util.TestRuleIgnoreTestSuites$1.evaluate(TestRuleIgnoreTestSuites.java:54)
	at com.carrotsearch.randomizedtesting.rules.StatementAdapter.evaluate(StatementAdapter.java:36)
	at com.carrotsearch.randomizedtesting.ThreadLeakControl$StatementRunner.run(ThreadLeakControl.java:368)
	at java.base/java.lang.Thread.run(Thread.java:834)
Caused by: java.lang.RuntimeException: REQUEST FAILED: xpath=//result/doc[24]/int[@name='number_p_i_dv_sml'][.='-1562090388']
	xml response was: <?xml version="1.0" encoding="UTF-8"?>
<response>
<lst name="responseHeader"><int name="status">0</int><int name="QTime">0</int></lst><result name="response" numFound="30" start="0"><doc><str name="id">R</str><int name="number_p_i_dv_sml">2012409951</int></doc><doc><str name="id">I</str><int name="number_p_i_dv_sml">1996013463</int></doc><doc><str name="id">P</str><int name="number_p_i_dv_sml">1954065694</int></doc><doc><str name="id">J</str><int name="number_p_i_dv_sml">1753974609</int></doc><doc><str name="id">Q</str><int name="number_p_i_dv_sml">1706241224</int></doc><doc><str name="id">X</str><int name="number_p_i_dv_sml">1679916326</int></doc><doc><str name="id">C</str><int name="number_p_i_dv_sml">1666526097</int></doc><doc><str name="id">W</str><int name="number_p_i_dv_sml">872938326</int></doc><doc><str name="id">D</str><int name="number_p_i_dv_sml">826820678</int></doc><doc><str name="id">M</str><int name="number_p_i_dv_sml">797909837</int></doc><doc><str name="id">N</str><int name="number_p_i_dv_sml">522763383</int></doc><doc><str name="id">Y</str><int name="number_p_i_dv_sml">458258037</int></doc><doc><str name="id">G</str><int name="number_p_i_dv_sml">326192740</int></doc><doc><str name="id">V</str><int name="number_p_i_dv_sml">-271328149</int></doc><doc><str name="id">L</str><int name="number_p_i_dv_sml">-331652139</int></doc><doc><str name="id">O</str><int name="number_p_i_dv_sml">-355898366</int></doc><doc><str name="id">A</str><int name="number_p_i_dv_sml">-464192352</int></doc><doc><str name="id">F</str><int name="number_p_i_dv_sml">-479633553</int></doc><doc><str name="id">Z</str><int name="number_p_i_dv_sml">-573873718</int></doc><doc><str name="id">[</str><int name="number_p_i_dv_sml">-574660573</int></doc><doc><str name="id">S</str><int name="number_p_i_dv_sml">-951407310</int></doc><doc><str name="id">K</str><int name="number_p_i_dv_sml">-1192759055</int></doc><doc><str name="id">^</str><int name="number_p_i_dv_sml">-1457364845</int></doc><doc><str name="id">\</str><int name="number_p_i_dv_sml">-1562090420</int></doc><doc><str name="id">]</str><int name="number_p_i_dv_sml">-1562090388</int></doc><doc><str name="id">T</str><int name="number_p_i_dv_sml">-1683540077</int></doc><doc><str name="id">E</str><int name="number_p_i_dv_sml">-1711761420</int></doc><doc><str name="id">U</str><int name="number_p_i_dv_sml">-1809272606</int></doc><doc><str name="id">H</str><int name="number_p_i_dv_sml">-1992435150</int></doc><doc><str name="id">B</str><int name="number_p_i_dv_sml">-2108818256</int></doc></result>
</response>

	request was:q=*:*&fl=id,+number_p_i_dv_sml&sort=product(-1,number_p_i_dv_sml)+asc&rows=30&wt=xml
	at org.apache.solr.SolrTestCaseJ4.assertQ(SolrTestCaseJ4.java:910)
	... 41 more


FAILED:  org.apache.solr.schema.TestPointFields.testIntPointFieldSortAndFunction

Error Message:
Exception during query

Stack Trace:
java.lang.RuntimeException: Exception during query
	at __randomizedtesting.SeedInfo.seed([E7AB050900E7AC47:839B80921A9C4030]:0)
	at org.apache.solr.SolrTestCaseJ4.assertQ(SolrTestCaseJ4.java:917)
	at org.apache.solr.SolrTestCaseJ4.assertQ(SolrTestCaseJ4.java:877)
	at org.apache.solr.schema.TestPointFields.doTestIntPointFunctionQuery(TestPointFields.java:2547)
	at org.apache.solr.schema.TestPointFields.testIntPointFieldSortAndFunction(TestPointFields.java:166)
	at java.base/jdk.internal.reflect.NativeMethodAccessorImpl.invoke0(Native Method)
	at java.base/jdk.internal.reflect.NativeMethodAccessorImpl.invoke(NativeMethodAccessorImpl.java:62)
	at java.base/jdk.internal.reflect.DelegatingMethodAccessorImpl.invoke(DelegatingMethodAccessorImpl.java:43)
	at java.base/java.lang.reflect.Method.invoke(Method.java:566)
	at com.carrotsearch.randomizedtesting.RandomizedRunner.invoke(RandomizedRunner.java:1742)
	at com.carrotsearch.randomizedtesting.RandomizedRunner$8.evaluate(RandomizedRunner.java:935)
	at com.carrotsearch.randomizedtesting.RandomizedRunner$9.evaluate(RandomizedRunner.java:971)
	at com.carrotsearch.randomizedtesting.RandomizedRunner$10.evaluate(RandomizedRunner.java:985)
	at com.carrotsearch.randomizedtesting.rules.SystemPropertiesRestoreRule$1.evaluate(SystemPropertiesRestoreRule.java:57)
	at org.apache.lucene.util.TestRuleSetupTeardownChained$1.evaluate(TestRuleSetupTeardownChained.java:49)
	at org.apache.lucene.util.AbstractBeforeAfterRule$1.evaluate(AbstractBeforeAfterRule.java:45)
	at org.apache.lucene.util.TestRuleThreadAndTestName$1.evaluate(TestRuleThreadAndTestName.java:48)
	at org.apache.lucene.util.TestRuleIgnoreAfterMaxFailures$1.evaluate(TestRuleIgnoreAfterMaxFailures.java:64)
	at org.apache.lucene.util.TestRuleMarkFailure$1.evaluate(TestRuleMarkFailure.java:47)
	at com.carrotsearch.randomizedtesting.rules.StatementAdapter.evaluate(StatementAdapter.java:36)
	at com.carrotsearch.randomizedtesting.ThreadLeakControl$StatementRunner.run(ThreadLeakControl.java:368)
	at com.carrotsearch.randomizedtesting.ThreadLeakControl.forkTimeoutingTask(ThreadLeakControl.java:817)
	at com.carrotsearch.randomizedtesting.ThreadLeakControl$3.evaluate(ThreadLeakControl.java:468)
	at com.carrotsearch.randomizedtesting.RandomizedRunner.runSingleTest(RandomizedRunner.java:944)
	at com.carrotsearch.randomizedtesting.RandomizedRunner$5.evaluate(RandomizedRunner.java:830)
	at com.carrotsearch.randomizedtesting.RandomizedRunner$6.evaluate(RandomizedRunner.java:880)
	at com.carrotsearch.randomizedtesting.RandomizedRunner$7.evaluate(RandomizedRunner.java:891)
	at com.carrotsearch.randomizedtesting.rules.StatementAdapter.evaluate(StatementAdapter.java:36)
	at com.carrotsearch.randomizedtesting.rules.SystemPropertiesRestoreRule$1.evaluate(SystemPropertiesRestoreRule.java:57)
	at org.apache.lucene.util.AbstractBeforeAfterRule$1.evaluate(AbstractBeforeAfterRule.java:45)
	at com.carrotsearch.randomizedtesting.rules.StatementAdapter.evaluate(StatementAdapter.java:36)
	at org.apache.lucene.util.TestRuleStoreClassName$1.evaluate(TestRuleStoreClassName.java:41)
	at com.carrotsearch.randomizedtesting.rules.NoShadowingOrOverridesOnMethodsRule$1.evaluate(NoShadowingOrOverridesOnMethodsRule.java:40)
	at com.carrotsearch.randomizedtesting.rules.NoShadowingOrOverridesOnMethodsRule$1.evaluate(NoShadowingOrOverridesOnMethodsRule.java:40)
	at com.carrotsearch.randomizedtesting.rules.StatementAdapter.evaluate(StatementAdapter.java:36)
	at com.carrotsearch.randomizedtesting.rules.StatementAdapter.evaluate(StatementAdapter.java:36)
	at org.apache.lucene.util.TestRuleAssertionsRequired$1.evaluate(TestRuleAssertionsRequired.java:53)
	at org.apache.lucene.util.TestRuleMarkFailure$1.evaluate(TestRuleMarkFailure.java:47)
	at org.apache.lucene.util.TestRuleIgnoreAfterMaxFailures$1.evaluate(TestRuleIgnoreAfterMaxFailures.java:64)
	at org.apache.lucene.util.TestRuleIgnoreTestSuites$1.evaluate(TestRuleIgnoreTestSuites.java:54)
	at com.carrotsearch.randomizedtesting.rules.StatementAdapter.evaluate(StatementAdapter.java:36)
	at com.carrotsearch.randomizedtesting.ThreadLeakControl$StatementRunner.run(ThreadLeakControl.java:368)
	at java.base/java.lang.Thread.run(Thread.java:834)
Caused by: java.lang.RuntimeException: REQUEST FAILED: xpath=//result/doc[24]/int[@name='number_p_i_dv_sml'][.='-1562090388']
	xml response was: <?xml version="1.0" encoding="UTF-8"?>
<response>
<lst name="responseHeader"><int name="status">0</int><int name="QTime">0</int></lst><result name="response" numFound="30" start="0"><doc><str name="id">R</str><int name="number_p_i_dv_sml">2012409951</int></doc><doc><str name="id">I</str><int name="number_p_i_dv_sml">1996013463</int></doc><doc><str name="id">P</str><int name="number_p_i_dv_sml">1954065694</int></doc><doc><str name="id">J</str><int name="number_p_i_dv_sml">1753974609</int></doc><doc><str name="id">Q</str><int name="number_p_i_dv_sml">1706241224</int></doc><doc><str name="id">X</str><int name="number_p_i_dv_sml">1679916326</int></doc><doc><str name="id">C</str><int name="number_p_i_dv_sml">1666526097</int></doc><doc><str name="id">W</str><int name="number_p_i_dv_sml">872938326</int></doc><doc><str name="id">D</str><int name="number_p_i_dv_sml">826820678</int></doc><doc><str name="id">M</str><int name="number_p_i_dv_sml">797909837</int></doc><doc><str name="id">N</str><int name="number_p_i_dv_sml">522763383</int></doc><doc><str name="id">Y</str><int name="number_p_i_dv_sml">458258037</int></doc><doc><str name="id">G</str><int name="number_p_i_dv_sml">326192740</int></doc><doc><str name="id">V</str><int name="number_p_i_dv_sml">-271328149</int></doc><doc><str name="id">L</str><int name="number_p_i_dv_sml">-331652139</int></doc><doc><str name="id">O</str><int name="number_p_i_dv_sml">-355898366</int></doc><doc><str name="id">A</str><int name="number_p_i_dv_sml">-464192352</int></doc><doc><str name="id">F</str><int name="number_p_i_dv_sml">-479633553</int></doc><doc><str name="id">Z</str><int name="number_p_i_dv_sml">-573873718</int></doc><doc><str name="id">[</str><int name="number_p_i_dv_sml">-574660573</int></doc><doc><str name="id">S</str><int name="number_p_i_dv_sml">-951407310</int></doc><doc><str name="id">K</str><int name="number_p_i_dv_sml">-1192759055</int></doc><doc><str name="id">^</str><int name="number_p_i_dv_sml">-1457364845</int></doc><doc><str name="id">\</str><int name="number_p_i_dv_sml">-1562090420</int></doc><doc><str name="id">]</str><int name="number_p_i_dv_sml">-1562090388</int></doc><doc><str name="id">T</str><int name="number_p_i_dv_sml">-1683540077</int></doc><doc><str name="id">E</str><int name="number_p_i_dv_sml">-1711761420</int></doc><doc><str name="id">U</str><int name="number_p_i_dv_sml">-1809272606</int></doc><doc><str name="id">H</str><int name="number_p_i_dv_sml">-1992435150</int></doc><doc><str name="id">B</str><int name="number_p_i_dv_sml">-2108818256</int></doc></result>
</response>

	request was:q=*:*&fl=id,+number_p_i_dv_sml&sort=product(-1,number_p_i_dv_sml)+asc&rows=30&wt=xml
	at org.apache.solr.SolrTestCaseJ4.assertQ(SolrTestCaseJ4.java:910)
	... 41 more




Build Log:
[...truncated 13709 lines...]
   [junit4] Suite: org.apache.solr.schema.TestPointFields
   [junit4]   2> Creating dataDir: /home/jenkins/workspace/Lucene-Solr-master-Linux/solr/build/solr-core/test/J2/temp/solr.schema.TestPointFields_E7AB050900E7AC47-001/init-core-data-001
   [junit4]   2> 1198832 WARN  (SUITE-TestPointFields-seed#[E7AB050900E7AC47]-worker) [    ] o.a.s.SolrTestCaseJ4 startTrackingSearchers: numOpens=3 numCloses=3
   [junit4]   2> 1198832 INFO  (SUITE-TestPointFields-seed#[E7AB050900E7AC47]-worker) [    ] o.a.s.SolrTestCaseJ4 Using PointFields (NUMERIC_POINTS_SYSPROP=true) w/NUMERIC_DOCVALUES_SYSPROP=true
   [junit4]   2> 1198832 INFO  (SUITE-TestPointFields-seed#[E7AB050900E7AC47]-worker) [    ] o.a.s.SolrTestCaseJ4 Randomized ssl (false) and clientAuth (false) via: @org.apache.solr.util.RandomizeSSL(reason="", value=0.0/0.0, ssl=0.0/0.0, clientAuth=0.0/0.0)
   [junit4]   2> 1198832 INFO  (SUITE-TestPointFields-seed#[E7AB050900E7AC47]-worker) [    ] o.a.s.SolrTestCaseJ4 SecureRandom sanity checks: test.solr.allowed.securerandom=null & java.security.egd=file:/dev/./urandom
   [junit4]   2> 1198833 INFO  (SUITE-TestPointFields-seed#[E7AB050900E7AC47]-worker) [    ] o.a.s.SolrTestCaseJ4 ####initCore
   [junit4]   2> 1198833 INFO  (SUITE-TestPointFields-seed#[E7AB050900E7AC47]-worker) [    ] o.a.s.c.SolrResourceLoader [null] Added 2 libs to classloader, from paths: [/home/jenkins/workspace/Lucene-Solr-master-Linux/solr/core/src/test-files/solr/collection1/lib, /home/jenkins/workspace/Lucene-Solr-master-Linux/solr/core/src/test-files/solr/collection1/lib/classes]
   [junit4]   2> 1198845 INFO  (SUITE-TestPointFields-seed#[E7AB050900E7AC47]-worker) [    ] o.a.s.c.SolrConfig Using Lucene MatchVersion: 8.0.0
   [junit4]   2> 1198856 INFO  (SUITE-TestPointFields-seed#[E7AB050900E7AC47]-worker) [    ] o.a.s.s.IndexSchema [null] Schema name=schema-point
   [junit4]   2> 1198858 INFO  (SUITE-TestPointFields-seed#[E7AB050900E7AC47]-worker) [    ] o.a.s.s.IndexSchema Loaded schema schema-point/1.6 with uniqueid field id
   [junit4]   2> 1199127 INFO  (SUITE-TestPointFields-seed#[E7AB050900E7AC47]-worker) [    ] o.a.s.c.TransientSolrCoreCacheDefault Allocating transient cache for 2147483647 transient cores
   [junit4]   2> 1199127 INFO  (SUITE-TestPointFields-seed#[E7AB050900E7AC47]-worker) [    ] o.a.s.h.a.MetricsHistoryHandler No .system collection, keeping metrics history in memory.
   [junit4]   2> 1199135 INFO  (SUITE-TestPointFields-seed#[E7AB050900E7AC47]-worker) [    ] o.a.s.m.r.SolrJmxReporter JMX monitoring for 'solr.node' (registry 'solr.node') enabled at server: com.sun.jmx.mbeanserver.JmxMBeanServer@2fa536b3
   [junit4]   2> 1199139 INFO  (SUITE-TestPointFields-seed#[E7AB050900E7AC47]-worker) [    ] o.a.s.m.r.SolrJmxReporter JMX monitoring for 'solr.jvm' (registry 'solr.jvm') enabled at server: com.sun.jmx.mbeanserver.JmxMBeanServer@2fa536b3
   [junit4]   2> 1199139 INFO  (SUITE-TestPointFields-seed#[E7AB050900E7AC47]-worker) [    ] o.a.s.m.r.SolrJmxReporter JMX monitoring for 'solr.jetty' (registry 'solr.jetty') enabled at server: com.sun.jmx.mbeanserver.JmxMBeanServer@2fa536b3
   [junit4]   2> 1199144 INFO  (coreLoadExecutor-5145-thread-1) [    x:collection1] o.a.s.c.SolrResourceLoader [null] Added 2 libs to classloader, from paths: [/home/jenkins/workspace/Lucene-Solr-master-Linux/solr/core/src/test-files/solr/collection1/lib, /home/jenkins/workspace/Lucene-Solr-master-Linux/solr/core/src/test-files/solr/collection1/lib/classes]
   [junit4]   2> 1199156 INFO  (coreLoadExecutor-5145-thread-1) [    x:collection1] o.a.s.c.SolrConfig Using Lucene MatchVersion: 8.0.0
   [junit4]   2> 1199167 INFO  (coreLoadExecutor-5145-thread-1) [    x:collection1] o.a.s.s.IndexSchema [collection1] Schema name=schema-point
   [junit4]   2> 1199169 INFO  (coreLoadExecutor-5145-thread-1) [    x:collection1] o.a.s.s.IndexSchema Loaded schema schema-point/1.6 with uniqueid field id
   [junit4]   2> 1199169 INFO  (coreLoadExecutor-5145-thread-1) [    x:collection1] o.a.s.c.CoreContainer Creating SolrCore 'collection1' using configuration from instancedir /home/jenkins/workspace/Lucene-Solr-master-Linux/solr/core/src/test-files/solr/collection1, trusted=true
   [junit4]   2> 1199169 INFO  (coreLoadExecutor-5145-thread-1) [    x:collection1] o.a.s.m.r.SolrJmxReporter JMX monitoring for 'solr.core.collection1' (registry 'solr.core.collection1') enabled at server: com.sun.jmx.mbeanserver.JmxMBeanServer@2fa536b3
   [junit4]   2> 1199169 INFO  (coreLoadExecutor-5145-thread-1) [    x:collection1] o.a.s.c.SolrCore [[collection1] ] Opening new SolrCore at [/home/jenkins/workspace/Lucene-Solr-master-Linux/solr/core/src/test-files/solr/collection1], dataDir=[/home/jenkins/workspace/Lucene-Solr-master-Linux/solr/build/solr-core/test/J2/temp/solr.schema.TestPointFields_E7AB050900E7AC47-001/init-core-data-001/]
   [junit4]   2> 1199170 INFO  (coreLoadExecutor-5145-thread-1) [    x:collection1] o.a.s.u.RandomMergePolicy RandomMergePolicy wrapping class org.apache.lucene.index.TieredMergePolicy: [TieredMergePolicy: maxMergeAtOnce=28, maxMergeAtOnceExplicit=44, maxMergedSegmentMB=16.0458984375, floorSegmentMB=0.2841796875, forceMergeDeletesPctAllowed=9.8604651875171, segmentsPerTier=38.0, maxCFSSegmentSizeMB=8.796093022207999E12, noCFSRatio=0.0, deletesPctAllowed=35.86675522318479
   [junit4]   2> 1199193 INFO  (coreLoadExecutor-5145-thread-1) [    x:collection1] o.a.s.u.UpdateHandler Using UpdateLog implementation: org.apache.solr.update.UpdateLog
   [junit4]   2> 1199193 INFO  (coreLoadExecutor-5145-thread-1) [    x:collection1] o.a.s.u.UpdateLog Initializing UpdateLog: dataDir= defaultSyncLevel=FLUSH numRecordsToKeep=100 maxNumLogsToKeep=10 numVersionBuckets=65536
   [junit4]   2> 1199193 INFO  (coreLoadExecutor-5145-thread-1) [    x:collection1] o.a.s.u.CommitTracker Hard AutoCommit: disabled
   [junit4]   2> 1199193 INFO  (coreLoadExecutor-5145-thread-1) [    x:collection1] o.a.s.u.CommitTracker Soft AutoCommit: disabled
   [junit4]   2> 1199194 INFO  (coreLoadExecutor-5145-thread-1) [    x:collection1] o.a.s.u.RandomMergePolicy RandomMergePolicy wrapping class org.apache.lucene.index.TieredMergePolicy: [TieredMergePolicy: maxMergeAtOnce=40, maxMergeAtOnceExplicit=11, maxMergedSegmentMB=10.791015625, floorSegmentMB=0.3271484375, forceMergeDeletesPctAllowed=23.601071013343336, segmentsPerTier=42.0, maxCFSSegmentSizeMB=8.796093022207999E12, noCFSRatio=0.5651638668115704, deletesPctAllowed=43.18121530452763
   [junit4]   2> 1199194 INFO  (coreLoadExecutor-5145-thread-1) [    x:collection1] o.a.s.s.SolrIndexSearcher Opening [Searcher@2d5e0ba3[collection1] main]
   [junit4]   2> 1199194 INFO  (coreLoadExecutor-5145-thread-1) [    x:collection1] o.a.s.h.c.SpellCheckComponent Initializing spell checkers
   [junit4]   2> 1199249 INFO  (coreLoadExecutor-5145-thread-1) [    x:collection1] o.a.s.s.DirectSolrSpellChecker init: {name=direct,classname=DirectSolrSpellChecker,field=lowerfilt,minQueryLength=3}
   [junit4]   2> 1199331 INFO  (coreLoadExecutor-5145-thread-1) [    x:collection1] o.a.s.h.ReplicationHandler Commits will be reserved for 10000ms.
   [junit4]   2> 1199331 INFO  (searcherExecutor-5146-thread-1-processing-x:collection1) [    x:collection1] o.a.s.h.c.SpellCheckComponent Loading spell index for spellchecker: default
   [junit4]   2> 1199331 INFO  (coreLoadExecutor-5145-thread-1) [    x:collection1] o.a.s.u.UpdateLog Could not find max version in index or recent updates, using new clock 1613087499670781952
   [junit4]   2> 1199331 INFO  (searcherExecutor-5146-thread-1-processing-x:collection1) [    x:collection1] o.a.s.h.c.SpellCheckComponent Loading spell index for spellchecker: direct
   [junit4]   2> 1199331 INFO  (searcherExecutor-5146-thread-1-processing-x:collection1) [    x:collection1] o.a.s.h.c.SpellCheckComponent Loading spell index for spellchecker: wordbreak
   [junit4]   2> 1199331 INFO  (searcherExecutor-5146-thread-1-processing-x:collection1) [    x:collection1] o.a.s.h.c.SpellCheckComponent Loading spell index for spellchecker: multipleFields
   [junit4]   2> 1199331 INFO  (searcherExecutor-5146-thread-1-processing-x:collection1) [    x:collection1] o.a.s.h.c.SpellCheckComponent Loading spell index for spellchecker: jarowinkler
   [junit4]   2> 1199331 INFO  (searcherExecutor-5146-thread-1-processing-x:collection1) [    x:collection1] o.a.s.h.c.SpellCheckComponent Loading spell index for spellchecker: external
   [junit4]   2> 1199332 INFO  (searcherExecutor-5146-thread-1-processing-x:collection1) [    x:collection1] o.a.s.h.c.SpellCheckComponent Loading spell index for spellchecker: freq
   [junit4]   2> 1199332 INFO  (searcherExecutor-5146-thread-1-processing-x:collection1) [    x:collection1] o.a.s.h.c.SpellCheckComponent Loading spell index for spellchecker: fqcn
   [junit4]   2> 1199332 INFO  (searcherExecutor-5146-thread-1-processing-x:collection1) [    x:collection1] o.a.s.h.c.SpellCheckComponent Loading spell index for spellchecker: perDict
   [junit4]   2> 1199332 INFO  (searcherExecutor-5146-thread-1-processing-x:collection1) [    x:collection1] o.a.s.c.SolrCore [collection1] Registered new searcher Searcher@2d5e0ba3[collection1] main{ExitableDirectoryReader(UninvertingDirectoryReader())}
   [junit4]   2> 1199333 INFO  (SUITE-TestPointFields-seed#[E7AB050900E7AC47]-worker) [    ] o.a.s.SolrTestCaseJ4 ####initCore end
   [junit4]   2> 1199335 INFO  (TEST-TestPointFields.testDatePointFieldMultiValuedNonSearchableExactQuery-seed#[E7AB050900E7AC47]) [    ] o.a.s.SolrTestCaseJ4 ###Starting testDatePointFieldMultiValuedNonSearchableExactQuery
   [junit4]   2> 1199336 INFO  (TEST-TestPointFields.testDatePointFieldMultiValuedNonSearchableExactQuery-seed#[E7AB050900E7AC47]) [    ] o.a.s.u.p.LogUpdateProcessorFactory [collection1]  webapp=null path=null params={}{add=[0 (1613087499676024832)]} 0 0
   [junit4]   2> 1199337 INFO  (TEST-TestPointFields.testDatePointFieldMultiValuedNonSearchableExactQuery-seed#[E7AB050900E7AC47]) [    ] o.a.s.u.p.LogUpdateProcessorFactory [collection1]  webapp=null path=null params={}{add=[1 (1613087499677073408)]} 0 0
   [junit4]   2> 1199337 INFO  (TEST-TestPointFields.testDatePointFieldMultiValuedNonSearchableExactQuery-seed#[E7AB050900E7AC47]) [    ] o.a.s.u.p.LogUpdateProcessorFactory [collection1]  webapp=null path=null params={}{add=[2 (1613087499677073409)]} 0 0
   [junit4]   2> 1199337 INFO  (TEST-TestPointFields.testDatePointFieldMultiValuedNonSearchableExactQuery-seed#[E7AB050900E7AC47]) [    ] o.a.s.u.p.LogUpdateProcessorFactory [collection1]  webapp=null path=null params={}{add=[3 (1613087499677073410)]} 0 0
   [junit4]   2> 1199337 INFO  (TEST-TestPointFields.testDatePointFieldMultiValuedNonSearchableExactQuery-seed#[E7AB050900E7AC47]) [    ] o.a.s.u.p.LogUpdateProcessorFactory [collection1]  webapp=null path=null params={}{add=[4 (1613087499677073411)]} 0 0
   [junit4]   2> 1199338 INFO  (TEST-TestPointFields.testDatePointFieldMultiValuedNonSearchableExactQuery-seed#[E7AB050900E7AC47]) [    ] o.a.s.u.p.LogUpdateProcessorFactory [collection1]  webapp=null path=null params={}{add=[5 (1613087499678121984)]} 0 0
   [junit4]   2> 1199338 INFO  (TEST-TestPointFields.testDatePointFieldMultiValuedNonSearchableExactQuery-seed#[E7AB050900E7AC47]) [    ] o.a.s.u.p.LogUpdateProcessorFactory [collection1]  webapp=null path=null params={}{add=[6 (1613087499678121985)]} 0 0
   [junit4]   2> 1199338 INFO  (TEST-TestPointFields.testDatePointFieldMultiValuedNonSearchableExactQuery-seed#[E7AB050900E7AC47]) [    ] o.a.s.u.p.LogUpdateProcessorFactory [collection1]  webapp=null path=null params={}{add=[7 (1613087499678121986)]} 0 0
   [junit4]   2> 1199338 INFO  (TEST-TestPointFields.testDatePointFieldMultiValuedNonSearchableExactQuery-seed#[E7AB050900E7AC47]) [    ] o.a.s.u.p.LogUpdateProcessorFactory [collection1]  webapp=null path=null params={}{add=[8 (1613087499678121987)]} 0 0
   [junit4]   2> 1199338 INFO  (TEST-TestPointFields.testDatePointFieldMultiValuedNonSearchableExactQuery-seed#[E7AB050900E7AC47]) [    ] o.a.s.u.p.LogUpdateProcessorFactory [collection1]  webapp=null path=null params={}{add=[9 (1613087499678121988)]} 0 0
   [junit4]   2> 1199338 INFO  (TEST-TestPointFields.testDatePointFieldMultiValuedNonSearchableExactQuery-seed#[E7AB050900E7AC47]) [    ] o.a.s.u.DirectUpdateHandler2 start commit{_version_=1613087499678121989,optimize=false,openSearcher=true,waitSearcher=true,expungeDeletes=false,softCommit=false,prepareCommit=false}
   [junit4]   2> 1199338 INFO  (TEST-TestPointFields.testDatePointFieldMultiValuedNonSearchableExactQuery-seed#[E7AB050900E7AC47]) [    ] o.a.s.u.SolrIndexWriter Calling setCommitData with IW:org.apache.solr.update.SolrIndexWriter@43bdfb80 commitCommandVersion:1613087499678121989
   [junit4]   2> 1199341 INFO  (TEST-TestPointFields.testDatePointFieldMultiValuedNonSearchableExactQuery-seed#[E7AB050900E7AC47]) [    ] o.a.s.s.SolrIndexSearcher Opening [Searcher@46ff21b[collection1] main]
   [junit4]   2> 1199341 INFO  (TEST-TestPointFields.testDatePointFieldMultiValuedNonSearchableExactQuery-seed#[E7AB050900E7AC47]) [    ] o.a.s.u.DirectUpdateHandler2 end_commit_flush
   [junit4]   2> 1199342 INFO  (searcherExecutor-5146-thread-1) [    ] o.a.s.c.SolrCore [collection1] Registered new searcher Searcher@46ff21b[collection1] main{ExitableDirectoryReader(UninvertingDirectoryReader(Uninverting(_0(8.0.0):C10)))}
   [junit4]   2> 1199342 INFO  (TEST-TestPointFields.testDatePointFieldMultiValuedNonSearchableExactQuery-seed#[E7AB050900E7AC47]) [    ] o.a.s.u.p.LogUpdateProcessorFactory [collection1]  webapp=null path=null params={}{commit=} 0 3
   [junit4]   2> 1199342 INFO  (TEST-TestPointFields.testDatePointFieldMultiValuedNonSearchableExactQuery-seed#[E7AB050900E7AC47]) [    ] o.a.s.c.S.Request [collection1]  webapp=null path=null params={q=number_p_dt_ni_mv:"-48258401-10-13T21:48:24.115Z"&wt=xml} hits=0 status=0 QTime=0
   [junit4]   2> 1199343 INFO  (TEST-TestPointFields.testDatePointFieldMultiValuedNonSearchableExactQuery-seed#[E7AB050900E7AC47]) [    ] o.a.s.c.S.Request [collection1]  webapp=null path=null params={q=number_p_dt_ni_mv:"-272667110-02-18T16:48:51.918Z"&wt=xml} hits=0 status=0 QTime=0
   [junit4]   2> 1199343 INFO  (TEST-TestPointFields.testDatePointFieldMultiValuedNonSearchableExactQuery-seed#[E7AB050900E7AC47]) [    ] o.a.s.c.S.Request [collection1]  webapp=null path=null params={q=number_p_dt_ni_mv:"-259930406-07-25T05:27:26.002Z"&wt=xml} hits=0 status=0 QTime=0
   [junit4]   2> 1199343 INFO  (TEST-TestPointFields.testDatePointFieldMultiValuedNonSearchableExactQuery-seed#[E7AB050900E7AC47]) [    ] o.a.s.c.S.Request [collection1]  webapp=null path=null params={q=number_p_dt_ni_mv:"-258404320-06-19T19:34:35.396Z"&wt=xml} hits=0 status=0 QTime=0
   [junit4]   2> 1199343 INFO  (TEST-TestPointFields.testDatePointFieldMultiValuedNonSearchableExactQuery-seed#[E7AB050900E7AC47]) [    ] o.a.s.c.S.Request [collection1]  webapp=null path=null params={q=number_p_dt_ni_mv:"%2B187192891-09-09T02:10:36.157Z"&wt=xml} hits=0 status=0 QTime=0
   [junit4]   2> 1199343 INFO  (TEST-TestPointFields.testDatePointFieldMultiValuedNonSearchableExactQuery-seed#[E7AB050900E7AC47]) [    ] o.a.s.c.S.Request [collection1]  webapp=null path=null params={q=number_p_dt_ni_mv:"-180715332-01-27T01:25:48.129Z"&wt=xml} hits=0 status=0 QTime=0
   [junit4]   2> 1199343 INFO  (TEST-TestPointFields.testDatePointFieldMultiValuedNonSearchableExactQuery-seed#[E7AB050900E7AC47]) [    ] o.a.s.c.S.Request [collection1]  webapp=null path=null params={q=number_p_dt_ni_mv:"%2B76821024-05-25T09:19:45.058Z"&wt=xml} hits=0 status=0 QTime=0
   [junit4]   2> 1199343 INFO  (TEST-TestPointFields.testDatePointFieldMultiValuedNonSearchableExactQuery-seed#[E7AB050900E7AC47]) [    ] o.a.s.c.S.Request [collection1]  webapp=null path=null params={q=number_p_dt_ni_mv:"%2B24788512-10-12T19:12:18.483Z"&wt=xml} hits=0 status=0 QTime=0
   [junit4]   2> 1199343 INFO  (TEST-TestPointFields.testDatePointFieldMultiValuedNonSearchableExactQuery-seed#[E7AB050900E7AC47]) [    ] o.a.s.c.S.Request [collection1]  webapp=null path=null params={q=number_p_dt_ni_mv:"%2B163150001-07-17T13:59:40.091Z"&wt=xml} hits=0 status=0 QTime=0
   [junit4]   2> 1199343 INFO  (TEST-TestPointFields.testDatePointFieldMultiValuedNonSearchableExactQuery-seed#[E7AB050900E7AC47]) [    ] o.a.s.c.S.Request [collection1]  webapp=null path=null params={q=number_p_dt_ni_mv:"%2B49561997-02-11T11:28:06.990Z"&wt=xml} hits=0 status=0 QTime=0
   [junit4]   2> 1199343 INFO  (TEST-TestPointFields.testDatePointFieldMultiValuedNonSearchableExactQuery-seed#[E7AB050900E7AC47]) [    ] o.a.s.c.S.Request [collection1]  webapp=null path=null params={q=number_p_dt_ni_mv:"%2B192940393-02-12T16:22:45.422Z"&wt=xml} hits=0 status=0 QTime=0
   [junit4]   2> 1199344 INFO  (TEST-TestPointFields.testDatePointFieldMultiValuedNonSearchableExactQuery-seed#[E7AB050900E7AC47]) [    ] o.a.s.c.S.Request [collection1]  webapp=null path=null params={q=number_p_dt_ni_mv:"-17932681-06-23T19:25:24.472Z"&wt=xml} hits=0 status=0 QTime=0
   [junit4]   2> 1199344 INFO  (TEST-TestPointFields.testDatePointFieldMultiValuedNonSearchableExactQuery-seed#[E7AB050900E7AC47]) [    ] o.a.s.c.S.Request [collection1]  webapp=null path=null params={q=number_p_dt_ni_mv:"%2B285308357-06-10T15:42:59.187Z"&wt=xml} hits=0 status=0 QTime=0
   [junit4]   2> 1199344 INFO  (TEST-TestPointFields.testDatePointFieldMultiValuedNonSearchableExactQuery-seed#[E7AB050900E7AC47]) [    ] o.a.s.c.S.Request [collection1]  webapp=null path=null params={q=number_p_dt_ni_mv:"-98821539-05-21T03:18:00.127Z"&wt=xml} hits=0 status=0 QTime=0
   [junit4]   2> 1199344 INFO  (TEST-TestPointFields.testDatePointFieldMultiValuedNonSearchableExactQuery-seed#[E7AB050900E7AC47]) [    ] o.a.s.c.S.Request [collection1]  webapp=null path=null params={q=number_p_dt_ni_mv:"%2B193388571-03-08T10:58:19.067Z"&wt=xml} hits=0 status=0 QTime=0
   [junit4]   2> 1199344 INFO  (TEST-TestPointFields.testDatePointFieldMultiValuedNonSearchableExactQuery-seed#[E7AB050900E7AC47]) [    ] o.a.s.c.S.Request [collection1]  webapp=null path=null params={q=number_p_dt_ni_mv:"%2B31870993-12-15T06:11:42.533Z"&wt=xml} hits=0 status=0 QTime=0
   [junit4]   2> 1199344 INFO  (TEST-TestPointFields.testDatePointFieldMultiValuedNonSearchableExactQuery-seed#[E7AB050900E7AC47]) [    ] o.a.s.c.S.Request [collection1]  webapp=null path=null params={q=number_p_dt_ni_mv:"%2B107572766-02-07T00:20:51.732Z"&wt=xml} hits=0 status=0 QTime=0
   [junit4]   2> 1199344 INFO  (TEST-TestPointFields.testDatePointFieldMultiValuedNonSearchableExactQuery-seed#[E7AB050900E7AC47]) [    ] o.a.s.c.S.Request [collection1]  webapp=null path=null params={q=number_p_dt_ni_mv:"%2B281315345-06-04T23:58:21.001Z"&wt=xml} hits=0 status=0 QTime=0
   [junit4]   2> 1199344 INFO  (TEST-TestPointFields.testDatePointFieldMultiValuedNonSearchableExactQuery-seed#[E7AB050900E7AC47]) [    ] o.a.s.c.S.Request [collection1]  webapp=null path=null params={q=number_p_dt_ni_mv:"-182489032-08-26T15:20:43.134Z"&wt=xml} hits=0 status=0 QTime=0
   [junit4]   2> 1199344 INFO  (TEST-TestPointFields.testDatePointFieldMultiValuedNonSearchableExactQuery-seed#[E7AB050900E7AC47]) [    ] o.a.s.c.S.Request [collection1]  webapp=null path=null params={q=number_p_dt_ni_mv:"%2B179198180-08-08T11:40:52.429Z"&wt=xml} hits=0 status=0 QTime=0
   [junit4]   2> 1199345 INFO  (TEST-TestPointFields.testDatePointFieldMultiValuedNonSearchableExactQuery-seed#[E7AB050900E7AC47]) [    ] o.a.s.c.S.Request [collection1]  webapp=null path=null params={q=number_p_dt_ni_mv:"-48258401-10-13T21:48:24.115Z"+OR+number_p_dt_ni_mv:"-272667110-02-18T16:48:51.918Z"&wt=xml} hits=0 status=0 QTime=0
   [junit4]   2> 1199345 INFO  (TEST-TestPointFields.testDatePointFieldMultiValuedNonSearchableExactQuery-seed#[E7AB050900E7AC47]) [    ] o.a.s.c.S.Request [collection1]  webapp=null path=null params={q=number_p_dt_ni_mv:"-272667110-02-18T16:48:51.918Z"+OR+number_p_dt_ni_mv:"-259930406-07-25T05:27:26.002Z"&wt=xml} hits=0 status=0 QTime=0
   [junit4]   2> 1199345 INFO  (TEST-TestPointFields.testDatePointFieldMultiValuedNonSearchableExactQuery-seed#[E7AB050900E7AC47]) [    ] o.a.s.c.S.Request [collection1]  webapp=null path=null params={q=number_p_dt_ni_mv:"-259930406-07-25T05:27:26.002Z"+OR+number_p_dt_ni_mv:"-258404320-06-19T19:34:35.396Z"&wt=xml} hits=0 status=0 QTime=0
   [junit4]   2> 1199345 INFO  (TEST-TestPointFields.testDatePointFieldMultiValuedNonSearchableExactQuery-seed#[E7AB050900E7AC47]) [    ] o.a.s.c.S.Request [collection1]  webapp=null path=null params={q=number_p_dt_ni_mv:"-258404320-06-19T19:34:35.396Z"+OR+number_p_dt_ni_mv:"%2B187192891-09-09T02:10:36.157Z"&wt=xml} hits=0 status=0 QTime=0
   [junit4]   2> 1199345 INFO  (TEST-TestPointFields.testDatePointFieldMultiValuedNonSearchableExactQuery-seed#[E7AB050900E7AC47]) [    ] o.a.s.c.S.Request [collection1]  webapp=null path=null params={q=number_p_dt_ni_mv:"%2B187192891-09-09T02:10:36.157Z"+OR+number_p_dt_ni_mv:"-180715332-01-27T01:25:48.129Z"&wt=xml} hits=0 status=0 QTime=0
   [junit4]   2> 1199345 INFO  (TEST-TestPointFields.testDatePointFieldMultiValuedNonSearchableExactQuery-seed#[E7AB050900E7AC47]) [    ] o.a.s.c.S.Request [collection1]  webapp=null path=null params={q=number_p_dt_ni_mv:"-180715332-01-27T01:25:48.129Z"+OR+number_p_dt_ni_mv:"%2B76821024-05-25T09:19:45.058Z"&wt=xml} hits=0 status=0 QTime=0
   [junit4]   2> 1199346 INFO  (TEST-TestPointFields.testDatePointFieldMultiValuedNonSearchableExactQuery-seed#[E7AB050900E7AC47]) [    ] o.a.s.c.S.Request [collection1]  webapp=null path=null params={q=number_p_dt_ni_mv:"%2B76821024-05-25T09:19:45.058Z"+OR+number_p_dt_ni_mv:"%2B24788512-10-12T19:12:18.483Z"&wt=xml} hits=0 status=0 QTime=0
   [junit4]   2> 1199346 INFO  (TEST-TestPointFields.testDatePointFieldMultiValuedNonSearchableExactQuery-seed#[E7AB050900E7AC47]) [    ] o.a.s.c.S.Request [collection1]  webapp=null path=null params={q=number_p_dt_ni_mv:"%2B24788512-10-12T19:12:18.483Z"+OR+number_p_dt_ni_mv:"%2B163150001-07-17T13:59:40.091Z"&wt=xml} hits=0 status=0 QTime=0
   [junit4]   2> 1199346 INFO  (TEST-TestPointFields.testDatePointFieldMultiValuedNonSearchableExactQuery-seed#[E7AB050900E7AC47]) [    ] o.a.s.c.S.Request [collection1]  webapp=null path=null params={q=number_p_dt_ni_mv:"%2B163150001-07-17T13:59:40.091Z"+OR+number_p_dt_ni_mv:"%2B49561997-02-11T11:28:06.990Z"&wt=xml} hits=0 status=0 QTime=0
   [junit4]   2> 1199346 INFO  (TEST-TestPointFields.testDatePointFieldMultiValuedNonSearchableExactQuery-seed#[E7AB050900E7AC47]) [    ] o.a.s.c.S.Request [collection1]  webapp=null path=null params={q=number_p_dt_ni_mv:"%2B49561997-02-11T11:28:06.990Z"+OR+number_p_dt_ni_mv:"-48258401-10-13T21:48:24.115Z"&wt=xml} hits=0 status=0 QTime=0
   [junit4]   2> 1199346 INFO  (TEST-TestPointFields.testDatePointFieldMultiValuedNonSearchableExactQuery-seed#[E7AB050900E7AC47]) [    ] o.a.s.c.S.Request [collection1]  webapp=null path=null params={q=number_p_dt_ni_mv:"%2B192940393-02-12T16:22:45.422Z"+OR+number_p_dt_ni_mv:"-272667110-02-18T16:48:51.918Z"&wt=xml} hits=0 status=0 QTime=0
   [junit4]   2> 1199346 INFO  (TEST-TestPointFields.testDatePointFieldMultiValuedNonSearchableExactQuery-seed#[E7AB050900E7AC47]) [    ] o.a.s.c.S.Request [collection1]  webapp=null path=null params={q=number_p_dt_ni_mv:"-17932681-06-23T19:25:24.472Z"+OR+number_p_dt_ni_mv:"-259930406-07-25T05:27:26.002Z"&wt=xml} hits=0 status=0 QTime=0
   [junit4]   2> 1199346 INFO  (TEST-TestPointFields.testDatePointFieldMultiValuedNonSearchableExactQuery-seed#[E7AB050900E7AC47]) [    ] o.a.s.c.S.Request [collection1]  webapp=null path=null params={q=number_p_dt_ni_mv:"%2B285308357-06-10T15:42:59.187Z"+OR+number_p_dt_ni_mv:"-258404320-06-19T19:34:35.396Z"&wt=xml} hits=0 status=0 QTime=0
   [junit4]   2> 1199346 INFO  (TEST-TestPointFields.testDatePointFieldMultiValuedNonSearchableExactQuery-seed#[E7AB050900E7AC47]) [    ] o.a.s.c.S.Request [collection1]  webapp=null path=null params={q=number_p_dt_ni_mv:"-98821539-05-21T03:18:00.127Z"+OR+number_p_dt_ni_mv:"%2B187192891-09-09T02:10:36.157Z"&wt=xml} hits=0 status=0 QTime=0
   [junit4]   2> 1199347 INFO  (TEST-TestPointFields.testDatePointFieldMultiValuedNonSearchableExactQuery-seed#[E7AB050900E7AC47]) [    ] o.a.s.c.S.Request [collection1]  webapp=null path=null params={q=number_p_dt_ni_mv:"%2B193388571-03-08T10:58:19.067Z"+OR+number_p_dt_ni_mv:"-180715332-01-27T01:25:48.129Z"&wt=xml} hits=0 status=0 QTime=0
   [junit4]   2> 1199347 INFO  (TEST-TestPointFields.testDatePointFieldMultiValuedNonSearchableExactQuery-seed#[E7AB050900E7AC47]) [    ] o.a.s.c.S.Request [collection1]  webapp=null path=null params={q=number_p_dt_ni_mv:"%2B31870993-12-15T06:11:42.533Z"+OR+number_p_dt_ni_mv:"%2B76821024-05-25T09:19:45.058Z"&wt=xml} hits=0 status=0 QTime=0
   [junit4]   2> 1199347 INFO  (TEST-TestPointFields.testDatePointFieldMultiValuedNonSearchableExactQuery-seed#[E7AB050900E7AC47]) [    ] o.a.s.c.S.Request [collection1]  webapp=null path=null params={q=number_p_dt_ni_mv:"%2B107572766-02-07T00:20:51.732Z"+OR+number_p_dt_ni_mv:"%2B24788512-10-12T19:12:18.483Z"&wt=xml} hits=0 status=0 QTime=0
   [junit4]   2> 1199347 INFO  (TEST-TestPointFields.testDatePointFieldMultiValuedNonSearchableExactQuery-seed#[E7AB050900E7AC47]) [    ] o.a.s.c.S.Request [collection1]  webapp=null path=null params={q=number_p_dt_ni_mv:"%2B281315345-06-04T23:58:21.001Z"+OR+number_p_dt_ni_mv:"%2B163150001-07-17T13:59:40.091Z"&wt=xml} hits=0 status=0 QTime=0
   [junit4]   2> 1199347 INFO  (TEST-TestPointFields.testDatePointFieldMultiValuedNonSearchableExactQuery-seed#[E7AB050900E7AC47]) [    ] o.a.s.c.S.Request [collection1]  webapp=null path=null params={q=number_p_dt_ni_mv:"-182489032-08-26T15:20:43.134Z"+OR+number_p_dt_ni_mv:"%2B49561997-02-11T11:28:06.990Z"&wt=xml} hits=0 status=0 QTime=0
   [junit4]   2> 1199347 INFO  (TEST-TestPointFields.testDatePointFieldMultiValuedNonSearchableExactQuery-seed#[E7AB050900E7AC47]) [    ] o.a.s.c.S.Request [collection1]  webapp=null path=null params={q=number_p_dt_ni_mv:"%2B179198180-08-08T11:40:52.429Z"+OR+number_p_dt_ni_mv:"-48258401-10-13T21:48:24.115Z"&wt=xml} hits=0 status=0 QTime=0
   [junit4]   2> 1199348 INFO  (TEST-TestPointFields.testDatePointFieldMultiValuedNonSearchableExactQuery-seed#[E7AB050900E7AC47]) [    ] o.a.s.u.p.LogUpdateProcessorFactory [collection1]  webapp=null path=null params={}{add=[0 (1613087499687559168)]} 0 0
   [junit4]   2> 1199348 INFO  (TEST-TestPointFields.testDatePointFieldMultiValuedNonSearchableExactQuery-seed#[E7AB050900E7AC47]) [    ] o.a.s.u.p.LogUpdateProcessorFactory [collection1]  webapp=null path=null params={}{add=[1 (1613087499688607744)]} 0 0
   [junit4]   2> 1199348 INFO  (TEST-TestPointFields.testDatePointFieldMultiValuedNonSearchableExactQuery-seed#[E7AB050900E7AC47]) [    ] o.a.s.u.p.LogUpdateProcessorFactory [collection1]  webapp=null path=null params={}{add=[2 (1613087499688607745)]} 0 0
   [junit4]   2> 1199348 INFO  (TEST-TestPointFields.testDatePointFieldMultiValuedNonSearchableExactQuery-seed#[E7AB050900E7AC47]) [    ] o.a.s.u.p.LogUpdateProcessorFactory [collection1]  webapp=null path=null params={}{add=[3 (1613087499688607746)]} 0 0
   [junit4]   2> 1199349 INFO  (TEST-TestPointFields.testDatePointFieldMultiValuedNonSearchableExactQuery-seed#[E7AB050900E7AC47]) [    ] o.a.s.u.p.LogUpdateProcessorFactory [collection1]  webapp=null path=null params={}{add=[4 (1613087499688607747)]} 0 0
   [junit4]   2> 1199349 INFO  (TEST-TestPointFields.testDatePointFieldMultiValuedNonSearchableExactQuery-seed#[E7AB050900E7AC47]) [    ] o.a.s.u.p.LogUpdateProcessorFactory [collection1]  webapp=null path=null params={}{add=[5 (1613087499689656320)]} 0 0
   [junit4]   2> 1199349 INFO  (TEST-TestPointFields.testDatePointFieldMultiValuedNonSearchableExactQuery-seed#[E7AB050900E7AC47]) [    ] o.a.s.u.p.LogUpdateProcessorFactory [collection1]  webapp=null path=null params={}{add=[6 (1613087499689656321)]} 0 0
   [junit4]   2> 1199349 INFO  (TEST-TestPointFields.testDatePointFieldMultiValuedNonSearchableExactQuery-seed#[E7AB050900E7AC47]) [    ] o.a.s.u.p.LogUpdateProcessorFactory [collection1]  webapp=null path=null params={}{add=[7 (1613087499689656322)]} 0 0
   [junit4]   2> 1199349 INFO  (TEST-TestPointFields.testDatePointFieldMultiValuedNonSearchableExactQuery-seed#[E7AB050900E7AC47]) [    ] o.a.s.u.p.LogUpdateProcessorFactory [collection1]  webapp=null path=null params={}{add=[8 (1613087499689656323)]} 0 0
   [junit4]   2> 1199349 INFO  (TEST-TestPointFields.testDatePointFieldMultiValuedNonSearchableExactQuery-seed#[E7AB050900E7AC47]) [    ] o.a.s.u.p.LogUpdateProcessorFactory [collection1]  webapp=null path=null params={}{add=[9 (1613087499689656324)]} 0 0
   [junit4]   2> 1199349 INFO  (TEST-TestPointFields.testDatePointFieldMultiValuedNonSearchableExactQuery-seed#[E7AB050900E7AC47]) [    ] o.a.s.u.DirectUpdateHandler2 start commit{_version_=1613087499689656325,optimize=false,openSearcher=true,waitSearcher=true,expungeDeletes=false,softCommit=false,prepareCommit=false}
   [junit4]   2> 1199349 INFO  (TEST-TestPointFields.testDatePointFieldMultiValuedNonSearchableExactQuery-seed#[E7AB050900E7AC47]) [    ] o.a.s.u.SolrIndexWriter Calling setCommitData with IW:org.apache.solr.update.SolrIndexWriter@43bdfb80 commitCommandVersion:1613087499689656325
   [junit4]   2> 1199350 INFO  (TEST-TestPointFields.testDatePointFieldMultiValuedNonSearchableExactQuery-seed#[E7AB050900E7AC47]) [    ] o.a.s.s.SolrIndexSearcher Opening [Searcher@20e43aa1[collection1] main]
   [junit4]   2> 1199351 INFO  (TEST-TestPointFields.testDatePointFieldMultiValuedNonSearchableExactQuery-seed#[E7AB050900E7AC47]) [    ] o.a.s.u.DirectUpdateHandler2 end_commit_flush
   [junit4]   2> 1199351 INFO  (searcherExecutor-5146-thread-1) [    ] o.a.s.c.SolrCore [collection1] Registered new searcher Searcher@20e43aa1[collection1] main{ExitableDirectoryReader(UninvertingDirectoryReader(Uninverting(_1(8.0.0):C10)))}
   [junit4]   2> 1199351 INFO  (TEST-TestPointFields.testDatePointFieldMultiValuedNonSearchableExactQuery-seed#[E7AB050900E7AC47]) [    ] o.a.s.u.p.LogUpdateProcessorFactory [collection1]  webapp=null path=null params={}{commit=} 0 2
   [junit4]   2> 1199352 INFO  (TEST-TestPointFields.testDatePointFieldMultiValuedNonSearchableExactQuery-seed#[E7AB050900E7AC47]) [    ] o.a.s.c.S.Request [collection1]  webapp=null path=null params={q=number_p_dt_ni_ns_mv:"-48258401-10-13T21:48:24.115Z"&wt=xml} hits=0 status=0 QTime=0
   [junit4]   2> 1199352 INFO  (TEST-TestPointFields.testDatePointFieldMultiValuedNonSearchableExactQuery-seed#[E7AB050900E7AC47]) [    ] o.a.s.c.S.Request [collection1]  webapp=null path=null params={q=number_p_dt_ni_ns_mv:"-272667110-02-18T16:48:51.918Z"&wt=xml} hits=0 status=0 QTime=0
   [junit4]   2> 1199352 INFO  (TEST-TestPointFields.testDatePointFieldMultiValuedNonSearchableExactQuery-seed#[E7AB050900E7AC47]) [    ] o.a.s.c.S.Request [collection1]  webapp=null path=null params={q=number_p_dt_ni_ns_mv:"-259930406-07-25T05:27:26.002Z"&wt=xml} hits=0 status=0 QTime=0
   [junit4]   2> 1199352 INFO  (TEST-TestPointFields.testDatePointFieldMultiValuedNonSearchableExactQuery-seed#[E7AB050900E7AC47]) [    ] o.a.s.c.S.Request [collection1]  webapp=null path=null params={q=number_p_dt_ni_ns_mv:"-258404320-06-19T19:34:35.396Z"&wt=xml} hits=0 status=0 QTime=0
   [junit4]   2> 1199352 INFO  (TEST-TestPointFields.testDatePointFieldMultiValuedNonSearchableExactQuery-seed#[E7AB050900E7AC47]) [    ] o.a.s.c.S.Request [collection1]  webapp=null path=null params={q=number_p_dt_ni_ns_mv:"%2B187192891-09-09T02:10:36.157Z"&wt=xml} hits=0 status=0 QTime=0
   [junit4]   2> 1199352 INFO  (TEST-TestPointFields.testDatePointFieldMultiValuedNonSearchableExactQuery-seed#[E7AB050900E7AC47]) [    ] o.a.s.c.S.Request [collection1]  webapp=null path=null params={q=number_p_dt_ni_ns_mv:"-180715332-01-27T01:25:48.129Z"&wt=xml} hits=0 status=0 QTime=0
   [junit4]   2> 1199352 INFO  (TEST-TestPointFields.testDatePointFieldMultiValuedNonSearchableExactQuery-seed#[E7AB050900E7AC47]) [    ] o.a.s.c.S.Request [collection1]  webapp=null path=null params={q=number_p_dt_ni_ns_mv:"%2B76821024-05-25T09:19:45.058Z"&wt=xml} hits=0 status=0 QTime=0
   [junit4]   2> 1199352 INFO  (TEST-TestPointFields.testDatePointFieldMultiValuedNonSearchableExactQuery-seed#[E7AB050900E7AC47]) [    ] o.a.s.c.S.Request [collection1]  webapp=null path=null params={q=number_p_dt_ni_ns_mv:"%2B24788512-10-12T19:12:18.483Z"&wt=xml} hits=0 status=0 QTime=0
   [junit4]   2> 1199353 INFO  (TEST-TestPointFields.testDatePointFieldMultiValuedNonSearchableExactQuery-seed#[E7AB050900E7AC47]) [    ] o.a.s.c.S.Request [collection1]  webapp=null path=null params={q=number_p_dt_ni_ns_mv:"%2B163150001-07-17T13:59:40.091Z"&wt=xml} hits=0 status=0 QTime=0
   [junit4]   2> 1199353 INFO  (TEST-TestPointFields.testDatePointFieldMultiValuedNonSearchableExactQuery-seed#[E7AB050900E7AC47]) [    ] o.a.s.c.S.Request [collection1]  webapp=null path=null params={q=number_p_dt_ni_ns_mv:"%2B49561997-02-11T11:28:06.990Z"&wt=xml} hits=0 status=0 QTime=0
   [junit4]   2> 1199353 INFO  (TEST-TestPointFields.testDatePointFieldMultiValuedNonSearchableExactQuery-seed#[E7AB050900E7AC47]) [    ] o.a.s.c.S.Request [collection1]  webapp=null path=null params={q=number_p_dt_ni_ns_mv:"%2B192940393-02-12T16:22:45.422Z"&wt=xml} hits=0 status=0 QTime=0
   [junit4]   2> 1199353 INFO  (TEST-TestPointFields.testDatePointFieldMultiValuedNonSearchableExactQuery-seed#[E7AB050900E7AC47]) [    ] o.a.s.c.S.Request [collection1]  webapp=null path=null params={q=number_p_dt_ni_ns_mv:"-17932681-06-23T19:25:24.472Z"&wt=xml} hits=0 status=0 QTime=0
   [junit4]   2> 1199353 INFO  (TEST-TestPointFields.testDatePointFieldMultiValuedNonSearchableExactQuery-seed#[E7AB050900E7AC47]) [    ] o.a.s.c.S.Request [collection1]  webapp=null path=null params={q=number_p_dt_ni_ns_mv:"%2B285308357-06-10T15:42:59.187Z"&wt=xml} hits=0 status=0 QTime=0
   [junit4]   2> 1199353 INFO  (TEST-TestPointFields.testDatePointFieldMultiValuedNonSearchableExactQuery-seed#[E7AB050900E7AC47]) [    ] o.a.s.c.S.Request [collection1]  webapp=null path=null params={q=number_p_dt_ni_ns_mv:"-98821539-05-21T03:18:00.127Z"&wt=xml} hits=0 status=0 QTime=0
   [junit4]   2> 1199353 INFO  (TEST-TestPointFields.testDatePointFieldMultiValuedNonSearchableExactQuery-seed#[E7AB050900E7AC47]) [    ] o.a.s.c.S.Request [collection1]  webapp=null path=null params={q=number_p_dt_ni_ns_mv:"%2B193388571-03-08T10:58:19.067Z"&wt=xml} hits=0 status=0 QTime=0
   [junit4]   2> 1199353 INFO  (TEST-TestPointFields.testDatePointFieldMultiValuedNonSearchableExactQuery-seed#[E7AB050900E7AC47]) [    ] o.a.s.c.S.Request [collection1]  webapp=null path=null params={q=number_p_dt_ni_ns_mv:"%2B31870993-12-15T06:11:42.533Z"&wt=xml} hits=0 status=0 QTime=0
   [junit4]   2> 1199353 INFO  (TEST-TestPointFields.testDatePointFieldMultiValuedNonSearchableExactQuery-seed#[E7AB050900E7AC47]) [    ] o.a.s.c.S.Request [collection1]  webapp=null path=null params={q=number_p_dt_ni_ns_mv:"%2B107572766-02-07T00:20:51.732Z"&wt=xml} hits=0 status=0 QTime=0
   [junit4]   2> 1199353 INFO  (TEST-TestPointFields.testDatePointFieldMultiValuedNonSearchableExactQuery-seed#[E7AB050900E7AC47]) [    ] o.a.s.c.S.Request [collection1]  webapp=null path=null params={q=number_p_dt_ni_ns_mv:"%2B281315345-06-04T23:58:21.001Z"&wt=xml} hits=0 status=0 QTime=0
   [junit4]   2> 1199354 INFO  (TEST-TestPointFields.testDatePointFieldMultiValuedNonSearchableExactQuery-seed#[E7AB050900E7AC47]) [    ] o.a.s.c.S.Request [collection1]  webapp=null path=null params={q=number_p_dt_ni_ns_mv:"-182489032-08-26T15:20:43.134Z"&wt=xml} hits=0 status=0 QTime=0
   [junit4]   2> 1199354 INFO  (TEST-TestPointFields.testDatePointFieldMultiValuedNonSearchableExactQuery-seed#[E7AB050900E7AC47]) [    ] o.a.s.c.S.Request [collection1]  webapp=null path=null params={q=number_p_dt_ni_ns_mv:"%2B179198180-08-08T11:40:52.429Z"&wt=xml} hits=0 status=0 QTime=0
   [junit4]   2> 1199354 INFO  (TEST-TestPointFields.testDatePointFieldMultiValuedNonSearchableExactQuery-seed#[E7AB050900E7AC47]) [    ] o.a.s.c.S.Request [collection1]  webapp=null path=null params={q=number_p_dt_ni_ns_mv:"-48258401-10-13T21:48:24.115Z"+OR+number_p_dt_ni_ns_mv:"-272667110-02-18T16:48:51.918Z"&wt=xml} hits=0 status=0 QTime=0
   [junit4]   2> 1199354 INFO  (TEST-TestPointFields.testDatePointFieldMultiValuedNonSearchableExactQuery-seed#[E7AB050900E7AC47]) [    ] o.a.s.c.S.Request [collection1]  webapp=null path=null params={q=number_p_dt_ni_ns_mv:"-272667110-02-18T16:48:51.918Z"+OR+number_p_dt_ni_ns_mv:"-259930406-07-25T05:27:26.002Z"&wt=xml} hits=0 status=0 QTime=0
   [junit4]   2> 1199354 INFO  (TEST-TestPointFields.testDatePointFieldMultiValuedNonSearchableExactQuery-seed#[E7AB050900E7AC47]) [    ] o.a.s.c.S.Request [collection1]  webapp=null path=null params={q=number_p_dt_ni_ns_mv:"-259930406-07-25T05:27:26.002Z"+OR+number_p_dt_ni_ns_mv:"-258404320-06-19T19:34:35.396Z"&wt=xml} hits=0 status=0 QTime=0
   [junit4]   2> 1199354 INFO  (TEST-TestPointFields.testDatePointFieldMultiValuedNonSearchableExactQuery-seed#[E7AB050900E7AC47]) [    ] o.a.s.c.S.Request [collection1]  webapp=null path=null params={q=number_p_dt_ni_ns_mv:"-258404320-06-19T19:34:35.396Z"+OR+number_p_dt_ni_ns_mv:"%2B187192891-09-09T02:10:36.157Z"&wt=xml} hits=0 status=0 QTime=0
   [junit4]   2> 1199354 INFO  (TEST-TestPointFields.testDatePointFieldMultiValuedNonSearchableExactQuery-seed#[E7AB050900E7AC47]) [    ] o.a.s.c.S.Request [collection1]  webapp=null path=null params={q=number_p_dt_ni_ns_mv:"%2B187192891-09-09T02:10:36.157Z"+OR+number_p_dt_ni_ns_mv:"-180715332-01-27T01:25:48.129Z"&wt=xml} hits=0 status=0 QTime=0
   [junit4]   2> 1199355 INFO  (TEST-TestPointFields.testDatePointFieldMultiValuedNonSearchableExactQuery-seed#[E7AB050900E7AC47]) [    ] o.a.s.c.S.Request [collection1]  webapp=null path=null params={q=number_p_dt_ni_ns_mv:"-180715332-01-27T01:25:48.129Z"+OR+number_p_dt_ni_ns_mv:"%2B76821024-05-25T09:19:45.058Z"&wt=xml} hits=0 status=0 QTime=0
   [junit4]   2> 1199355 INFO  (TEST-TestPointFields.testDatePointFieldMultiValuedNonSearchableExactQuery-seed#[E7AB050900E7AC47]) [    ] o.a.s.c.S.Request [collection1]  webapp=null path=null params={q=number_p_dt_ni_ns_mv:"%2B76821024-05-25T09:19:45.058Z"+OR+number_p_dt_ni_ns_mv:"%2B24788512-10-12T19:12:18.483Z"&wt=xml} hits=0 status=0 QTime=0
   [junit4]   2> 1199355 INFO  (TEST-TestPointFields.testDatePointFieldMultiValuedNonSearchableExactQuery-seed#[E7AB050900E7AC47]) [    ] o.a.s.c.S.Request [collection1]  webapp=null path=null params={q=number_p_dt_ni_ns_mv:"%2B24788512-10-12T19:12:18.483Z"+OR+number_p_dt_ni_ns_mv:"%2B163150001-07-17T13:59:40.091Z"&wt=xml} hits=0 status=0 QTime=0
   [junit4]   2> 1199355 INFO  (TEST-TestPointFields.testDatePointFieldMultiValuedNonSearchableExactQuery-seed#[E7AB050900E7AC47]) [    ] o.a.s.c.S.Request [collection1]  webapp=null path=null params={q=number_p_dt_ni_ns_mv:"%2B163150001-07-17T13:59:40.091Z"+OR+number_p_dt_ni_ns_mv:"%2B49561997-02-11T11:28:06.990Z"&wt=xml} hits=0 status=0 QTime=0
   [junit4]   2> 1199355 INFO  (TEST-TestPointFields.testDatePointFieldMultiValuedNonSearchableExactQuery-seed#[E7AB050900E7AC47]) [    ] o.a.s.c.S.Request [collection1]  webapp=null path=null params={q=number_p_dt_ni_ns_mv:"%2B49561997-02-11T11:28:06.990Z"+OR+number_p_dt_ni_ns_mv:"-48258401-10-13T21:48:24.115Z"&wt=xml} hits=0 status=0 QTime=0
   [junit4]   2> 1199355 INFO  (TEST-TestPointFields.testDatePointFieldMultiValuedNonSearchableExactQuery-seed#[E7AB050900E7AC47]) [    ] o.a.s.c.S.Request [collection1]  webapp=null path=null params={q=number_p_dt_ni_ns_mv:"%2B192940393-02-12T16:22:45.422Z"+OR+number_p_dt_ni_ns_mv:"-272667110-02-18T16:48:51.918Z"&wt=xml} hits=0 status=0 QTime=0
   [junit4]   2> 1199355 INFO  (TEST-TestPointFields.testDatePointFieldMultiValuedNonSearchableExactQuery-seed#[E7AB050900E7AC47]) [    ] o.a.s.c.S.Request [collection1]  webapp=null path=null params={q=number_p_dt_ni_ns_mv:"-17932681-06-23T19:25:24.472Z"+OR+number_p_dt_ni_ns_mv:"-259930406-07-25T05:27:26.002Z"&wt=xml} hits=0 status=0 QTime=0
   [junit4]   2> 1199356 INFO  (TEST-TestPointFields.testDatePointFieldMultiValuedNonSearchableExactQuery-seed#[E7AB050900E7AC47]) [    ] o.a.s.c.S.Request [collection1]  webapp=null path=null params={q=number_p_dt_ni_ns_mv:"%2B285308357-06-10T15:42:59.187Z"+OR+number_p_dt_ni_ns_mv:"-258404320-06-19T19:34:35.396Z"&wt=xml} hits=0 status=0 QTime=0
   [junit4]   2> 1199356 INFO  (TEST-TestPointFields.testDatePointFieldMultiValuedNonSearchableExactQuery-seed#[E7AB050900E7AC47]) [    ] o.a.s.c.S.Request [collection1]  webapp=null path=null params={q=number_p_dt_ni_ns_mv:"-98821539-05-21T03:18:00.127Z"+OR+number_p_dt_ni_ns_mv:"%2B187192891-09-09T02:10:36.157Z"&wt=xml} hits=0 status=0 QTime=0
   [junit4]   2> 1199356 INFO  (TEST-TestPointFields.testDatePointFieldMultiValuedNonSearchableExactQuery-seed#[E7AB050900E7AC47]) [    ] o.a.s.c.S.Request [collection1]  webapp=null path=null params={q=number_p_dt_ni_ns_mv:"%2B193388571-03-08T10:58:19.067Z"+OR+number_p_dt_ni_ns_mv:"-180715332-01-27T01:25:48.129Z"&wt=xml} hits=0 status=0 QTime=0
   [junit4]   2> 1199356 INFO  (TEST-TestPointFields.testDatePointFieldMultiValuedNonSearchableExactQuery-seed#[E7AB050900E7AC47]) [    ] o.a.s.c.S.Request [collection1]  webapp=null path=null params={q=number_p_dt_ni_ns_mv:"%2B31870993-12-15T06:11:42.533Z"+OR+number_p_dt_ni_ns_mv:"%2B76821024-05-25T09:19:45.058Z"&wt=xml} hits=0 status=0 QTime=0
   [junit4]   2> 1199356 INFO  (TEST-TestPointFields.testDatePointFieldMultiValuedNonSearchableExactQuery-seed#[E7AB050900E7AC47]) [    ] o.a.s.c.S.Request [collection1]  webapp=null path=null params={q=number_p_dt_ni_ns_mv:"%2B107572766-02-07T00:20:51.732Z"+OR+number_p_dt_ni_ns_mv:"%2B24788512-10-12T19:12:18.483Z"&wt=xml} hits=0 status=0 QTime=0
   [junit4]   2> 1199356 INFO  (TEST-TestPointFields.testDatePointFieldMultiValuedNonSearchableExactQuery-seed#[E7AB050900E7AC47]) [    ] o.a.s.c.S.Request [collection1]  webapp=null path=null params={q=number_p_dt_ni_ns_mv:"%2B281315345-06-04T23:58:21.001Z"+OR+number_p_dt_ni_ns_mv:"%2B163150001-07-17T13:59:40.091Z"&wt=xml} hits=0 status=0 QTime=0
   [junit4]   2> 1199356 INFO  (TEST-TestPointFields.testDatePointFieldMultiValuedNonSearchableExactQuery-seed#[E7AB050900E7AC47]) [    ] o.a.s.c.S.Request [collection1]  webapp=null path=null params={q=number_p_dt_ni_ns_mv:"-182489032-08-26T15:20:43.134Z"+OR+number_p_dt_ni_ns_mv:"%2B49561997-02-11T11:28:06.990Z"&wt=xml} hits=0 status=0 QTime=0
   [junit4]   2> 1199356 INFO  (TEST-TestPointFields.testDatePointFieldMultiValuedNonSearchableExactQuery-seed#[E7AB050900E7AC47]) [    ] o.a.s.c.S.Request [collection1]  webapp=null path=null params={q=number_p_dt_ni_ns_mv:"%2B179198180-08-08T11:40:52.429Z"+OR+number_p_dt_ni_ns_mv:"-48258401-10-13T21:48:24.115Z"&wt=xml} hits=0 status=0 QTime=0
   [junit4]   2> 1199357 INFO  (TEST-TestPointFields.testDatePointFieldMultiValuedNonSearchableExactQuery-seed#[E7AB050900E7AC47]) [    ] o.a.s.u.DirectUpdateHandler2 [collection1] REMOVING ALL DOCUMENTS FROM INDEX
   [junit4]   2> 1199357 INFO  (TEST-TestPointFields.testDatePointFieldMultiValuedNonSearchableExactQuery-seed#[E7AB050900E7AC47]) [    ] o.a.s.s.SolrIndexSearcher Opening [Searcher@cf3a1b8[collection1] realtime]
   [junit4]   2> 1199357 INFO  (TEST-TestPointFields.testDatePointFieldMultiValuedNonSearchableExactQuery-seed#[E7AB050900E7AC47]) [    ] o.a.s.u.p.LogUpdateProcessorFactory [collection1]  webapp=null path=null params={_version_=-9223372036854775807&update.distrib=FROMLEADER&versions=true&wt=json&indent=true}{deleteByQuery=*:* (-9223372036854775807)} 0 0
   [junit4]   2> 1199357 INFO  (TEST-TestPointFields.testDatePointFieldMultiValuedNonSearchableExactQuery-seed#[E7AB050900E7AC47]) [    ] o.a.s.u.DirectUpdateHandler2 start commit{_version_=1613087499698044928,optimize=false,openSearcher=true,waitSearcher=true,expungeDeletes=false,softCommit=false,prepareCommit=false}
   [junit4]   2> 1199357 INFO  (TEST-TestPointFields.testDatePointFieldMultiValuedNonSearchableExactQuery-seed#[E7AB050900E7AC47]) [    ] o.a.s.u.SolrIndexWriter Calling setCommitData with IW:org.apache.solr.update.SolrIndexWriter@43bdfb80 commitCommandVersion:1613087499698044928
   [junit4]   2> 1199357 INFO  (TEST-TestPointFields.testDatePointFieldMultiValuedNonSearchableExactQuery-seed#[E7AB050900E7AC47]) [    ] o.a.s.s.SolrIndexSearcher Opening [Searcher@5138c677[collection1] main]
   [junit4]   2> 1199358 INFO  (TEST-TestPointFields.testDatePointFieldMultiValuedNonSearchableExactQuery-seed#[E7AB050900E7AC47]) [    ] o.a.s.u.DirectUpdateHandler2 end_commit_flush
   [junit4]   2> 1199358 INFO  (searcherExecutor-5146-thread-1) [    ] o.a.s.c.SolrCore [collection1] Registered new searcher Searcher@5138c677[collection1] main{ExitableDirectoryReader(UninvertingDirectoryReader())}
   [junit4]   2> 1199359 INFO  (TEST-TestPointFields.testDatePointFieldMultiValuedNonSearchableExactQuery-seed#[E7AB050900E7AC47]) [    ] o.a.s.u.p.LogUpdateProcessorFactory [collection1]  webapp=null path=null params={}{commit=} 0 1
   [junit4]   2> 1199359 INFO  (TEST-TestPointFields.testDatePointFieldMultiValuedNonSearchableExactQuery-seed#[E7AB050900E7AC47]) [    ] o.a.s.SolrTestCaseJ4 ###Ending testDatePointFieldMultiValuedNonSearchableExactQuery
   [junit4]   2> 1199361 INFO  (TEST-TestPointFields.testInternals-seed#[E7AB050900E7AC47]) [    ] o.a.s.SolrTestCaseJ4 ###Starting testInternals
   [junit4]   2> 1199362 INFO  (TEST-TestPointFields.testInternals-seed#[E7AB050900E7AC47]) [    ] o.a.s.u.p.LogUpdateProcessorFactory [collection1]  webapp=null path=null params={}{add=[0 (1613087499703287808)]} 0 0
   [junit4]   2> 1199362 INFO  (TEST-TestPointFields.testInternals-seed#[E7AB050900E7AC47]) [    ] o.a.s.u.p.LogUpdateProcessorFactory [collection1]  webapp=null path=null params={}{add=[1 (1613087499703287809)]} 0 0
   [junit4]   2> 1199362 INFO  (TEST-TestPointFields.testInternals-seed#[E7AB050900E7AC47]) [    ] o.a.s.u.p.LogUpdateProcessorFactory [collection1]  webapp=null path=null params={}{add=[2 (1613087499703287810)]} 0 0
   [junit4]   2> 1199363 INFO  (TEST-TestPointFields.testInternals-seed#[E7AB050900E7AC47]) [    ] o.a.s.u.p.LogUpdateProcessorFactory [collection1]  webapp=null path=null params={}{add=[3 (1613087499704336384)]} 0 0
   [junit4]   2> 1199363 INFO  (TEST-TestPointFields.testInternals-seed#[E7AB050900E7AC47]) [    ] o.a.s.u.p.LogUpdateProcessorFactory [collection1]  webapp=null path=null params={}{add=[4 (1613087499704336385)]} 0 0
   [junit4]   2> 1199363 INFO  (TEST-TestPointFields.testInternals-seed#[E7AB050900E7AC47]) [    ] o.a.s.u.p.LogUpdateProcessorFactory [collection1]  webapp=null path=null params={}{add=[5 (1613087499704336386)]} 0 0
   [junit4]   2> 1199363 INFO  (TEST-TestPointFields.testInternals-seed#[E7AB050900E7AC47]) [    ] o.a.s.u.p.LogUpdateProcessorFactory [collection1]  webapp=null path=null params={}{add=[6 (1613087499704336387)]} 0 0
   [junit4]   2> 1199363 INFO  (TEST-TestPointFields.testInternals-seed#[E7AB050900E7AC47]) [    ] o.a.s.u.p.LogUpdateProcessorFactory [collection1]  webapp=null path=null params={}{add=[7 (1613087499704336388)]} 0 0
   [junit4]   2> 1199363 INFO  (TEST-TestPointFields.testInternals-seed#[E7AB050900E7AC47]) [    ] o.a.s.u.p.LogUpdateProcessorFactory [collection1]  webapp=null path=null params={}{add=[8 (1613087499704336389)]} 0 0
   [junit4]   2> 1199363 INFO  (TEST-TestPointFields.testInternals-seed#[E7AB050900E7AC47]) [    ] o.a.s.u.p.LogUpdateProcessorFactory [collection1]  webapp=null path=null params={}{add=[9 (1613087499704336390)]} 0 0
   [junit4]   2> 1199363 INFO  (TEST-TestPointFields.testInternals-seed#[E7AB050900E7AC47]) [    ] o.a.s.u.DirectUpdateHandler2 start commit{_version_=1613087499704336391,optimize=false,openSearcher=true,waitSearcher=true,expungeDeletes=false,softCommit=false,prepareCommit=false}
   [junit4]   2> 1199363 INFO  (TEST-TestPointFields.testInternals-seed#[E7AB050900E7AC47]) [    ] o.a.s.u.SolrIndexWriter Calling setCommitData with IW:org.apache.solr.update.SolrIndexWriter@43bdfb80 commitCommandVersion:16130874

[...truncated too long message...]

odahale.metrics.MetricRegistry@5412318b
   [junit4]   2> 56188 INFO  (SUITE-TestPointFields-seed#[E7AB050900E7AC47]-worker) [    ] o.a.s.m.SolrMetricManager Closing metric reporters for registry=solr.jetty, tag=null
   [junit4]   2> 56188 INFO  (SUITE-TestPointFields-seed#[E7AB050900E7AC47]-worker) [    ] o.a.s.m.r.SolrJmxReporter Closing reporter [org.apache.solr.metrics.reporters.SolrJmxReporter@42c84f22: rootName = null, domain = solr.jetty, service url = null, agent id = null] for registry solr.jetty / com.codahale.metrics.MetricRegistry@11f79cbb
   [junit4]   2> 56189 INFO  (coreCloseExecutor-32-thread-1) [    x:collection1] o.a.s.c.SolrCore [collection1]  CLOSING SolrCore org.apache.solr.core.SolrCore@750df02a
   [junit4]   2> 56189 INFO  (coreCloseExecutor-32-thread-1) [    x:collection1] o.a.s.m.SolrMetricManager Closing metric reporters for registry=solr.core.collection1, tag=750df02a
   [junit4]   2> 56189 INFO  (coreCloseExecutor-32-thread-1) [    x:collection1] o.a.s.m.r.SolrJmxReporter Closing reporter [org.apache.solr.metrics.reporters.SolrJmxReporter@7066cbb3: rootName = null, domain = solr.core.collection1, service url = null, agent id = null] for registry solr.core.collection1 / com.codahale.metrics.MetricRegistry@3094b7f0
   [junit4]   2> NOTE: leaving temporary files on disk at: /home/jenkins/workspace/Lucene-Solr-master-Linux/solr/build/solr-core/test/J1/temp/solr.schema.TestPointFields_E7AB050900E7AC47-002
   [junit4]   2> Oct 01, 2018 2:59:41 AM com.carrotsearch.randomizedtesting.ThreadLeakControl checkThreadLeaks
   [junit4]   2> WARNING: Will linger awaiting termination of 1 leaked thread(s).
   [junit4]   2> NOTE: test params are: codec=Asserting(Lucene80): {id=TestBloomFilteredLucenePostings(BloomFilteringPostingsFormat(Lucene50(blocksize=128)))}, docValues:{foo_p_f_ni_dv_ns=DocValuesFormat(name=Lucene70), foo_p_f_ni_dv_ns_mv=DocValuesFormat(name=Lucene70), number_p_dt_dv_ns=DocValuesFormat(name=Direct), foo_p_d_ni_dv_ns_mv=DocValuesFormat(name=Lucene70), foo_p_i_ni_dv_ns=DocValuesFormat(name=Direct), number_p_f_ni_mv_dv_smf=DocValuesFormat(name=Lucene70), number_p_dt_ni_mv_dv_sml=DocValuesFormat(name=Lucene70), number_p_i_dv_ns=DocValuesFormat(name=Lucene70), number_p_l_ni_dv=DocValuesFormat(name=Asserting), number_p_f_dv=DocValuesFormat(name=Direct), number_p_l_dv_ns=DocValuesFormat(name=Asserting), foo_p_l_ni_dv_ns=DocValuesFormat(name=Lucene70), number_p_dt_ni_mv_dv=DocValuesFormat(name=Asserting), number_p_l_dv_sml=DocValuesFormat(name=Lucene70), number_p_i_dv_smf=DocValuesFormat(name=Asserting), number_p_d_ni_ns_dv=DocValuesFormat(name=Direct), number_p_dt_ni_dv_ns_mv=DocValuesFormat(name=Direct), number_p_i_ni_dv_ns_mv=DocValuesFormat(name=Lucene70), number_p_f_dv_smf=DocValuesFormat(name=Lucene70), number_p_l_ni_dv_ns=DocValuesFormat(name=Asserting), number_p_l_dv_smf=DocValuesFormat(name=Lucene70), number_p_d_ni_mv_dv_sml=DocValuesFormat(name=Lucene70), number_p_f_ni_dv_ns_mv=DocValuesFormat(name=Direct), number_p_d_dv_smf=DocValuesFormat(name=Lucene70), number_p_f_ni_mv_dv_sml=DocValuesFormat(name=Lucene70), number_p_d_ni_mv_dv_smf=DocValuesFormat(name=Lucene70), number_p_dt_ni_dv=DocValuesFormat(name=Direct), number_p_f_dv_ns_mv=DocValuesFormat(name=Direct), number_p_l_dv_ns_mv=DocValuesFormat(name=Asserting), number_p_dt_mv_dv_sml=DocValuesFormat(name=Lucene70), number_p_l_ni_ns_dv=DocValuesFormat(name=Direct), number_p_i_ni_dv_ns=DocValuesFormat(name=Lucene70), number_p_i_dv_sml=DocValuesFormat(name=Direct), number_p_f_ni_ns_dv=DocValuesFormat(name=Asserting), foo_p_d_ni_dv_ns=DocValuesFormat(name=Lucene70), number_p_dt_dv_sml=DocValuesFormat(name=Lucene70), number_p_dt_dv_smf=DocValuesFormat(name=Lucene70), number_p_i_mv_dv=DocValuesFormat(name=Lucene70), number_p_l_ni_dv_ns_mv=DocValuesFormat(name=Asserting), number_p_d_ni_dv=DocValuesFormat(name=Asserting), number_p_dt_ni_dv_sml=DocValuesFormat(name=Lucene70), number_p_d_mv_dv_smf=DocValuesFormat(name=Lucene70), number_p_d_ni_dv_smf=DocValuesFormat(name=Lucene70), number_p_dt_ni_dv_smf=DocValuesFormat(name=Lucene70), foo_p_l_ni_dv_ns_mv=DocValuesFormat(name=Lucene70), number_p_d_mv_dv_sml=DocValuesFormat(name=Lucene70), number_p_dt_ni_ns_dv=DocValuesFormat(name=Asserting), number_p_dt_mv_dv_smf=DocValuesFormat(name=Lucene70), foo_p_i_ni_dv_ns_mv=DocValuesFormat(name=Direct), number_p_l_mv_dv=DocValuesFormat(name=Direct), number_p_d_ni_dv_sml=DocValuesFormat(name=Lucene70), number_p_i_ni_mv_dv=DocValuesFormat(name=Lucene70), number_p_f_mv_dv=DocValuesFormat(name=Asserting), number_p_f_ni_mv_dv=DocValuesFormat(name=Asserting), number_p_i_mv_dv_smf=DocValuesFormat(name=Asserting), foo_p_dt_ni_dv_ns_mv=DocValuesFormat(name=Lucene70), number_p_l_ni_mv_dv=DocValuesFormat(name=Direct), number_p_l_ni_dv_sml=DocValuesFormat(name=Lucene70), number_p_d_dv=DocValuesFormat(name=Asserting), number_p_i_ni_mv_dv_smf=DocValuesFormat(name=Direct), number_p_d_dv_ns=DocValuesFormat(name=Asserting), number_p_l_ni_dv_smf=DocValuesFormat(name=Lucene70), number_p_i_ni_mv_dv_sml=DocValuesFormat(name=Asserting), number_p_dt_dv_ns_mv=DocValuesFormat(name=Direct), number_p_l_dv=DocValuesFormat(name=Asserting), number_p_dt_mv_dv=DocValuesFormat(name=Asserting), number_p_l_mv_dv_smf=DocValuesFormat(name=Lucene70), number_p_d_ni_dv_ns=DocValuesFormat(name=Asserting), number_p_i_dv_ns_mv=DocValuesFormat(name=Lucene70), number_p_d_ni_dv_ns_mv=DocValuesFormat(name=Asserting), number_p_i_ni_dv_sml=DocValuesFormat(name=Asserting), number_p_i_ni_dv_smf=DocValuesFormat(name=Direct), number_p_l_mv_dv_sml=DocValuesFormat(name=Lucene70), number_p_f_dv_sml=DocValuesFormat(name=Lucene70), number_p_d_dv_sml=DocValuesFormat(name=Lucene70), number_p_i_ni_ns_dv=DocValuesFormat(name=Lucene70), number_p_f_ni_dv_ns=DocValuesFormat(name=Direct), number_p_f_ni_dv=DocValuesFormat(name=Direct), foo_p_dt_ni_dv_ns=DocValuesFormat(name=Lucene70), number_p_l_ni_mv_dv_smf=DocValuesFormat(name=Lucene70), number_p_dt_dv=DocValuesFormat(name=Direct), number_p_dt_ni_mv_dv_smf=DocValuesFormat(name=Lucene70), number_p_l_ni_mv_dv_sml=DocValuesFormat(name=Lucene70), number_p_f_ni_dv_sml=DocValuesFormat(name=Lucene70), number_p_d_ni_mv_dv=DocValuesFormat(name=Direct), number_p_d_dv_ns_mv=DocValuesFormat(name=Asserting), number_p_d_mv_dv=DocValuesFormat(name=Direct), number_p_i_dv=DocValuesFormat(name=Lucene70), number_p_f_mv_dv_sml=DocValuesFormat(name=Lucene70), number_p_i_mv_dv_sml=DocValuesFormat(name=Direct), number_p_f_ni_dv_smf=DocValuesFormat(name=Lucene70), number_p_dt_ni_dv_ns=DocValuesFormat(name=Direct), number_p_f_mv_dv_smf=DocValuesFormat(name=Lucene70), number_p_i_ni_dv=DocValuesFormat(name=Lucene70), number_p_f_dv_ns=DocValuesFormat(name=Direct)}, maxPointsInLeafNode=466, maxMBSortInHeap=5.39632151410669, sim=Asserting(org.apache.lucene.search.similarities.AssertingSimilarity@37be4fbf), locale=mk-MK, timezone=SystemV/AST4ADT
   [junit4]   2> NOTE: Linux 4.15.0-32-generic amd64/Oracle Corporation 11 (64-bit)/cpus=8,threads=1,free=365752400,total=534773760
   [junit4]   2> NOTE: All tests run in this JVM: [TestPointFields, TestPointFields]
   [junit4] Completed [5/5 (5!)] on J1 in 14.92s, 104 tests, 1 error <<< FAILURES!
   [junit4] 
   [junit4] 
   [junit4] Tests with failures [seed: E7AB050900E7AC47]:
   [junit4]   - org.apache.solr.schema.TestPointFields.testIntPointFieldSortAndFunction
   [junit4]   - org.apache.solr.schema.TestPointFields.testIntPointFieldSortAndFunction
   [junit4]   - org.apache.solr.schema.TestPointFields.testIntPointFieldSortAndFunction
   [junit4]   - org.apache.solr.schema.TestPointFields.testIntPointFieldSortAndFunction
   [junit4]   - org.apache.solr.schema.TestPointFields.testIntPointFieldSortAndFunction
   [junit4] 
   [junit4] 
   [junit4] JVM J0:     0.75 ..    57.79 =    57.04s
   [junit4] JVM J1:     0.57 ..    58.03 =    57.47s
   [junit4] JVM J2:     0.74 ..    43.18 =    42.44s
   [junit4] Execution time total: 58 seconds
   [junit4] Tests summary: 5 suites, 520 tests, 5 errors

BUILD FAILED
/home/jenkins/workspace/Lucene-Solr-master-Linux/lucene/common-build.xml:1567: The following error occurred while executing this line:
/home/jenkins/workspace/Lucene-Solr-master-Linux/lucene/common-build.xml:1092: There were test failures: 5 suites, 520 tests, 5 errors [seed: E7AB050900E7AC47]

Total time: 59 seconds

[repro] Setting last failure code to 256

[repro] Failures:
[repro]   2/5 failed: org.apache.solr.client.solrj.impl.CloudSolrClientTest
[repro]   5/5 failed: org.apache.solr.schema.TestPointFields
[repro] Exiting with code 256
+ mv lucene/build lucene/build.repro
+ mv solr/build solr/build.repro
+ mv lucene/build.orig lucene/build
+ mv solr/build.orig solr/build
Archiving artifacts
Setting ANT_1_8_2_HOME=/var/lib/jenkins/tools/hudson.tasks.Ant_AntInstallation/ANT_1.8.2
[WARNINGS] Parsing warnings in console log with parser Java Compiler (javac)
Setting ANT_1_8_2_HOME=/var/lib/jenkins/tools/hudson.tasks.Ant_AntInstallation/ANT_1.8.2
Setting ANT_1_8_2_HOME=/var/lib/jenkins/tools/hudson.tasks.Ant_AntInstallation/ANT_1.8.2
<Git Blamer> Using GitBlamer to create author and commit information for all warnings.
<Git Blamer> GIT_COMMIT=3ece536d812aff0e4c29b30ef8330c11cf1c967e, workspace=/var/lib/jenkins/workspace/Lucene-Solr-master-Linux
[WARNINGS] Computing warning deltas based on reference build #22952
Recording test results
Setting ANT_1_8_2_HOME=/var/lib/jenkins/tools/hudson.tasks.Ant_AntInstallation/ANT_1.8.2
Build step 'Publish JUnit test result report' changed build result to UNSTABLE
Email was triggered for: Unstable (Test Failures)
Sending email for trigger: Unstable (Test Failures)
Setting ANT_1_8_2_HOME=/var/lib/jenkins/tools/hudson.tasks.Ant_AntInstallation/ANT_1.8.2
Setting ANT_1_8_2_HOME=/var/lib/jenkins/tools/hudson.tasks.Ant_AntInstallation/ANT_1.8.2
Setting ANT_1_8_2_HOME=/var/lib/jenkins/tools/hudson.tasks.Ant_AntInstallation/ANT_1.8.2
Setting ANT_1_8_2_HOME=/var/lib/jenkins/tools/hudson.tasks.Ant_AntInstallation/ANT_1.8.2

Mime
View raw message