lucene-dev mailing list archives

Site index · List index
Message view « Date » · « Thread »
Top « Date » · « Thread »
From Policeman Jenkins Server <jenk...@thetaphi.de>
Subject [JENKINS] Lucene-Solr-master-Solaris (64bit/jdk1.8.0) - Build # 2118 - Unstable!
Date Mon, 22 Oct 2018 23:33:25 GMT
Build: https://jenkins.thetaphi.de/job/Lucene-Solr-master-Solaris/2118/
Java: 64bit/jdk1.8.0 -XX:+UseCompressedOops -XX:+UseConcMarkSweepGC

7 tests failed.
FAILED:  org.apache.solr.cloud.MoveReplicaTest.test

Error Message:


Stack Trace:
java.lang.AssertionError
	at __randomizedtesting.SeedInfo.seed([9BDEAA54A11634A5:138A958E0FEA595D]:0)
	at org.junit.Assert.fail(Assert.java:92)
	at org.junit.Assert.assertTrue(Assert.java:43)
	at org.junit.Assert.assertFalse(Assert.java:68)
	at org.junit.Assert.assertFalse(Assert.java:79)
	at org.apache.solr.cloud.MoveReplicaTest.test(MoveReplicaTest.java:148)
	at sun.reflect.NativeMethodAccessorImpl.invoke0(Native Method)
	at sun.reflect.NativeMethodAccessorImpl.invoke(NativeMethodAccessorImpl.java:62)
	at sun.reflect.DelegatingMethodAccessorImpl.invoke(DelegatingMethodAccessorImpl.java:43)
	at java.lang.reflect.Method.invoke(Method.java:498)
	at com.carrotsearch.randomizedtesting.RandomizedRunner.invoke(RandomizedRunner.java:1742)
	at com.carrotsearch.randomizedtesting.RandomizedRunner$8.evaluate(RandomizedRunner.java:935)
	at com.carrotsearch.randomizedtesting.RandomizedRunner$9.evaluate(RandomizedRunner.java:971)
	at com.carrotsearch.randomizedtesting.RandomizedRunner$10.evaluate(RandomizedRunner.java:985)
	at com.carrotsearch.randomizedtesting.rules.SystemPropertiesRestoreRule$1.evaluate(SystemPropertiesRestoreRule.java:57)
	at org.apache.lucene.util.TestRuleSetupTeardownChained$1.evaluate(TestRuleSetupTeardownChained.java:49)
	at org.apache.lucene.util.AbstractBeforeAfterRule$1.evaluate(AbstractBeforeAfterRule.java:45)
	at org.apache.lucene.util.TestRuleThreadAndTestName$1.evaluate(TestRuleThreadAndTestName.java:48)
	at org.apache.lucene.util.TestRuleIgnoreAfterMaxFailures$1.evaluate(TestRuleIgnoreAfterMaxFailures.java:64)
	at org.apache.lucene.util.TestRuleMarkFailure$1.evaluate(TestRuleMarkFailure.java:47)
	at com.carrotsearch.randomizedtesting.rules.StatementAdapter.evaluate(StatementAdapter.java:36)
	at com.carrotsearch.randomizedtesting.ThreadLeakControl$StatementRunner.run(ThreadLeakControl.java:368)
	at com.carrotsearch.randomizedtesting.ThreadLeakControl.forkTimeoutingTask(ThreadLeakControl.java:817)
	at com.carrotsearch.randomizedtesting.ThreadLeakControl$3.evaluate(ThreadLeakControl.java:468)
	at com.carrotsearch.randomizedtesting.RandomizedRunner.runSingleTest(RandomizedRunner.java:944)
	at com.carrotsearch.randomizedtesting.RandomizedRunner$5.evaluate(RandomizedRunner.java:830)
	at com.carrotsearch.randomizedtesting.RandomizedRunner$6.evaluate(RandomizedRunner.java:880)
	at com.carrotsearch.randomizedtesting.RandomizedRunner$7.evaluate(RandomizedRunner.java:891)
	at com.carrotsearch.randomizedtesting.rules.StatementAdapter.evaluate(StatementAdapter.java:36)
	at com.carrotsearch.randomizedtesting.rules.SystemPropertiesRestoreRule$1.evaluate(SystemPropertiesRestoreRule.java:57)
	at org.apache.lucene.util.AbstractBeforeAfterRule$1.evaluate(AbstractBeforeAfterRule.java:45)
	at com.carrotsearch.randomizedtesting.rules.StatementAdapter.evaluate(StatementAdapter.java:36)
	at org.apache.lucene.util.TestRuleStoreClassName$1.evaluate(TestRuleStoreClassName.java:41)
	at com.carrotsearch.randomizedtesting.rules.NoShadowingOrOverridesOnMethodsRule$1.evaluate(NoShadowingOrOverridesOnMethodsRule.java:40)
	at com.carrotsearch.randomizedtesting.rules.NoShadowingOrOverridesOnMethodsRule$1.evaluate(NoShadowingOrOverridesOnMethodsRule.java:40)
	at com.carrotsearch.randomizedtesting.rules.StatementAdapter.evaluate(StatementAdapter.java:36)
	at com.carrotsearch.randomizedtesting.rules.StatementAdapter.evaluate(StatementAdapter.java:36)
	at com.carrotsearch.randomizedtesting.rules.StatementAdapter.evaluate(StatementAdapter.java:36)
	at org.apache.lucene.util.TestRuleAssertionsRequired$1.evaluate(TestRuleAssertionsRequired.java:53)
	at org.apache.lucene.util.TestRuleMarkFailure$1.evaluate(TestRuleMarkFailure.java:47)
	at org.apache.lucene.util.TestRuleIgnoreAfterMaxFailures$1.evaluate(TestRuleIgnoreAfterMaxFailures.java:64)
	at org.apache.lucene.util.TestRuleIgnoreTestSuites$1.evaluate(TestRuleIgnoreTestSuites.java:54)
	at com.carrotsearch.randomizedtesting.rules.StatementAdapter.evaluate(StatementAdapter.java:36)
	at com.carrotsearch.randomizedtesting.ThreadLeakControl$StatementRunner.run(ThreadLeakControl.java:368)
	at java.lang.Thread.run(Thread.java:748)


FAILED:  org.apache.solr.cloud.autoscaling.SystemLogListenerTest.test

Error Message:
wrong number of events added to .system expected:<9> but was:<4>

Stack Trace:
java.lang.AssertionError: wrong number of events added to .system expected:<9> but was:<4>
	at __randomizedtesting.SeedInfo.seed([9BDEAA54A11634A5:138A958E0FEA595D]:0)
	at org.junit.Assert.fail(Assert.java:93)
	at org.junit.Assert.failNotEquals(Assert.java:647)
	at org.junit.Assert.assertEquals(Assert.java:128)
	at org.junit.Assert.assertEquals(Assert.java:472)
	at org.apache.solr.cloud.autoscaling.SystemLogListenerTest.test(SystemLogListenerTest.java:166)
	at sun.reflect.NativeMethodAccessorImpl.invoke0(Native Method)
	at sun.reflect.NativeMethodAccessorImpl.invoke(NativeMethodAccessorImpl.java:62)
	at sun.reflect.DelegatingMethodAccessorImpl.invoke(DelegatingMethodAccessorImpl.java:43)
	at java.lang.reflect.Method.invoke(Method.java:498)
	at com.carrotsearch.randomizedtesting.RandomizedRunner.invoke(RandomizedRunner.java:1742)
	at com.carrotsearch.randomizedtesting.RandomizedRunner$8.evaluate(RandomizedRunner.java:935)
	at com.carrotsearch.randomizedtesting.RandomizedRunner$9.evaluate(RandomizedRunner.java:971)
	at com.carrotsearch.randomizedtesting.RandomizedRunner$10.evaluate(RandomizedRunner.java:985)
	at com.carrotsearch.randomizedtesting.rules.SystemPropertiesRestoreRule$1.evaluate(SystemPropertiesRestoreRule.java:57)
	at org.apache.lucene.util.TestRuleSetupTeardownChained$1.evaluate(TestRuleSetupTeardownChained.java:49)
	at org.apache.lucene.util.AbstractBeforeAfterRule$1.evaluate(AbstractBeforeAfterRule.java:45)
	at org.apache.lucene.util.TestRuleThreadAndTestName$1.evaluate(TestRuleThreadAndTestName.java:48)
	at org.apache.lucene.util.TestRuleIgnoreAfterMaxFailures$1.evaluate(TestRuleIgnoreAfterMaxFailures.java:64)
	at org.apache.lucene.util.TestRuleMarkFailure$1.evaluate(TestRuleMarkFailure.java:47)
	at com.carrotsearch.randomizedtesting.rules.StatementAdapter.evaluate(StatementAdapter.java:36)
	at com.carrotsearch.randomizedtesting.ThreadLeakControl$StatementRunner.run(ThreadLeakControl.java:368)
	at com.carrotsearch.randomizedtesting.ThreadLeakControl.forkTimeoutingTask(ThreadLeakControl.java:817)
	at com.carrotsearch.randomizedtesting.ThreadLeakControl$3.evaluate(ThreadLeakControl.java:468)
	at com.carrotsearch.randomizedtesting.RandomizedRunner.runSingleTest(RandomizedRunner.java:944)
	at com.carrotsearch.randomizedtesting.RandomizedRunner$5.evaluate(RandomizedRunner.java:830)
	at com.carrotsearch.randomizedtesting.RandomizedRunner$6.evaluate(RandomizedRunner.java:880)
	at com.carrotsearch.randomizedtesting.RandomizedRunner$7.evaluate(RandomizedRunner.java:891)
	at com.carrotsearch.randomizedtesting.rules.StatementAdapter.evaluate(StatementAdapter.java:36)
	at com.carrotsearch.randomizedtesting.rules.SystemPropertiesRestoreRule$1.evaluate(SystemPropertiesRestoreRule.java:57)
	at org.apache.lucene.util.AbstractBeforeAfterRule$1.evaluate(AbstractBeforeAfterRule.java:45)
	at com.carrotsearch.randomizedtesting.rules.StatementAdapter.evaluate(StatementAdapter.java:36)
	at org.apache.lucene.util.TestRuleStoreClassName$1.evaluate(TestRuleStoreClassName.java:41)
	at com.carrotsearch.randomizedtesting.rules.NoShadowingOrOverridesOnMethodsRule$1.evaluate(NoShadowingOrOverridesOnMethodsRule.java:40)
	at com.carrotsearch.randomizedtesting.rules.NoShadowingOrOverridesOnMethodsRule$1.evaluate(NoShadowingOrOverridesOnMethodsRule.java:40)
	at com.carrotsearch.randomizedtesting.rules.StatementAdapter.evaluate(StatementAdapter.java:36)
	at com.carrotsearch.randomizedtesting.rules.StatementAdapter.evaluate(StatementAdapter.java:36)
	at com.carrotsearch.randomizedtesting.rules.StatementAdapter.evaluate(StatementAdapter.java:36)
	at org.apache.lucene.util.TestRuleAssertionsRequired$1.evaluate(TestRuleAssertionsRequired.java:53)
	at org.apache.lucene.util.TestRuleMarkFailure$1.evaluate(TestRuleMarkFailure.java:47)
	at org.apache.lucene.util.TestRuleIgnoreAfterMaxFailures$1.evaluate(TestRuleIgnoreAfterMaxFailures.java:64)
	at org.apache.lucene.util.TestRuleIgnoreTestSuites$1.evaluate(TestRuleIgnoreTestSuites.java:54)
	at com.carrotsearch.randomizedtesting.rules.StatementAdapter.evaluate(StatementAdapter.java:36)
	at com.carrotsearch.randomizedtesting.ThreadLeakControl$StatementRunner.run(ThreadLeakControl.java:368)
	at java.lang.Thread.run(Thread.java:748)


FAILED:  org.apache.solr.cloud.autoscaling.SystemLogListenerTest.test

Error Message:
wrong number of events added to .system expected:<9> but was:<4>

Stack Trace:
java.lang.AssertionError: wrong number of events added to .system expected:<9> but was:<4>
	at __randomizedtesting.SeedInfo.seed([9BDEAA54A11634A5:138A958E0FEA595D]:0)
	at org.junit.Assert.fail(Assert.java:93)
	at org.junit.Assert.failNotEquals(Assert.java:647)
	at org.junit.Assert.assertEquals(Assert.java:128)
	at org.junit.Assert.assertEquals(Assert.java:472)
	at org.apache.solr.cloud.autoscaling.SystemLogListenerTest.test(SystemLogListenerTest.java:166)
	at sun.reflect.NativeMethodAccessorImpl.invoke0(Native Method)
	at sun.reflect.NativeMethodAccessorImpl.invoke(NativeMethodAccessorImpl.java:62)
	at sun.reflect.DelegatingMethodAccessorImpl.invoke(DelegatingMethodAccessorImpl.java:43)
	at java.lang.reflect.Method.invoke(Method.java:498)
	at com.carrotsearch.randomizedtesting.RandomizedRunner.invoke(RandomizedRunner.java:1742)
	at com.carrotsearch.randomizedtesting.RandomizedRunner$8.evaluate(RandomizedRunner.java:935)
	at com.carrotsearch.randomizedtesting.RandomizedRunner$9.evaluate(RandomizedRunner.java:971)
	at com.carrotsearch.randomizedtesting.RandomizedRunner$10.evaluate(RandomizedRunner.java:985)
	at com.carrotsearch.randomizedtesting.rules.SystemPropertiesRestoreRule$1.evaluate(SystemPropertiesRestoreRule.java:57)
	at org.apache.lucene.util.TestRuleSetupTeardownChained$1.evaluate(TestRuleSetupTeardownChained.java:49)
	at org.apache.lucene.util.AbstractBeforeAfterRule$1.evaluate(AbstractBeforeAfterRule.java:45)
	at org.apache.lucene.util.TestRuleThreadAndTestName$1.evaluate(TestRuleThreadAndTestName.java:48)
	at org.apache.lucene.util.TestRuleIgnoreAfterMaxFailures$1.evaluate(TestRuleIgnoreAfterMaxFailures.java:64)
	at org.apache.lucene.util.TestRuleMarkFailure$1.evaluate(TestRuleMarkFailure.java:47)
	at com.carrotsearch.randomizedtesting.rules.StatementAdapter.evaluate(StatementAdapter.java:36)
	at com.carrotsearch.randomizedtesting.ThreadLeakControl$StatementRunner.run(ThreadLeakControl.java:368)
	at com.carrotsearch.randomizedtesting.ThreadLeakControl.forkTimeoutingTask(ThreadLeakControl.java:817)
	at com.carrotsearch.randomizedtesting.ThreadLeakControl$3.evaluate(ThreadLeakControl.java:468)
	at com.carrotsearch.randomizedtesting.RandomizedRunner.runSingleTest(RandomizedRunner.java:944)
	at com.carrotsearch.randomizedtesting.RandomizedRunner$5.evaluate(RandomizedRunner.java:830)
	at com.carrotsearch.randomizedtesting.RandomizedRunner$6.evaluate(RandomizedRunner.java:880)
	at com.carrotsearch.randomizedtesting.RandomizedRunner$7.evaluate(RandomizedRunner.java:891)
	at com.carrotsearch.randomizedtesting.rules.StatementAdapter.evaluate(StatementAdapter.java:36)
	at com.carrotsearch.randomizedtesting.rules.SystemPropertiesRestoreRule$1.evaluate(SystemPropertiesRestoreRule.java:57)
	at org.apache.lucene.util.AbstractBeforeAfterRule$1.evaluate(AbstractBeforeAfterRule.java:45)
	at com.carrotsearch.randomizedtesting.rules.StatementAdapter.evaluate(StatementAdapter.java:36)
	at org.apache.lucene.util.TestRuleStoreClassName$1.evaluate(TestRuleStoreClassName.java:41)
	at com.carrotsearch.randomizedtesting.rules.NoShadowingOrOverridesOnMethodsRule$1.evaluate(NoShadowingOrOverridesOnMethodsRule.java:40)
	at com.carrotsearch.randomizedtesting.rules.NoShadowingOrOverridesOnMethodsRule$1.evaluate(NoShadowingOrOverridesOnMethodsRule.java:40)
	at com.carrotsearch.randomizedtesting.rules.StatementAdapter.evaluate(StatementAdapter.java:36)
	at com.carrotsearch.randomizedtesting.rules.StatementAdapter.evaluate(StatementAdapter.java:36)
	at com.carrotsearch.randomizedtesting.rules.StatementAdapter.evaluate(StatementAdapter.java:36)
	at org.apache.lucene.util.TestRuleAssertionsRequired$1.evaluate(TestRuleAssertionsRequired.java:53)
	at org.apache.lucene.util.TestRuleMarkFailure$1.evaluate(TestRuleMarkFailure.java:47)
	at org.apache.lucene.util.TestRuleIgnoreAfterMaxFailures$1.evaluate(TestRuleIgnoreAfterMaxFailures.java:64)
	at org.apache.lucene.util.TestRuleIgnoreTestSuites$1.evaluate(TestRuleIgnoreTestSuites.java:54)
	at com.carrotsearch.randomizedtesting.rules.StatementAdapter.evaluate(StatementAdapter.java:36)
	at com.carrotsearch.randomizedtesting.ThreadLeakControl$StatementRunner.run(ThreadLeakControl.java:368)
	at java.lang.Thread.run(Thread.java:748)


FAILED:  org.apache.solr.cloud.autoscaling.SystemLogListenerTest.test

Error Message:
wrong number of events added to .system expected:<9> but was:<4>

Stack Trace:
java.lang.AssertionError: wrong number of events added to .system expected:<9> but was:<4>
	at __randomizedtesting.SeedInfo.seed([9BDEAA54A11634A5:138A958E0FEA595D]:0)
	at org.junit.Assert.fail(Assert.java:93)
	at org.junit.Assert.failNotEquals(Assert.java:647)
	at org.junit.Assert.assertEquals(Assert.java:128)
	at org.junit.Assert.assertEquals(Assert.java:472)
	at org.apache.solr.cloud.autoscaling.SystemLogListenerTest.test(SystemLogListenerTest.java:166)
	at sun.reflect.NativeMethodAccessorImpl.invoke0(Native Method)
	at sun.reflect.NativeMethodAccessorImpl.invoke(NativeMethodAccessorImpl.java:62)
	at sun.reflect.DelegatingMethodAccessorImpl.invoke(DelegatingMethodAccessorImpl.java:43)
	at java.lang.reflect.Method.invoke(Method.java:498)
	at com.carrotsearch.randomizedtesting.RandomizedRunner.invoke(RandomizedRunner.java:1742)
	at com.carrotsearch.randomizedtesting.RandomizedRunner$8.evaluate(RandomizedRunner.java:935)
	at com.carrotsearch.randomizedtesting.RandomizedRunner$9.evaluate(RandomizedRunner.java:971)
	at com.carrotsearch.randomizedtesting.RandomizedRunner$10.evaluate(RandomizedRunner.java:985)
	at com.carrotsearch.randomizedtesting.rules.SystemPropertiesRestoreRule$1.evaluate(SystemPropertiesRestoreRule.java:57)
	at org.apache.lucene.util.TestRuleSetupTeardownChained$1.evaluate(TestRuleSetupTeardownChained.java:49)
	at org.apache.lucene.util.AbstractBeforeAfterRule$1.evaluate(AbstractBeforeAfterRule.java:45)
	at org.apache.lucene.util.TestRuleThreadAndTestName$1.evaluate(TestRuleThreadAndTestName.java:48)
	at org.apache.lucene.util.TestRuleIgnoreAfterMaxFailures$1.evaluate(TestRuleIgnoreAfterMaxFailures.java:64)
	at org.apache.lucene.util.TestRuleMarkFailure$1.evaluate(TestRuleMarkFailure.java:47)
	at com.carrotsearch.randomizedtesting.rules.StatementAdapter.evaluate(StatementAdapter.java:36)
	at com.carrotsearch.randomizedtesting.ThreadLeakControl$StatementRunner.run(ThreadLeakControl.java:368)
	at com.carrotsearch.randomizedtesting.ThreadLeakControl.forkTimeoutingTask(ThreadLeakControl.java:817)
	at com.carrotsearch.randomizedtesting.ThreadLeakControl$3.evaluate(ThreadLeakControl.java:468)
	at com.carrotsearch.randomizedtesting.RandomizedRunner.runSingleTest(RandomizedRunner.java:944)
	at com.carrotsearch.randomizedtesting.RandomizedRunner$5.evaluate(RandomizedRunner.java:830)
	at com.carrotsearch.randomizedtesting.RandomizedRunner$6.evaluate(RandomizedRunner.java:880)
	at com.carrotsearch.randomizedtesting.RandomizedRunner$7.evaluate(RandomizedRunner.java:891)
	at com.carrotsearch.randomizedtesting.rules.StatementAdapter.evaluate(StatementAdapter.java:36)
	at com.carrotsearch.randomizedtesting.rules.SystemPropertiesRestoreRule$1.evaluate(SystemPropertiesRestoreRule.java:57)
	at org.apache.lucene.util.AbstractBeforeAfterRule$1.evaluate(AbstractBeforeAfterRule.java:45)
	at com.carrotsearch.randomizedtesting.rules.StatementAdapter.evaluate(StatementAdapter.java:36)
	at org.apache.lucene.util.TestRuleStoreClassName$1.evaluate(TestRuleStoreClassName.java:41)
	at com.carrotsearch.randomizedtesting.rules.NoShadowingOrOverridesOnMethodsRule$1.evaluate(NoShadowingOrOverridesOnMethodsRule.java:40)
	at com.carrotsearch.randomizedtesting.rules.NoShadowingOrOverridesOnMethodsRule$1.evaluate(NoShadowingOrOverridesOnMethodsRule.java:40)
	at com.carrotsearch.randomizedtesting.rules.StatementAdapter.evaluate(StatementAdapter.java:36)
	at com.carrotsearch.randomizedtesting.rules.StatementAdapter.evaluate(StatementAdapter.java:36)
	at com.carrotsearch.randomizedtesting.rules.StatementAdapter.evaluate(StatementAdapter.java:36)
	at org.apache.lucene.util.TestRuleAssertionsRequired$1.evaluate(TestRuleAssertionsRequired.java:53)
	at org.apache.lucene.util.TestRuleMarkFailure$1.evaluate(TestRuleMarkFailure.java:47)
	at org.apache.lucene.util.TestRuleIgnoreAfterMaxFailures$1.evaluate(TestRuleIgnoreAfterMaxFailures.java:64)
	at org.apache.lucene.util.TestRuleIgnoreTestSuites$1.evaluate(TestRuleIgnoreTestSuites.java:54)
	at com.carrotsearch.randomizedtesting.rules.StatementAdapter.evaluate(StatementAdapter.java:36)
	at com.carrotsearch.randomizedtesting.ThreadLeakControl$StatementRunner.run(ThreadLeakControl.java:368)
	at java.lang.Thread.run(Thread.java:748)


FAILED:  junit.framework.TestSuite.org.apache.solr.cloud.autoscaling.SystemLogListenerTest

Error Message:
java.util.concurrent.TimeoutException: Could not connect to ZooKeeper 127.0.0.1:59210 within 30000 ms

Stack Trace:
org.apache.solr.common.SolrException: java.util.concurrent.TimeoutException: Could not connect to ZooKeeper 127.0.0.1:59210 within 30000 ms
	at __randomizedtesting.SeedInfo.seed([9BDEAA54A11634A5]:0)
	at org.apache.solr.common.cloud.SolrZkClient.<init>(SolrZkClient.java:184)
	at org.apache.solr.common.cloud.SolrZkClient.<init>(SolrZkClient.java:121)
	at org.apache.solr.common.cloud.SolrZkClient.<init>(SolrZkClient.java:116)
	at org.apache.solr.common.cloud.SolrZkClient.<init>(SolrZkClient.java:103)
	at org.apache.solr.cloud.MiniSolrCloudCluster.<init>(MiniSolrCloudCluster.java:233)
	at org.apache.solr.cloud.SolrCloudTestCase$Builder.build(SolrCloudTestCase.java:200)
	at org.apache.solr.cloud.SolrCloudTestCase$Builder.configure(SolrCloudTestCase.java:192)
	at org.apache.solr.cloud.autoscaling.SystemLogListenerTest.setupCluster(SystemLogListenerTest.java:82)
	at sun.reflect.NativeMethodAccessorImpl.invoke0(Native Method)
	at sun.reflect.NativeMethodAccessorImpl.invoke(NativeMethodAccessorImpl.java:62)
	at sun.reflect.DelegatingMethodAccessorImpl.invoke(DelegatingMethodAccessorImpl.java:43)
	at java.lang.reflect.Method.invoke(Method.java:498)
	at com.carrotsearch.randomizedtesting.RandomizedRunner.invoke(RandomizedRunner.java:1742)
	at com.carrotsearch.randomizedtesting.RandomizedRunner$6.evaluate(RandomizedRunner.java:875)
	at com.carrotsearch.randomizedtesting.RandomizedRunner$7.evaluate(RandomizedRunner.java:891)
	at com.carrotsearch.randomizedtesting.rules.StatementAdapter.evaluate(StatementAdapter.java:36)
	at com.carrotsearch.randomizedtesting.rules.SystemPropertiesRestoreRule$1.evaluate(SystemPropertiesRestoreRule.java:57)
	at org.apache.lucene.util.AbstractBeforeAfterRule$1.evaluate(AbstractBeforeAfterRule.java:45)
	at com.carrotsearch.randomizedtesting.rules.StatementAdapter.evaluate(StatementAdapter.java:36)
	at org.apache.lucene.util.TestRuleStoreClassName$1.evaluate(TestRuleStoreClassName.java:41)
	at com.carrotsearch.randomizedtesting.rules.NoShadowingOrOverridesOnMethodsRule$1.evaluate(NoShadowingOrOverridesOnMethodsRule.java:40)
	at com.carrotsearch.randomizedtesting.rules.NoShadowingOrOverridesOnMethodsRule$1.evaluate(NoShadowingOrOverridesOnMethodsRule.java:40)
	at com.carrotsearch.randomizedtesting.rules.StatementAdapter.evaluate(StatementAdapter.java:36)
	at com.carrotsearch.randomizedtesting.rules.StatementAdapter.evaluate(StatementAdapter.java:36)
	at com.carrotsearch.randomizedtesting.rules.StatementAdapter.evaluate(StatementAdapter.java:36)
	at org.apache.lucene.util.TestRuleAssertionsRequired$1.evaluate(TestRuleAssertionsRequired.java:53)
	at org.apache.lucene.util.TestRuleMarkFailure$1.evaluate(TestRuleMarkFailure.java:47)
	at org.apache.lucene.util.TestRuleIgnoreAfterMaxFailures$1.evaluate(TestRuleIgnoreAfterMaxFailures.java:64)
	at org.apache.lucene.util.TestRuleIgnoreTestSuites$1.evaluate(TestRuleIgnoreTestSuites.java:54)
	at com.carrotsearch.randomizedtesting.rules.StatementAdapter.evaluate(StatementAdapter.java:36)
	at com.carrotsearch.randomizedtesting.ThreadLeakControl$StatementRunner.run(ThreadLeakControl.java:368)
	at java.lang.Thread.run(Thread.java:748)
Caused by: java.util.concurrent.TimeoutException: Could not connect to ZooKeeper 127.0.0.1:59210 within 30000 ms
	at org.apache.solr.common.cloud.ConnectionManager.waitForConnected(ConnectionManager.java:232)
	at org.apache.solr.common.cloud.SolrZkClient.<init>(SolrZkClient.java:176)
	... 31 more


FAILED:  junit.framework.TestSuite.org.apache.solr.cloud.autoscaling.SystemLogListenerTest

Error Message:
4 threads leaked from SUITE scope at org.apache.solr.cloud.autoscaling.SystemLogListenerTest:     1) Thread[id=36867, name=NIOServerCxn.Factory:0.0.0.0/0.0.0.0:0, state=RUNNABLE, group=TGRP-SystemLogListenerTest]         at sun.nio.ch.DevPollArrayWrapper.poll0(Native Method)         at sun.nio.ch.DevPollArrayWrapper.poll(DevPollArrayWrapper.java:223)         at sun.nio.ch.DevPollSelectorImpl.doSelect(DevPollSelectorImpl.java:98)         at sun.nio.ch.SelectorImpl.lockAndDoSelect(SelectorImpl.java:86)         at sun.nio.ch.SelectorImpl.select(SelectorImpl.java:97)         at org.apache.zookeeper.server.NIOServerCnxnFactory.run(NIOServerCnxnFactory.java:196)         at java.lang.Thread.run(Thread.java:748)    2) Thread[id=36868, name=SessionTracker, state=TIMED_WAITING, group=TGRP-SystemLogListenerTest]         at java.lang.Object.wait(Native Method)         at org.apache.zookeeper.server.SessionTrackerImpl.run(SessionTrackerImpl.java:147)    3) Thread[id=36866, name=Thread-7817, state=WAITING, group=TGRP-SystemLogListenerTest]         at java.lang.Object.wait(Native Method)         at java.lang.Thread.join(Thread.java:1252)         at java.lang.Thread.join(Thread.java:1326)         at org.apache.zookeeper.server.NIOServerCnxnFactory.join(NIOServerCnxnFactory.java:313)         at org.apache.solr.cloud.ZkTestServer$ZKServerMain.runFromConfig(ZkTestServer.java:313)         at org.apache.solr.cloud.ZkTestServer$2.run(ZkTestServer.java:496)    4) Thread[id=36870, name=ProcessThread(sid:0 cport:59210):, state=WAITING, group=TGRP-SystemLogListenerTest]         at sun.misc.Unsafe.park(Native Method)         at java.util.concurrent.locks.LockSupport.park(LockSupport.java:175)         at java.util.concurrent.locks.AbstractQueuedSynchronizer$ConditionObject.await(AbstractQueuedSynchronizer.java:2039)         at java.util.concurrent.LinkedBlockingQueue.take(LinkedBlockingQueue.java:442)         at org.apache.zookeeper.server.PrepRequestProcessor.run(PrepRequestProcessor.java:123)

Stack Trace:
com.carrotsearch.randomizedtesting.ThreadLeakError: 4 threads leaked from SUITE scope at org.apache.solr.cloud.autoscaling.SystemLogListenerTest: 
   1) Thread[id=36867, name=NIOServerCxn.Factory:0.0.0.0/0.0.0.0:0, state=RUNNABLE, group=TGRP-SystemLogListenerTest]
        at sun.nio.ch.DevPollArrayWrapper.poll0(Native Method)
        at sun.nio.ch.DevPollArrayWrapper.poll(DevPollArrayWrapper.java:223)
        at sun.nio.ch.DevPollSelectorImpl.doSelect(DevPollSelectorImpl.java:98)
        at sun.nio.ch.SelectorImpl.lockAndDoSelect(SelectorImpl.java:86)
        at sun.nio.ch.SelectorImpl.select(SelectorImpl.java:97)
        at org.apache.zookeeper.server.NIOServerCnxnFactory.run(NIOServerCnxnFactory.java:196)
        at java.lang.Thread.run(Thread.java:748)
   2) Thread[id=36868, name=SessionTracker, state=TIMED_WAITING, group=TGRP-SystemLogListenerTest]
        at java.lang.Object.wait(Native Method)
        at org.apache.zookeeper.server.SessionTrackerImpl.run(SessionTrackerImpl.java:147)
   3) Thread[id=36866, name=Thread-7817, state=WAITING, group=TGRP-SystemLogListenerTest]
        at java.lang.Object.wait(Native Method)
        at java.lang.Thread.join(Thread.java:1252)
        at java.lang.Thread.join(Thread.java:1326)
        at org.apache.zookeeper.server.NIOServerCnxnFactory.join(NIOServerCnxnFactory.java:313)
        at org.apache.solr.cloud.ZkTestServer$ZKServerMain.runFromConfig(ZkTestServer.java:313)
        at org.apache.solr.cloud.ZkTestServer$2.run(ZkTestServer.java:496)
   4) Thread[id=36870, name=ProcessThread(sid:0 cport:59210):, state=WAITING, group=TGRP-SystemLogListenerTest]
        at sun.misc.Unsafe.park(Native Method)
        at java.util.concurrent.locks.LockSupport.park(LockSupport.java:175)
        at java.util.concurrent.locks.AbstractQueuedSynchronizer$ConditionObject.await(AbstractQueuedSynchronizer.java:2039)
        at java.util.concurrent.LinkedBlockingQueue.take(LinkedBlockingQueue.java:442)
        at org.apache.zookeeper.server.PrepRequestProcessor.run(PrepRequestProcessor.java:123)
	at __randomizedtesting.SeedInfo.seed([9BDEAA54A11634A5]:0)


FAILED:  junit.framework.TestSuite.org.apache.solr.cloud.autoscaling.SystemLogListenerTest

Error Message:
There are still zombie threads that couldn't be terminated:    1) Thread[id=36867, name=NIOServerCxn.Factory:0.0.0.0/0.0.0.0:0, state=RUNNABLE, group=TGRP-SystemLogListenerTest]         at sun.nio.ch.DevPollArrayWrapper.interrupt(Native Method)         at sun.nio.ch.DevPollArrayWrapper.interrupt(DevPollArrayWrapper.java:300)         at sun.nio.ch.DevPollSelectorImpl.wakeup(DevPollSelectorImpl.java:207)         at java.nio.channels.spi.AbstractSelector$1.interrupt(AbstractSelector.java:213)         at java.nio.channels.spi.AbstractSelector.begin(AbstractSelector.java:219)         at sun.nio.ch.DevPollSelectorImpl.doSelect(DevPollSelectorImpl.java:97)         at sun.nio.ch.SelectorImpl.lockAndDoSelect(SelectorImpl.java:86)         at sun.nio.ch.SelectorImpl.select(SelectorImpl.java:97)         at org.apache.zookeeper.server.NIOServerCnxnFactory.run(NIOServerCnxnFactory.java:196)         at java.lang.Thread.run(Thread.java:748)

Stack Trace:
com.carrotsearch.randomizedtesting.ThreadLeakError: There are still zombie threads that couldn't be terminated:
   1) Thread[id=36867, name=NIOServerCxn.Factory:0.0.0.0/0.0.0.0:0, state=RUNNABLE, group=TGRP-SystemLogListenerTest]
        at sun.nio.ch.DevPollArrayWrapper.interrupt(Native Method)
        at sun.nio.ch.DevPollArrayWrapper.interrupt(DevPollArrayWrapper.java:300)
        at sun.nio.ch.DevPollSelectorImpl.wakeup(DevPollSelectorImpl.java:207)
        at java.nio.channels.spi.AbstractSelector$1.interrupt(AbstractSelector.java:213)
        at java.nio.channels.spi.AbstractSelector.begin(AbstractSelector.java:219)
        at sun.nio.ch.DevPollSelectorImpl.doSelect(DevPollSelectorImpl.java:97)
        at sun.nio.ch.SelectorImpl.lockAndDoSelect(SelectorImpl.java:86)
        at sun.nio.ch.SelectorImpl.select(SelectorImpl.java:97)
        at org.apache.zookeeper.server.NIOServerCnxnFactory.run(NIOServerCnxnFactory.java:196)
        at java.lang.Thread.run(Thread.java:748)
	at __randomizedtesting.SeedInfo.seed([9BDEAA54A11634A5]:0)




Build Log:
[...truncated 13736 lines...]
   [junit4] Suite: org.apache.solr.cloud.MoveReplicaTest
   [junit4]   2> 1845470 INFO  (SUITE-MoveReplicaTest-seed#[9BDEAA54A11634A5]-worker) [    ] o.a.s.SolrTestCaseJ4 SecureRandom sanity checks: test.solr.allowed.securerandom=null & java.security.egd=file:/dev/./urandom
   [junit4]   2> Creating dataDir: /export/home/jenkins/workspace/Lucene-Solr-master-Solaris/solr/build/solr-core/test/J0/temp/solr.cloud.MoveReplicaTest_9BDEAA54A11634A5-001/init-core-data-001
   [junit4]   2> 1845471 WARN  (SUITE-MoveReplicaTest-seed#[9BDEAA54A11634A5]-worker) [    ] o.a.s.SolrTestCaseJ4 startTrackingSearchers: numOpens=2 numCloses=2
   [junit4]   2> 1845471 INFO  (SUITE-MoveReplicaTest-seed#[9BDEAA54A11634A5]-worker) [    ] o.a.s.SolrTestCaseJ4 Using PointFields (NUMERIC_POINTS_SYSPROP=true) w/NUMERIC_DOCVALUES_SYSPROP=false
   [junit4]   2> 1845472 INFO  (SUITE-MoveReplicaTest-seed#[9BDEAA54A11634A5]-worker) [    ] o.a.s.SolrTestCaseJ4 Randomized ssl (false) and clientAuth (false) via: @org.apache.solr.util.RandomizeSSL(reason=, value=NaN, ssl=NaN, clientAuth=NaN)
   [junit4]   2> 1845472 INFO  (SUITE-MoveReplicaTest-seed#[9BDEAA54A11634A5]-worker) [    ] o.a.s.c.MiniSolrCloudCluster Starting cluster of 4 servers in /export/home/jenkins/workspace/Lucene-Solr-master-Solaris/solr/build/solr-core/test/J0/temp/solr.cloud.MoveReplicaTest_9BDEAA54A11634A5-001/tempDir-001
   [junit4]   2> 1845472 INFO  (SUITE-MoveReplicaTest-seed#[9BDEAA54A11634A5]-worker) [    ] o.a.s.c.ZkTestServer STARTING ZK TEST SERVER
   [junit4]   2> 1845472 INFO  (Thread-3130) [    ] o.a.s.c.ZkTestServer client port:0.0.0.0/0.0.0.0:0
   [junit4]   2> 1845472 INFO  (Thread-3130) [    ] o.a.s.c.ZkTestServer Starting server
   [junit4]   2> 1845478 ERROR (Thread-3130) [    ] o.a.z.s.ZooKeeperServer ZKShutdownHandler is not registered, so ZooKeeper server won't take any action on ERROR or SHUTDOWN server state changes
   [junit4]   2> 1845573 INFO  (SUITE-MoveReplicaTest-seed#[9BDEAA54A11634A5]-worker) [    ] o.a.s.c.ZkTestServer start zk server on port:63044
   [junit4]   2> 1845588 INFO  (zkConnectionManagerCallback-6843-thread-1) [    ] o.a.s.c.c.ConnectionManager zkClient has connected
   [junit4]   2> 1845600 INFO  (jetty-launcher-6840-thread-1) [    ] o.e.j.s.Server jetty-9.4.11.v20180605; built: 2018-06-05T18:24:03.829Z; git: d5fc0523cfa96bfebfbda19606cad384d772f04c; jvm 1.8.0_172-b11
   [junit4]   2> 1845600 INFO  (jetty-launcher-6840-thread-2) [    ] o.e.j.s.Server jetty-9.4.11.v20180605; built: 2018-06-05T18:24:03.829Z; git: d5fc0523cfa96bfebfbda19606cad384d772f04c; jvm 1.8.0_172-b11
   [junit4]   2> 1845600 INFO  (jetty-launcher-6840-thread-3) [    ] o.e.j.s.Server jetty-9.4.11.v20180605; built: 2018-06-05T18:24:03.829Z; git: d5fc0523cfa96bfebfbda19606cad384d772f04c; jvm 1.8.0_172-b11
   [junit4]   2> 1845602 INFO  (jetty-launcher-6840-thread-3) [    ] o.e.j.s.session DefaultSessionIdManager workerName=node0
   [junit4]   2> 1845602 INFO  (jetty-launcher-6840-thread-3) [    ] o.e.j.s.session No SessionScavenger set, using defaults
   [junit4]   2> 1845602 INFO  (jetty-launcher-6840-thread-3) [    ] o.e.j.s.session node0 Scavenging every 660000ms
   [junit4]   2> 1845603 INFO  (jetty-launcher-6840-thread-1) [    ] o.e.j.s.session DefaultSessionIdManager workerName=node0
   [junit4]   2> 1845603 INFO  (jetty-launcher-6840-thread-1) [    ] o.e.j.s.session No SessionScavenger set, using defaults
   [junit4]   2> 1845603 INFO  (jetty-launcher-6840-thread-1) [    ] o.e.j.s.session node0 Scavenging every 600000ms
   [junit4]   2> 1845609 INFO  (jetty-launcher-6840-thread-4) [    ] o.e.j.s.Server jetty-9.4.11.v20180605; built: 2018-06-05T18:24:03.829Z; git: d5fc0523cfa96bfebfbda19606cad384d772f04c; jvm 1.8.0_172-b11
   [junit4]   2> 1845609 INFO  (jetty-launcher-6840-thread-3) [    ] o.e.j.s.h.ContextHandler Started o.e.j.s.ServletContextHandler@4d035e2{/solr,null,AVAILABLE}
   [junit4]   2> 1845609 INFO  (jetty-launcher-6840-thread-3) [    ] o.e.j.s.AbstractConnector Started ServerConnector@12c737eb{HTTP/1.1,[http/1.1]}{127.0.0.1:64169}
   [junit4]   2> 1845609 INFO  (jetty-launcher-6840-thread-3) [    ] o.e.j.s.Server Started @1847090ms
   [junit4]   2> 1845609 INFO  (jetty-launcher-6840-thread-3) [    ] o.a.s.c.s.e.JettySolrRunner Jetty properties: {hostContext=/solr, hostPort=64169}
   [junit4]   2> 1845610 ERROR (jetty-launcher-6840-thread-3) [    ] o.a.s.u.StartupLoggingUtils Missing Java Option solr.log.dir. Logging may be missing or incomplete.
   [junit4]   2> 1845612 INFO  (jetty-launcher-6840-thread-3) [    ] o.a.s.s.SolrDispatchFilter Using logger factory org.apache.logging.slf4j.Log4jLoggerFactory
   [junit4]   2> 1845612 INFO  (jetty-launcher-6840-thread-3) [    ] o.a.s.s.SolrDispatchFilter  ___      _       Welcome to Apache Solr? version 8.0.0
   [junit4]   2> 1845612 INFO  (jetty-launcher-6840-thread-3) [    ] o.a.s.s.SolrDispatchFilter / __| ___| |_ _   Starting in cloud mode on port null
   [junit4]   2> 1845612 INFO  (jetty-launcher-6840-thread-3) [    ] o.a.s.s.SolrDispatchFilter \__ \/ _ \ | '_|  Install dir: null
   [junit4]   2> 1845612 INFO  (jetty-launcher-6840-thread-3) [    ] o.a.s.s.SolrDispatchFilter |___/\___/_|_|    Start time: 2018-10-22T22:20:00.500Z
   [junit4]   2> 1845613 INFO  (jetty-launcher-6840-thread-1) [    ] o.e.j.s.h.ContextHandler Started o.e.j.s.ServletContextHandler@1abcc742{/solr,null,AVAILABLE}
   [junit4]   2> 1845613 INFO  (jetty-launcher-6840-thread-2) [    ] o.e.j.s.session DefaultSessionIdManager workerName=node0
   [junit4]   2> 1845613 INFO  (jetty-launcher-6840-thread-2) [    ] o.e.j.s.session No SessionScavenger set, using defaults
   [junit4]   2> 1845614 INFO  (jetty-launcher-6840-thread-2) [    ] o.e.j.s.session node0 Scavenging every 600000ms
   [junit4]   2> 1845614 INFO  (jetty-launcher-6840-thread-2) [    ] o.e.j.s.h.ContextHandler Started o.e.j.s.ServletContextHandler@2fcb4c89{/solr,null,AVAILABLE}
   [junit4]   2> 1845614 INFO  (jetty-launcher-6840-thread-2) [    ] o.e.j.s.AbstractConnector Started ServerConnector@11828d60{HTTP/1.1,[http/1.1]}{127.0.0.1:64321}
   [junit4]   2> 1845614 INFO  (jetty-launcher-6840-thread-2) [    ] o.e.j.s.Server Started @1847094ms
   [junit4]   2> 1845614 INFO  (jetty-launcher-6840-thread-2) [    ] o.a.s.c.s.e.JettySolrRunner Jetty properties: {hostContext=/solr, hostPort=64321}
   [junit4]   2> 1845614 INFO  (zkConnectionManagerCallback-6845-thread-1) [    ] o.a.s.c.c.ConnectionManager zkClient has connected
   [junit4]   2> 1845614 ERROR (jetty-launcher-6840-thread-2) [    ] o.a.s.u.StartupLoggingUtils Missing Java Option solr.log.dir. Logging may be missing or incomplete.
   [junit4]   2> 1845614 INFO  (jetty-launcher-6840-thread-2) [    ] o.a.s.s.SolrDispatchFilter Using logger factory org.apache.logging.slf4j.Log4jLoggerFactory
   [junit4]   2> 1845614 INFO  (jetty-launcher-6840-thread-2) [    ] o.a.s.s.SolrDispatchFilter  ___      _       Welcome to Apache Solr? version 8.0.0
   [junit4]   2> 1845614 INFO  (jetty-launcher-6840-thread-2) [    ] o.a.s.s.SolrDispatchFilter / __| ___| |_ _   Starting in cloud mode on port null
   [junit4]   2> 1845614 INFO  (jetty-launcher-6840-thread-2) [    ] o.a.s.s.SolrDispatchFilter \__ \/ _ \ | '_|  Install dir: null
   [junit4]   2> 1845614 INFO  (jetty-launcher-6840-thread-2) [    ] o.a.s.s.SolrDispatchFilter |___/\___/_|_|    Start time: 2018-10-22T22:20:00.502Z
   [junit4]   2> 1845614 INFO  (jetty-launcher-6840-thread-3) [    ] o.a.s.s.SolrDispatchFilter solr.xml found in ZooKeeper. Loading...
   [junit4]   2> 1845616 INFO  (jetty-launcher-6840-thread-4) [    ] o.e.j.s.session DefaultSessionIdManager workerName=node0
   [junit4]   2> 1845616 INFO  (jetty-launcher-6840-thread-4) [    ] o.e.j.s.session No SessionScavenger set, using defaults
   [junit4]   2> 1845616 INFO  (jetty-launcher-6840-thread-4) [    ] o.e.j.s.session node0 Scavenging every 660000ms
   [junit4]   2> 1845616 INFO  (jetty-launcher-6840-thread-4) [    ] o.e.j.s.h.ContextHandler Started o.e.j.s.ServletContextHandler@316e091a{/solr,null,AVAILABLE}
   [junit4]   2> 1845616 INFO  (jetty-launcher-6840-thread-4) [    ] o.e.j.s.AbstractConnector Started ServerConnector@3a7a0bb4{HTTP/1.1,[http/1.1]}{127.0.0.1:42730}
   [junit4]   2> 1845616 INFO  (jetty-launcher-6840-thread-4) [    ] o.e.j.s.Server Started @1847097ms
   [junit4]   2> 1845616 INFO  (jetty-launcher-6840-thread-4) [    ] o.a.s.c.s.e.JettySolrRunner Jetty properties: {hostContext=/solr, hostPort=42730}
   [junit4]   2> 1845617 ERROR (jetty-launcher-6840-thread-4) [    ] o.a.s.u.StartupLoggingUtils Missing Java Option solr.log.dir. Logging may be missing or incomplete.
   [junit4]   2> 1845617 INFO  (jetty-launcher-6840-thread-4) [    ] o.a.s.s.SolrDispatchFilter Using logger factory org.apache.logging.slf4j.Log4jLoggerFactory
   [junit4]   2> 1845617 INFO  (jetty-launcher-6840-thread-4) [    ] o.a.s.s.SolrDispatchFilter  ___      _       Welcome to Apache Solr? version 8.0.0
   [junit4]   2> 1845617 INFO  (jetty-launcher-6840-thread-4) [    ] o.a.s.s.SolrDispatchFilter / __| ___| |_ _   Starting in cloud mode on port null
   [junit4]   2> 1845617 INFO  (jetty-launcher-6840-thread-4) [    ] o.a.s.s.SolrDispatchFilter \__ \/ _ \ | '_|  Install dir: null
   [junit4]   2> 1845617 INFO  (jetty-launcher-6840-thread-4) [    ] o.a.s.s.SolrDispatchFilter |___/\___/_|_|    Start time: 2018-10-22T22:20:00.505Z
   [junit4]   2> 1845620 INFO  (zkConnectionManagerCallback-6847-thread-1) [    ] o.a.s.c.c.ConnectionManager zkClient has connected
   [junit4]   2> 1845621 INFO  (jetty-launcher-6840-thread-2) [    ] o.a.s.s.SolrDispatchFilter solr.xml found in ZooKeeper. Loading...
   [junit4]   2> 1845635 INFO  (jetty-launcher-6840-thread-1) [    ] o.e.j.s.AbstractConnector Started ServerConnector@2ee528c8{HTTP/1.1,[http/1.1]}{127.0.0.1:41166}
   [junit4]   2> 1845635 INFO  (jetty-launcher-6840-thread-1) [    ] o.e.j.s.Server Started @1847116ms
   [junit4]   2> 1845635 INFO  (jetty-launcher-6840-thread-1) [    ] o.a.s.c.s.e.JettySolrRunner Jetty properties: {hostContext=/solr, hostPort=41166}
   [junit4]   2> 1845635 ERROR (jetty-launcher-6840-thread-1) [    ] o.a.s.u.StartupLoggingUtils Missing Java Option solr.log.dir. Logging may be missing or incomplete.
   [junit4]   2> 1845635 INFO  (jetty-launcher-6840-thread-1) [    ] o.a.s.s.SolrDispatchFilter Using logger factory org.apache.logging.slf4j.Log4jLoggerFactory
   [junit4]   2> 1845635 INFO  (jetty-launcher-6840-thread-1) [    ] o.a.s.s.SolrDispatchFilter  ___      _       Welcome to Apache Solr? version 8.0.0
   [junit4]   2> 1845635 INFO  (jetty-launcher-6840-thread-1) [    ] o.a.s.s.SolrDispatchFilter / __| ___| |_ _   Starting in cloud mode on port null
   [junit4]   2> 1845635 INFO  (jetty-launcher-6840-thread-1) [    ] o.a.s.s.SolrDispatchFilter \__ \/ _ \ | '_|  Install dir: null
   [junit4]   2> 1845635 INFO  (jetty-launcher-6840-thread-1) [    ] o.a.s.s.SolrDispatchFilter |___/\___/_|_|    Start time: 2018-10-22T22:20:00.523Z
   [junit4]   2> 1845636 INFO  (zkConnectionManagerCallback-6849-thread-1) [    ] o.a.s.c.c.ConnectionManager zkClient has connected
   [junit4]   2> 1845637 INFO  (jetty-launcher-6840-thread-4) [    ] o.a.s.s.SolrDispatchFilter solr.xml found in ZooKeeper. Loading...
   [junit4]   2> 1845639 INFO  (zkConnectionManagerCallback-6851-thread-1) [    ] o.a.s.c.c.ConnectionManager zkClient has connected
   [junit4]   2> 1845640 INFO  (jetty-launcher-6840-thread-1) [    ] o.a.s.s.SolrDispatchFilter solr.xml found in ZooKeeper. Loading...
   [junit4]   2> 1845989 INFO  (jetty-launcher-6840-thread-3) [    ] o.a.s.c.ZkContainer Zookeeper client=127.0.0.1:63044/solr
   [junit4]   2> 1846001 INFO  (zkConnectionManagerCallback-6855-thread-1) [    ] o.a.s.c.c.ConnectionManager zkClient has connected
   [junit4]   2> 1846010 DEBUG (jetty-launcher-6840-thread-3) [n:127.0.0.1:64169_solr    ] o.a.s.c.ZkController Added new OnReconnect listener org.apache.solr.cloud.ZkController$$Lambda$368/1043976828@24a03d3d
   [junit4]   2> 1846050 INFO  (zkConnectionManagerCallback-6857-thread-1) [    ] o.a.s.c.c.ConnectionManager zkClient has connected
   [junit4]   2> 1846109 INFO  (jetty-launcher-6840-thread-1) [    ] o.a.s.c.ZkContainer Zookeeper client=127.0.0.1:63044/solr
   [junit4]   2> 1846132 INFO  (zkConnectionManagerCallback-6863-thread-1) [    ] o.a.s.c.c.ConnectionManager zkClient has connected
   [junit4]   2> 1846144 DEBUG (jetty-launcher-6840-thread-1) [n:127.0.0.1:41166_solr    ] o.a.s.c.ZkController Added new OnReconnect listener org.apache.solr.cloud.ZkController$$Lambda$368/1043976828@44e81241
   [junit4]   2> 1846148 INFO  (zkConnectionManagerCallback-6865-thread-1) [    ] o.a.s.c.c.ConnectionManager zkClient has connected
   [junit4]   2> 1846166 DEBUG (SyncThread:0) [    ] o.a.s.c.ZkTestServer Watch added: create/delete: /solr/clusterprops.json
   [junit4]   2> 1846166 DEBUG (SyncThread:0) [    ] o.a.s.c.ZkTestServer Watch added: children: /solr/live_nodes
   [junit4]   2> 1846167 DEBUG (SyncThread:0) [    ] o.a.s.c.ZkTestServer Watch added: data: /solr/clusterstate.json
   [junit4]   2> 1846167 DEBUG (SyncThread:0) [    ] o.a.s.c.ZkTestServer Watch added: children: /solr/collections
   [junit4]   2> 1846167 DEBUG (SyncThread:0) [    ] o.a.s.c.ZkTestServer Watch added: create/delete: /solr/aliases.json
   [junit4]   2> 1846168 DEBUG (SyncThread:0) [    ] o.a.s.c.ZkTestServer Watch added: create/delete: /solr/security.json
   [junit4]   2> 1846171 DEBUG (SyncThread:0) [    ] o.a.s.c.ZkTestServer Watch added: create/delete: /solr/clusterprops.json
   [junit4]   2> 1846172 DEBUG (SyncThread:0) [    ] o.a.s.c.ZkTestServer Watch added: children: /solr/live_nodes
   [junit4]   2> 1846172 DEBUG (jetty-launcher-6840-thread-3) [n:127.0.0.1:64169_solr    ] o.a.s.c.LeaderElector Joined leadership election with path: /overseer_elect/election/72142325660188678-127.0.0.1:64169_solr-n_0000000000
   [junit4]   2> 1846172 INFO  (jetty-launcher-6840-thread-3) [n:127.0.0.1:64169_solr    ] o.a.s.c.OverseerElectionContext I am going to be the leader 127.0.0.1:64169_solr
   [junit4]   2> 1846173 DEBUG (SyncThread:0) [    ] o.a.s.c.ZkTestServer Watch added: data: /solr/clusterstate.json
   [junit4]   2> 1846173 INFO  (jetty-launcher-6840-thread-3) [n:127.0.0.1:64169_solr    ] o.a.s.c.Overseer Overseer (id=72142325660188678-127.0.0.1:64169_solr-n_0000000000) starting
   [junit4]   2> 1846174 DEBUG (SyncThread:0) [    ] o.a.s.c.ZkTestServer Watch added: children: /solr/collections
   [junit4]   2> 1846175 DEBUG (SyncThread:0) [    ] o.a.s.c.ZkTestServer Watch added: create/delete: /solr/aliases.json
   [junit4]   2> 1846176 INFO  (jetty-launcher-6840-thread-4) [    ] o.a.s.c.ZkContainer Zookeeper client=127.0.0.1:63044/solr
   [junit4]   2> 1846177 DEBUG (SyncThread:0) [    ] o.a.s.c.ZkTestServer Watch added: create/delete: /solr/security.json
   [junit4]   2> 1846178 INFO  (zkConnectionManagerCallback-6871-thread-1) [    ] o.a.s.c.c.ConnectionManager zkClient has connected
   [junit4]   2> 1846180 DEBUG (jetty-launcher-6840-thread-1) [n:127.0.0.1:41166_solr    ] o.a.s.c.LeaderElector Joined leadership election with path: /overseer_elect/election/72142325660188680-127.0.0.1:41166_solr-n_0000000001
   [junit4]   2> 1846180 DEBUG (SyncThread:0) [    ] o.a.s.c.ZkTestServer Watch added: data: /solr/overseer_elect/election/72142325660188678-127.0.0.1:64169_solr-n_0000000000
   [junit4]   2> 1846180 DEBUG (jetty-launcher-6840-thread-1) [n:127.0.0.1:41166_solr    ] o.a.s.c.LeaderElector Watching path /overseer_elect/election/72142325660188678-127.0.0.1:64169_solr-n_0000000000 to know if I could be the leader
   [junit4]   2> 1846181 INFO  (jetty-launcher-6840-thread-1) [n:127.0.0.1:41166_solr    ] o.a.s.c.ZkController Register node as live in ZooKeeper:/live_nodes/127.0.0.1:41166_solr
   [junit4]   2> 1846181 DEBUG (SyncThread:0) [    ] o.a.s.c.ZkTestServer Watch fired: children: /solr/live_nodes
   [junit4]   2> 1846181 DEBUG (SyncThread:0) [    ] o.a.s.c.ZkTestServer Watch fired: children: /solr/live_nodes
   [junit4]   2> 1846182 DEBUG (SyncThread:0) [    ] o.a.s.c.ZkTestServer Watch added: children: /solr/live_nodes
   [junit4]   2> 1846185 INFO  (zkCallback-6856-thread-1) [    ] o.a.s.c.c.ZkStateReader Updated live nodes from ZooKeeper... (0) -> (1)
   [junit4]   2> 1846186 DEBUG (SyncThread:0) [    ] o.a.s.c.ZkTestServer Watch added: children: /solr/live_nodes
   [junit4]   2> 1846189 INFO  (zkCallback-6864-thread-1) [    ] o.a.s.c.c.ZkStateReader Updated live nodes from ZooKeeper... (0) -> (1)
   [junit4]   2> 1846190 DEBUG (jetty-launcher-6840-thread-4) [n:127.0.0.1:42730_solr    ] o.a.s.c.ZkController Added new OnReconnect listener org.apache.solr.cloud.ZkController$$Lambda$368/1043976828@1cfd1b84
   [junit4]   2> 1846190 INFO  (zkConnectionManagerCallback-6876-thread-1) [    ] o.a.s.c.c.ConnectionManager zkClient has connected
   [junit4]   2> 1846191 DEBUG (SyncThread:0) [    ] o.a.s.c.ZkTestServer Watch added: create/delete: /solr/clusterprops.json
   [junit4]   2> 1846191 DEBUG (SyncThread:0) [    ] o.a.s.c.ZkTestServer Watch added: children: /solr/live_nodes
   [junit4]   2> 1846191 INFO  (jetty-launcher-6840-thread-3) [n:127.0.0.1:64169_solr    ] o.a.s.c.c.ZkStateReader Updated live nodes from ZooKeeper... (0) -> (1)
   [junit4]   2> 1846191 DEBUG (SyncThread:0) [    ] o.a.s.c.ZkTestServer Watch added: data: /solr/clusterstate.json
   [junit4]   2> 1846192 DEBUG (SyncThread:0) [    ] o.a.s.c.ZkTestServer Watch added: children: /solr/collections
   [junit4]   2> 1846192 DEBUG (SyncThread:0) [    ] o.a.s.c.ZkTestServer Watch added: create/delete: /solr/aliases.json
   [junit4]   2> 1846192 INFO  (jetty-launcher-6840-thread-3) [n:127.0.0.1:64169_solr    ] o.a.s.c.s.i.ZkClientClusterStateProvider Cluster at 127.0.0.1:63044/solr ready
   [junit4]   2> 1846192 INFO  (zkConnectionManagerCallback-6878-thread-1) [    ] o.a.s.c.c.ConnectionManager zkClient has connected
   [junit4]   2> 1846193 DEBUG (OverseerCollectionConfigSetProcessor-72142325660188678-127.0.0.1:64169_solr-n_0000000000) [n:127.0.0.1:64169_solr    ] o.a.s.c.OverseerTaskProcessor Process current queue of overseer operations
   [junit4]   2> 1846194 INFO  (OverseerStateUpdate-72142325660188678-127.0.0.1:64169_solr-n_0000000000) [n:127.0.0.1:64169_solr    ] o.a.s.c.Overseer Starting to work on the main queue : 127.0.0.1:64169_solr
   [junit4]   2> 1846194 DEBUG (jetty-launcher-6840-thread-3) [n:127.0.0.1:64169_solr    ] o.a.s.c.ZkController Publish node=127.0.0.1:64169_solr as DOWN
   [junit4]   2> 1846195 DEBUG (OverseerCollectionConfigSetProcessor-72142325660188678-127.0.0.1:64169_solr-n_0000000000) [n:127.0.0.1:64169_solr    ] o.a.s.c.OverseerTaskProcessor Cleaning up work-queue. #Running tasks: 0
   [junit4]   2> 1846195 DEBUG (OverseerCollectionConfigSetProcessor-72142325660188678-127.0.0.1:64169_solr-n_0000000000) [n:127.0.0.1:64169_solr    ] o.a.s.c.OverseerTaskProcessor RunningTasks: []
   [junit4]   2> 1846195 DEBUG (OverseerCollectionConfigSetProcessor-72142325660188678-127.0.0.1:64169_solr-n_0000000000) [n:127.0.0.1:64169_solr    ] o.a.s.c.OverseerTaskProcessor BlockedTasks: []
   [junit4]   2> 1846195 INFO  (jetty-launcher-6840-thread-3) [n:127.0.0.1:64169_solr    ] o.a.s.c.TransientSolrCoreCacheDefault Allocating transient cache for 2147483647 transient cores
   [junit4]   2> 1846195 DEBUG (OverseerCollectionConfigSetProcessor-72142325660188678-127.0.0.1:64169_solr-n_0000000000) [n:127.0.0.1:64169_solr    ] o.a.s.c.OverseerTaskProcessor CompletedTasks: []
   [junit4]   2> 1846195 INFO  (jetty-launcher-6840-thread-3) [n:127.0.0.1:64169_solr    ] o.a.s.c.ZkController Register node as live in ZooKeeper:/live_nodes/127.0.0.1:64169_solr
   [junit4]   2> 1846195 DEBUG (OverseerCollectionConfigSetProcessor-72142325660188678-127.0.0.1:64169_solr-n_0000000000) [n:127.0.0.1:64169_solr    ] o.a.s.c.OverseerTaskProcessor RunningZKTasks: []
   [junit4]   2> 1846195 DEBUG (OverseerCollectionConfigSetProcessor-72142325660188678-127.0.0.1:64169_solr-n_0000000000) [n:127.0.0.1:64169_solr    ] o.a.s.c.OverseerTaskQueue Peeking for top 100 elements. ExcludeSet: []
   [junit4]   2> 1846196 DEBUG (SyncThread:0) [    ] o.a.s.c.ZkTestServer Watch fired: children: /solr/live_nodes
   [junit4]   2> 1846196 DEBUG (SyncThread:0) [    ] o.a.s.c.ZkTestServer Watch fired: children: /solr/live_nodes
   [junit4]   2> 1846196 DEBUG (SyncThread:0) [    ] o.a.s.c.ZkTestServer Watch fired: children: /solr/live_nodes
   [junit4]   2> 1846196 DEBUG (SyncThread:0) [    ] o.a.s.c.ZkTestServer Watch added: children: /solr/overseer/collection-queue-work
   [junit4]   2> 1846199 DEBUG (OverseerAutoScalingTriggerThread-72142325660188678-127.0.0.1:64169_solr-n_0000000000) [    ] o.a.s.c.a.OverseerTriggerThread Adding .auto_add_replicas and .scheduled_maintenance triggers
   [junit4]   2> 1846206 DEBUG (SyncThread:0) [    ] o.a.s.c.ZkTestServer Watch added: children: /solr/live_nodes
   [junit4]   2> 1846209 INFO  (zkCallback-6875-thread-1) [    ] o.a.s.c.c.ZkStateReader Updated live nodes from ZooKeeper... (1) -> (2)
   [junit4]   2> 1846209 DEBUG (SyncThread:0) [    ] o.a.s.c.ZkTestServer Watch added: children: /solr/overseer/queue-work
   [junit4]   2> 1846210 DEBUG (SyncThread:0) [    ] o.a.s.c.ZkTestServer Watch added: children: /solr/live_nodes
   [junit4]   2> 1846210 DEBUG (SyncThread:0) [    ] o.a.s.c.ZkTestServer Watch added: data: /solr/autoscaling.json
   [junit4]   2> 1846210 DEBUG (OverseerAutoScalingTriggerThread-72142325660188678-127.0.0.1:64169_solr-n_0000000000) [    ] o.a.s.c.a.OverseerTriggerThread Refreshing /autoscaling.json with znode version 1
   [junit4]   2> 1846210 DEBUG (OverseerAutoScalingTriggerThread-72142325660188678-127.0.0.1:64169_solr-n_0000000000) [    ] o.a.s.c.a.OverseerTriggerThread Current znodeVersion 1, lastZnodeVersion -1
   [junit4]   2> 1846210 DEBUG (OverseerAutoScalingTriggerThread-72142325660188678-127.0.0.1:64169_solr-n_0000000000) [    ] o.a.s.c.a.OverseerTriggerThread Processed trigger updates upto znodeVersion 1
   [junit4]   2> 1846210 INFO  (zkCallback-6856-thread-1) [    ] o.a.s.c.c.ZkStateReader Updated live nodes from ZooKeeper... (1) -> (2)
   [junit4]   2> 1846211 DEBUG (SyncThread:0) [    ] o.a.s.c.ZkTestServer Watch added: children: /solr/live_nodes
   [junit4]   2> 1846214 DEBUG (SyncThread:0) [    ] o.a.s.c.ZkTestServer Watch added: children: /solr/overseer/queue
   [junit4]   2> 1846217 DEBUG (SyncThread:0) [    ] o.a.s.c.ZkTestServer Watch added: children: /solr/autoscaling/events/.scheduled_maintenance
   [junit4]   2> 1846219 DEBUG (OverseerAutoScalingTriggerThread-72142325660188678-127.0.0.1:64169_solr-n_0000000000) [    ] o.a.s.c.a.NodeLostTrigger NodeLostTrigger .auto_add_replicas - Initial livenodes: [127.0.0.1:64169_solr, 127.0.0.1:41166_solr]
   [junit4]   2> 1846219 DEBUG (OverseerAutoScalingTriggerThread-72142325660188678-127.0.0.1:64169_solr-n_0000000000) [    ] o.a.s.c.a.OverseerTriggerThread -- clean old nodeAdded markers
   [junit4]   2> 1846220 DEBUG (SyncThread:0) [    ] o.a.s.c.ZkTestServer Watch added: children: /solr/autoscaling/events/.auto_add_replicas
   [junit4]   2> 1846220 DEBUG (OverseerAutoScalingTriggerThread-72142325660188678-127.0.0.1:64169_solr-n_0000000000) [    ] o.a.s.c.a.OverseerTriggerThread Current znodeVersion 1, lastZnodeVersion 1
   [junit4]   2> 1846220 DEBUG (ScheduledTrigger-6601-thread-1) [    ] o.a.s.c.a.NodeLostTrigger Running NodeLostTrigger: .auto_add_replicas with currently live nodes: 2
   [junit4]   2> 1846221 INFO  (zkCallback-6864-thread-1) [    ] o.a.s.c.c.ZkStateReader Updated live nodes from ZooKeeper... (1) -> (2)
   [junit4]   2> 1846222 INFO  (jetty-launcher-6840-thread-3) [n:127.0.0.1:64169_solr    ] o.a.s.h.a.MetricsHistoryHandler No .system collection, keeping metrics history in memory.
   [junit4]   2> 1846229 DEBUG (SyncThread:0) [    ] o.a.s.c.ZkTestServer Watch added: create/delete: /solr/clusterprops.json
   [junit4]   2> 1846229 DEBUG (SyncThread:0) [    ] o.a.s.c.ZkTestServer Watch added: children: /solr/live_nodes
   [junit4]   2> 1846230 INFO  (jetty-launcher-6840-thread-4) [n:127.0.0.1:42730_solr    ] o.a.s.c.c.ZkStateReader Updated live nodes from ZooKeeper... (0) -> (2)
   [junit4]   2> 1846230 DEBUG (SyncThread:0) [    ] o.a.s.c.ZkTestServer Watch added: data: /solr/clusterstate.json
   [junit4]   2> 1846230 DEBUG (SyncThread:0) [    ] o.a.s.c.ZkTestServer Watch added: children: /solr/collections
   [junit4]   2> 1846230 DEBUG (SyncThread:0) [    ] o.a.s.c.ZkTestServer Watch added: create/delete: /solr/aliases.json
   [junit4]   2> 1846233 DEBUG (SyncThread:0) [    ] o.a.s.c.ZkTestServer Watch added: create/delete: /solr/security.json
   [junit4]   2> 1846234 DEBUG (jetty-launcher-6840-thread-4) [n:127.0.0.1:42730_solr    ] o.a.s.c.LeaderElector Joined leadership election with path: /overseer_elect/election/72142325660188683-127.0.0.1:42730_solr-n_0000000002
   [junit4]   2> 1846234 DEBUG (SyncThread:0) [    ] o.a.s.c.ZkTestServer Watch added: data: /solr/overseer_elect/election/72142325660188680-127.0.0.1:41166_solr-n_0000000001
   [junit4]   2> 1846234 DEBUG (jetty-launcher-6840-thread-4) [n:127.0.0.1:42730_solr    ] o.a.s.c.LeaderElector Watching path /overseer_elect/election/72142325660188680-127.0.0.1:41166_solr-n_0000000001 to know if I could be the leader
   [junit4]   2> 1846235 DEBUG (jetty-launcher-6840-thread-4) [n:127.0.0.1:42730_solr    ] o.a.s.c.ZkController Publish node=127.0.0.1:42730_solr as DOWN
   [junit4]   2> 1846236 DEBUG (SyncThread:0) [    ] o.a.s.c.ZkTestServer Watch fired: children: /solr/overseer/queue
   [junit4]   2> 1846236 INFO  (jetty-launcher-6840-thread-4) [n:127.0.0.1:42730_solr    ] o.a.s.c.TransientSolrCoreCacheDefault Allocating transient cache for 2147483647 transient cores
   [junit4]   2> 1846236 INFO  (jetty-launcher-6840-thread-4) [n:127.0.0.1:42730_solr    ] o.a.s.c.ZkController Register node as live in ZooKeeper:/live_nodes/127.0.0.1:42730_solr
   [junit4]   2> 1846236 DEBUG (SyncThread:0) [    ] o.a.s.c.ZkTestServer Watch fired: children: /solr/live_nodes
   [junit4]   2> 1846236 DEBUG (SyncThread:0) [    ] o.a.s.c.ZkTestServer Watch fired: children: /solr/live_nodes
   [junit4]   2> 1846236 DEBUG (SyncThread:0) [    ] o.a.s.c.ZkTestServer Watch fired: children: /solr/live_nodes
   [junit4]   2> 1846236 DEBUG (SyncThread:0) [    ] o.a.s.c.ZkTestServer Watch fired: children: /solr/live_nodes
   [junit4]   2> 1846237 DEBUG (SyncThread:0) [    ] o.a.s.c.ZkTestServer Watch added: children: /solr/live_nodes
   [junit4]   2> 1846237 INFO  (zkCallback-6856-thread-1) [    ] o.a.s.c.c.ZkStateReader Updated live nodes from ZooKeeper... (2) -> (3)
   [junit4]   2> 1846250 INFO  (zkConnectionManagerCallback-6883-thread-1) [    ] o.a.s.c.c.ConnectionManager zkClient has connected
   [junit4]   2> 1846251 DEBUG (SyncThread:0) [    ] o.a.s.c.ZkTestServer Watch added: children: /solr/live_nodes
   [junit4]   2> 1846251 INFO  (zkCallback-6864-thread-1) [    ] o.a.s.c.c.ZkStateReader Updated live nodes from ZooKeeper... (2) -> (3)
   [junit4]   2> 1846251 DEBUG (SyncThread:0) [    ] o.a.s.c.ZkTestServer Watch added: create/delete: /solr/clusterprops.json
   [junit4]   2> 1846252 DEBUG (SyncThread:0) [    ] o.a.s.c.ZkTestServer Watch added: children: /solr/live_nodes
   [junit4]   2> 1846252 INFO  (jetty-launcher-6840-thread-1) [n:127.0.0.1:41166_solr    ] o.a.s.c.c.ZkStateReader Updated live nodes from ZooKeeper... (0) -> (3)
   [junit4]   2> 1846252 DEBUG (SyncThread:0) [    ] o.a.s.c.ZkTestServer Watch added: data: /solr/clusterstate.json
   [junit4]   2> 1846252 DEBUG (SyncThread:0) [    ] o.a.s.c.ZkTestServer Watch added: children: /solr/collections
   [junit4]   2> 1846252 DEBUG (SyncThread:0) [    ] o.a.s.c.ZkTestServer Watch added: create/delete: /solr/aliases.json
   [junit4]   2> 1846253 INFO  (jetty-launcher-6840-thread-1) [n:127.0.0.1:41166_solr    ] o.a.s.c.s.i.ZkClientClusterStateProvider Cluster at 127.0.0.1:63044/solr ready
   [junit4]   2> 1846253 INFO  (jetty-launcher-6840-thread-1) [n:127.0.0.1:41166_solr    ] o.a.s.h.a.MetricsHistoryHandler No .system collection, keeping metrics history in memory.
   [junit4]   2> 1846256 INFO  (jetty-launcher-6840-thread-3) [n:127.0.0.1:64169_solr    ] o.a.s.m.r.SolrJmxReporter JMX monitoring for 'solr_64169.solr.node' (registry 'solr.node') enabled at server: com.sun.jmx.mbeanserver.JmxMBeanServer@7c8277c3
   [junit4]   2> 1846270 DEBUG (SyncThread:0) [    ] o.a.s.c.ZkTestServer Watch added: children: /solr/live_nodes
   [junit4]   2> 1846276 INFO  (jetty-launcher-6840-thread-3) [n:127.0.0.1:64169_solr    ] o.a.s.m.r.SolrJmxReporter JMX monitoring for 'solr_64169.solr.jvm' (registry 'solr.jvm') enabled at server: com.sun.jmx.mbeanserver.JmxMBeanServer@7c8277c3
   [junit4]   2> 1846276 INFO  (jetty-launcher-6840-thread-3) [n:127.0.0.1:64169_solr    ] o.a.s.m.r.SolrJmxReporter JMX monitoring for 'solr_64169.solr.jetty' (registry 'solr.jetty') enabled at server: com.sun.jmx.mbeanserver.JmxMBeanServer@7c8277c3
   [junit4]   2> 1846277 INFO  (jetty-launcher-6840-thread-3) [n:127.0.0.1:64169_solr    ] o.a.s.c.CorePropertiesLocator Found 0 core definitions underneath /export/home/jenkins/workspace/Lucene-Solr-master-Solaris/solr/build/solr-core/test/J0/temp/solr.cloud.MoveReplicaTest_9BDEAA54A11634A5-001/tempDir-001/node3/.
   [junit4]   2> 1846280 DEBUG (SyncThread:0) [    ] o.a.s.c.ZkTestServer Watch added: children: /solr/live_nodes
   [junit4]   2> 1846280 DEBUG (SyncThread:0) [    ] o.a.s.c.ZkTestServer Watch added: children: /solr/overseer/queue
   [junit4]   2> 1846280 INFO  (zkCallback-6875-thread-1) [    ] o.a.s.c.c.ZkStateReader Updated live nodes from ZooKeeper... (2) -> (3)
   [junit4]   2> 1846292 INFO  (zkConnectionManagerCallback-6892-thread-1) [    ] o.a.s.c.c.ConnectionManager zkClient has connected
   [junit4]   2> 1846303 DEBUG (SyncThread:0) [    ] o.a.s.c.ZkTestServer Watch added: create/delete: /solr/clusterprops.json
   [junit4]   2> 1846303 DEBUG (SyncThread:0) [    ] o.a.s.c.ZkTestServer Watch added: children: /solr/live_nodes
   [junit4]   2> 1846303 INFO  (jetty-launcher-6840-thread-4) [n:127.0.0.1:42730_solr    ] o.a.s.c.c.ZkStateReader Updated live nodes from ZooKeeper... (0) -> (3)
   [junit4]   2> 1846303 DEBUG (SyncThread:0) [    ] o.a.s.c.ZkTestServer Watch added: data: /solr/clusterstate.json
   [junit4]   2> 1846304 DEBUG (SyncThread:0) [    ] o.a.s.c.ZkTestServer Watch added: children: /solr/collections
   [junit4]   2> 1846304 DEBUG (SyncThread:0) [    ] o.a.s.c.ZkTestServer Watch added: create/delete: /solr/aliases.json
   [junit4]   2> 1846313 INFO  (jetty-launcher-6840-thread-1) [n:127.0.0.1:41166_solr    ] o.a.s.m.r.SolrJmxReporter JMX monitoring for 'solr_41166.solr.node' (registry 'solr.node') enabled at server: com.sun.jmx.mbeanserver.JmxMBeanServer@7c8277c3
   [junit4]   2> 1846313 INFO  (zkCallback-6877-thread-1) [    ] o.a.s.c.c.ZkStateReader Updated live nodes from ZooKeeper... (2) -> (3)
   [junit4]   2> 1846314 INFO  (jetty-launcher-6840-thread-4) [n:127.0.0.1:42730_solr    ] o.a.s.c.s.i.ZkClientClusterStateProvider Cluster at 127.0.0.1:63044/solr ready
   [junit4]   2> 1846314 INFO  (jetty-launcher-6840-thread-4) [n:127.0.0.1:42730_solr    ] o.a.s.h.a.MetricsHistoryHandler No .system collection, keeping metrics history in memory.
   [junit4]   2> 1846327 INFO  (jetty-launcher-6840-thread-1) [n:127.0.0.1:41166_solr    ] o.a.s.m.r.SolrJmxReporter JMX monitoring for 'solr_41166.solr.jvm' (registry 'solr.jvm') enabled at server: com.sun.jmx.mbeanserver.JmxMBeanServer@7c8277c3
   [junit4]   2> 1846327 INFO  (jetty-launcher-6840-thread-1) [n:127.0.0.1:41166_solr    ] o.a.s.m.r.SolrJmxReporter JMX monitoring for 'solr_41166.solr.jetty' (registry 'solr.jetty') enabled at server: com.sun.jmx.mbeanserver.JmxMBeanServer@7c8277c3
   [junit4]   2> 1846327 INFO  (jetty-launcher-6840-thread-1) [n:127.0.0.1:41166_solr    ] o.a.s.c.CorePropertiesLocator Found 0 core definitions underneath /export/home/jenkins/workspace/Lucene-Solr-master-Solaris/solr/build/solr-core/test/J0/temp/solr.cloud.MoveReplicaTest_9BDEAA54A11634A5-001/tempDir-001/node1/.
   [junit4]   2> 1846334 INFO  (jetty-launcher-6840-thread-4) [n:127.0.0.1:42730_solr    ] o.a.s.m.r.SolrJmxReporter JMX monitoring for 'solr_42730.solr.node' (registry 'solr.node') enabled at server: com.sun.jmx.mbeanserver.JmxMBeanServer@7c8277c3
   [junit4]   2> 1846339 INFO  (jetty-launcher-6840-thread-4) [n:127.0.0.1:42730_solr    ] o.a.s.m.r.SolrJmxReporter JMX monitoring for 'solr_42730.solr.jvm' (registry 'solr.jvm') enabled at server: com.sun.jmx.mbeanserver.JmxMBeanServer@7c8277c3
   [junit4]   2> 1846339 INFO  (jetty-launcher-6840-thread-4) [n:127.0.0.1:42730_solr    ] o.a.s.m.r.SolrJmxReporter JMX monitoring for 'solr_42730.solr.jetty' (registry 'solr.jetty') enabled at server: com.sun.jmx.mbeanserver.JmxMBeanServer@7c8277c3
   [junit4]   2> 1846340 INFO  (jetty-launcher-6840-thread-4) [n:127.0.0.1:42730_solr    ] o.a.s.c.CorePropertiesLocator Found 0 core definitions underneath /export/home/jenkins/workspace/Lucene-Solr-master-Solaris/solr/build/solr-core/test/J0/temp/solr.cloud.MoveReplicaTest_9BDEAA54A11634A5-001/tempDir-001/node4/.
   [junit4]   2> 1846394 DEBUG (SyncThread:0) [    ] o.a.s.c.ZkTestServer Watch fired: children: /solr/overseer/queue
   [junit4]   2> 1846395 DEBUG (SyncThread:0) [    ] o.a.s.c.ZkTestServer Watch added: children: /solr/overseer/queue
   [junit4]   2> 1846988 INFO  (jetty-launcher-6840-thread-2) [    ] o.a.s.c.ZkContainer Zookeeper client=127.0.0.1:63044/solr
   [junit4]   2> 1846990 INFO  (zkConnectionManagerCallback-6897-thread-1) [    ] o.a.s.c.c.ConnectionManager zkClient has connected
   [junit4]   2> 1846992 DEBUG (jetty-launcher-6840-thread-2) [n:127.0.0.1:64321_solr    ] o.a.s.c.ZkController Added new OnReconnect listener org.apache.solr.cloud.ZkController$$Lambda$368/1043976828@57692cc2
   [junit4]   2> 1846994 INFO  (zkConnectionManagerCallback-6899-thread-1) [    ] o.a.s.c.c.ConnectionManager zkClient has connected
   [junit4]   2> 1847008 DEBUG (SyncThread:0) [    ] o.a.s.c.ZkTestServer Watch added: create/delete: /solr/clusterprops.json
   [junit4]   2> 1847008 DEBUG (SyncThread:0) [    ] o.a.s.c.ZkTestServer Watch added: children: /solr/live_nodes
   [junit4]   2> 1847009 INFO  (jetty-launcher-6840-thread-2) [n:127.0.0.1:64321_solr    ] o.a.s.c.c.ZkStateReader Updated live nodes from ZooKeeper... (0) -> (3)
   [junit4]   2> 1847009 DEBUG (SyncThread:0) [    ] o.a.s.c.ZkTestServer Watch added: data: /solr/clusterstate.json
   [junit4]   2> 1847009 DEBUG (SyncThread:0) [    ] o.a.s.c.ZkTestServer Watch added: children: /solr/collections
   [junit4]   2> 1847010 DEBUG (SyncThread:0) [    ] o.a.s.c.ZkTestServer Watch added: create/delete: /solr/aliases.json
   [junit4]   2> 1847010 DEBUG (SyncThread:0) [    ] o.a.s.c.ZkTestServer Watch added: create/delete: /solr/security.json
   [junit4]   2> 1847013 DEBUG (jetty-launcher-6840-thread-2) [n:127.0.0.1:64321_solr    ] o.a.s.c.LeaderElector Joined leadership election with path: /overseer_elect/election/72142325660188687-127.0.0.1:64321_solr-n_0000000003
   [junit4]   2> 1847014 DEBUG (SyncThread:0) [    ] o.a.s.c.ZkTestServer Watch added: data: /solr/overseer_elect/election/72142325660188683-127.0.0.1:42730_solr-n_0000000002
   [junit4]   2> 1847014 DEBUG (jetty-launcher-6840-thread-2) [n:127.0.0.1:64321_solr    ] o.a.s.c.LeaderElector Watching path /overseer_elect/election/72142325660188683-127.0.0.1:42730_solr-n_0000000002 to know if I could be the leader
   [junit4]   2> 1847014 DEBUG (jetty-launcher-6840-thread-2) [n:127.0.0.1:64321_solr    ] o.a.s.c.ZkController Publish node=127.0.0.1:64321_solr as DOWN
   [junit4]   2> 1847015 DEBUG (SyncThread:0) [    ] o.a.s.c.ZkTestServer Watch fired: children: /solr/overseer/queue
   [junit4]   2> 1847016 INFO  (jetty-launcher-6840-thread-2) [n:127.0.0.1:64321_solr    ] o.a.s.c.TransientSolrCoreCacheDefault Allocating transient cache for 2147483647 transient cores
   [junit4]   2> 1847016 INFO  (jetty-launcher-6840-thread-2) [n:127.0.0.1:64321_solr    ] o.a.s.c.ZkController Register node as live in ZooKeeper:/live_nodes/127.0.0.1:64321_solr
   [junit4]   2> 1847016 DEBUG (SyncThread:0) [    ] o.a.s.c.ZkTestServer Watch added: children: /solr/overseer/queue
   [junit4]   2> 1847017 DEBUG (SyncThread:0) [    ] o.a.s.c.ZkTestServer Watch fired: children: /solr/live_nodes
   [junit4]   2> 1847017 DEBUG (SyncThread:0) [    ] o.a.s.c.ZkTestServer Watch fired: children: /solr/live_nodes
   [junit4]   2> 1847017 DEBUG (SyncThread:0) [    ] o.a.s.c.ZkTestServer Watch fired: children: /solr/live_nodes
   [junit4]   2> 1847017 DEBUG (SyncThread:0) [    ] o.a.s.c.ZkTestServer Watch fired: children: /solr/live_nodes
   [junit4]   2> 1847017 DEBUG (SyncThread:0) [    ] o.a.s.c.ZkTestServer Watch fired: children: /solr/live_nodes
   [junit4]   2> 1847017 DEBUG (SyncThread:0) [    ] o.a.s.c.ZkTestServer Watch fired: children: /solr/live_nodes
   [junit4]   2> 1847017 DEBUG (SyncThread:0) [    ] o.a.s.c.ZkTestServer Watch fired: children: /solr/live_nodes
   [junit4]   2> 1847017 DEBUG (SyncThread:0) [    ] o.a.s.c.ZkTestServer Watch added: children: /solr/live_nodes
   [junit4]   2> 1847017 INFO  (zkCallback-6875-thread-1) [    ] o.a.s.c.c.ZkStateReader Updated live nodes from ZooKeeper... (3) -> (4)
   [junit4]   2> 1847017 DEBUG (SyncThread:0) [    ] o.a.s.c.ZkTestServer Watch added: children: /solr/live_nodes
   [junit4]   2> 1847017 DEBUG (SyncThread:0) [    ] o.a.s.c.ZkTestServer Watch added: children: /solr/live_nodes
   [junit4]   2> 1847017 INFO  (zkCallback-6856-thread-1) [    ] o.a.s.c.c.ZkStateReader Updated live nodes from ZooKeeper... (3) -> (4)
   [junit4]   2> 1847017 INFO  (zkCallback-6864-thread-1) [    ] o.a.s.c.c.ZkStateReader Updated live nodes from ZooKeeper... (3) -> (4)
   [junit4]   2> 1847018 DEBUG (SyncThread:0) [    ] o.a.s.c.ZkTestServer Watch added: children: /solr/live_nodes
   [junit4]   2> 1847018 DEBUG (SyncThread:0) [    ] o.a.s.c.ZkTestServer Watch added: children: /solr/live_nodes
   [junit4]   2> 1847018 INFO  (zkCallback-6877-thread-1) [    ] o.a.s.c.c.ZkStateReader Updated live nodes from ZooKeeper... (3) -> (4)
   [junit4]   2> 1847018 DEBUG (SyncThread:0) [    ] o.a.s.c.ZkTestServer Watch added: children: /solr/live_nodes
   [junit4]   2> 1847021 INFO  (zkCallback-6891-thread-1) [    ] o.a.s.c.c.ZkStateReader Updated live nodes from ZooKeeper... (3) -> (4)
   [junit4]   2> 1847023 INFO  (zkCallback-6882-thread-1) [    ] o.a.s.c.c.ZkStateReader Updated live nodes from ZooKeeper... (3) -> (4)
   [junit4]   2> 1847023 DEBUG (SyncThread:0) [    ] o.a.s.c.ZkTestServer Watch added: children: /solr/live_nodes
   [junit4]   2> 1847026 INFO  (zkCallback-6898-thread-1) [    ] o.a.s.c.c.ZkStateReader Updated live nodes from ZooKeeper... (3) -> (4)
   [junit4]   2> 1847049 INFO  (zkConnectionManagerCallback-6906-thread-1) [    ] o.a.s.c.c.ConnectionManager zkClient has connected
   [junit4]   2> 1847051 DEBUG (SyncThread:0) [    ] o.a.s.c.ZkTestServer Watch added: create/delete: /solr/clusterprops.json
   [junit4]   2> 1847051 DEBUG (SyncThread:0) [    ] o.a.s.c.ZkTestServer Watch added: children: /solr/live_nodes
   [junit4]   2> 1847051 INFO  (jetty-launcher-6840-thread-2) [n:127.0.0.1:64321_solr    ] o.a.s.c.c.ZkStateReader Updated live nodes from ZooKeeper... (0) -> (4)
   [junit4]   2> 1847052 DEBUG (SyncThread:0) [    ] o.a.s.c.ZkTestServer Watch added: data: /solr/clusterstate.json
   [junit4]   2> 1847052 DEBUG (SyncThread:0) [    ] o.a.s.c.ZkTestServer Watch added: children: /solr/collections
   [junit4]   2> 1847053 DEBUG (SyncThread:0) [    ] o.a.s.c.ZkTestServer Watch added: create/delete: /solr/aliases.json
   [junit4]   2> 1847053 INFO  (jetty-launcher-6840-thread-2) [n:127.0.0.1:64321_solr    ] o.a.s.c.s.i.ZkClientClusterStateProvider Cluster at 127.0.0.1:63044/solr ready
   [junit4]   2> 1847054 INFO  (jetty-launcher-6840-thread-2) [n:127.0.0.1:64321_solr    ] o.a.s.h.a.MetricsHistoryHandler No .system collection, keeping metrics history in memory.
   [junit4]   2> 1847065 INFO  (jetty-launcher-6840-thread-2) [n:127.0.0.1:64321_solr    ] o.a.s.m.r.SolrJmxReporter JMX monitoring for 'solr_64321.solr.node' (registry 'solr.node') enabled at server: com.sun.jmx.mbeanserver.JmxMBeanServer@7c8277c3
   [junit4]   2> 1847070 INFO  (jetty-launcher-6840-thread-2) [n:127.0.0.1:64321_solr    ] o.a.s.m.r.SolrJmxReporter JMX monitoring for 'solr_64321.solr.jvm' (registry 'solr.jvm') enabled at server: com.sun.jmx.mbeanserver.JmxMBeanServer@7c8277c3
   [junit4]   2> 1847070 INFO  (jetty-launcher-6840-thread-2) [n:127.0.0.1:64321_solr    ] o.a.s.m.r.SolrJmxReporter JMX monitoring for 'solr_64321.solr.jetty' (registry 'solr.jetty') enabled at server: com.sun.jmx.mbeanserver.JmxMBeanServer@7c8277c3
   [junit4]   2> 1847071 INFO  (jetty-launcher-6840-thread-2) [n:127.0.0.1:64321_solr    ] o.a.s.c.CorePropertiesLocator Found 0 core definitions underneath /export/home/jenkins/workspace/Lucene-Solr-master-Solaris/solr/build/solr-core/test/J0/temp/solr.cloud.MoveReplicaTest_9BDEAA54A11634A5-001/tempDir-001/node2/.
   [junit4]   2> 1847103 INFO  (zkConnectionManagerCallback-6909-thread-1) [    ] o.a.s.c.c.ConnectionManager zkClient has connected
   [junit4]   2> 1847107 INFO  (zkConnectionManagerCallback-6914-thread-1) [    ] o.a.s.c.c.ConnectionManager zkClient has connected
   [junit4]   2> 1847108 DEBUG (SyncThread:0) [    ] o.a.s.c.ZkTestServer Watch added: create/delete: /solr/clusterprops.json
   [junit4]   2> 1847109 DEBUG (SyncThread:0) [    ] o.a.s.c.ZkTestServer Watch added: children: /solr/live_nodes
   [junit4]   2> 1847109 INFO  (SUITE-MoveReplicaTest-seed#[9BDEAA54A11634A5]-worker) [    ] o.a.s.c.c.ZkStateReader Updated live nodes from ZooKeeper... (0) -> (4)
   [junit4]   2> 1847109 DEBUG (SyncThread:0) [    ] o.a.s.c.ZkTestServer Watch added: data: /solr/clusterstate.json
   [junit4]   2> 1847109 DEBUG (SyncThread:0) [    ] o.a.s.c.ZkTestServer Watch added: children: /solr/collections
   [junit4]   2> 1847110 DEBUG (SyncThread:0) [    ] o.a.s.c.ZkTestServer Watch added: create/delete: /solr/aliases.json
   [junit4]   2> 1847110 INFO  (SUITE-MoveReplicaTest-seed#[9BDEAA54A11634A5]-worker) [    ] o.a.s.c.s.i.ZkClientClusterStateProvider Cluster at 127.0.0.1:63044/solr ready
   [junit4]   2> 1847116 INFO  (qtp1469207419-19166) [n:127.0.0.1:64169_solr    ] o.a.s.h.a.CollectionsHandler Invoked Collection Action :overseerstatus with params action=OVERSEERSTATUS&wt=javabin&version=2 and sendToOCPQueue=true
   [junit4]   2> 1847117 DEBUG (SyncThread:0) [    ] o.a.s.c.ZkTestServer Watch fired: children: /solr/overseer/collection-queue-work
   [junit4]   2> 1847117 DEBUG (SyncThread:0) [    ] o.a.s.c.ZkTestServer Watch added: create/delete: /solr/overseer/collection-queue-work/qnr-0000000000
   [junit4]   2> 1847117 DEBUG (SyncThread:0) [    ] o.a.s.c.ZkTestServer Watch added: children: /solr/overseer/collection-queue-work
   [junit4]   2> 1847118 DEBUG (SyncThread:0) [    ] o.a.s.c.ZkTestServer Watch fired: children: /solr/overseer/queue
   [junit4]   2> 1847118 DEBUG (OverseerCollectionConfigSetProcessor-72142325660188678-127.0.0.1:64169_solr-n_0000000000) [n:127.0.0.1:64169_solr    ] o.a.s.c.ZkDistributedQueue Found child node with improper name: qnr-0000000000
   [junit4]   2> 1847118 DEBUG (SyncThread:0) [    ] o.a.s.c.ZkTestServer Watch fired: children: /solr/overseer/collection-queue-work
   [junit4]   2> 1847118 DEBUG (SyncThread:0) [    ] o.a.s.c.ZkTestServer Watch added: children: /solr/overseer/collection-queue-work
   [junit4]   2> 1847119 DEBUG (OverseerCollectionConfigSetProcessor-72142325660188678-127.0.0.1:64169_solr-n_0000000000) [n:127.0.0.1:64169_solr    ] o.a.s.c.ZkDistributedQueue Found child node with improper name: qnr-0000000000
   [junit4]   2> 1847119 DEBUG (SyncThread:0) [    ] o.a.s.c.ZkTestServer Watch added: children: /solr/overseer/queue
   [junit4]   2> 1847119 DEBUG (OverseerCollectionConfigSetProcessor-72142325660188678-127.0.0.1:64169_solr-n_0000000000) [n:127.0.0.1:64169_solr    ] o.a.s.c.OverseerTaskQueue Returning topN elements: [/overseer/collection-queue-work/qn-0000000000, ]
   [junit4]   2> 1847119 DEBUG (OverseerCollectionConfigSetProcessor-72142325660188678-127.0.0.1:64169_solr-n_0000000000) [n:127.0.0.1:64169_solr    ] o.a.s.c.OverseerTaskProcessor Got 1 tasks from work-queue : [[org.apache.solr.cloud.OverseerTaskQueue$QueueEvent@2e684ecf]]
   [junit4]   2> 1847119 DEBUG (OverseerCollectionConfigSetProcessor-72142325660188678-127.0.0.1:64169_solr-n_0000000000) [n:127.0.0.1:64169_solr    ] o.a.s.c.OverseerTaskProcessor Marked task [/overseer/collection-queue-work/qn-0000000000] as running
   [junit4]   2> 1847119 DEBUG (OverseerCollectionConfigSetProcessor-72142325660188678-127.0.0.1:64169_solr-n_0000000000) [n:127.0.0.1:64169_solr    ] o.a.s.c.OverseerTaskProcessor Overseer Collection Message Handler: Get the message id:/overseer/collection-queue-work/qn-0000000000 message:{"operation":"overseerstatus"}
   [junit4]   2> 1847120 DEBUG (OverseerThreadFactory-6603-thread-1-processing-n:127.0.0.1:64169_solr) [n:127.0.0.1:64169_solr    ] o.a.s.c.OverseerTaskProcessor Runner processing /overseer/collection-queue-work/qn-0000000000
   [junit4]   2> 1847120 DEBUG (OverseerCollectionConfigSetProcessor-72142325660188678-127.0.0.1:64169_solr-n_0000000000) [n:127.0.0.1:64169_solr    ] o.a.s.c.OverseerTaskProcessor Cleaning up work-queue. #Running tasks: 1
   [junit4]   2> 1847120 DEBUG (OverseerThreadFactory-6603-thread-1-processing-n:127.0.0.1:64169_solr) [n:127.0.0.1:64169_solr    ] o.a.s.c.a.c.OverseerCollectionMessageHandler OverseerCollectionMessageHandler.processMessage : overseerstatus , {"operation":"overseerstatus"}
   [junit4]   2> 1847120 DEBUG (OverseerCollectionConfigSetProcessor-72142325660188678-127.0.0.1:64169_solr-n_0000000000) [n:127.0.0.1:64169_solr    ] o.a.s.c.OverseerTaskProcessor RunningTasks: [/overseer/collection-queue-work/qn-0000000000]
   [junit4]   2> 1847120 DEBUG (OverseerCollectionConfigSetProcessor-72142325660188678-127.0.0.1:64169_solr-n_0000000000) [n:127.0.0.1:64169_solr    ] o.a.s.c.OverseerTaskProcessor BlockedTasks: []
   [junit4]   2> 1847120 DEBUG (OverseerCollectionConfigSetProcessor-72142325660188678-127.0.0.1:64169_solr-n_0000000000) [n:127.0.0.1:64169_solr    ] o.a.s.c.OverseerTaskProcessor CompletedTasks: []
   [junit4]   2> 1847120 DEBUG (OverseerCollectionConfigSetProcessor-72142325660188678-127.0.0.1:64169_solr-n_0000000000) [n:127.0.0.1:64169_solr    ] o.a.s.c.OverseerTaskProcessor RunningZKTasks: [/overseer/collection-queue-work/qn-0000000000]
   [junit4]   2> 1847120 DEBUG (OverseerCollectionConfigSetProcessor-72142325660188678-127.0.0.1:64169_solr-n_0000000000) [n:127.0.0.1:64169_solr    ] o.a.s.c.OverseerTaskQueue Peeking for top 99 elements. ExcludeSet: [/overseer/collection-queue-work/qn-0000000000],[]
   [junit4]   2> 1847122 DEBUG (OverseerThreadFactory-6603-thread-1-processing-n:127.0.0.1:64169_solr) [n:127.0.0.1:64169_solr    ] o.a.s.c.OverseerTaskProcessor Completed task:[/overseer/collection-queue-work/qn-0000000000]
   [junit4]   2> 1847123 DEBUG (SyncThread:0) [    ] o.a.s.c.ZkTestServer Watch fired: data: /solr/overseer/collection-queue-work/qnr-0000000000
   [junit4]   2> 1847124 DEBUG (SyncThread:0) [    ] o.a.s.c.ZkTestServer Watch fired: children: /solr/overseer/collection-queue-work
   [junit4]   2> 1847124 DEBUG (zkCallback-6856-thread-2) [    ] o.a.s.c.OverseerTaskQueue NodeDataChanged fired on path /overseer/collection-queue-work/qnr-0000000000 state SyncConnected latchEventType null
   [junit4]   2> 1847124 DEBUG (OverseerThreadFactory-6603-thread-1-processing-n:127.0.0.1:64169_solr) [n:127.0.0.1:64169_solr    ] o.a.s.c.OverseerTaskProcessor Marked task [/overseer/collection-queue-work/qn-0000000000] as completed.
   [junit4]   2> 1847124 DEBUG (OverseerThreadFactory-6603-thread-1-processing-n:127.0.0.1:64169_solr) [n:127.0.0.1:64169_solr    ] o.a.s.c.OverseerTaskProcessor RunningTasks: []
   [junit4]   2> 1847124 DEBUG (OverseerThreadFactory-6603-thread-1-processing-n:127.0.0.1:64169_solr) [n:127.0.0.1:64169_solr    ] o.a.s.c.OverseerTaskProcessor BlockedTasks: []
   [junit4]   2> 1847124 DEBUG (OverseerThreadFactory-6603-thread-1-processing-n:127.0.0.1:64169_solr) [n:127.0.0.1:64169_solr    ] o.a.s.c.OverseerTaskProcessor CompletedTasks: [/overseer/collection-queue-work/qn-0000000000]
   [junit4]   2> 1847124 DEBUG (OverseerThreadFactory-6603-thread-1-processing-n:127.0.0.1:64169_solr) [n:127.0.0.1:64169_solr    ] o.a.s.c.OverseerTaskProcessor RunningZKTasks: [/overseer/collection-queue-work/qn-0000000000]
   [junit4]   2> 1847125 DEBUG (OverseerThreadFactory-6603-thread-1-processing-n:127.0.0.1:64169_solr) [n:127.0.0.1:64169_solr    ] o.a.s.c.OverseerTaskProcessor Overseer Collection Message Handler: Message id:/overseer/collection-queue-work/qn-0000000000 complete, response:{leader=127.0.0.1:64169_solr,overseer_queue_size=0,overseer_work_queue_size=0,overseer_collection_queue_size=2,overseer_operations={am_i_leader={requests=4,errors=0,avgRequestsPerSecond=4.306316417071706,5minRateRequestsPerSecond=0.0,15minRateRequestsPerSecond=0.0,avgTimePerRequest=0.3801095333855279,medianRequestTime=0.408018,75thPcRequestTime=0.457601,95thPcRequestTime=0.457601,99thPcRequestTime=0.457601,999thPcRequestTime=0.457601},downnode={requests=3,errors=0,avgRequestsPerSecond=3.3047681366523562,5minRateRequestsPerSecond=0.0,15minRateRequestsPerSecond=0.0,avgTimePerRequest=0.005939666666666666,medianRequestTime=0.00585,75thPcRequestTime=0.00615,95thPcRequestTime=0.00615,99thPcRequestTime=0.00615,999thPcRequestTime=0.00615}},collection_operations={am_i_leader={requests=3,errors=0,avgRequestsPerSecond=3.2308951984024086,5minRateRequestsPerSecond=0.0,15minRateRequestsPerSecond=0.0,avgTimePerRequest=0.37060059262882056,medianRequestTime=0.371101,75thPcRequestTime=0.446679,95thPcRequestTime=0.446679,99thPcRequestTime=0.446679,999thPcRequestTime=0.446679},overseerstatus={requests=0,errors=0,avgRequestsPerSecond=0.0,5minRateRequestsPerSecond=0.0,15minRateRequestsPerSecond=0.0,avgTimePerRequest=0.0,medianRequestTime=0.0,75thPcRequestTime=0.0,95thPcRequestTime=0.0,99thPcRequestTime=0.0,999thPcRequestTime=0.0}},overseer_queue={},overseer_internal_queue={peek={avgRequestsPerSecond=1.0803662056826895,5minRateRequestsPerSecond=0.0,15minRateRequestsPerSecond=0.0,avgTimePerRequest=13.684918,medianRequestTime=13.684918,75thPcRequestTime=13.684918,95thPcRequestTime=13.684918,99thPcRequestTime=13.684918,999thPcRequestTime=13.684918}},collection_queue={peektopn_wait2000={avgRequestsPerSecond=1.0791792009913461,5minRateRequestsPerSecond=0.0,15minRateRequestsPerSecond=0.0,avgTimePerRequest=924.169323,medianRequestTime=924.169323,75thPcRequestTime=924.169323,95thPcRequestTime=924.169323,99thPcRequestTime=924.169323,999thPcRequestTime=924.169323}}}
   [junit4]   2> 1847125 DEBUG (SyncThread:0) [    ] o.a.s.c.ZkTestServer Watch added: children: /solr/overseer/collection-queue-work
   [junit4]   2> 1847126 INFO  (qtp1469207419-19166) [n:127.0.0.1:64169_solr    ] o.a.s.s.HttpSolrCall [admin] webapp=null path=/admin/collections params={action=OVERSEERSTATUS&wt=javabin&version=2} status=0 QTime=9
   [junit4]   2> 1847238 DEBUG (ScheduledTrigger-6601-thread-2) [    ] o.a.s.c.a.NodeLostTrigger Running NodeLostTrigger: .auto_add_replicas with currently live nodes: 4
   [junit4]   2> 1847412 INFO  (TEST-MoveReplicaTest.testFailedMove-seed#[9BDEAA54A11634A5]) [    ] o.a.s.SolrTestCaseJ4 ###Starting testFailedMove
   [junit4]   2> 1847413 DEBUG (SyncThread:0) [    ] o.a.s.c.ZkTestServer Watch added: create/delete: /solr/clusterprops.json
   [junit4]   2> 1847413 DEBUG (SyncThread:0) [    ] o.a.s.c.ZkTestServer Watch added: children: /solr/live_nodes
   [junit4]   2> 1847414 INFO  (TEST-MoveReplicaTest.testFailedMove-seed#[9BDEAA54A11634A5]) [    ] o.a.s.c.c.ZkStateReader Updated live nodes from ZooKeeper... (0) -> (4)
   [junit4]   2> 1847414 DEBUG (SyncThread:0) [    ] o.a.s.c.ZkTestServer Watch added: data: /solr/clusterstate.json
   [junit4]   2> 1847414 DEBUG (SyncThread:0) [    ] o.a.s.c.ZkTestServer Watch added: children: /solr/collections
   [junit4]   2> 1847415 DEBUG (SyncThread:0) [    ] o.a.s.c.ZkTestServer Watch added: create/delete: /solr/aliases.json
   [junit4]   2> 1847416 DEBUG (SyncThread:0) [    ] o.a.s.c.ZkTestServer Watch fired: data: /solr/aliases.json
   [junit4]   2> 1847416 DEBUG (SyncThread:0) [    ] o.a.s.c.ZkTestServer Watch fired: data: /solr/aliases.json
   [junit4]   2> 1847416 DEBUG (SyncThread:0) [    ] o.a.s.c.ZkTestServer Watch fired: data: /solr/aliases.json
   [junit4]   2> 1847416 DEBUG (SyncThread:0) [    ] o.a.s.c.ZkTestServer Watch fired: data: /solr/aliases.json
   [junit4]   2> 1847416 DEBUG (SyncThread:0) [    ] o.a.s.c.ZkTestServer Watch fired: data: /solr/aliases.json
   [junit4]   2> 1847416 DEBUG (SyncThread:0) [    ] o.a.s.c.ZkTestServer Watch fired: data: /solr/aliases.json
   [junit4]   2> 1847416 DEBUG (SyncThread:0) [    ] o.a.s.c.ZkTestServer Watch fired: data: /solr/aliases.json
   [junit4]   2> 1847416 DEBUG (SyncThread:0) [    ] o.a.s.c.ZkTestServer Watch fired: data: /solr/aliases.json
   [junit4]   2> 1847416 DEBUG (SyncThread:0) [    ] o.a.s.c.ZkTestServer Watch fired: data: /solr/aliases.json
   [junit4]   2> 1847417 INFO  (TEST-MoveReplicaTest.testFailedMove-seed#[9BDEAA54A11634A5]) [    ] o.e.j.s.Server jetty-9.4.11.v20180605; built: 2018-06-05T18:24:03.829Z; git: d5fc0523cfa96bfebfbda19606cad384d772f04c; jvm 1.8.0_172-b11
   [junit4]   2> 1847418 INFO  (TEST-MoveReplicaTest.testFailedMove-seed#[9BDEAA54A11634A5]) [    ] o.e.j.s.session DefaultSessionIdManager workerName=node0
   [junit4]   2> 1847418 INFO  (TEST-MoveReplicaTest.testFailedMove-seed#[9BDEAA54A11634A5]) [    ] o.e.j.s.session No SessionScavenger set, using defaults
   [junit4]   2> 1847418 INFO  (TEST-MoveReplicaTest.testFailedMove-seed#[9BDEAA54A11634A5]) [    ] o.e.j.s.session node0 Scavenging every 660000ms
   [junit4]   2> 1847417 DEBUG (SyncThread:0) [    ] o.a.s.c.ZkTestServer Watch added: data: /solr/aliases.json
   [junit4]   2> 1847418 INFO  (TEST-MoveReplicaTest.testFailedMove-seed#[9BDEAA54A11634A5]) [    ] o.e.j.s.h.ContextHandler Started o.e.j.s.ServletContextHandler@4b688f96{/solr,null,AVAILABLE}
   [junit4]   2> 1847419 INFO  (TEST-MoveReplicaTest.testFailedMove-seed#[9BDEAA54A11634A5]) [    ] o.e.j.s.AbstractConnector Started ServerConnector@45af2d34{HTTP/1.1,[http/1.1]}{127.0.0.1:36288}
   [junit4]   2> 1847419 INFO  (TEST-MoveReplicaTest.testFailedMove-seed#[9BDEAA54A11634A5]) [    ] o.e.j.s.Server Started @1848900ms
   [junit4]   2> 1847419 INFO  (TEST-MoveReplicaTest.testFailedMove-seed#[9BDEAA54A11634A5]) [    ] o.a.s.c.s.e.JettySolrRunner Jetty properties: {hostContext=/solr, hostPort=36288}
   [junit4]   2> 1847419 ERROR (TEST-MoveReplicaTest.testFailedMove-seed#[9BDEAA54A11634A5]) [    ] o.a.s.u.StartupLoggingUtils Missing Java Option solr.log.dir. Logging may be missing or incomplete.
   [junit4]   2> 1847419 INFO  (TEST-MoveReplicaTest.testFailedMove-seed#[9BDEAA54A11634A5]) [    ] o.a.s.s.SolrDispatchFilter Using logger factory org.apache.logging.slf4j.Log4jLoggerFactory
   [junit4]   2> 1847419 INFO  (TEST-MoveReplicaTest.testFailedMove-seed#[9BDEAA54A11634A5]) [    ] o.a.s.s.SolrDispatchFilter  ___      _       Welcome to Apache Solr? version 8.0.0
   [junit4]   2> 1847419 INFO  (TEST-MoveReplicaTest.testFailedMove-seed#[9BDEAA54A11634A5]) [    ] o.a.s.s.SolrDispatchFilter / __| ___| |_ _   Starting in cloud mode on port null
   [junit4]   2> 1847419 INFO  (TEST-MoveReplicaTest.testFailedMove-seed#[9BDEAA54A11634A5]) [    ] o.a.s.s.SolrDispatchFilter \__ \/ _ \ | '_|  Install dir: null
   [junit4]   2> 1847419 INFO  (TEST-MoveReplicaTest.testFailedMove-seed#[9BDEAA54A11634A5]) [    ] o.a.s.s.SolrDispatchFilter |___/\___/_|_|    Start time: 2018-10-22T22:20:02.307Z
   [junit4]   2> 1847419 DEBUG (SyncThread:0) [    ] o.a.s.c.ZkTestServer Watch added: data: /solr/aliases.json
   [junit4]   2> 1847419 DEBUG (SyncThread:0) [    ] o.a.s.c.ZkTestServer Watch added: data: /solr/aliases.json
   [junit4]   2> 1847420 DEBUG (SyncThread:0) [    ] o.a.s.c.ZkTestServer Watch added: data: /solr/aliases.json
   [junit4]   2> 1847420 DEBUG (SyncThread:0) [    ] o.a.s.c.ZkTestServer Watch added: data: /solr/aliases.json
   [junit4]   2> 1847420 DEBUG (SyncThread:0) [    ] o.a.s.c.ZkTestServer Watch added: data: /solr/aliases.json
   [junit4]   2> 1847421 INFO  (zkConnectionManagerCallback-6918-thread-1) [    ] o.a.s.c.c.ConnectionManager zkClient has connected
   [junit4]   2> 1847421 DEBUG (SyncThread:0) [    ] o.a.s.c.ZkTestServer Watch added: data: /solr/aliases.json
   [junit4]   2> 1847421 DEBUG (SyncThread:0) [    ] o.a.s.c.ZkTestServer Watch added: data: /solr/aliases.json
   [junit4]   2> 1847421 INFO  (TEST-MoveReplicaTest.testFailedMove-seed#[9BDEAA54A11634A5]) [    ] o.a.s.s.SolrDispatchFilter solr.xml found in ZooKeeper. Loading...
   [junit4]   2> 1847421 DEBUG (SyncThread:0) [    ] o.a.s.c.ZkTestServer Watch added: data: /solr/aliases.json
   [junit4]   2> 1847422 DEBUG (SyncThread:0) [    ] o.a.s.c.ZkTestServer Watch added: data: /solr/aliases.json
   [junit4]   2> 1847425 WARN  (NIOServerCxn.Factory:0.0.0.0/0.0.0.0:0) [    ] o.a.z.s.NIOServerCnxn Unable to read additional data from client sessionid 0x1004d101e3f0013, likely client has closed socket
   [junit4]   2> 1848194 INFO  (TEST-MoveReplicaTest.testFailedMove-seed#[9BDEAA54A11634A5]) [    ] o.a.s.c.ZkContainer Zookeeper client=127.0.0.1:63044/solr
   [junit4]   2> 1848196 INFO  (zkConnectionManagerCallback-6922-thread-1) [    ] o.a.s.c.c.ConnectionManager zkClient has connected
   [junit4]   2> 1848198 DEBUG (TEST-MoveReplicaTest.testFailedMove-seed#[9BDEAA54A11634A5]) [n:127.0.0.1:36288_solr    ] o.a.s.c.ZkController Added new OnReconnect listener org.apache.solr.cloud.ZkController$$Lambda$368/1043976828@51a8b9c
   [junit4]   2> 1848199 INFO  (zkConnectionManagerCallback-6924-thread-1) [    ] o.a.s.c.c.ConnectionManager zkClient has connected
   [junit4]   2> 1848211 DEBUG (SyncThread:0) [    ] o.a.s.c.ZkTestServer Watch added: create/delete: /solr/clusterprops.json
   [junit4]   2> 1848211 DEBUG (SyncThread:0) [    ] o.a.s.c.ZkTestServer Watch added: children: /solr/live_nodes
   [junit4]   2> 1848212 INFO  (TEST-MoveReplicaTest.testFailedMove-seed#[9BDEAA54A11634A5]) [n:127.0.0.1:36288_solr    ] o.a.s.c.c.ZkStateReader Updated live nodes from ZooKeeper... (0) -> (4)
   [junit4]   2> 1848212 DEBUG (SyncThread:0) [    ] o.a.s.c.ZkTestServer Watch added: data: /solr/clusterstate.json
   [junit4]   2> 1848212 DEBUG (SyncThread:0) [    ] o.a.s.c.ZkTestServer Watch added: children: /solr/collections
   [junit4]   2> 1848213 DEBUG (SyncThread:0) [    ] o.a.s.c.ZkTestServer Watch added: create/delete: /solr/aliases.json
   [junit4]   2> 1848213 DEBUG (SyncThread:0) [    ] o.a.s.c.ZkTestServer Watch added: create/delete: /solr/security.json
   [junit4]   2> 1848215 DEBUG (TEST-MoveReplicaTest.testFailedMove-seed#[9BDEAA54A11634A5]) [n:127.0.0.1:36288_solr    ] o.a.s.c.LeaderElector Joined leadership election with path: /overseer_elect/election/72142325660188693-127.0.0.1:36288_solr-n_0000000004
   [junit4]   2> 1848216 DEBUG (SyncThread:0) [    ] o.a.s.c.ZkTestServer Watch added: data: /solr/overseer_elect/election/72142325660188687-127.0.0.1:64321_solr-n_0000000003
   [junit4]   2> 1848216 DEBUG (TEST-MoveReplicaTest.testFailedMove-seed#[9BDEAA54A11634A5]) [n:127.0.0.1:36288_solr    ] o.a.s.c.LeaderElector Watching path /overseer_elect/election/72142325660188687-127.0.0.1:64321_solr-n_0000000003 to know if I could be the leader
   [junit4]   2> 1848216 DEBUG (TEST-MoveReplicaTest.testFailedMove-seed#[9BDEAA54A11634A5]) [n:127.0.0.1:36288_solr    ] o.a.s.c.ZkController Publish node=127.0.0.1:36288_solr as DOWN
   [junit4]   2> 1848219 DEBUG (SyncThread:0) [    ] o.a.s.c.ZkTestServer Watch fired: children: /solr/overseer/queue
   [junit4]   2> 1848219 DEBUG (SyncThread:0) [    ] o.a.s.c.ZkTestServer Watch added: children: /solr/overseer/queue
   [junit4]   2> 1848219 INFO  (TEST-MoveReplicaTest.testFailedMove-seed#[9BDEAA54A11634A5]) [n:127.0.0.1:36288_solr    ] o.a.s.c.TransientSolrCoreCacheDefault Allocating transient cache for 2147483647 transient cores
   [junit4]   2> 1848219 INFO  (TEST-MoveReplicaTest.testFailedMove-seed#[9BDEAA54A11634A5]) [n:127.0.0.1:36288_solr    ] o.a.s.c.ZkController Register node as live in ZooKeeper:/live_nodes/127.0.0.1:36288_solr
   [junit4]   2> 1848220 DEBUG (SyncThread:0) [    ] o.a.s.c.ZkTestServer Watch fired: children: /solr/live_nodes
   [junit4]   2> 1848220 DEBUG (SyncThread:0) [    ] o.a.s.c.ZkTestServer Watch fired: children: /solr/live_nodes
   [junit4]   2> 1848220 DEBUG (SyncThread:0) [    ] o.a.s.c.ZkTestServer Watch fired: children: /solr/live_nodes
   [junit4]   2> 1848220 DEBUG (SyncThread:0) [    ] o.a.s.c.ZkTestServer Watch fired: children: /solr/live_nodes
   [junit4]   2> 1848220 DEBUG (SyncThread:0) [    ] o.a.s.c.ZkTestServer Watch fired: children: /solr/live_nodes
   [junit4]   2> 1848220 DEBUG (SyncThread:0) [    ] o.a.s.c.ZkTestServer Watch fired: children: /solr/live_nodes
   [junit4]   2> 1848220 DEBUG (SyncThread:0) [    ] o.a.s.c.ZkTestServer Watch fired: children: /solr/live_nodes
   [junit4]   2> 1848220 DEBUG (SyncThread:0) [    ] o.a.s.c.ZkTestServer Watch fired: children: /solr/live_nodes
   [junit4]   2> 1848221 DEBUG (SyncThread:0) [    ] o.a.s.c.ZkTestServer Watch fired: children: /solr/live_nodes
   [junit4]   2> 1848221 DEBUG (SyncThread:0) [    ] o.a.s.c.ZkTestServer Watch fired: children: /solr/live_nodes
   [junit4]   2> 1848221 DEBUG (SyncThread:0) [    ] o.a.s.c.ZkTestServer Watch added: children: /solr/live_nodes
   [junit4]   2> 1848221 DEBUG (SyncThread:0) [    ] o.a.s.c.ZkTestServer Watch added: children: /solr/live_nodes
   [junit4]   2> 1848223 INFO  (zkCallback-6913-thread-1) [    ] o.a.s.c.c.ZkStateReader Updated live nodes from ZooKeeper... (4) -> (5)
   [junit4]   2> 1848226 INFO  (zkCallback-6913-thread-2) [    ] o.a.s.c.c.ZkStateReader Updated live nodes from ZooKeeper... (4) -> (5)


[...truncated too long message...]

  CLOSING SolrCore org.apache.solr.core.SolrCore@6b7eb281
   [junit4]   2> 1320948 INFO  (coreCloseExecutor-359-thread-4) [n:127.0.0.1:63464_solr c:test s:shard2 r:core_node14 x:test_shard2_replica_n13] o.a.s.c.SolrCore [test_shard2_replica_n13]  CLOSING SolrCore org.apache.solr.core.SolrCore@4b9f7ab3
   [junit4]   2> 1320954 INFO  (coreCloseExecutor-359-thread-1) [n:127.0.0.1:63464_solr c:.system s:shard1 r:core_node5 x:.system_shard1_replica_n2] o.a.s.m.SolrMetricManager Closing metric reporters for registry=solr.collection..system.shard1.leader, tag=6b79f87c
   [junit4]   2> 1320955 INFO  (coreCloseExecutor-359-thread-2) [n:127.0.0.1:63464_solr c:test s:shard3 r:core_node11 x:test_shard3_replica_n8] o.a.s.m.SolrMetricManager Closing metric reporters for registry=solr.core.test.shard3.replica_n8, tag=373cdc03
   [junit4]   2> 1320955 INFO  (coreCloseExecutor-359-thread-2) [n:127.0.0.1:63464_solr c:test s:shard3 r:core_node11 x:test_shard3_replica_n8] o.a.s.m.r.SolrJmxReporter Closing reporter [org.apache.solr.metrics.reporters.SolrJmxReporter@69e3b58: rootName = solr_63464, domain = solr.core.test.shard3.replica_n8, service url = null, agent id = null] for registry solr.core.test.shard3.replica_n8 / com.codahale.metrics.MetricRegistry@31ad8d4c
   [junit4]   2> 1320962 INFO  (coreCloseExecutor-359-thread-2) [n:127.0.0.1:63464_solr c:test s:shard3 r:core_node11 x:test_shard3_replica_n8] o.a.s.m.SolrMetricManager Closing metric reporters for registry=solr.collection.test.shard3.leader, tag=373cdc03
   [junit4]   2> 1320962 INFO  (coreCloseExecutor-359-thread-3) [n:127.0.0.1:63464_solr c:test s:shard1 r:core_node5 x:test_shard1_replica_n2] o.a.s.m.SolrMetricManager Closing metric reporters for registry=solr.core.test.shard1.replica_n2, tag=6b7eb281
   [junit4]   2> 1320962 INFO  (coreCloseExecutor-359-thread-3) [n:127.0.0.1:63464_solr c:test s:shard1 r:core_node5 x:test_shard1_replica_n2] o.a.s.m.r.SolrJmxReporter Closing reporter [org.apache.solr.metrics.reporters.SolrJmxReporter@15a51f41: rootName = solr_63464, domain = solr.core.test.shard1.replica_n2, service url = null, agent id = null] for registry solr.core.test.shard1.replica_n2 / com.codahale.metrics.MetricRegistry@29865d22
   [junit4]   2> 1320970 INFO  (coreCloseExecutor-359-thread-3) [n:127.0.0.1:63464_solr c:test s:shard1 r:core_node5 x:test_shard1_replica_n2] o.a.s.m.SolrMetricManager Closing metric reporters for registry=solr.collection.test.shard1.leader, tag=6b7eb281
   [junit4]   2> 1320970 INFO  (coreCloseExecutor-359-thread-4) [n:127.0.0.1:63464_solr c:test s:shard2 r:core_node14 x:test_shard2_replica_n13] o.a.s.m.SolrMetricManager Closing metric reporters for registry=solr.core.test.shard2.replica_n13, tag=4b9f7ab3
   [junit4]   2> 1320970 INFO  (coreCloseExecutor-359-thread-4) [n:127.0.0.1:63464_solr c:test s:shard2 r:core_node14 x:test_shard2_replica_n13] o.a.s.m.r.SolrJmxReporter Closing reporter [org.apache.solr.metrics.reporters.SolrJmxReporter@3f5981dc: rootName = solr_63464, domain = solr.core.test.shard2.replica_n13, service url = null, agent id = null] for registry solr.core.test.shard2.replica_n13 / com.codahale.metrics.MetricRegistry@1f0442ef
   [junit4]   2> 1320977 INFO  (coreCloseExecutor-359-thread-4) [n:127.0.0.1:63464_solr c:test s:shard2 r:core_node14 x:test_shard2_replica_n13] o.a.s.m.SolrMetricManager Closing metric reporters for registry=solr.collection.test.shard2.leader, tag=4b9f7ab3
   [junit4]   2> 1320985 INFO  (jetty-closer-189-thread-2) [    ] o.e.j.s.h.ContextHandler Stopped o.e.j.s.ServletContextHandler@6921d8f5{/solr,null,UNAVAILABLE}
   [junit4]   2> 1320985 INFO  (jetty-closer-189-thread-2) [    ] o.e.j.s.session node0 Stopped scavenging
   [junit4]   2> 1320987 ERROR (SUITE-SystemLogListenerTest-seed#[9BDEAA54A11634A5]-worker) [    ] o.a.z.s.ZooKeeperServer ZKShutdownHandler is not registered, so ZooKeeper server won't take any action on ERROR or SHUTDOWN server state changes
   [junit4]   2> 1320988 INFO  (SUITE-SystemLogListenerTest-seed#[9BDEAA54A11634A5]-worker) [    ] o.a.s.c.ZkTestServer connecting to 127.0.0.1:57348 57348
   [junit4]   2> 1321123 INFO  (Thread-97) [    ] o.a.s.c.ZkTestServer connecting to 127.0.0.1:57348 57348
   [junit4]   2> 1321124 WARN  (Thread-97) [    ] o.a.s.c.ZkTestServer Watch limit violations: 
   [junit4]   2> Maximum concurrent create/delete watches above limit:
   [junit4]   2> 
   [junit4]   2> 	11	/solr/collections/.system/terms/shard1
   [junit4]   2> 	7	/solr/clusterprops.json
   [junit4]   2> 	7	/solr/aliases.json
   [junit4]   2> 	5	/solr/collections/test/terms/shard3
   [junit4]   2> 	5	/solr/collections/test/terms/shard2
   [junit4]   2> 	5	/solr/collections/test/terms/shard1
   [junit4]   2> 	3	/solr/configs/.system
   [junit4]   2> 	3	/solr/security.json
   [junit4]   2> 	3	/solr/configs/.system/managed-schema
   [junit4]   2> 	3	/solr/configs/conf
   [junit4]   2> 
   [junit4]   2> Maximum concurrent data watches above limit:
   [junit4]   2> 
   [junit4]   2> 	10	/solr/collections/test/state.json
   [junit4]   2> 	7	/solr/clusterstate.json
   [junit4]   2> 	3	/solr/collections/.system/state.json
   [junit4]   2> 	2	/solr/collections/.system/leader_elect/shard1/election/72142520595775493-core_node3-n_0000000000
   [junit4]   2> 
   [junit4]   2> Maximum concurrent children watches above limit:
   [junit4]   2> 
   [junit4]   2> 	7	/solr/live_nodes
   [junit4]   2> 	7	/solr/collections
   [junit4]   2> 
   [junit4]   2> NOTE: leaving temporary files on disk at: /export/home/jenkins/workspace/Lucene-Solr-master-Solaris/solr/build/solr-core/test/J0/temp/solr.cloud.autoscaling.SystemLogListenerTest_9BDEAA54A11634A5-003
   [junit4]   2> Oct 22, 2018 11:30:06 PM com.carrotsearch.randomizedtesting.ThreadLeakControl checkThreadLeaks
   [junit4]   2> WARNING: Will linger awaiting termination of 1 leaked thread(s).
   [junit4]   2> NOTE: test params are: codec=Asserting(Lucene80): {action_s=Lucene50(blocksize=128), event.property.preferredOperation_ss=PostingsFormat(name=LuceneVarGapFixedInterval), event.source_s=PostingsFormat(name=MockRandom), type=Lucene50(blocksize=128), before.actions_ss=PostingsFormat(name=MockRandom), event.property._enqueue_time__ss=Lucene50(blocksize=128), after.actions_ss=PostingsFormat(name=LuceneVarGapFixedInterval), stage_s=Lucene50(blocksize=128), event.id_s=PostingsFormat(name=LuceneFixedGap), event.property.eventTimes_ss=Lucene50(blocksize=128), source_s=PostingsFormat(name=LuceneFixedGap), event.type_s=Lucene50(blocksize=128), id=PostingsFormat(name=LuceneFixedGap), collections_ss=Lucene50(blocksize=128), operations.params_ts=Lucene50(blocksize=128), event.property.nodeNames_ss=Lucene50(blocksize=128)}, docValues:{_version_=DocValuesFormat(name=Lucene70), event.time_l=DocValuesFormat(name=Lucene70), timestamp=DocValuesFormat(name=Lucene70)}, maxPointsInLeafNode=1886, maxMBSortInHeap=5.114749927456169, sim=Asserting(org.apache.lucene.search.similarities.AssertingSimilarity@285a62), locale=zh-CN, timezone=Europe/Zurich
   [junit4]   2> NOTE: SunOS 5.11 amd64/Oracle Corporation 1.8.0_172 (64-bit)/cpus=3,threads=1,free=45942216,total=125796352
   [junit4]   2> NOTE: All tests run in this JVM: [SystemLogListenerTest, SystemLogListenerTest, SystemLogListenerTest, SystemLogListenerTest]
   [junit4] Completed [10/10 (3!)] on J0 in 1234.66s, 1 test, 1 failure <<< FAILURES!
   [junit4] 
   [junit4] 
   [junit4] Tests with failures [seed: 9BDEAA54A11634A5]:
   [junit4]   - org.apache.solr.cloud.autoscaling.SystemLogListenerTest.test
   [junit4]   - org.apache.solr.cloud.autoscaling.SystemLogListenerTest.test
   [junit4]   - org.apache.solr.cloud.autoscaling.SystemLogListenerTest.test
   [junit4] 
   [junit4] 
   [junit4] JVM J0:     0.75 ..  1321.94 =  1321.19s
   [junit4] JVM J1:     0.73 ..   208.76 =   208.03s
   [junit4] Execution time total: 22 minutes 2 seconds
   [junit4] Tests summary: 10 suites, 15 tests, 3 failures

BUILD FAILED
/export/home/jenkins/workspace/Lucene-Solr-master-Solaris/lucene/common-build.xml:1567: The following error occurred while executing this line:
/export/home/jenkins/workspace/Lucene-Solr-master-Solaris/lucene/common-build.xml:1092: There were test failures: 10 suites, 15 tests, 3 failures [seed: 9BDEAA54A11634A5]

Total time: 22 minutes 4 seconds

[repro] Setting last failure code to 256

[repro] Failures:
[repro]   0/5 failed: org.apache.solr.cloud.MoveReplicaTest
[repro]   3/5 failed: org.apache.solr.cloud.autoscaling.SystemLogListenerTest
[repro] Exiting with code 256
+ mv lucene/build lucene/build.repro
+ mv solr/build solr/build.repro
+ mv lucene/build.orig lucene/build
+ mv solr/build.orig solr/build
Archiving artifacts
Setting ANT_1_8_2_HOME=/export/home/jenkins/tools/hudson.tasks.Ant_AntInstallation/ANT_1.8.2
[WARNINGS] Parsing warnings in console log with parser Java Compiler (javac)
Setting ANT_1_8_2_HOME=/export/home/jenkins/tools/hudson.tasks.Ant_AntInstallation/ANT_1.8.2
Setting ANT_1_8_2_HOME=/export/home/jenkins/tools/hudson.tasks.Ant_AntInstallation/ANT_1.8.2
<Git Blamer> Using GitBlamer to create author and commit information for all warnings.
<Git Blamer> GIT_COMMIT=fcaea07f3c8cba34906ca02f40fb1d2c40badc08, workspace=/export/home/jenkins/workspace/Lucene-Solr-master-Solaris
[WARNINGS] Computing warning deltas based on reference build #2117
Recording test results
Setting ANT_1_8_2_HOME=/export/home/jenkins/tools/hudson.tasks.Ant_AntInstallation/ANT_1.8.2
Build step 'Publish JUnit test result report' changed build result to UNSTABLE
Email was triggered for: Unstable (Test Failures)
Sending email for trigger: Unstable (Test Failures)
Setting ANT_1_8_2_HOME=/export/home/jenkins/tools/hudson.tasks.Ant_AntInstallation/ANT_1.8.2
Setting ANT_1_8_2_HOME=/export/home/jenkins/tools/hudson.tasks.Ant_AntInstallation/ANT_1.8.2
Setting ANT_1_8_2_HOME=/export/home/jenkins/tools/hudson.tasks.Ant_AntInstallation/ANT_1.8.2
Setting ANT_1_8_2_HOME=/export/home/jenkins/tools/hudson.tasks.Ant_AntInstallation/ANT_1.8.2

Mime
View raw message