lucene-dev mailing list archives

Site index · List index
Message view « Date » · « Thread »
Top « Date » · « Thread »
From Policeman Jenkins Server <jenk...@thetaphi.de>
Subject [JENKINS] Lucene-Solr-master-Solaris (64bit/jdk1.8.0) - Build # 2086 - Still Unstable!
Date Mon, 01 Oct 2018 22:00:30 GMT
Build: https://jenkins.thetaphi.de/job/Lucene-Solr-master-Solaris/2086/
Java: 64bit/jdk1.8.0 -XX:+UseCompressedOops -XX:+UseSerialGC

3 tests failed.
FAILED:  junit.framework.TestSuite.org.apache.solr.rest.TestManagedResourceStorage

Error Message:
SolrCore.getOpenCount()==1

Stack Trace:
java.lang.RuntimeException: SolrCore.getOpenCount()==1
	at __randomizedtesting.SeedInfo.seed([F465419791631E17]:0)
	at org.apache.solr.util.TestHarness.close(TestHarness.java:380)
	at org.apache.solr.SolrTestCaseJ4.deleteCore(SolrTestCaseJ4.java:802)
	at org.apache.solr.cloud.AbstractZkTestCase.azt_afterClass(AbstractZkTestCase.java:147)
	at sun.reflect.NativeMethodAccessorImpl.invoke0(Native Method)
	at sun.reflect.NativeMethodAccessorImpl.invoke(NativeMethodAccessorImpl.java:62)
	at sun.reflect.DelegatingMethodAccessorImpl.invoke(DelegatingMethodAccessorImpl.java:43)
	at java.lang.reflect.Method.invoke(Method.java:498)
	at com.carrotsearch.randomizedtesting.RandomizedRunner.invoke(RandomizedRunner.java:1742)
	at com.carrotsearch.randomizedtesting.RandomizedRunner$7.evaluate(RandomizedRunner.java:898)
	at com.carrotsearch.randomizedtesting.rules.StatementAdapter.evaluate(StatementAdapter.java:36)
	at com.carrotsearch.randomizedtesting.rules.SystemPropertiesRestoreRule$1.evaluate(SystemPropertiesRestoreRule.java:57)
	at org.apache.lucene.util.AbstractBeforeAfterRule$1.evaluate(AbstractBeforeAfterRule.java:45)
	at com.carrotsearch.randomizedtesting.rules.StatementAdapter.evaluate(StatementAdapter.java:36)
	at org.apache.lucene.util.TestRuleStoreClassName$1.evaluate(TestRuleStoreClassName.java:41)
	at com.carrotsearch.randomizedtesting.rules.NoShadowingOrOverridesOnMethodsRule$1.evaluate(NoShadowingOrOverridesOnMethodsRule.java:40)
	at com.carrotsearch.randomizedtesting.rules.NoShadowingOrOverridesOnMethodsRule$1.evaluate(NoShadowingOrOverridesOnMethodsRule.java:40)
	at com.carrotsearch.randomizedtesting.rules.StatementAdapter.evaluate(StatementAdapter.java:36)
	at com.carrotsearch.randomizedtesting.rules.StatementAdapter.evaluate(StatementAdapter.java:36)
	at com.carrotsearch.randomizedtesting.rules.StatementAdapter.evaluate(StatementAdapter.java:36)
	at org.apache.lucene.util.TestRuleAssertionsRequired$1.evaluate(TestRuleAssertionsRequired.java:53)
	at org.apache.lucene.util.TestRuleMarkFailure$1.evaluate(TestRuleMarkFailure.java:47)
	at org.apache.lucene.util.TestRuleIgnoreAfterMaxFailures$1.evaluate(TestRuleIgnoreAfterMaxFailures.java:64)
	at org.apache.lucene.util.TestRuleIgnoreTestSuites$1.evaluate(TestRuleIgnoreTestSuites.java:54)
	at com.carrotsearch.randomizedtesting.rules.StatementAdapter.evaluate(StatementAdapter.java:36)
	at com.carrotsearch.randomizedtesting.ThreadLeakControl$StatementRunner.run(ThreadLeakControl.java:368)
	at java.lang.Thread.run(Thread.java:748)


FAILED:  junit.framework.TestSuite.org.apache.solr.rest.TestManagedResourceStorage

Error Message:
4 threads leaked from SUITE scope at org.apache.solr.rest.TestManagedResourceStorage:     1) Thread[id=4402, name=Thread-911, state=WAITING, group=TGRP-TestManagedResourceStorage]         at java.lang.Object.wait(Native Method)         at java.lang.Thread.join(Thread.java:1252)         at java.lang.Thread.join(Thread.java:1326)         at org.apache.zookeeper.server.NIOServerCnxnFactory.join(NIOServerCnxnFactory.java:313)         at org.apache.solr.cloud.ZkTestServer$ZKServerMain.runFromConfig(ZkTestServer.java:313)         at org.apache.solr.cloud.ZkTestServer$2.run(ZkTestServer.java:496)    2) Thread[id=4406, name=ProcessThread(sid:0 cport:55026):, state=WAITING, group=TGRP-TestManagedResourceStorage]         at sun.misc.Unsafe.park(Native Method)         at java.util.concurrent.locks.LockSupport.park(LockSupport.java:175)         at java.util.concurrent.locks.AbstractQueuedSynchronizer$ConditionObject.await(AbstractQueuedSynchronizer.java:2039)         at java.util.concurrent.LinkedBlockingQueue.take(LinkedBlockingQueue.java:442)         at org.apache.zookeeper.server.PrepRequestProcessor.run(PrepRequestProcessor.java:123)    3) Thread[id=4403, name=NIOServerCxn.Factory:0.0.0.0/0.0.0.0:0, state=RUNNABLE, group=TGRP-TestManagedResourceStorage]         at sun.nio.ch.DevPollArrayWrapper.poll0(Native Method)         at sun.nio.ch.DevPollArrayWrapper.poll(DevPollArrayWrapper.java:223)         at sun.nio.ch.DevPollSelectorImpl.doSelect(DevPollSelectorImpl.java:98)         at sun.nio.ch.SelectorImpl.lockAndDoSelect(SelectorImpl.java:86)         at sun.nio.ch.SelectorImpl.select(SelectorImpl.java:97)         at org.apache.zookeeper.server.NIOServerCnxnFactory.run(NIOServerCnxnFactory.java:196)         at java.lang.Thread.run(Thread.java:748)    4) Thread[id=4404, name=SessionTracker, state=TIMED_WAITING, group=TGRP-TestManagedResourceStorage]         at java.lang.Object.wait(Native Method)         at org.apache.zookeeper.server.SessionTrackerImpl.run(SessionTrackerImpl.java:147)

Stack Trace:
com.carrotsearch.randomizedtesting.ThreadLeakError: 4 threads leaked from SUITE scope at org.apache.solr.rest.TestManagedResourceStorage: 
   1) Thread[id=4402, name=Thread-911, state=WAITING, group=TGRP-TestManagedResourceStorage]
        at java.lang.Object.wait(Native Method)
        at java.lang.Thread.join(Thread.java:1252)
        at java.lang.Thread.join(Thread.java:1326)
        at org.apache.zookeeper.server.NIOServerCnxnFactory.join(NIOServerCnxnFactory.java:313)
        at org.apache.solr.cloud.ZkTestServer$ZKServerMain.runFromConfig(ZkTestServer.java:313)
        at org.apache.solr.cloud.ZkTestServer$2.run(ZkTestServer.java:496)
   2) Thread[id=4406, name=ProcessThread(sid:0 cport:55026):, state=WAITING, group=TGRP-TestManagedResourceStorage]
        at sun.misc.Unsafe.park(Native Method)
        at java.util.concurrent.locks.LockSupport.park(LockSupport.java:175)
        at java.util.concurrent.locks.AbstractQueuedSynchronizer$ConditionObject.await(AbstractQueuedSynchronizer.java:2039)
        at java.util.concurrent.LinkedBlockingQueue.take(LinkedBlockingQueue.java:442)
        at org.apache.zookeeper.server.PrepRequestProcessor.run(PrepRequestProcessor.java:123)
   3) Thread[id=4403, name=NIOServerCxn.Factory:0.0.0.0/0.0.0.0:0, state=RUNNABLE, group=TGRP-TestManagedResourceStorage]
        at sun.nio.ch.DevPollArrayWrapper.poll0(Native Method)
        at sun.nio.ch.DevPollArrayWrapper.poll(DevPollArrayWrapper.java:223)
        at sun.nio.ch.DevPollSelectorImpl.doSelect(DevPollSelectorImpl.java:98)
        at sun.nio.ch.SelectorImpl.lockAndDoSelect(SelectorImpl.java:86)
        at sun.nio.ch.SelectorImpl.select(SelectorImpl.java:97)
        at org.apache.zookeeper.server.NIOServerCnxnFactory.run(NIOServerCnxnFactory.java:196)
        at java.lang.Thread.run(Thread.java:748)
   4) Thread[id=4404, name=SessionTracker, state=TIMED_WAITING, group=TGRP-TestManagedResourceStorage]
        at java.lang.Object.wait(Native Method)
        at org.apache.zookeeper.server.SessionTrackerImpl.run(SessionTrackerImpl.java:147)
	at __randomizedtesting.SeedInfo.seed([F465419791631E17]:0)


FAILED:  junit.framework.TestSuite.org.apache.solr.rest.TestManagedResourceStorage

Error Message:
There are still zombie threads that couldn't be terminated:    1) Thread[id=4403, name=NIOServerCxn.Factory:0.0.0.0/0.0.0.0:0, state=RUNNABLE, group=TGRP-TestManagedResourceStorage]         at sun.nio.ch.DevPollArrayWrapper.poll0(Native Method)         at sun.nio.ch.DevPollArrayWrapper.poll(DevPollArrayWrapper.java:223)         at sun.nio.ch.DevPollSelectorImpl.doSelect(DevPollSelectorImpl.java:98)         at sun.nio.ch.SelectorImpl.lockAndDoSelect(SelectorImpl.java:86)         at sun.nio.ch.SelectorImpl.select(SelectorImpl.java:97)         at org.apache.zookeeper.server.NIOServerCnxnFactory.run(NIOServerCnxnFactory.java:196)         at java.lang.Thread.run(Thread.java:748)

Stack Trace:
com.carrotsearch.randomizedtesting.ThreadLeakError: There are still zombie threads that couldn't be terminated:
   1) Thread[id=4403, name=NIOServerCxn.Factory:0.0.0.0/0.0.0.0:0, state=RUNNABLE, group=TGRP-TestManagedResourceStorage]
        at sun.nio.ch.DevPollArrayWrapper.poll0(Native Method)
        at sun.nio.ch.DevPollArrayWrapper.poll(DevPollArrayWrapper.java:223)
        at sun.nio.ch.DevPollSelectorImpl.doSelect(DevPollSelectorImpl.java:98)
        at sun.nio.ch.SelectorImpl.lockAndDoSelect(SelectorImpl.java:86)
        at sun.nio.ch.SelectorImpl.select(SelectorImpl.java:97)
        at org.apache.zookeeper.server.NIOServerCnxnFactory.run(NIOServerCnxnFactory.java:196)
        at java.lang.Thread.run(Thread.java:748)
	at __randomizedtesting.SeedInfo.seed([F465419791631E17]:0)




Build Log:
[...truncated 12738 lines...]
   [junit4] Suite: org.apache.solr.rest.TestManagedResourceStorage
   [junit4]   2> 419011 INFO  (SUITE-TestManagedResourceStorage-seed#[F465419791631E17]-worker) [    ] o.a.s.SolrTestCaseJ4 SecureRandom sanity checks: test.solr.allowed.securerandom=null & java.security.egd=file:/dev/./urandom
   [junit4]   2> Creating dataDir: /export/home/jenkins/workspace/Lucene-Solr-master-Solaris/solr/build/solr-core/test/J0/temp/solr.rest.TestManagedResourceStorage_F465419791631E17-001/init-core-data-001
   [junit4]   2> 419011 WARN  (SUITE-TestManagedResourceStorage-seed#[F465419791631E17]-worker) [    ] o.a.s.SolrTestCaseJ4 startTrackingSearchers: numOpens=5 numCloses=5
   [junit4]   2> 419013 INFO  (SUITE-TestManagedResourceStorage-seed#[F465419791631E17]-worker) [    ] o.a.s.SolrTestCaseJ4 Using PointFields (NUMERIC_POINTS_SYSPROP=true) w/NUMERIC_DOCVALUES_SYSPROP=false
   [junit4]   2> 419015 INFO  (SUITE-TestManagedResourceStorage-seed#[F465419791631E17]-worker) [    ] o.a.s.SolrTestCaseJ4 Randomized ssl (false) and clientAuth (false) via: @org.apache.solr.util.RandomizeSSL(reason=, value=NaN, ssl=NaN, clientAuth=NaN)
   [junit4]   2> 419015 INFO  (SUITE-TestManagedResourceStorage-seed#[F465419791631E17]-worker) [    ] o.a.s.c.ZkTestServer STARTING ZK TEST SERVER
   [junit4]   2> 419015 INFO  (Thread-911) [    ] o.a.s.c.ZkTestServer client port:0.0.0.0/0.0.0.0:0
   [junit4]   2> 419015 INFO  (Thread-911) [    ] o.a.s.c.ZkTestServer Starting server
   [junit4]   2> 419018 ERROR (Thread-911) [    ] o.a.z.s.ZooKeeperServer ZKShutdownHandler is not registered, so ZooKeeper server won't take any action on ERROR or SHUTDOWN server state changes
   [junit4]   2> 419115 INFO  (SUITE-TestManagedResourceStorage-seed#[F465419791631E17]-worker) [    ] o.a.s.c.ZkTestServer start zk server on port:55026
   [junit4]   2> 419121 INFO  (zkConnectionManagerCallback-854-thread-1) [    ] o.a.s.c.c.ConnectionManager zkClient has connected
   [junit4]   2> 419132 INFO  (zkConnectionManagerCallback-856-thread-1) [    ] o.a.s.c.c.ConnectionManager zkClient has connected
   [junit4]   2> 419140 INFO  (SUITE-TestManagedResourceStorage-seed#[F465419791631E17]-worker) [    ] o.a.s.c.AbstractZkTestCase put /export/home/jenkins/workspace/Lucene-Solr-master-Solaris/solr/core/src/test-files/solr/collection1/conf/solrconfig.xml to /configs/conf1/solrconfig.xml
   [junit4]   2> 419143 INFO  (SUITE-TestManagedResourceStorage-seed#[F465419791631E17]-worker) [    ] o.a.s.c.AbstractZkTestCase put /export/home/jenkins/workspace/Lucene-Solr-master-Solaris/solr/core/src/test-files/solr/collection1/conf/schema.xml to /configs/conf1/schema.xml
   [junit4]   2> 419145 INFO  (SUITE-TestManagedResourceStorage-seed#[F465419791631E17]-worker) [    ] o.a.s.c.AbstractZkTestCase put /export/home/jenkins/workspace/Lucene-Solr-master-Solaris/solr/core/src/test-files/solr/collection1/conf/solrconfig.snippet.randomindexconfig.xml to /configs/conf1/solrconfig.snippet.randomindexconfig.xml
   [junit4]   2> 419147 INFO  (SUITE-TestManagedResourceStorage-seed#[F465419791631E17]-worker) [    ] o.a.s.c.AbstractZkTestCase put /export/home/jenkins/workspace/Lucene-Solr-master-Solaris/solr/core/src/test-files/solr/collection1/conf/stopwords.txt to /configs/conf1/stopwords.txt
   [junit4]   2> 419149 INFO  (SUITE-TestManagedResourceStorage-seed#[F465419791631E17]-worker) [    ] o.a.s.c.AbstractZkTestCase put /export/home/jenkins/workspace/Lucene-Solr-master-Solaris/solr/core/src/test-files/solr/collection1/conf/protwords.txt to /configs/conf1/protwords.txt
   [junit4]   2> 419150 INFO  (SUITE-TestManagedResourceStorage-seed#[F465419791631E17]-worker) [    ] o.a.s.c.AbstractZkTestCase put /export/home/jenkins/workspace/Lucene-Solr-master-Solaris/solr/core/src/test-files/solr/collection1/conf/currency.xml to /configs/conf1/currency.xml
   [junit4]   2> 419152 INFO  (SUITE-TestManagedResourceStorage-seed#[F465419791631E17]-worker) [    ] o.a.s.c.AbstractZkTestCase put /export/home/jenkins/workspace/Lucene-Solr-master-Solaris/solr/core/src/test-files/solr/collection1/conf/enumsConfig.xml to /configs/conf1/enumsConfig.xml
   [junit4]   2> 419154 INFO  (SUITE-TestManagedResourceStorage-seed#[F465419791631E17]-worker) [    ] o.a.s.c.AbstractZkTestCase put /export/home/jenkins/workspace/Lucene-Solr-master-Solaris/solr/core/src/test-files/solr/collection1/conf/open-exchange-rates.json to /configs/conf1/open-exchange-rates.json
   [junit4]   2> 419156 INFO  (SUITE-TestManagedResourceStorage-seed#[F465419791631E17]-worker) [    ] o.a.s.c.AbstractZkTestCase put /export/home/jenkins/workspace/Lucene-Solr-master-Solaris/solr/core/src/test-files/solr/collection1/conf/mapping-ISOLatin1Accent.txt to /configs/conf1/mapping-ISOLatin1Accent.txt
   [junit4]   2> 419158 INFO  (SUITE-TestManagedResourceStorage-seed#[F465419791631E17]-worker) [    ] o.a.s.c.AbstractZkTestCase put /export/home/jenkins/workspace/Lucene-Solr-master-Solaris/solr/core/src/test-files/solr/collection1/conf/old_synonyms.txt to /configs/conf1/old_synonyms.txt
   [junit4]   2> 419159 INFO  (SUITE-TestManagedResourceStorage-seed#[F465419791631E17]-worker) [    ] o.a.s.c.AbstractZkTestCase put /export/home/jenkins/workspace/Lucene-Solr-master-Solaris/solr/core/src/test-files/solr/collection1/conf/synonyms.txt to /configs/conf1/synonyms.txt
   [junit4]   2> 419162 INFO  (SUITE-TestManagedResourceStorage-seed#[F465419791631E17]-worker) [    ] o.a.s.SolrTestCaseJ4 ####initCore
   [junit4]   2> 419162 INFO  (SUITE-TestManagedResourceStorage-seed#[F465419791631E17]-worker) [    ] o.a.s.c.SolrResourceLoader [null] Added 2 libs to classloader, from paths: [/export/home/jenkins/workspace/Lucene-Solr-master-Solaris/solr/core/src/test-files/solr/collection1/lib, /export/home/jenkins/workspace/Lucene-Solr-master-Solaris/solr/core/src/test-files/solr/collection1/lib/classes]
   [junit4]   2> 419181 INFO  (SUITE-TestManagedResourceStorage-seed#[F465419791631E17]-worker) [    ] o.a.s.c.SolrConfig Using Lucene MatchVersion: 8.0.0
   [junit4]   2> 419205 INFO  (SUITE-TestManagedResourceStorage-seed#[F465419791631E17]-worker) [    ] o.a.s.s.IndexSchema [null] Schema name=test
   [junit4]   2> 419257 INFO  (SUITE-TestManagedResourceStorage-seed#[F465419791631E17]-worker) [    ] o.a.s.s.IndexSchema Loaded schema test/1.0 with uniqueid field id
   [junit4]   2> 419561 INFO  (SUITE-TestManagedResourceStorage-seed#[F465419791631E17]-worker) [    ] o.a.s.c.ZkContainer Zookeeper client=127.0.0.1:55026/solr
   [junit4]   2> 419564 INFO  (zkConnectionManagerCallback-860-thread-1) [    ] o.a.s.c.c.ConnectionManager zkClient has connected
   [junit4]   2> 419568 INFO  (zkConnectionManagerCallback-862-thread-1) [    ] o.a.s.c.c.ConnectionManager zkClient has connected
   [junit4]   2> 419731 INFO  (SUITE-TestManagedResourceStorage-seed#[F465419791631E17]-worker) [n:127.0.0.1:8983_    ] o.a.s.c.OverseerElectionContext I am going to be the leader 127.0.0.1:8983_
   [junit4]   2> 419732 INFO  (SUITE-TestManagedResourceStorage-seed#[F465419791631E17]-worker) [n:127.0.0.1:8983_    ] o.a.s.c.Overseer Overseer (id=72099585228603395-127.0.0.1:8983_-n_0000000000) starting
   [junit4]   2> 419743 INFO  (zkConnectionManagerCallback-869-thread-1) [    ] o.a.s.c.c.ConnectionManager zkClient has connected
   [junit4]   2> 419746 INFO  (SUITE-TestManagedResourceStorage-seed#[F465419791631E17]-worker) [n:127.0.0.1:8983_    ] o.a.s.c.s.i.ZkClientClusterStateProvider Cluster at 127.0.0.1:55026/solr ready
   [junit4]   2> 419747 INFO  (OverseerStateUpdate-72099585228603395-127.0.0.1:8983_-n_0000000000) [n:127.0.0.1:8983_    ] o.a.s.c.Overseer Starting to work on the main queue : 127.0.0.1:8983_
   [junit4]   2> 419748 INFO  (SUITE-TestManagedResourceStorage-seed#[F465419791631E17]-worker) [n:127.0.0.1:8983_    ] o.a.s.c.ZkController Register node as live in ZooKeeper:/live_nodes/127.0.0.1:8983_
   [junit4]   2> 419752 INFO  (OverseerStateUpdate-72099585228603395-127.0.0.1:8983_-n_0000000000) [n:127.0.0.1:8983_    ] o.a.s.c.c.ZkStateReader Updated live nodes from ZooKeeper... (0) -> (1)
   [junit4]   2> 419758 INFO  (zkCallback-868-thread-1) [    ] o.a.s.c.c.ZkStateReader Updated live nodes from ZooKeeper... (0) -> (1)
   [junit4]   2> 419772 INFO  (SUITE-TestManagedResourceStorage-seed#[F465419791631E17]-worker) [n:127.0.0.1:8983_    ] o.a.s.h.a.MetricsHistoryHandler No .system collection, keeping metrics history in memory.
   [junit4]   2> 419798 INFO  (SUITE-TestManagedResourceStorage-seed#[F465419791631E17]-worker) [n:127.0.0.1:8983_    ] o.a.s.m.r.SolrJmxReporter JMX monitoring for 'solr.node' (registry 'solr.node') enabled at server: com.sun.jmx.mbeanserver.JmxMBeanServer@58c91144
   [junit4]   2> 419802 INFO  (SUITE-TestManagedResourceStorage-seed#[F465419791631E17]-worker) [n:127.0.0.1:8983_    ] o.a.s.m.r.SolrJmxReporter JMX monitoring for 'solr.jvm' (registry 'solr.jvm') enabled at server: com.sun.jmx.mbeanserver.JmxMBeanServer@58c91144
   [junit4]   2> 419802 INFO  (SUITE-TestManagedResourceStorage-seed#[F465419791631E17]-worker) [n:127.0.0.1:8983_    ] o.a.s.m.r.SolrJmxReporter JMX monitoring for 'solr.jetty' (registry 'solr.jetty') enabled at server: com.sun.jmx.mbeanserver.JmxMBeanServer@58c91144
   [junit4]   2> 419804 INFO  (coreLoadExecutor-1428-thread-1-processing-n:127.0.0.1:8983_) [n:127.0.0.1:8983_    ] o.a.s.c.TransientSolrCoreCacheDefault Allocating transient cache for 2147483647 transient cores
   [junit4]   2> 420812 INFO  (coreLoadExecutor-1428-thread-1-processing-n:127.0.0.1:8983_) [n:127.0.0.1:8983_ c:collection1 s:shard1  x:collection1] o.a.s.c.SolrResourceLoader [null] Added 2 libs to classloader, from paths: [/export/home/jenkins/workspace/Lucene-Solr-master-Solaris/solr/core/src/test-files/solr/collection1/lib, /export/home/jenkins/workspace/Lucene-Solr-master-Solaris/solr/core/src/test-files/solr/collection1/lib/classes]
   [junit4]   2> 420841 INFO  (coreLoadExecutor-1428-thread-1-processing-n:127.0.0.1:8983_) [n:127.0.0.1:8983_ c:collection1 s:shard1  x:collection1] o.a.s.c.SolrConfig Using Lucene MatchVersion: 8.0.0
   [junit4]   2> 420864 INFO  (coreLoadExecutor-1428-thread-1-processing-n:127.0.0.1:8983_) [n:127.0.0.1:8983_ c:collection1 s:shard1  x:collection1] o.a.s.s.IndexSchema [collection1] Schema name=test
   [junit4]   2> 420919 INFO  (coreLoadExecutor-1428-thread-1-processing-n:127.0.0.1:8983_) [n:127.0.0.1:8983_ c:collection1 s:shard1  x:collection1] o.a.s.s.IndexSchema Loaded schema test/1.0 with uniqueid field id
   [junit4]   2> 420942 INFO  (coreLoadExecutor-1428-thread-1-processing-n:127.0.0.1:8983_) [n:127.0.0.1:8983_ c:collection1 s:shard1  x:collection1] o.a.s.c.CoreContainer Creating SolrCore 'collection1' using configuration from collection collection1, trusted=true
   [junit4]   2> 420942 INFO  (coreLoadExecutor-1428-thread-1-processing-n:127.0.0.1:8983_) [n:127.0.0.1:8983_ c:collection1 s:shard1  x:collection1] o.a.s.m.r.SolrJmxReporter JMX monitoring for 'solr.core.collection1.shard1.127.0.0.1:8983__collection1' (registry 'solr.core.collection1.shard1.127.0.0.1:8983__collection1') enabled at server: com.sun.jmx.mbeanserver.JmxMBeanServer@58c91144
   [junit4]   2> 420942 INFO  (coreLoadExecutor-1428-thread-1-processing-n:127.0.0.1:8983_) [n:127.0.0.1:8983_ c:collection1 s:shard1  x:collection1] o.a.s.c.SolrCore [[collection1] ] Opening new SolrCore at [/export/home/jenkins/workspace/Lucene-Solr-master-Solaris/solr/core/src/test-files/solr/collection1], dataDir=[/export/home/jenkins/workspace/Lucene-Solr-master-Solaris/solr/build/solr-core/test/J0/temp/solr.rest.TestManagedResourceStorage_F465419791631E17-001/init-core-data-001/]
   [junit4]   2> 420943 INFO  (coreLoadExecutor-1428-thread-1-processing-n:127.0.0.1:8983_) [n:127.0.0.1:8983_ c:collection1 s:shard1  x:collection1] o.a.s.u.RandomMergePolicy RandomMergePolicy wrapping class org.apache.lucene.index.TieredMergePolicy: [TieredMergePolicy: maxMergeAtOnce=13, maxMergeAtOnceExplicit=32, maxMergedSegmentMB=50.1376953125, floorSegmentMB=0.4453125, forceMergeDeletesPctAllowed=19.23098100885198, segmentsPerTier=39.0, maxCFSSegmentSizeMB=8.796093022207999E12, noCFSRatio=0.8007630693197345, deletesPctAllowed=42.412192158432134
   [junit4]   2> 420999 INFO  (coreLoadExecutor-1428-thread-1-processing-n:127.0.0.1:8983_) [n:127.0.0.1:8983_ c:collection1 s:shard1  x:collection1] o.a.s.u.UpdateHandler Using UpdateLog implementation: org.apache.solr.update.UpdateLog
   [junit4]   2> 420999 INFO  (coreLoadExecutor-1428-thread-1-processing-n:127.0.0.1:8983_) [n:127.0.0.1:8983_ c:collection1 s:shard1  x:collection1] o.a.s.u.UpdateLog Initializing UpdateLog: dataDir= defaultSyncLevel=FLUSH numRecordsToKeep=100 maxNumLogsToKeep=10 numVersionBuckets=65536
   [junit4]   2> 420999 INFO  (coreLoadExecutor-1428-thread-1-processing-n:127.0.0.1:8983_) [n:127.0.0.1:8983_ c:collection1 s:shard1  x:collection1] o.a.s.u.CommitTracker Hard AutoCommit: disabled
   [junit4]   2> 420999 INFO  (coreLoadExecutor-1428-thread-1-processing-n:127.0.0.1:8983_) [n:127.0.0.1:8983_ c:collection1 s:shard1  x:collection1] o.a.s.u.CommitTracker Soft AutoCommit: disabled
   [junit4]   2> 421000 INFO  (coreLoadExecutor-1428-thread-1-processing-n:127.0.0.1:8983_) [n:127.0.0.1:8983_ c:collection1 s:shard1  x:collection1] o.a.s.u.RandomMergePolicy RandomMergePolicy wrapping class org.apache.lucene.index.TieredMergePolicy: [TieredMergePolicy: maxMergeAtOnce=19, maxMergeAtOnceExplicit=39, maxMergedSegmentMB=89.1865234375, floorSegmentMB=0.373046875, forceMergeDeletesPctAllowed=24.50071589176812, segmentsPerTier=42.0, maxCFSSegmentSizeMB=8.796093022207999E12, noCFSRatio=0.7456844114856621, deletesPctAllowed=27.298942331065376
   [junit4]   2> 421000 INFO  (coreLoadExecutor-1428-thread-1-processing-n:127.0.0.1:8983_) [n:127.0.0.1:8983_ c:collection1 s:shard1  x:collection1] o.a.s.s.SolrIndexSearcher Opening [Searcher@10edd7e6[collection1] main]
   [junit4]   2> 421001 INFO  (coreLoadExecutor-1428-thread-1-processing-n:127.0.0.1:8983_) [n:127.0.0.1:8983_ c:collection1 s:shard1  x:collection1] o.a.s.h.c.SpellCheckComponent Initializing spell checkers
   [junit4]   2> 421045 INFO  (coreLoadExecutor-1428-thread-1-processing-n:127.0.0.1:8983_) [n:127.0.0.1:8983_ c:collection1 s:shard1  x:collection1] o.a.s.s.DirectSolrSpellChecker init: {name=direct,classname=DirectSolrSpellChecker,field=lowerfilt,minQueryLength=3}
   [junit4]   2> 421182 INFO  (coreLoadExecutor-1428-thread-1-processing-n:127.0.0.1:8983_) [n:127.0.0.1:8983_ c:collection1 s:shard1  x:collection1] o.a.s.h.ReplicationHandler Commits will be reserved for 10000ms.
   [junit4]   2> 421182 INFO  (coreLoadExecutor-1428-thread-1-processing-n:127.0.0.1:8983_) [n:127.0.0.1:8983_ c:collection1 s:shard1  x:collection1] o.a.s.u.UpdateLog Could not find max version in index or recent updates, using new clock 1613159459770597376
   [junit4]   2> 421182 INFO  (searcherExecutor-1429-thread-1-processing-n:127.0.0.1:8983_ x:collection1 c:collection1 s:shard1) [n:127.0.0.1:8983_ c:collection1 s:shard1  x:collection1] o.a.s.h.c.SpellCheckComponent Loading spell index for spellchecker: default
   [junit4]   2> 421183 INFO  (searcherExecutor-1429-thread-1-processing-n:127.0.0.1:8983_ x:collection1 c:collection1 s:shard1) [n:127.0.0.1:8983_ c:collection1 s:shard1  x:collection1] o.a.s.h.c.SpellCheckComponent Loading spell index for spellchecker: direct
   [junit4]   2> 421183 INFO  (searcherExecutor-1429-thread-1-processing-n:127.0.0.1:8983_ x:collection1 c:collection1 s:shard1) [n:127.0.0.1:8983_ c:collection1 s:shard1  x:collection1] o.a.s.h.c.SpellCheckComponent Loading spell index for spellchecker: wordbreak
   [junit4]   2> 421183 INFO  (searcherExecutor-1429-thread-1-processing-n:127.0.0.1:8983_ x:collection1 c:collection1 s:shard1) [n:127.0.0.1:8983_ c:collection1 s:shard1  x:collection1] o.a.s.h.c.SpellCheckComponent Loading spell index for spellchecker: multipleFields
   [junit4]   2> 421183 INFO  (searcherExecutor-1429-thread-1-processing-n:127.0.0.1:8983_ x:collection1 c:collection1 s:shard1) [n:127.0.0.1:8983_ c:collection1 s:shard1  x:collection1] o.a.s.h.c.SpellCheckComponent Loading spell index for spellchecker: jarowinkler
   [junit4]   2> 421184 INFO  (searcherExecutor-1429-thread-1-processing-n:127.0.0.1:8983_ x:collection1 c:collection1 s:shard1) [n:127.0.0.1:8983_ c:collection1 s:shard1  x:collection1] o.a.s.h.c.SpellCheckComponent Loading spell index for spellchecker: external
   [junit4]   2> 421184 INFO  (searcherExecutor-1429-thread-1-processing-n:127.0.0.1:8983_ x:collection1 c:collection1 s:shard1) [n:127.0.0.1:8983_ c:collection1 s:shard1  x:collection1] o.a.s.h.c.SpellCheckComponent Loading spell index for spellchecker: freq
   [junit4]   2> 421185 INFO  (searcherExecutor-1429-thread-1-processing-n:127.0.0.1:8983_ x:collection1 c:collection1 s:shard1) [n:127.0.0.1:8983_ c:collection1 s:shard1  x:collection1] o.a.s.h.c.SpellCheckComponent Loading spell index for spellchecker: fqcn
   [junit4]   2> 421185 INFO  (searcherExecutor-1429-thread-1-processing-n:127.0.0.1:8983_ x:collection1 c:collection1 s:shard1) [n:127.0.0.1:8983_ c:collection1 s:shard1  x:collection1] o.a.s.h.c.SpellCheckComponent Loading spell index for spellchecker: perDict
   [junit4]   2> 421186 INFO  (searcherExecutor-1429-thread-1-processing-n:127.0.0.1:8983_ x:collection1 c:collection1 s:shard1) [n:127.0.0.1:8983_ c:collection1 s:shard1  x:collection1] o.a.s.c.SolrCore [collection1] Registered new searcher Searcher@10edd7e6[collection1] main{ExitableDirectoryReader(UninvertingDirectoryReader())}
   [junit4]   2> 421188 INFO  (SUITE-TestManagedResourceStorage-seed#[F465419791631E17]-worker) [n:127.0.0.1:8983_    ] o.a.s.SolrTestCaseJ4 ####initCore end
   [junit4]   2> 421236 INFO  (coreZkRegister-1416-thread-1-processing-n:127.0.0.1:8983_ x:collection1 c:collection1 s:shard1) [n:127.0.0.1:8983_ c:collection1 s:shard1 r:127.0.0.1:8983__collection1 x:collection1] o.a.s.c.ZkShardTerms Successful update of terms at /collections/collection1/terms/shard1 to Terms{values={127.0.0.1:8983__collection1=0}, version=0}
   [junit4]   2> 421258 INFO  (TEST-TestManagedResourceStorage.testZkBasedJsonStorage-seed#[F465419791631E17]) [n:127.0.0.1:8983_    ] o.a.s.SolrTestCaseJ4 ###Starting testZkBasedJsonStorage
   [junit4]   2> 421260 INFO  (TEST-TestManagedResourceStorage.testZkBasedJsonStorage-seed#[F465419791631E17]) [n:127.0.0.1:8983_    ] o.a.s.r.ManagedResourceStorage Configured ZooKeeperStorageIO with znodeBase: /test
   [junit4]   2> 421262 INFO  (coreZkRegister-1416-thread-1-processing-n:127.0.0.1:8983_ x:collection1 c:collection1 s:shard1) [n:127.0.0.1:8983_ c:collection1 s:shard1 r:127.0.0.1:8983__collection1 x:collection1] o.a.s.c.ShardLeaderElectionContext Enough replicas found to continue.
   [junit4]   2> 421262 INFO  (coreZkRegister-1416-thread-1-processing-n:127.0.0.1:8983_ x:collection1 c:collection1 s:shard1) [n:127.0.0.1:8983_ c:collection1 s:shard1 r:127.0.0.1:8983__collection1 x:collection1] o.a.s.c.ShardLeaderElectionContext I may be the new leader - try and sync
   [junit4]   2> 421263 INFO  (coreZkRegister-1416-thread-1-processing-n:127.0.0.1:8983_ x:collection1 c:collection1 s:shard1) [n:127.0.0.1:8983_ c:collection1 s:shard1 r:127.0.0.1:8983__collection1 x:collection1] o.a.s.c.ShardLeaderElectionContext Found all replicas participating in election, clear LIR
   [junit4]   2> 421263 INFO  (TEST-TestManagedResourceStorage.testZkBasedJsonStorage-seed#[F465419791631E17]) [n:127.0.0.1:8983_    ] o.a.s.r.ManagedResourceStorage Wrote 136 bytes to new znode /test/_test_foo.json
   [junit4]   2> 421263 INFO  (TEST-TestManagedResourceStorage.testZkBasedJsonStorage-seed#[F465419791631E17]) [n:127.0.0.1:8983_    ] o.a.s.r.ManagedResourceStorage Saved JSON object to path _test_foo.json using ZooKeeperStorageIO:path=/test
   [junit4]   2> 421264 INFO  (TEST-TestManagedResourceStorage.testZkBasedJsonStorage-seed#[F465419791631E17]) [n:127.0.0.1:8983_    ] o.a.s.r.ManagedResourceStorage Loaded LinkedHashMap at path _test_foo.json using ZooKeeperStorageIO:path=/test
   [junit4]   2> 421265 INFO  (TEST-TestManagedResourceStorage.testZkBasedJsonStorage-seed#[F465419791631E17]) [n:127.0.0.1:8983_    ] o.a.s.r.ManagedResourceStorage Wrote 175 bytes to existing znode /test/_test_foo.json
   [junit4]   2> 421265 INFO  (TEST-TestManagedResourceStorage.testZkBasedJsonStorage-seed#[F465419791631E17]) [n:127.0.0.1:8983_    ] o.a.s.r.ManagedResourceStorage Saved JSON object to path _test_foo.json using ZooKeeperStorageIO:path=/test
   [junit4]   2> 421266 INFO  (TEST-TestManagedResourceStorage.testZkBasedJsonStorage-seed#[F465419791631E17]) [n:127.0.0.1:8983_    ] o.a.s.r.ManagedResourceStorage Loaded LinkedHashMap at path _test_foo.json using ZooKeeperStorageIO:path=/test
   [junit4]   2> 421266 INFO  (TEST-TestManagedResourceStorage.testZkBasedJsonStorage-seed#[F465419791631E17]) [n:127.0.0.1:8983_    ] o.a.s.SolrTestCaseJ4 ###Ending testZkBasedJsonStorage
   [junit4]   2> 421335 INFO  (TEST-TestManagedResourceStorage.testFileBasedJsonStorage-seed#[F465419791631E17]) [n:127.0.0.1:8983_    ] o.a.s.SolrTestCaseJ4 ###Starting testFileBasedJsonStorage
   [junit4]   2> 421336 INFO  (coreZkRegister-1416-thread-1-processing-n:127.0.0.1:8983_ x:collection1 c:collection1 s:shard1) [n:127.0.0.1:8983_ c:collection1 s:shard1 r:127.0.0.1:8983__collection1 x:collection1] o.a.s.c.ShardLeaderElectionContext I am the new leader: http://127.0.0.1:8983/collection1/ shard1
   [junit4]   2> 421336 INFO  (TEST-TestManagedResourceStorage.testFileBasedJsonStorage-seed#[F465419791631E17]) [n:127.0.0.1:8983_    ] o.a.s.r.ManagedResourceStorage File-based storage initialized to use dir: /export/home/jenkins/workspace/Lucene-Solr-master-Solaris/solr/build/solr-core/test/J0/temp/solr.rest.TestManagedResourceStorage_F465419791631E17-001/json-storage-001/managed
   [junit4]   2> 421336 INFO  (TEST-TestManagedResourceStorage.testFileBasedJsonStorage-seed#[F465419791631E17]) [n:127.0.0.1:8983_    ] o.a.s.r.ManagedResourceStorage Saved JSON object to path _test_foo.json using file:dir=/export/home/jenkins/workspace/Lucene-Solr-master-Solaris/solr/build/solr-core/test/J0/temp/solr.rest.TestManagedResourceStorage_F465419791631E17-001/json-storage-001/managed
   [junit4]   2> 421336 INFO  (TEST-TestManagedResourceStorage.testFileBasedJsonStorage-seed#[F465419791631E17]) [n:127.0.0.1:8983_    ] o.a.s.r.ManagedResourceStorage Loaded LinkedHashMap at path _test_foo.json using file:dir=/export/home/jenkins/workspace/Lucene-Solr-master-Solaris/solr/build/solr-core/test/J0/temp/solr.rest.TestManagedResourceStorage_F465419791631E17-001/json-storage-001/managed
   [junit4]   2> 421336 INFO  (TEST-TestManagedResourceStorage.testFileBasedJsonStorage-seed#[F465419791631E17]) [n:127.0.0.1:8983_    ] o.a.s.r.ManagedResourceStorage Saved JSON object to path _test_foo.json using file:dir=/export/home/jenkins/workspace/Lucene-Solr-master-Solaris/solr/build/solr-core/test/J0/temp/solr.rest.TestManagedResourceStorage_F465419791631E17-001/json-storage-001/managed
   [junit4]   2> 421336 INFO  (TEST-TestManagedResourceStorage.testFileBasedJsonStorage-seed#[F465419791631E17]) [n:127.0.0.1:8983_    ] o.a.s.r.ManagedResourceStorage Loaded LinkedHashMap at path _test_foo.json using file:dir=/export/home/jenkins/workspace/Lucene-Solr-master-Solaris/solr/build/solr-core/test/J0/temp/solr.rest.TestManagedResourceStorage_F465419791631E17-001/json-storage-001/managed
   [junit4]   2> 421336 INFO  (TEST-TestManagedResourceStorage.testFileBasedJsonStorage-seed#[F465419791631E17]) [n:127.0.0.1:8983_    ] o.a.s.SolrTestCaseJ4 ###Ending testFileBasedJsonStorage
   [junit4]   2> 421336 INFO  (SUITE-TestManagedResourceStorage-seed#[F465419791631E17]-worker) [n:127.0.0.1:8983_    ] o.a.s.SolrTestCaseJ4 ###deleteCore
   [junit4]   2> 421336 INFO  (SUITE-TestManagedResourceStorage-seed#[F465419791631E17]-worker) [n:127.0.0.1:8983_    ] o.a.s.SolrTestCaseJ4 ###deleteCore
   [junit4]   2> 421340 INFO  (SUITE-TestManagedResourceStorage-seed#[F465419791631E17]-worker) [n:127.0.0.1:8983_    ] o.a.s.c.CoreContainer Shutting down CoreContainer instance=977579805
   [junit4]   2> 421340 INFO  (SUITE-TestManagedResourceStorage-seed#[F465419791631E17]-worker) [n:127.0.0.1:8983_    ] o.a.s.m.SolrMetricManager Closing metric reporters for registry=solr.node, tag=null
   [junit4]   2> 421341 INFO  (SUITE-TestManagedResourceStorage-seed#[F465419791631E17]-worker) [n:127.0.0.1:8983_    ] o.a.s.m.r.SolrJmxReporter Closing reporter [org.apache.solr.metrics.reporters.SolrJmxReporter@3b3edbe: rootName = null, domain = solr.node, service url = null, agent id = null] for registry solr.node / com.codahale.metrics.MetricRegistry@7a3c99b
   [junit4]   2> 421344 INFO  (SUITE-TestManagedResourceStorage-seed#[F465419791631E17]-worker) [n:127.0.0.1:8983_    ] o.a.s.m.SolrMetricManager Closing metric reporters for registry=solr.jvm, tag=null
   [junit4]   2> 421344 INFO  (SUITE-TestManagedResourceStorage-seed#[F465419791631E17]-worker) [n:127.0.0.1:8983_    ] o.a.s.m.r.SolrJmxReporter Closing reporter [org.apache.solr.metrics.reporters.SolrJmxReporter@21f23282: rootName = null, domain = solr.jvm, service url = null, agent id = null] for registry solr.jvm / com.codahale.metrics.MetricRegistry@1f11ede6
   [junit4]   2> 421345 INFO  (SUITE-TestManagedResourceStorage-seed#[F465419791631E17]-worker) [n:127.0.0.1:8983_    ] o.a.s.m.SolrMetricManager Closing metric reporters for registry=solr.jetty, tag=null
   [junit4]   2> 421345 INFO  (SUITE-TestManagedResourceStorage-seed#[F465419791631E17]-worker) [n:127.0.0.1:8983_    ] o.a.s.m.r.SolrJmxReporter Closing reporter [org.apache.solr.metrics.reporters.SolrJmxReporter@1c61842e: rootName = null, domain = solr.jetty, service url = null, agent id = null] for registry solr.jetty / com.codahale.metrics.MetricRegistry@5975d8ad
   [junit4]   2> 421348 INFO  (SUITE-TestManagedResourceStorage-seed#[F465419791631E17]-worker) [n:127.0.0.1:8983_    ] o.a.s.c.ZkController Remove node as live in ZooKeeper:/live_nodes/127.0.0.1:8983_
   [junit4]   2> 421349 INFO  (SUITE-TestManagedResourceStorage-seed#[F465419791631E17]-worker) [n:127.0.0.1:8983_    ] o.a.s.m.SolrMetricManager Closing metric reporters for registry=solr.cluster, tag=null
   [junit4]   2> 421349 INFO  (zkCallback-861-thread-1) [    ] o.a.s.c.c.ZkStateReader Updated live nodes from ZooKeeper... (1) -> (0)
   [junit4]   2> 421349 INFO  (zkCallback-868-thread-1) [    ] o.a.s.c.c.ZkStateReader Updated live nodes from ZooKeeper... (1) -> (0)
   [junit4]   2> 421353 INFO  (coreCloseExecutor-1434-thread-1-processing-n:127.0.0.1:8983_) [n:127.0.0.1:8983_ c:collection1 s:shard1 r:127.0.0.1:8983__collection1 x:collection1] o.a.s.c.SolrCore [collection1]  CLOSING SolrCore org.apache.solr.core.SolrCore@e30739f
   [junit4]   2> 421354 INFO  (coreCloseExecutor-1434-thread-1-processing-n:127.0.0.1:8983_) [n:127.0.0.1:8983_ c:collection1 s:shard1 r:127.0.0.1:8983__collection1 x:collection1] o.a.s.m.SolrMetricManager Closing metric reporters for registry=solr.core.collection1.shard1.127.0.0.1:8983__collection1, tag=e30739f
   [junit4]   2> 421354 INFO  (coreCloseExecutor-1434-thread-1-processing-n:127.0.0.1:8983_) [n:127.0.0.1:8983_ c:collection1 s:shard1 r:127.0.0.1:8983__collection1 x:collection1] o.a.s.m.r.SolrJmxReporter Closing reporter [org.apache.solr.metrics.reporters.SolrJmxReporter@40177d6c: rootName = null, domain = solr.core.collection1.shard1.127.0.0.1:8983__collection1, service url = null, agent id = null] for registry solr.core.collection1.shard1.127.0.0.1:8983__collection1 / com.codahale.metrics.MetricRegistry@2be89a4e
   [junit4]   2> 421360 INFO  (coreCloseExecutor-1434-thread-1-processing-n:127.0.0.1:8983_) [n:127.0.0.1:8983_ c:collection1 s:shard1 r:127.0.0.1:8983__collection1 x:collection1] o.a.s.m.SolrMetricManager Closing metric reporters for registry=solr.collection.collection1.shard1.leader, tag=e30739f
   [junit4]   2> 421384 INFO  (SUITE-TestManagedResourceStorage-seed#[F465419791631E17]-worker) [n:127.0.0.1:8983_    ] o.a.s.c.Overseer Overseer (id=72099585228603395-127.0.0.1:8983_-n_0000000000) closing
   [junit4]   2> 421384 INFO  (OverseerStateUpdate-72099585228603395-127.0.0.1:8983_-n_0000000000) [n:127.0.0.1:8983_    ] o.a.s.c.Overseer Overseer Loop exiting : 127.0.0.1:8983_
   [junit4]   2> 421384 WARN  (OverseerAutoScalingTriggerThread-72099585228603395-127.0.0.1:8983_-n_0000000000) [    ] o.a.s.c.a.OverseerTriggerThread OverseerTriggerThread woken up but we are closed, exiting.
   [junit4]   2> 421391 ERROR (coreZkRegister-1416-thread-1-processing-n:127.0.0.1:8983_ x:collection1 c:collection1 s:shard1) [n:127.0.0.1:8983_ c:collection1 s:shard1 r:127.0.0.1:8983__collection1 x:collection1] o.a.s.c.ZkController Error getting leader from zk
   [junit4]   2> org.apache.solr.common.SolrException: No registered leader was found after waiting for 1560000ms , collection: collection1 slice: shard1 saw state=DocCollection(collection1//clusterstate.json/1)={
   [junit4]   2>   "shards":{"shard1":{
   [junit4]   2>       "parent":null,
   [junit4]   2>       "range":null,
   [junit4]   2>       "state":"active",
   [junit4]   2>       "replicas":{"127.0.0.1:8983__collection1":{
   [junit4]   2>           "core":"collection1",
   [junit4]   2>           "base_url":"http://127.0.0.1:8983",
   [junit4]   2>           "node_name":"127.0.0.1:8983_",
   [junit4]   2>           "state":"down",
   [junit4]   2>           "type":"NRT"}}}},
   [junit4]   2>   "router":{"name":"implicit"}} with live_nodes=[]
   [junit4]   2> 	at org.apache.solr.common.cloud.ZkStateReader.getLeaderRetry(ZkStateReader.java:861) ~[java/:?]
   [junit4]   2> 	at org.apache.solr.common.cloud.ZkStateReader.getLeaderUrl(ZkStateReader.java:826) ~[java/:?]
   [junit4]   2> 	at org.apache.solr.cloud.ZkController.getLeader(ZkController.java:1269) ~[java/:?]
   [junit4]   2> 	at org.apache.solr.cloud.ZkController.register(ZkController.java:1149) ~[java/:?]
   [junit4]   2> 	at org.apache.solr.cloud.ZkController.register(ZkController.java:1080) ~[java/:?]
   [junit4]   2> 	at org.apache.solr.core.ZkContainer.lambda$registerInZk$0(ZkContainer.java:187) ~[java/:?]
   [junit4]   2> 	at org.apache.solr.common.util.ExecutorUtil$MDCAwareThreadPoolExecutor.lambda$execute$0(ExecutorUtil.java:209) ~[java/:?]
   [junit4]   2> 	at java.util.concurrent.ThreadPoolExecutor.runWorker(ThreadPoolExecutor.java:1149) [?:1.8.0_172]
   [junit4]   2> 	at java.util.concurrent.ThreadPoolExecutor$Worker.run(ThreadPoolExecutor.java:624) [?:1.8.0_172]
   [junit4]   2> 	at java.lang.Thread.run(Thread.java:748) [?:1.8.0_172]
   [junit4]   2> 421396 ERROR (coreZkRegister-1416-thread-1-processing-n:127.0.0.1:8983_ x:collection1 c:collection1 s:shard1) [n:127.0.0.1:8983_ c:collection1 s:shard1 r:127.0.0.1:8983__collection1 x:collection1] o.a.s.c.ZkContainer :org.apache.solr.common.SolrException: Error getting leader from zk for shard shard1
   [junit4]   2> 	at org.apache.solr.cloud.ZkController.getLeader(ZkController.java:1298)
   [junit4]   2> 	at org.apache.solr.cloud.ZkController.register(ZkController.java:1149)
   [junit4]   2> 	at org.apache.solr.cloud.ZkController.register(ZkController.java:1080)
   [junit4]   2> 	at org.apache.solr.core.ZkContainer.lambda$registerInZk$0(ZkContainer.java:187)
   [junit4]   2> 	at org.apache.solr.common.util.ExecutorUtil$MDCAwareThreadPoolExecutor.lambda$execute$0(ExecutorUtil.java:209)
   [junit4]   2> 	at java.util.concurrent.ThreadPoolExecutor.runWorker(ThreadPoolExecutor.java:1149)
   [junit4]   2> 	at java.util.concurrent.ThreadPoolExecutor$Worker.run(ThreadPoolExecutor.java:624)
   [junit4]   2> 	at java.lang.Thread.run(Thread.java:748)
   [junit4]   2> Caused by: org.apache.solr.common.SolrException: No registered leader was found after waiting for 1560000ms , collection: collection1 slice: shard1 saw state=DocCollection(collection1//clusterstate.json/1)={
   [junit4]   2>   "shards":{"shard1":{
   [junit4]   2>       "parent":null,
   [junit4]   2>       "range":null,
   [junit4]   2>       "state":"active",
   [junit4]   2>       "replicas":{"127.0.0.1:8983__collection1":{
   [junit4]   2>           "core":"collection1",
   [junit4]   2>           "base_url":"http://127.0.0.1:8983",
   [junit4]   2>           "node_name":"127.0.0.1:8983_",
   [junit4]   2>           "state":"down",
   [junit4]   2>           "type":"NRT"}}}},
   [junit4]   2>   "router":{"name":"implicit"}} with live_nodes=[]
   [junit4]   2> 	at org.apache.solr.common.cloud.ZkStateReader.getLeaderRetry(ZkStateReader.java:861)
   [junit4]   2> 	at org.apache.solr.common.cloud.ZkStateReader.getLeaderUrl(ZkStateReader.java:826)
   [junit4]   2> 	at org.apache.solr.cloud.ZkController.getLeader(ZkController.java:1269)
   [junit4]   2> 	... 7 more
   [junit4]   2> 
   [junit4]   2> 421396 INFO  (SUITE-TestManagedResourceStorage-seed#[F465419791631E17]-worker) [n:127.0.0.1:8983_    ] o.a.s.SolrTestCaseJ4 ------------------------------------------------------- Done waiting for tracked resources to be released
   [junit4]   2> Oct 01, 2018 9:19:05 PM com.carrotsearch.randomizedtesting.ThreadLeakControl checkThreadLeaks
   [junit4]   2> WARNING: Will linger awaiting termination of 6 leaked thread(s).
   [junit4]   2> Oct 01, 2018 9:20:25 PM com.carrotsearch.randomizedtesting.ThreadLeakControl checkThreadLeaks
   [junit4]   2> SEVERE: 4 threads leaked from SUITE scope at org.apache.solr.rest.TestManagedResourceStorage: 
   [junit4]   2>    1) Thread[id=4402, name=Thread-911, state=WAITING, group=TGRP-TestManagedResourceStorage]
   [junit4]   2>         at java.lang.Object.wait(Native Method)
   [junit4]   2>         at java.lang.Thread.join(Thread.java:1252)
   [junit4]   2>         at java.lang.Thread.join(Thread.java:1326)
   [junit4]   2>         at org.apache.zookeeper.server.NIOServerCnxnFactory.join(NIOServerCnxnFactory.java:313)
   [junit4]   2>         at org.apache.solr.cloud.ZkTestServer$ZKServerMain.runFromConfig(ZkTestServer.java:313)
   [junit4]   2>         at org.apache.solr.cloud.ZkTestServer$2.run(ZkTestServer.java:496)
   [junit4]   2>    2) Thread[id=4406, name=ProcessThread(sid:0 cport:55026):, state=WAITING, group=TGRP-TestManagedResourceStorage]
   [junit4]   2>         at sun.misc.Unsafe.park(Native Method)
   [junit4]   2>         at java.util.concurrent.locks.LockSupport.park(LockSupport.java:175)
   [junit4]   2>         at java.util.concurrent.locks.AbstractQueuedSynchronizer$ConditionObject.await(AbstractQueuedSynchronizer.java:2039)
   [junit4]   2>         at java.util.concurrent.LinkedBlockingQueue.take(LinkedBlockingQueue.java:442)
   [junit4]   2>         at org.apache.zookeeper.server.PrepRequestProcessor.run(PrepRequestProcessor.java:123)
   [junit4]   2>    3) Thread[id=4403, name=NIOServerCxn.Factory:0.0.0.0/0.0.0.0:0, state=RUNNABLE, group=TGRP-TestManagedResourceStorage]
   [junit4]   2>         at sun.nio.ch.DevPollArrayWrapper.poll0(Native Method)
   [junit4]   2>         at sun.nio.ch.DevPollArrayWrapper.poll(DevPollArrayWrapper.java:223)
   [junit4]   2>         at sun.nio.ch.DevPollSelectorImpl.doSelect(DevPollSelectorImpl.java:98)
   [junit4]   2>         at sun.nio.ch.SelectorImpl.lockAndDoSelect(SelectorImpl.java:86)
   [junit4]   2>         at sun.nio.ch.SelectorImpl.select(SelectorImpl.java:97)
   [junit4]   2>         at org.apache.zookeeper.server.NIOServerCnxnFactory.run(NIOServerCnxnFactory.java:196)
   [junit4]   2>         at java.lang.Thread.run(Thread.java:748)
   [junit4]   2>    4) Thread[id=4404, name=SessionTracker, state=TIMED_WAITING, group=TGRP-TestManagedResourceStorage]
   [junit4]   2>         at java.lang.Object.wait(Native Method)
   [junit4]   2>         at org.apache.zookeeper.server.SessionTrackerImpl.run(SessionTrackerImpl.java:147)
   [junit4]   2> Oct 01, 2018 9:20:25 PM com.carrotsearch.randomizedtesting.ThreadLeakControl tryToInterruptAll
   [junit4]   2> INFO: Starting to interrupt leaked threads:
   [junit4]   2>    1) Thread[id=4402, name=Thread-911, state=WAITING, group=TGRP-TestManagedResourceStorage]
   [junit4]   2>    2) Thread[id=4406, name=ProcessThread(sid:0 cport:55026):, state=WAITING, group=TGRP-TestManagedResourceStorage]
   [junit4]   2>    3) Thread[id=4403, name=NIOServerCxn.Factory:0.0.0.0/0.0.0.0:0, state=RUNNABLE, group=TGRP-TestManagedResourceStorage]
   [junit4]   2>    4) Thread[id=4404, name=SessionTracker, state=TIMED_WAITING, group=TGRP-TestManagedResourceStorage]
   [junit4]   2> 501632 ERROR (SessionTracker) [    ] o.a.z.s.ZooKeeperCriticalThread Severe unrecoverable error, from thread : SessionTracker
   [junit4]   2> java.lang.InterruptedException: null
   [junit4]   2> 	at java.lang.Object.wait(Native Method) ~[?:1.8.0_172]
   [junit4]   2> 	at org.apache.zookeeper.server.SessionTrackerImpl.run(SessionTrackerImpl.java:147) [zookeeper-3.4.11.jar:3.4.11-37e277162d567b55a07d1755f0b31c32e93c01a0]
   [junit4]   2> 501632 WARN  (Thread-911) [    ] o.a.s.c.ZkTestServer Server interrupted
   [junit4]   2> java.lang.InterruptedException: null
   [junit4]   2> 	at java.lang.Object.wait(Native Method) ~[?:1.8.0_172]
   [junit4]   2> 	at java.lang.Thread.join(Thread.java:1252) ~[?:1.8.0_172]
   [junit4]   2> 	at java.lang.Thread.join(Thread.java:1326) ~[?:1.8.0_172]
   [junit4]   2> 	at org.apache.zookeeper.server.NIOServerCnxnFactory.join(NIOServerCnxnFactory.java:313) ~[zookeeper-3.4.11.jar:3.4.11-37e277162d567b55a07d1755f0b31c32e93c01a0]
   [junit4]   2> 	at org.apache.solr.cloud.ZkTestServer$ZKServerMain.runFromConfig(ZkTestServer.java:313) [java/:?]
   [junit4]   2> 	at org.apache.solr.cloud.ZkTestServer$2.run(ZkTestServer.java:496) [java/:?]
   [junit4]   2> 501632 ERROR (ProcessThread(sid:0 cport:55026):) [    ] o.a.z.s.ZooKeeperCriticalThread Severe unrecoverable error, from thread : ProcessThread(sid:0 cport:55026):
   [junit4]   2> java.lang.InterruptedException: null
   [junit4]   2> 	at java.util.concurrent.locks.AbstractQueuedSynchronizer$ConditionObject.reportInterruptAfterWait(AbstractQueuedSynchronizer.java:2014) ~[?:1.8.0_172]
   [junit4]   2> 	at java.util.concurrent.locks.AbstractQueuedSynchronizer$ConditionObject.await(AbstractQueuedSynchronizer.java:2048) ~[?:1.8.0_172]
   [junit4]   2> 	at java.util.concurrent.LinkedBlockingQueue.take(LinkedBlockingQueue.java:442) ~[?:1.8.0_172]
   [junit4]   2> 	at org.apache.zookeeper.server.PrepRequestProcessor.run(PrepRequestProcessor.java:123) [zookeeper-3.4.11.jar:3.4.11-37e277162d567b55a07d1755f0b31c32e93c01a0]
   [junit4]   2> 501632 ERROR (ProcessThread(sid:0 cport:55026):) [    ] o.a.z.s.ZooKeeperServer ZKShutdownHandler is not registered, so ZooKeeper server won't take any action on ERROR or SHUTDOWN server state changes
   [junit4]   2> 501632 ERROR (SessionTracker) [    ] o.a.z.s.ZooKeeperServer ZKShutdownHandler is not registered, so ZooKeeper server won't take any action on ERROR or SHUTDOWN server state changes
   [junit4]   2> Oct 01, 2018 9:20:28 PM com.carrotsearch.randomizedtesting.ThreadLeakControl tryToInterruptAll
   [junit4]   2> SEVERE: There are still zombie threads that couldn't be terminated:
   [junit4]   2>    1) Thread[id=4403, name=NIOServerCxn.Factory:0.0.0.0/0.0.0.0:0, state=RUNNABLE, group=TGRP-TestManagedResourceStorage]
   [junit4]   2>         at sun.nio.ch.DevPollArrayWrapper.poll0(Native Method)
   [junit4]   2>         at sun.nio.ch.DevPollArrayWrapper.poll(DevPollArrayWrapper.java:223)
   [junit4]   2>         at sun.nio.ch.DevPollSelectorImpl.doSelect(DevPollSelectorImpl.java:98)
   [junit4]   2>         at sun.nio.ch.SelectorImpl.lockAndDoSelect(SelectorImpl.java:86)
   [junit4]   2>         at sun.nio.ch.SelectorImpl.select(SelectorImpl.java:97)
   [junit4]   2>         at org.apache.zookeeper.server.NIOServerCnxnFactory.run(NIOServerCnxnFactory.java:196)
   [junit4]   2>         at java.lang.Thread.run(Thread.java:748)
   [junit4]   2> NOTE: test params are: codec=CheapBastard, sim=Asserting(org.apache.lucene.search.similarities.AssertingSimilarity@55b55fd4), locale=es-PY, timezone=Europe/Zagreb
   [junit4]   2> NOTE: SunOS 5.11 amd64/Oracle Corporation 1.8.0_172 (64-bit)/cpus=3,threads=3,free=166596456,total=375476224
   [junit4]   2> NOTE: All tests run in this JVM: [UniqFieldsUpdateProcessorFactoryTest, DateRangeFieldTest, TestRawResponseWriter, PluginInfoTest, HdfsLockFactoryTest, TestInPlaceUpdatesDistrib, TestFieldTypeCollectionResource, HdfsSyncSliceTest, GraphQueryTest, TestHdfsCloudBackupRestore, TestPolicyCloud, CreateRoutedAliasTest, TestCloudSchemaless, ConfigureRecoveryStrategyTest, ProtectedTermFilterFactoryTest, ChaosMonkeyNothingIsSafeTest, TlogReplayBufferedWhileIndexingTest, TestJettySolrRunner, HttpTriggerListenerTest, TestSimNodeLostTrigger, SchemaApiFailureTest, TestSystemCollAutoCreate, SortByFunctionTest, AssignTest, TestRemoteStreaming, TestCloudPhrasesIdentificationComponent, TestCrossCoreJoin, SubstringBytesRefFilterTest, TestSweetSpotSimilarityFactory, HighlighterTest, ParsingFieldUpdateProcessorsTest, TestCollationFieldDocValues, TestSystemIdResolver, ActionThrottleTest, TestLuceneIndexBackCompat, TestSizeLimitedDistributedMap, TestSolrCloudWithSecureImpersonation, BufferStoreTest, StatelessScriptUpdateProcessorFactoryTest, AnalysisAfterCoreReloadTest, TestManagedResourceStorage]
   [junit4]   2> NOTE: reproduce with: ant test  -Dtestcase=TestManagedResourceStorage -Dtests.seed=F465419791631E17 -Dtests.slow=true -Dtests.locale=es-PY -Dtests.timezone=Europe/Zagreb -Dtests.asserts=true -Dtests.file.encoding=ISO-8859-1
   [junit4] ERROR   0.00s J0 | TestManagedResourceStorage (suite) <<<
   [junit4]    > Throwable #1: java.lang.RuntimeException: SolrCore.getOpenCount()==1
   [junit4]    > 	at __randomizedtesting.SeedInfo.seed([F465419791631E17]:0)
   [junit4]    > 	at org.apache.solr.util.TestHarness.close(TestHarness.java:380)
   [junit4]    > 	at org.apache.solr.SolrTestCaseJ4.deleteCore(SolrTestCaseJ4.java:802)
   [junit4]    > 	at org.apache.solr.cloud.AbstractZkTestCase.azt_afterClass(AbstractZkTestCase.java:147)
   [junit4]    > 	at java.lang.Thread.run(Thread.java:748)Throwable #2: com.carrotsearch.randomizedtesting.ThreadLeakError: 4 threads leaked from SUITE scope at org.apache.solr.rest.TestManagedResourceStorage: 
   [junit4]    >    1) Thread[id=4402, name=Thread-911, state=WAITING, group=TGRP-TestManagedResourceStorage]
   [junit4]    >         at java.lang.Object.wait(Native Method)
   [junit4]    >         at java.lang.Thread.join(Thread.java:1252)
   [junit4]    >         at java.lang.Thread.join(Thread.java:1326)
   [junit4]    >         at org.apache.zookeeper.server.NIOServerCnxnFactory.join(NIOServerCnxnFactory.java:313)
   [junit4]    >         at org.apache.solr.cloud.ZkTestServer$ZKServerMain.runFromConfig(ZkTestServer.java:313)
   [junit4]    >         at org.apache.solr.cloud.ZkTestServer$2.run(ZkTestServer.java:496)
   [junit4]    >    2) Thread[id=4406, name=ProcessThread(sid:0 cport:55026):, state=WAITING, group=TGRP-TestManagedResourceStorage]
   [junit4]    >         at sun.misc.Unsafe.park(Native Method)
   [junit4]    >         at java.util.concurrent.locks.LockSupport.park(LockSupport.java:175)
   [junit4]    >         at java.util.concurrent.locks.AbstractQueuedSynchronizer$ConditionObject.await(AbstractQueuedSynchronizer.java:2039)
   [junit4]    >         at java.util.concurrent.LinkedBlockingQueue.take(LinkedBlockingQueue.java:442)
   [junit4]    >         at org.apache.zookeeper.server.PrepRequestProcessor.run(PrepRequestProcessor.java:123)
   [junit4]    >    3) Thread[id=4403, name=NIOServerCxn.Factory:0.0.0.0/0.0.0.0:0, state=RUNNABLE, group=TGRP-TestManagedResourceStorage]
   [junit4]    >         at sun.nio.ch.DevPollArrayWrapper.poll0(Native Method)
   [junit4]    >         at sun.nio.ch.DevPollArrayWrapper.poll(DevPollArrayWrapper.java:223)
   [junit4]    >         at sun.nio.ch.DevPollSelectorImpl.doSelect(DevPollSelectorImpl.java:98)
   [junit4]    >         at sun.nio.ch.SelectorImpl.lockAndDoSelect(SelectorImpl.java:86)
   [junit4]    >         at sun.nio.ch.SelectorImpl.select(SelectorImpl.java:97)
   [junit4]    >         at org.apache.zookeeper.server.NIOServerCnxnFactory.run(NIOServerCnxnFactory.java:196)
   [junit4]    >         at java.lang.Thread.run(Thread.java:748)
   [junit4]    >    4) Thread[id=4404, name=SessionTracker, state=TIMED_WAITING, group=TGRP-TestManagedResourceStorage]
   [junit4]    >         at java.lang.Object.wait(Native Method)
   [junit4]    >         at org.apache.zookeeper.server.SessionTrackerImpl.run(SessionTrackerImpl.java:147)
   [junit4]    > 	at __randomizedtesting.SeedInfo.seed([F465419791631E17]:0)Throwable #3: com.carrotsearch.randomizedtesting.ThreadLeakError: There are still zombie threads that couldn't be terminated:
   [junit4]    >    1) Thread[id=4403, name=NIOServerCxn.Factory:0.0.0.0/0.0.0.0:0, state=RUNNABLE, group=TGRP-TestManagedResourceStorage]
   [junit4]    >         at sun.nio.ch.DevPollArrayWrapper.poll0(Native Method)
   [junit4]    >         at sun.nio.ch.DevPollArrayWrapper.poll(DevPollArrayWrapper.java:223)
   [junit4]    >         at sun.nio.ch.DevPollSelectorImpl.doSelect(DevPollSelectorImpl.java:98)
   [junit4]    >         at sun.nio.ch.SelectorImpl.lockAndDoSelect(SelectorImpl.java:86)
   [junit4]    >         at sun.nio.ch.SelectorImpl.select(SelectorImpl.java:97)
   [junit4]    >         at org.apache.zookeeper.server.NIOServerCnxnFactory.run(NIOServerCnxnFactory.java:196)
   [junit4]    >         at java.lang.Thread.run(Thread.java:748)
   [junit4]    > 	at __randomizedtesting.SeedInfo.seed([F465419791631E17]:0)
   [junit4] Completed [123/835 (1!)] on J0 in 85.64s, 2 tests, 3 errors <<< FAILURES!

[...truncated 51032 lines...]
[asciidoctor:convert] asciidoctor: ERROR: about-this-guide.adoc: line 1: invalid part, must have at least one section (e.g., chapter, appendix, etc.)
[asciidoctor:convert] asciidoctor: ERROR: solr-glossary.adoc: line 1: invalid part, must have at least one section (e.g., chapter, appendix, etc.)
     [java] Processed 2432 links (1984 relative) to 3172 anchors in 246 files
     [echo] Validated Links & Anchors via: /export/home/jenkins/workspace/Lucene-Solr-master-Solaris/solr/build/solr-ref-guide/bare-bones-html/

-documentation-lint:
    [jtidy] Checking for broken html (such as invalid tags)...
   [delete] Deleting directory /export/home/jenkins/workspace/Lucene-Solr-master-Solaris/lucene/build/jtidy_tmp
     [echo] Checking for broken links...
     [exec] 
     [exec] Crawl/parse...
     [exec] 
     [exec] Verify...
     [echo] Checking for malformed docs...

jar-checksums:

resolve:

ivy-availability-check:
[loadresource] Do not set property disallowed.ivy.jars.list as its length is 0.

-ivy-fail-disallowed-ivy-version:

ivy-fail:

ivy-configure:
[ivy:configure] :: loading settings :: file = /export/home/jenkins/workspace/Lucene-Solr-master-Solaris/lucene/top-level-ivy-settings.xml

resolve:

ivy-availability-check:
[loadresource] Do not set property disallowed.ivy.jars.list as its length is 0.

-ivy-fail-disallowed-ivy-version:

ivy-fail:

ivy-configure:
[ivy:configure] :: loading settings :: file = /export/home/jenkins/workspace/Lucene-Solr-master-Solaris/lucene/top-level-ivy-settings.xml

resolve:

resolve:

ivy-availability-check:
[loadresource] Do not set property disallowed.ivy.jars.list as its length is 0.

-ivy-fail-disallowed-ivy-version:

ivy-fail:

ivy-configure:
[ivy:configure] :: loading settings :: file = /export/home/jenkins/workspace/Lucene-Solr-master-Solaris/lucene/top-level-ivy-settings.xml

resolve:

ivy-availability-check:
[loadresource] Do not set property disallowed.ivy.jars.list as its length is 0.

-ivy-fail-disallowed-ivy-version:

ivy-fail:

ivy-configure:
[ivy:configure] :: loading settings :: file = /export/home/jenkins/workspace/Lucene-Solr-master-Solaris/lucene/top-level-ivy-settings.xml

resolve:

ivy-availability-check:
[loadresource] Do not set property disallowed.ivy.jars.list as its length is 0.

-ivy-fail-disallowed-ivy-version:

ivy-fail:

ivy-configure:
[ivy:configure] :: loading settings :: file = /export/home/jenkins/workspace/Lucene-Solr-master-Solaris/lucene/top-level-ivy-settings.xml

resolve:

ivy-availability-check:
[loadresource] Do not set property disallowed.ivy.jars.list as its length is 0.

-ivy-fail-disallowed-ivy-version:

ivy-fail:

ivy-configure:
[ivy:configure] :: loading settings :: file = /export/home/jenkins/workspace/Lucene-Solr-master-Solaris/lucene/top-level-ivy-settings.xml

resolve:

ivy-availability-check:
[loadresource] Do not set property disallowed.ivy.jars.list as its length is 0.

-ivy-fail-disallowed-ivy-version:

ivy-fail:

ivy-configure:
[ivy:configure] :: loading settings :: file = /export/home/jenkins/workspace/Lucene-Solr-master-Solaris/lucene/top-level-ivy-settings.xml

resolve:

ivy-availability-check:
[loadresource] Do not set property disallowed.ivy.jars.list as its length is 0.

-ivy-fail-disallowed-ivy-version:

ivy-fail:

ivy-configure:
[ivy:configure] :: loading settings :: file = /export/home/jenkins/workspace/Lucene-Solr-master-Solaris/lucene/top-level-ivy-settings.xml

resolve:

ivy-availability-check:
[loadresource] Do not set property disallowed.ivy.jars.list as its length is 0.

-ivy-fail-disallowed-ivy-version:

ivy-fail:

ivy-configure:
[ivy:configure] :: loading settings :: file = /export/home/jenkins/workspace/Lucene-Solr-master-Solaris/lucene/top-level-ivy-settings.xml

resolve:

ivy-availability-check:
[loadresource] Do not set property disallowed.ivy.jars.list as its length is 0.

-ivy-fail-disallowed-ivy-version:

ivy-fail:

ivy-configure:
[ivy:configure] :: loading settings :: file = /export/home/jenkins/workspace/Lucene-Solr-master-Solaris/lucene/top-level-ivy-settings.xml

resolve:

ivy-availability-check:
[loadresource] Do not set property disallowed.ivy.jars.list as its length is 0.

-ivy-fail-disallowed-ivy-version:

ivy-fail:

ivy-configure:
[ivy:configure] :: loading settings :: file = /export/home/jenkins/workspace/Lucene-Solr-master-Solaris/lucene/top-level-ivy-settings.xml

resolve:

ivy-availability-check:
[loadresource] Do not set property disallowed.ivy.jars.list as its length is 0.

-ivy-fail-disallowed-ivy-version:

ivy-fail:

ivy-configure:
[ivy:configure] :: loading settings :: file = /export/home/jenkins/workspace/Lucene-Solr-master-Solaris/lucene/top-level-ivy-settings.xml

resolve:

ivy-availability-check:
[loadresource] Do not set property disallowed.ivy.jars.list as its length is 0.

-ivy-fail-disallowed-ivy-version:

ivy-fail:

ivy-configure:
[ivy:configure] :: loading settings :: file = /export/home/jenkins/workspace/Lucene-Solr-master-Solaris/lucene/top-level-ivy-settings.xml

resolve:

ivy-availability-check:
[loadresource] Do not set property disallowed.ivy.jars.list as its length is 0.

-ivy-fail-disallowed-ivy-version:

ivy-fail:

ivy-configure:
[ivy:configure] :: loading settings :: file = /export/home/jenkins/workspace/Lucene-Solr-master-Solaris/lucene/top-level-ivy-settings.xml

resolve:

ivy-availability-check:
[loadresource] Do not set property disallowed.ivy.jars.list as its length is 0.

-ivy-fail-disallowed-ivy-version:

ivy-fail:

ivy-configure:
[ivy:configure] :: loading settings :: file = /export/home/jenkins/workspace/Lucene-Solr-master-Solaris/lucene/top-level-ivy-settings.xml

resolve:

ivy-availability-check:
[loadresource] Do not set property disallowed.ivy.jars.list as its length is 0.

-ivy-fail-disallowed-ivy-version:

ivy-fail:

ivy-configure:
[ivy:configure] :: loading settings :: file = /export/home/jenkins/workspace/Lucene-Solr-master-Solaris/lucene/top-level-ivy-settings.xml

resolve:

ivy-availability-check:
[loadresource] Do not set property disallowed.ivy.jars.list as its length is 0.

-ivy-fail-disallowed-ivy-version:

ivy-fail:

ivy-configure:
[ivy:configure] :: loading settings :: file = /export/home/jenkins/workspace/Lucene-Solr-master-Solaris/lucene/top-level-ivy-settings.xml

resolve:

ivy-availability-check:
[loadresource] Do not set property disallowed.ivy.jars.list as its length is 0.

-ivy-fail-disallowed-ivy-version:

ivy-fail:

ivy-configure:
[ivy:configure] :: loading settings :: file = /export/home/jenkins/workspace/Lucene-Solr-master-Solaris/lucene/top-level-ivy-settings.xml

resolve:

ivy-availability-check:
[loadresource] Do not set property disallowed.ivy.jars.list as its length is 0.

-ivy-fail-disallowed-ivy-version:

ivy-fail:

ivy-configure:
[ivy:configure] :: loading settings :: file = /export/home/jenkins/workspace/Lucene-Solr-master-Solaris/lucene/top-level-ivy-settings.xml

resolve:

ivy-availability-check:
[loadresource] Do not set property disallowed.ivy.jars.list as its length is 0.

-ivy-fail-disallowed-ivy-version:

ivy-fail:

ivy-configure:
[ivy:configure] :: loading settings :: file = /export/home/jenkins/workspace/Lucene-Solr-master-Solaris/lucene/top-level-ivy-settings.xml

resolve:

ivy-availability-check:
[loadresource] Do not set property disallowed.ivy.jars.list as its length is 0.

-ivy-fail-disallowed-ivy-version:

ivy-fail:

ivy-configure:
[ivy:configure] :: loading settings :: file = /export/home/jenkins/workspace/Lucene-Solr-master-Solaris/lucene/top-level-ivy-settings.xml

resolve:

ivy-availability-check:
[loadresource] Do not set property disallowed.ivy.jars.list as its length is 0.

-ivy-fail-disallowed-ivy-version:

ivy-fail:

ivy-configure:
[ivy:configure] :: loading settings :: file = /export/home/jenkins/workspace/Lucene-Solr-master-Solaris/lucene/top-level-ivy-settings.xml

resolve:

ivy-availability-check:
[loadresource] Do not set property disallowed.ivy.jars.list as its length is 0.

-ivy-fail-disallowed-ivy-version:

ivy-fail:

ivy-configure:
[ivy:configure] :: loading settings :: file = /export/home/jenkins/workspace/Lucene-Solr-master-Solaris/lucene/top-level-ivy-settings.xml

resolve:

ivy-availability-check:
[loadresource] Do not set property disallowed.ivy.jars.list as its length is 0.

-ivy-fail-disallowed-ivy-version:

ivy-fail:

ivy-configure:
[ivy:configure] :: loading settings :: file = /export/home/jenkins/workspace/Lucene-Solr-master-Solaris/lucene/top-level-ivy-settings.xml

resolve:

ivy-availability-check:
[loadresource] Do not set property disallowed.ivy.jars.list as its length is 0.

-ivy-fail-disallowed-ivy-version:

ivy-fail:

ivy-configure:
[ivy:configure] :: loading settings :: file = /export/home/jenkins/workspace/Lucene-Solr-master-Solaris/lucene/top-level-ivy-settings.xml

resolve:

ivy-availability-check:
[loadresource] Do not set property disallowed.ivy.jars.list as its length is 0.

-ivy-fail-disallowed-ivy-version:

ivy-fail:

ivy-configure:
[ivy:configure] :: loading settings :: file = /export/home/jenkins/workspace/Lucene-Solr-master-Solaris/lucene/top-level-ivy-settings.xml

common.resolve:

resolve:

ivy-availability-check:
[loadresource] Do not set property disallowed.ivy.jars.list as its length is 0.

-ivy-fail-disallowed-ivy-version:

ivy-fail:

ivy-configure:
[ivy:configure] :: loading settings :: file = /export/home/jenkins/workspace/Lucene-Solr-master-Solaris/lucene/top-level-ivy-settings.xml

resolve:

ivy-availability-check:
[loadresource] Do not set property disallowed.ivy.jars.list as its length is 0.

-ivy-fail-disallowed-ivy-version:

ivy-fail:

ivy-configure:
[ivy:configure] :: loading settings :: file = /export/home/jenkins/workspace/Lucene-Solr-master-Solaris/lucene/top-level-ivy-settings.xml

resolve:

ivy-availability-check:
[loadresource] Do not set property disallowed.ivy.jars.list as its length is 0.

-ivy-fail-disallowed-ivy-version:

ivy-fail:

ivy-configure:
[ivy:configure] :: loading settings :: file = /export/home/jenkins/workspace/Lucene-Solr-master-Solaris/lucene/top-level-ivy-settings.xml

resolve:

ivy-availability-check:
[loadresource] Do not set property disallowed.ivy.jars.list as its length is 0.

-ivy-fail-disallowed-ivy-version:

ivy-fail:

ivy-configure:
[ivy:configure] :: loading settings :: file = /export/home/jenkins/workspace/Lucene-Solr-master-Solaris/lucene/top-level-ivy-settings.xml

resolve:

ivy-availability-check:
[loadresource] Do not set property disallowed.ivy.jars.list as its length is 0.

-ivy-fail-disallowed-ivy-version:

ivy-fail:

ivy-configure:
[ivy:configure] :: loading settings :: file = /export/home/jenkins/workspace/Lucene-Solr-master-Solaris/lucene/top-level-ivy-settings.xml

resolve:

jar-checksums:
    [mkdir] Created dir: /export/home/jenkins/workspace/Lucene-Solr-master-Solaris/lucene/null1358882602
     [copy] Copying 35 files to /export/home/jenkins/workspace/Lucene-Solr-master-Solaris/lucene/null1358882602
   [delete] Deleting directory /export/home/jenkins/workspace/Lucene-Solr-master-Solaris/lucene/null1358882602

resolve-example:

ivy-availability-check:
[loadresource] Do not set property disallowed.ivy.jars.list as its length is 0.

-ivy-fail-disallowed-ivy-version:

ivy-fail:

ivy-configure:
[ivy:configure] :: loading settings :: file = /export/home/jenkins/workspace/Lucene-Solr-master-Solaris/lucene/top-level-ivy-settings.xml

resolve:

resolve-server:

ivy-availability-check:
[loadresource] Do not set property disallowed.ivy.jars.list as its length is 0.

-ivy-fail-disallowed-ivy-version:

ivy-fail:

ivy-fail:

ivy-configure:
[ivy:configure] :: loading settings :: file = /export/home/jenkins/workspace/Lucene-Solr-master-Solaris/lucene/top-level-ivy-settings.xml

resolve:

resolve:

ivy-availability-check:
[loadresource] Do not set property disallowed.ivy.jars.list as its length is 0.

-ivy-fail-disallowed-ivy-version:

ivy-fail:

ivy-fail:

ivy-configure:
[ivy:configure] :: loading settings :: file = /export/home/jenkins/workspace/Lucene-Solr-master-Solaris/lucene/top-level-ivy-settings.xml

resolve:

ivy-availability-check:
[loadresource] Do not set property disallowed.ivy.jars.list as its length is 0.

-ivy-fail-disallowed-ivy-version:

ivy-fail:

ivy-fail:

ivy-configure:
[ivy:configure] :: loading settings :: file = /export/home/jenkins/workspace/Lucene-Solr-master-Solaris/lucene/top-level-ivy-settings.xml

resolve:

ivy-availability-check:
[loadresource] Do not set property disallowed.ivy.jars.list as its length is 0.

-ivy-fail-disallowed-ivy-version:

ivy-fail:

ivy-configure:
[ivy:configure] :: loading settings :: file = /export/home/jenkins/workspace/Lucene-Solr-master-Solaris/lucene/top-level-ivy-settings.xml

resolve:

ivy-availability-check:
[loadresource] Do not set property disallowed.ivy.jars.list as its length is 0.

-ivy-fail-disallowed-ivy-version:

ivy-fail:

ivy-fail:

ivy-configure:
[ivy:configure] :: loading settings :: file = /export/home/jenkins/workspace/Lucene-Solr-master-Solaris/lucene/top-level-ivy-settings.xml

resolve:

ivy-availability-check:
[loadresource] Do not set property disallowed.ivy.jars.list as its length is 0.

-ivy-fail-disallowed-ivy-version:

ivy-fail:

ivy-configure:
[ivy:configure] :: loading settings :: file = /export/home/jenkins/workspace/Lucene-Solr-master-Solaris/lucene/top-level-ivy-settings.xml

resolve:

ivy-availability-check:
[loadresource] Do not set property disallowed.ivy.jars.list as its length is 0.

-ivy-fail-disallowed-ivy-version:

ivy-fail:

ivy-fail:

ivy-configure:
[ivy:configure] :: loading settings :: file = /export/home/jenkins/workspace/Lucene-Solr-master-Solaris/lucene/top-level-ivy-settings.xml

resolve:

ivy-availability-check:
[loadresource] Do not set property disallowed.ivy.jars.list as its length is 0.

-ivy-fail-disallowed-ivy-version:

ivy-fail:

ivy-fail:

ivy-configure:
[ivy:configure] :: loading settings :: file = /export/home/jenkins/workspace/Lucene-Solr-master-Solaris/lucene/top-level-ivy-settings.xml

resolve:

ivy-availability-check:
[loadresource] Do not set property disallowed.ivy.jars.list as its length is 0.

-ivy-fail-disallowed-ivy-version:

ivy-fail:

ivy-fail:

ivy-configure:
[ivy:configure] :: loading settings :: file = /export/home/jenkins/workspace/Lucene-Solr-master-Solaris/lucene/top-level-ivy-settings.xml

resolve:

ivy-availability-check:
[loadresource] Do not set property disallowed.ivy.jars.list as its length is 0.

-ivy-fail-disallowed-ivy-version:

ivy-fail:

ivy-fail:

ivy-configure:
[ivy:configure] :: loading settings :: file = /export/home/jenkins/workspace/Lucene-Solr-master-Solaris/lucene/top-level-ivy-settings.xml

resolve:

ivy-availability-check:
[loadresource] Do not set property disallowed.ivy.jars.list as its length is 0.

-ivy-fail-disallowed-ivy-version:

ivy-fail:

ivy-fail:

ivy-configure:
[ivy:configure] :: loading settings :: file = /export/home/jenkins/workspace/Lucene-Solr-master-Solaris/lucene/top-level-ivy-settings.xml

resolve:

ivy-availability-check:
[loadresource] Do not set property disallowed.ivy.jars.list as its length is 0.

-ivy-fail-disallowed-ivy-version:

ivy-fail:

ivy-fail:

ivy-configure:
[ivy:configure] :: loading settings :: file = /export/home/jenkins/workspace/Lucene-Solr-master-Solaris/lucene/top-level-ivy-settings.xml

resolve:

ivy-availability-check:
[loadresource] Do not set property disallowed.ivy.jars.list as its length is 0.

-ivy-fail-disallowed-ivy-version:

ivy-fail:

ivy-fail:

ivy-configure:
[ivy:configure] :: loading settings :: file = /export/home/jenkins/workspace/Lucene-Solr-master-Solaris/lucene/top-level-ivy-settings.xml

resolve:

ivy-availability-check:
[loadresource] Do not set property disallowed.ivy.jars.list as its length is 0.

-ivy-fail-disallowed-ivy-version:

ivy-fail:

ivy-fail:

ivy-configure:
[ivy:configure] :: loading settings :: file = /export/home/jenkins/workspace/Lucene-Solr-master-Solaris/lucene/top-level-ivy-settings.xml

resolve:

ivy-availability-check:
[loadresource] Do not set property disallowed.ivy.jars.list as its length is 0.

-ivy-fail-disallowed-ivy-version:

ivy-fail:

ivy-fail:

ivy-configure:
[ivy:configure] :: loading settings :: file = /export/home/jenkins/workspace/Lucene-Solr-master-Solaris/lucene/top-level-ivy-settings.xml

resolve:

ivy-availability-check:
[loadresource] Do not set property disallowed.ivy.jars.list as its length is 0.

-ivy-fail-disallowed-ivy-version:

ivy-fail:

ivy-fail:

ivy-configure:
[ivy:configure] :: loading settings :: file = /export/home/jenkins/workspace/Lucene-Solr-master-Solaris/lucene/top-level-ivy-settings.xml

resolve:

jar-checksums:
    [mkdir] Created dir: /export/home/jenkins/workspace/Lucene-Solr-master-Solaris/solr/null1592018846
     [copy] Copying 238 files to /export/home/jenkins/workspace/Lucene-Solr-master-Solaris/solr/null1592018846
   [delete] Deleting directory /export/home/jenkins/workspace/Lucene-Solr-master-Solaris/solr/null1592018846

check-working-copy:
[ivy:cachepath] :: resolving dependencies :: org.eclipse.jgit#org.eclipse.jgit-caller;working
[ivy:cachepath] 	confs: [default]
[ivy:cachepath] 	found org.eclipse.jgit#org.eclipse.jgit;4.6.0.201612231935-r in public
[ivy:cachepath] 	found com.jcraft#jsch;0.1.53 in public
[ivy:cachepath] 	found com.googlecode.javaewah#JavaEWAH;1.1.6 in public
[ivy:cachepath] 	found org.apache.httpcomponents#httpclient;4.3.6 in public
[ivy:cachepath] 	found org.apache.httpcomponents#httpcore;4.3.3 in public
[ivy:cachepath] 	found commons-logging#commons-logging;1.1.3 in public
[ivy:cachepath] 	found commons-codec#commons-codec;1.6 in public
[ivy:cachepath] 	found org.slf4j#slf4j-api;1.7.2 in public
[ivy:cachepath] :: resolution report :: resolve 1952ms :: artifacts dl 3ms
	---------------------------------------------------------------------
	|                  |            modules            ||   artifacts   |
	|       conf       | number| search|dwnlded|evicted|| number|dwnlded|
	---------------------------------------------------------------------
	|      default     |   8   |   0   |   0   |   0   ||   8   |   0   |
	---------------------------------------------------------------------
[wc-checker] Initializing working copy...
[wc-checker] SLF4J: Failed to load class "org.slf4j.impl.StaticLoggerBinder".
[wc-checker] SLF4J: Defaulting to no-operation (NOP) logger implementation
[wc-checker] SLF4J: See http://www.slf4j.org/codes.html#StaticLoggerBinder for further details.
[wc-checker] Checking working copy status...

-jenkins-base:

BUILD SUCCESSFUL
Total time: 62 minutes 24 seconds
Setting ANT_1_8_2_HOME=/export/home/jenkins/tools/hudson.tasks.Ant_AntInstallation/ANT_1.8.2
[Lucene-Solr-master-Solaris] $ /bin/sh -xe /var/tmp/jenkins4798984317124449740.sh
+ mv lucene/build lucene/build.orig
+ mv solr/build solr/build.orig
+ ANT_HOME=/export/home/jenkins/tools/hudson.tasks.Ant_AntInstallation/ANT_1.8.2
+ export ANT_HOME
+ PATH=/export/home/jenkins/tools/hudson.tasks.Ant_AntInstallation/ANT_1.8.2/bin:/export/home/jenkins/tools/java/64bit/jdk1.8.0/bin:/usr/bin:/usr/sbin
+ export PATH
+ python3.4 -u dev-tools/scripts/reproduceJenkinsFailures.py --no-git https://jenkins.thetaphi.de/job/Lucene-Solr-master-Solaris/2086/consoleText
[repro] Jenkins log URL: https://jenkins.thetaphi.de/job/Lucene-Solr-master-Solaris/2086/consoleText

[repro] Revision: fe844c739b1bd24090789acad099d3b3e5c12d4e

[repro] Ant options: "-Dargs=-XX:+UseCompressedOops -XX:+UseSerialGC"
[repro] Repro line:  ant test  -Dtestcase=TestManagedResourceStorage -Dtests.seed=F465419791631E17 -Dtests.slow=true -Dtests.locale=es-PY -Dtests.timezone=Europe/Zagreb -Dtests.asserts=true -Dtests.file.encoding=ISO-8859-1

[repro] ant clean
Buildfile: /export/home/jenkins/workspace/Lucene-Solr-master-Solaris/build.xml

clean:

clean:

clean:

BUILD SUCCESSFUL
Total time: 0 seconds
[repro] Test suites by module:
[repro]    solr/core
[repro]       TestManagedResourceStorage
[repro] ant compile-test
Buildfile: /export/home/jenkins/workspace/Lucene-Solr-master-Solaris/solr/core/build.xml

check-analyzers-icu-uptodate:

jar-analyzers-icu:

-mrjar-classes-uptodate:

ivy-availability-check:
[loadresource] Do not set property disallowed.ivy.jars.list as its length is 0.

-ivy-fail-disallowed-ivy-version:

ivy-fail:

ivy-configure:
[ivy:configure] :: Apache Ivy 2.4.0 - 20141213170938 :: http://ant.apache.org/ivy/ ::
[ivy:configure] :: loading settings :: file = /export/home/jenkins/workspace/Lucene-Solr-master-Solaris/lucene/top-level-ivy-settings.xml

resolve-groovy:
[ivy:cachepath] :: resolving dependencies :: org.codehaus.groovy#groovy-all-caller;working
[ivy:cachepath] 	confs: [default]
[ivy:cachepath] 	found org.codehaus.groovy#groovy-all;2.4.15 in public
[ivy:cachepath] :: resolution report :: resolve 112ms :: artifacts dl 2ms
	---------------------------------------------------------------------
	|                  |            modules            ||   artifacts   |
	|       conf       | number| search|dwnlded|evicted|| number|dwnlded|
	---------------------------------------------------------------------
	|      default     |   1   |   0   |   0   |   0   ||   1   |   0   |
	---------------------------------------------------------------------

check-analyzers-common-uptodate:

jar-analyzers-common:

-mrjar-classes-uptodate:

ivy-availability-check:
[loadresource] Do not set property disallowed.ivy.jars.list as its length is 0.

-ivy-fail-disallowed-ivy-version:

ivy-fail:

ivy-configure:
[ivy:configure] :: loading settings :: file = /export/home/jenkins/workspace/Lucene-Solr-master-Solaris/lucene/top-level-ivy-settings.xml

resolve-groovy:

-check-git-state:

-git-cleanroot:

-copy-git-state:
     [copy] Copying 1 file to /export/home/jenkins/workspace/Lucene-Solr-master-Solaris/lucene/build

git-autoclean:

resolve:

common.init:

compile-lucene-core:

-check-git-state:

-git-cleanroot:

-copy-git-state:

git-autoclean:

ivy-availability-check:
[loadresource] Do not set property disallowed.ivy.jars.list as its length is 0.

-ivy-fail-disallowed-ivy-version:

ivy-fail:

ivy-configure:
[ivy:configure] :: loading settings :: file = /export/home/jenkins/workspace/Lucene-Solr-master-Solaris/lucene/top-level-ivy-settings.xml

resolve:

init:

-clover.disable:

-clover.load:

-clover.classpath:

-clover.setup:

clover:

compile-core:
    [mkdir] Created dir: /export/home/jenkins/workspace/Lucene-Solr-master-Solaris/lucene/build/core/classes/java
    [javac] Compiling 868 source files to /export/home/jenkins/workspace/Lucene-Solr-master-Solaris/lucene/build/core/classes/java
    [javac] Note: Some input files use or override a deprecated API.
    [javac] Note: Recompile with -Xlint:deprecation for details.
    [javac] Creating empty /export/home/jenkins/workspace/Lucene-Solr-master-Solaris/lucene/build/core/classes/java/org/apache/lucene/util/graph/package-info.class
    [javac] Creating empty /export/home/jenkins/workspace/Lucene-Solr-master-Solaris/lucene/build/core/classes/java/org/apache/lucene/document/package-info.class
    [javac] Creating empty /export/home/jenkins/workspace/Lucene-Solr-master-Solaris/lucene/build/core/classes/java/org/apache/lucene/package-info.class
    [javac] Creating empty /export/home/jenkins/workspace/Lucene-Solr-master-Solaris/lucene/build/core/classes/java/org/apache/lucene/util/bkd/package-info.class
    [javac] Creating empty /export/home/jenkins/workspace/Lucene-Solr-master-Solaris/lucene/build/core/classes/java/org/apache/lucene/codecs/compressing/package-info.class
    [javac] Creating empty /export/home/jenkins/workspace/Lucene-Solr-master-Solaris/lucene/build/core/classes/java/org/apache/lucene/codecs/lucene60/package-info.class
    [javac] Creating empty /export/home/jenkins/workspace/Lucene-Solr-master-Solaris/lucene/build/core/classes/java/org/apache/lucene/codecs/package-info.class
    [javac] Creating empty /export/home/jenkins/workspace/Lucene-Solr-master-Solaris/lucene/build/core/classes/java/org/apache/lucene/codecs/lucene80/package-info.class
    [javac] Creating empty /export/home/jenkins/workspace/Lucene-Solr-master-Solaris/lucene/build/core/classes/java/org/apache/lucene/util/package-info.class
    [javac] Creating empty /export/home/jenkins/workspace/Lucene-Solr-master-Solaris/lucene/build/core/classes/java/org/apache/lucene/index/package-info.class
    [javac] Creating empty /export/home/jenkins/workspace/Lucene-Solr-master-Solaris/lucene/build/core/classes/java/org/apache/lucene/util/fst/package-info.class
    [javac] Creating empty /export/home/jenkins/workspace/Lucene-Solr-master-Solaris/lucene/build/core/classes/java/org/apache/lucene/analysis/tokenattributes/package-info.class
    [javac] Creating empty /export/home/jenkins/workspace/Lucene-Solr-master-Solaris/lucene/build/core/classes/java/org/apache/lucene/search/package-info.class
    [javac] Creating empty /export/home/jenkins/workspace/Lucene-Solr-master-Solaris/lucene/build/core/classes/java/org/apache/lucene/util/packed/package-info.class
    [javac] Creating empty /export/home/jenkins/workspace/Lucene-Solr-master-Solaris/lucene/build/core/classes/java/org/apache/lucene/util/mutable/package-info.class
    [javac] Creating empty /export/home/jenkins/workspace/Lucene-Solr-master-Solaris/lucene/build/core/classes/java/org/apache/lucene/codecs/lucene70/package-info.class
    [javac] Creating empty /export/home/jenkins/workspace/Lucene-Solr-master-Solaris/lucene/build/core/classes/java/org/apache/lucene/codecs/perfield/package-info.class
    [javac] Creating empty /export/home/jenkins/workspace/Lucene-Solr-master-Solaris/lucene/build/core/classes/java/org/apache/lucene/analysis/package-info.class
    [javac] Creating empty /export/home/jenkins/workspace/Lucene-Solr-master-Solaris/lucene/build/core/classes/java/org/apache/lucene/analysis/standard/package-info.class
    [javac] Creating empty /export/home/jenkins/workspace/Lucene-Solr-master-Solaris/lucene/build/core/classes/java/org/apache/lucene/store/package-info.class
    [javac] Creating empty /export/home/jenkins/workspace/Lucene-Solr-master-Solaris/lucene/build/core/classes/java/org/apache/lucene/codecs/blocktree/package-info.class
    [javac] Creating empty /export/home/jenkins/workspace/Lucene-Solr-master-Solaris/lucene/build/core/classes/java/org/apache/lucene/search/spans/package-info.class
    [javac] Creating empty /export/home/jenkins/workspace/Lucene-Solr-master-Solaris/lucene/build/core/classes/java/org/apache/lucene/search/similarities/package-info.class
    [javac] Creating empty /export/home/jenkins/workspace/Lucene-Solr-master-Solaris/lucene/build/core/classes/java/org/apache/lucene/util/automaton/package-info.class
    [javac] Creating empty /export/home/jenkins/workspace/Lucene-Solr-master-Solaris/lucene/build/core/classes/java/org/apache/lucene/codecs/lucene50/package-info.class
    [javac] Creating empty /export/home/jenkins/workspace/Lucene-Solr-master-Solaris/lucene/build/core/classes/java/org/apache/lucene/geo/package-info.class
     [copy] Copying 3 files to /export/home/jenkins/workspace/Lucene-Solr-master-Solaris/lucene/build/core/classes/java

init:

-clover.disable:

-clover.load:

-clover.classpath:

-clover.setup:

clover:

compile-core:
    [mkdir] Created dir: /export/home/jenkins/workspace/Lucene-Solr-master-Solaris/lucene/build/analysis/common/classes/java
    [javac] Compiling 472 source files to /export/home/jenkins/workspace/Lucene-Solr-master-Solaris/lucene/build/analysis/common/classes/java
    [javac] Note: Some input files use or override a deprecated API.
    [javac] Note: Recompile with -Xlint:deprecation for details.
    [javac] Creating empty /export/home/jenkins/workspace/Lucene-Solr-master-Solaris/lucene/build/analysis/common/classes/java/org/apache/lucene/analysis/hunspell/package-info.class
    [javac] Creating empty /export/home/jenkins/workspace/Lucene-Solr-master-Solaris/lucene/build/analysis/common/classes/java/org/apache/lucene/analysis/minhash/package-info.class
    [javac] Creating empty /export/home/jenkins/workspace/Lucene-Solr-master-Solaris/lucene/build/analysis/common/classes/java/org/apache/lucene/analysis/ga/package-info.class
    [javac] Creating empty /export/home/jenkins/workspace/Lucene-Solr-master-Solaris/lucene/build/analysis/common/classes/java/org/apache/lucene/analysis/ca/package-info.class
    [javac] Creating empty /export/home/jenkins/workspace/Lucene-Solr-master-Solaris/lucene/build/analysis/common/classes/java/org/apache/lucene/analysis/custom/package-info.class
    [javac] Creating empty /export/home/jenkins/workspace/Lucene-Solr-master-Solaris/lucene/build/analysis/common/classes/java/org/apache/lucene/analysis/sr/package-info.class
    [javac] Creating empty /export/home/jenkins/workspace/Lucene-Solr-master-Solaris/lucene/build/analysis/common/classes/java/org/apache/lucene/collation/package-info.class
    [javac] Creating empty /export/home/jenkins/workspace/Lucene-Solr-master-Solaris/lucene/build/analysis/common/classes/java/org/apache/lucene/analysis/sv/package-info.class
    [javac] Creating empty /export/home/jenkins/workspace/Lucene-Solr-master-Solaris/lucene/build/analysis/common/classes/java/org/apache/lucene/analysis/bg/package-info.class
    [javac] Creating empty /export/home/jenkins/workspace/Lucene-Solr-master-Solaris/lucene/build/analysis/common/classes/java/org/apache/lucene/analysis/payloads/package-info.class
    [javac] Creating empty /export/home/jenkins/workspace/Lucene-Solr-master-Solaris/lucene/build/analysis/common/classes/java/org/apache/lucene/analysis/ngram/package-info.class
    [javac] Creating empty /export/home/jenkins/workspace/Lucene-Solr-master-Solaris/lucene/build/analysis/common/classes/java/org/apache/lucene/analysis/core/package-info.class
    [javac] Creating empty /export/home/jenkins/workspace/Lucene-Solr-master-Solaris/lucene/build/analysis/common/classes/java/org/apache/lucene/analysis/bn/package-info.class
    [javac] Creating empty /export/home/jenkins/workspace/Lucene-Solr-master-Solaris/lucene/build/analysis/common/classes/java/org/apache/lucene/analysis/fr/package-info.class
    [javac] Creating empty /export/home/jenkins/workspace/Lucene-Solr-master-Solaris/lucene/build/analysis/common/classes/java/org/tartarus/snowball/ext/package-info.class
    [javac] Creating empty /export/home/jenkins/workspace/Lucene-Solr-master-Solaris/lucene/build/analysis/common/classes/java/org/apache/lucene/analysis/br/package-info.class
    [javac] Creating empty /export/home/jenkins/workspace/Lucene-Solr-master-Solaris/lucene/build/analysis/common/classes/java/org/apache/lucene/analysis/miscellaneous/package-info.class
    [javac] Creating empty /export/home/jenkins/workspace/Lucene-Solr-master-Solaris/lucene/build/analysis/common/classes/java/org/apache/lucene/analysis/sinks/package-info.class
    [javac] Creating empty /export/home/jenkins/workspace/Lucene-Solr-master-Solaris/lucene/build/analysis/common/classes/java/org/apache/lucene/analysis/cjk/package-info.class
    [javac] Creating empty /export/home/jenkins/workspace/Lucene-Solr-master-Solaris/lucene/build/analysis/common/classes/java/org/apache/lucene/analysis/synonym/package-info.class
    [javac] Creating empty /export/home/jenkins/workspace/Lucene-Solr-master-Solaris/lucene/build/analysis/common/classes/java/org/apache/lucene/analysis/wikipedia/package-info.class
    [javac] Creating empty /export/home/jenkins/workspace/Lucene-Solr-master-Solaris/lucene/build/analysis/common/classes/java/org/apache/lucene/analysis/fa/package-info.class
    [javac] Creating empty /export/home/jenkins/workspace/Lucene-Solr-master-Solaris/lucene/build/analysis/common/classes/java/org/apache/lucene/analysis/reverse/package-info.class
    [javac] Creating empty /export/home/jenkins/workspace/Lucene-Solr-master-Solaris/lucene/build/analysis/common/classes/java/org/apache/lucene/analysis/nl/package-info.class
    [javac] Creating empty /export/home/jenkins/workspace/Lucene-Solr-master-Solaris/lucene/build/analysis/common/classes/java/org/apache/lucene/analysis/ro/package-info.class
    [javac] Creating empty /export/home/jenkins/workspace/Lucene-Solr-master-Solaris/lucene/build/analysis/common/classes/java/org/apache/lucene/analysis/fi/package-info.class
    [javac] Creating empty /export/home/jenkins/workspace/Lucene-Solr-master-Solaris/lucene/build/analysis/common/classes/java/org/apache/lucene/analysis/ru/package-info.class
    [javac] Creating empty /export/home/jenkins/workspace/Lucene-Solr-master-Solaris/lucene/build/analysis/common/classes/java/org/apache/lucene/analysis/no/package-info.class
    [javac] Creating empty /export/home/jenkins/workspace/Lucene-Solr-master-Solaris/lucene/build/analysis/common/classes/java/org/apache/lucene/analysis/el/package-info.class
    [javac] Creating empty /export/home/jenkins/workspace/Lucene-Solr-master-Solaris/lucene/build/analysis/common/classes/java/org/apache/lucene/analysis/ckb/package-info.class
    [javac] Creating empty /export/home/jenkins/workspace/Lucene-Solr-master-Solaris/lucene/build/analysis/common/classes/java/org/tartarus/snowball/package-info.class
    [javac] Creating empty /export/home/jenkins/workspace/Lucene-Solr-master-Solaris/lucene/build/analysis/common/classes/java/org/apache/lucene/analysis/in/package-info.class
    [javac] Creating empty /export/home/jenkins/workspace/Lucene-Solr-master-Solaris/lucene/build/analysis/common/classes/java/org/apache/lucene/analysis/util/package-info.class
    [javac] Creating empty /export/home/jenkins/workspace/Lucene-Solr-master-Solaris/lucene/build/analysis/common/classes/java/org/apache/lucene/analysis/it/package-info.class
    [javac] Creating empty /export/home/jenkins/workspace/Lucene-Solr-master-Solaris/lucene/build/analysis/common/classes/java/org/apache/lucene/analysis/snowball/package-info.class
    [javac] Creating empty /export/home/jenkins/workspace/Lucene-Solr-master-Solaris/lucene/build/analysis/common/classes/java/org/apache/lucene/analysis/en/package-info.class
    [javac] Creating empty /export/home/jenkins/workspace/Lucene-Solr-master-Solaris/lucene/build/analysis/common/classes/java/org/apache/lucene/analysis/es/package-info.class
    [javac] Creating empty /export/home/jenkins/workspace/Lucene-Solr-master-Solaris/lucene/build/analysis/common/classes/java/org/apache/lucene/analysis/shingle/package-info.class
    [javac] Creating empty /export/home/jenkins/workspace/Lucene-Solr-master-Solaris/lucene/build/analysis/common/classes/java/org/apache/lucene/analysis/eu/package-info.class
    [javac] Creating empty /export/home/jenkins/workspace/Lucene-Solr-master-Solaris/lucene/build/analysis/common/classes/java/org/apache/lucene/analysis/ar/package-info.class
    [javac] Creating empty /export/home/jenkins/workspace/Lucene-Solr-master-Solaris/lucene/build/analysis/common/classes/java/org/apache/lucene/analysis/query/package-info.class
    [javac] Creating empty /export/home/jenkins/workspace/Lucene-Solr-master-Solaris/lucene/build/analysis/common/classes/java/org/apache/lucene/analysis/id/package-info.class
    [javac] Creating empty /export/home/jenkins/workspace/Lucene-Solr-master-Solaris/lucene/build/analysis/common/classes/java/org/apache/lucene/analysis/compound/hyphenation/package-info.class
    [javac] Creating empty /export/home/jenkins/workspace/Lucene-Solr-master-Solaris/lucene/build/analysis/common/classes/java/org/apache/lucene/analysis/charfilter/package-info.class
    [javac] Creating empty /export/home/jenkins/workspace/Lucene-Solr-master-Sola

[...truncated too long message...]

ant test-nocompile -Dtests.dups=5 -Dtests.maxfailures=5 -Dtests.class="*.TestManagedResourceStorage" -Dtests.showOutput=onerror "-Dargs=-XX:+UseCompressedOops -XX:+UseSerialGC" -Dtests.seed=F465419791631E17 -Dtests.slow=true -Dtests.locale=es-PY -Dtests.timezone=Europe/Zagreb -Dtests.asserts=true -Dtests.file.encoding=ISO-8859-1
Buildfile: /export/home/jenkins/workspace/Lucene-Solr-master-Solaris/solr/core/build.xml

-clover.disable:

ivy-configure:
[ivy:configure] :: Apache Ivy 2.4.0 - 20141213170938 :: http://ant.apache.org/ivy/ ::
[ivy:configure] :: loading settings :: file = /export/home/jenkins/workspace/Lucene-Solr-master-Solaris/lucene/top-level-ivy-settings.xml

install-junit4-taskdef:

ivy-availability-check:
[loadresource] Do not set property disallowed.ivy.jars.list as its length is 0.

-ivy-fail-disallowed-ivy-version:

ivy-fail:

resolve-groovy:
[ivy:cachepath] :: resolving dependencies :: org.codehaus.groovy#groovy-all-caller;working
[ivy:cachepath] 	confs: [default]
[ivy:cachepath] 	found org.codehaus.groovy#groovy-all;2.4.15 in public
[ivy:cachepath] :: resolution report :: resolve 22ms :: artifacts dl 1ms
	---------------------------------------------------------------------
	|                  |            modules            ||   artifacts   |
	|       conf       | number| search|dwnlded|evicted|| number|dwnlded|
	---------------------------------------------------------------------
	|      default     |   1   |   0   |   0   |   0   ||   1   |   0   |
	---------------------------------------------------------------------

-init-totals:

-test:
    [mkdir] Created dir: /export/home/jenkins/workspace/Lucene-Solr-master-Solaris/solr/build/solr-core/test
[junit4:pickseed] Seed property 'tests.seed' already defined: F465419791631E17
    [mkdir] Created dir: /export/home/jenkins/workspace/Lucene-Solr-master-Solaris/solr/build/solr-core/test/temp
   [junit4] <JUnit4> says Привет! Master seed: F465419791631E17
   [junit4] Executing 5 suites with 2 JVMs.
   [junit4] 
   [junit4] Started J1 PID(27215@serv1-vm3).
   [junit4] Started J0 PID(27216@serv1-vm3).
   [junit4] Suite: org.apache.solr.rest.TestManagedResourceStorage
   [junit4] OK      0.04s J1 | TestManagedResourceStorage.testZkBasedJsonStorage
   [junit4] OK      0.03s J1 | TestManagedResourceStorage.testFileBasedJsonStorage
   [junit4] Completed [1/5] on J1 in 13.10s, 2 tests
   [junit4] 
   [junit4] Suite: org.apache.solr.rest.TestManagedResourceStorage
   [junit4] OK      0.07s J0 | TestManagedResourceStorage.testZkBasedJsonStorage
   [junit4] OK      0.01s J0 | TestManagedResourceStorage.testFileBasedJsonStorage
   [junit4] Completed [2/5] on J0 in 14.12s, 2 tests
   [junit4] 
   [junit4] Duplicate suite name used with XML reports: org.apache.solr.rest.TestManagedResourceStorage. This may confuse tools that process XML reports. Set 'ignoreDuplicateSuites' to true to skip this message.
   [junit4] Suite: org.apache.solr.rest.TestManagedResourceStorage
   [junit4] OK      0.03s J0 | TestManagedResourceStorage.testZkBasedJsonStorage
   [junit4] OK      0.01s J0 | TestManagedResourceStorage.testFileBasedJsonStorage
   [junit4] Completed [3/5] on J0 in 2.85s, 2 tests
   [junit4] 
   [junit4] Suite: org.apache.solr.rest.TestManagedResourceStorage
   [junit4] OK      0.02s J1 | TestManagedResourceStorage.testZkBasedJsonStorage
   [junit4] OK      0.01s J1 | TestManagedResourceStorage.testFileBasedJsonStorage
   [junit4] Completed [4/5] on J1 in 4.94s, 2 tests
   [junit4] 
   [junit4] Suite: org.apache.solr.rest.TestManagedResourceStorage
   [junit4] OK      0.03s J0 | TestManagedResourceStorage.testZkBasedJsonStorage
   [junit4] OK      0.01s J0 | TestManagedResourceStorage.testFileBasedJsonStorage
   [junit4] Completed [5/5] on J0 in 2.91s, 2 tests
   [junit4] 
   [junit4] JVM J0:     0.72 ..    21.97 =    21.25s
   [junit4] JVM J1:     0.72 ..    19.74 =    19.02s
   [junit4] Execution time total: 21 seconds
   [junit4] Tests summary: 5 suites, 10 tests
   [junit4] Could not remove temporary path: /export/home/jenkins/workspace/Lucene-Solr-master-Solaris/solr/build/solr-core/test/J1 (java.nio.file.DirectoryNotEmptyException: Remaining files: [/export/home/jenkins/workspace/Lucene-Solr-master-Solaris/solr/build/solr-core/test/J1/temp])
   [junit4] Could not remove temporary path: /export/home/jenkins/workspace/Lucene-Solr-master-Solaris/solr/build/solr-core/test/J0 (java.nio.file.DirectoryNotEmptyException: Remaining files: [/export/home/jenkins/workspace/Lucene-Solr-master-Solaris/solr/build/solr-core/test/J0/temp])
     [echo] 5 slowest tests:
[junit4:tophints] 100.87s | org.apache.solr.cloud.autoscaling.ComputePlanActionTest
[junit4:tophints]  84.89s | org.apache.solr.cloud.LIRRollingUpdatesTest
[junit4:tophints]  70.86s | org.apache.solr.cloud.MoveReplicaHDFSFailoverTest
[junit4:tophints]  69.99s | org.apache.solr.cloud.CollectionsAPISolrJTest
[junit4:tophints]  69.22s | org.apache.solr.update.TestInPlaceUpdatesDistrib

-check-totals:

test-nocompile:

BUILD SUCCESSFUL
Total time: 25 seconds
[repro] Failures:
[repro]   0/5 failed: org.apache.solr.rest.TestManagedResourceStorage
[repro] Exiting with code 0
+ mv lucene/build lucene/build.repro
+ mv solr/build solr/build.repro
+ mv lucene/build.orig lucene/build
+ mv solr/build.orig solr/build
Archiving artifacts
Setting ANT_1_8_2_HOME=/export/home/jenkins/tools/hudson.tasks.Ant_AntInstallation/ANT_1.8.2
java.lang.InterruptedException: no matches found within 10000
	at hudson.FilePath$ValidateAntFileMask.hasMatch(FilePath.java:2845)
	at hudson.FilePath$ValidateAntFileMask.invoke(FilePath.java:2724)
	at hudson.FilePath$ValidateAntFileMask.invoke(FilePath.java:2705)
	at hudson.FilePath$FileCallableWrapper.call(FilePath.java:3084)
Also:   hudson.remoting.Channel$CallSiteStackTrace: Remote call to Solaris VBOX
		at hudson.remoting.Channel.attachCallSiteStackTrace(Channel.java:1741)
		at hudson.remoting.UserRequest$ExceptionResponse.retrieve(UserRequest.java:357)
		at hudson.remoting.Channel.call(Channel.java:955)
		at hudson.FilePath.act(FilePath.java:1070)
		at hudson.FilePath.act(FilePath.java:1059)
		at hudson.FilePath.validateAntFileMask(FilePath.java:2703)
		at hudson.tasks.ArtifactArchiver.perform(ArtifactArchiver.java:243)
		at hudson.tasks.BuildStepCompatibilityLayer.perform(BuildStepCompatibilityLayer.java:81)
		at hudson.tasks.BuildStepMonitor$1.perform(BuildStepMonitor.java:20)
		at hudson.model.AbstractBuild$AbstractBuildExecution.perform(AbstractBuild.java:744)
		at hudson.model.AbstractBuild$AbstractBuildExecution.performAllBuildSteps(AbstractBuild.java:690)
		at hudson.model.Build$BuildExecution.post2(Build.java:186)
		at hudson.model.AbstractBuild$AbstractBuildExecution.post(AbstractBuild.java:635)
		at hudson.model.Run.execute(Run.java:1831)
		at hudson.model.FreeStyleBuild.run(FreeStyleBuild.java:43)
		at hudson.model.ResourceController.execute(ResourceController.java:97)
		at hudson.model.Executor.run(Executor.java:429)
Caused: hudson.FilePath$TunneledInterruptedException
	at hudson.FilePath$FileCallableWrapper.call(FilePath.java:3086)
	at hudson.remoting.UserRequest.perform(UserRequest.java:212)
	at hudson.remoting.UserRequest.perform(UserRequest.java:54)
	at hudson.remoting.Request$2.run(Request.java:369)
	at hudson.remoting.InterceptingExecutorService$1.call(InterceptingExecutorService.java:72)
	at java.util.concurrent.FutureTask.run(FutureTask.java:266)
	at java.util.concurrent.ThreadPoolExecutor.runWorker(ThreadPoolExecutor.java:1149)
	at java.util.concurrent.ThreadPoolExecutor$Worker.run(ThreadPoolExecutor.java:624)
	at java.lang.Thread.run(Thread.java:748)
Caused: java.lang.InterruptedException: java.lang.InterruptedException: no matches found within 10000
	at hudson.FilePath.act(FilePath.java:1072)
	at hudson.FilePath.act(FilePath.java:1059)
	at hudson.FilePath.validateAntFileMask(FilePath.java:2703)
	at hudson.tasks.ArtifactArchiver.perform(ArtifactArchiver.java:243)
	at hudson.tasks.BuildStepCompatibilityLayer.perform(BuildStepCompatibilityLayer.java:81)
	at hudson.tasks.BuildStepMonitor$1.perform(BuildStepMonitor.java:20)
	at hudson.model.AbstractBuild$AbstractBuildExecution.perform(AbstractBuild.java:744)
	at hudson.model.AbstractBuild$AbstractBuildExecution.performAllBuildSteps(AbstractBuild.java:690)
	at hudson.model.Build$BuildExecution.post2(Build.java:186)
	at hudson.model.AbstractBuild$AbstractBuildExecution.post(AbstractBuild.java:635)
	at hudson.model.Run.execute(Run.java:1831)
	at hudson.model.FreeStyleBuild.run(FreeStyleBuild.java:43)
	at hudson.model.ResourceController.execute(ResourceController.java:97)
	at hudson.model.Executor.run(Executor.java:429)
No artifacts found that match the file pattern "**/*.events,heapdumps/**,**/*_pid*.log". Configuration error?
[WARNINGS] Parsing warnings in console log with parser Java Compiler (javac)
Setting ANT_1_8_2_HOME=/export/home/jenkins/tools/hudson.tasks.Ant_AntInstallation/ANT_1.8.2
Setting ANT_1_8_2_HOME=/export/home/jenkins/tools/hudson.tasks.Ant_AntInstallation/ANT_1.8.2
<Git Blamer> Using GitBlamer to create author and commit information for all warnings.
<Git Blamer> GIT_COMMIT=fe844c739b1bd24090789acad099d3b3e5c12d4e, workspace=/export/home/jenkins/workspace/Lucene-Solr-master-Solaris
[WARNINGS] Computing warning deltas based on reference build #2085
Recording test results
Setting ANT_1_8_2_HOME=/export/home/jenkins/tools/hudson.tasks.Ant_AntInstallation/ANT_1.8.2
Build step 'Publish JUnit test result report' changed build result to UNSTABLE
Email was triggered for: Unstable (Test Failures)
Sending email for trigger: Unstable (Test Failures)
Setting ANT_1_8_2_HOME=/export/home/jenkins/tools/hudson.tasks.Ant_AntInstallation/ANT_1.8.2
Setting ANT_1_8_2_HOME=/export/home/jenkins/tools/hudson.tasks.Ant_AntInstallation/ANT_1.8.2
Setting ANT_1_8_2_HOME=/export/home/jenkins/tools/hudson.tasks.Ant_AntInstallation/ANT_1.8.2
Setting ANT_1_8_2_HOME=/export/home/jenkins/tools/hudson.tasks.Ant_AntInstallation/ANT_1.8.2

Mime
View raw message