lucene-dev mailing list archives

Site index · List index
Message view « Date » · « Thread »
Top « Date » · « Thread »
From Policeman Jenkins Server <jenk...@thetaphi.de>
Subject [JENKINS] Lucene-Solr-master-MacOSX (64bit/jdk-9) - Build # 4903 - Unstable!
Date Tue, 30 Oct 2018 23:55:31 GMT
Build: https://jenkins.thetaphi.de/job/Lucene-Solr-master-MacOSX/4903/
Java: 64bit/jdk-9 -XX:+UseCompressedOops -XX:+UseParallelGC

6 tests failed.
FAILED:  org.apache.lucene.store.TestByteBuffersDirectory.testSeekPastEOF {impl=byte array (heap)}

Error Message:
Unexpected exception type, expected EOFException but got java.lang.ArrayIndexOutOfBoundsException: 1770

Stack Trace:
junit.framework.AssertionFailedError: Unexpected exception type, expected EOFException but got java.lang.ArrayIndexOutOfBoundsException: 1770
	at __randomizedtesting.SeedInfo.seed([BDFA8CEDB7C93AC1:5DBC4714B74C4450]:0)
	at org.apache.lucene.util.LuceneTestCase.expectThrows(LuceneTestCase.java:2680)
	at org.apache.lucene.util.LuceneTestCase.expectThrows(LuceneTestCase.java:2669)
	at org.apache.lucene.store.BaseDirectoryTestCase.testSeekPastEOF(BaseDirectoryTestCase.java:516)
	at java.base/jdk.internal.reflect.NativeMethodAccessorImpl.invoke0(Native Method)
	at java.base/jdk.internal.reflect.NativeMethodAccessorImpl.invoke(NativeMethodAccessorImpl.java:62)
	at java.base/jdk.internal.reflect.DelegatingMethodAccessorImpl.invoke(DelegatingMethodAccessorImpl.java:43)
	at java.base/java.lang.reflect.Method.invoke(Method.java:564)
	at com.carrotsearch.randomizedtesting.RandomizedRunner.invoke(RandomizedRunner.java:1742)
	at com.carrotsearch.randomizedtesting.RandomizedRunner$8.evaluate(RandomizedRunner.java:935)
	at com.carrotsearch.randomizedtesting.RandomizedRunner$9.evaluate(RandomizedRunner.java:971)
	at com.carrotsearch.randomizedtesting.RandomizedRunner$10.evaluate(RandomizedRunner.java:985)
	at org.apache.lucene.util.TestRuleSetupTeardownChained$1.evaluate(TestRuleSetupTeardownChained.java:49)
	at org.apache.lucene.util.AbstractBeforeAfterRule$1.evaluate(AbstractBeforeAfterRule.java:45)
	at org.apache.lucene.util.TestRuleThreadAndTestName$1.evaluate(TestRuleThreadAndTestName.java:48)
	at org.apache.lucene.util.TestRuleIgnoreAfterMaxFailures$1.evaluate(TestRuleIgnoreAfterMaxFailures.java:64)
	at org.apache.lucene.util.TestRuleMarkFailure$1.evaluate(TestRuleMarkFailure.java:47)
	at com.carrotsearch.randomizedtesting.rules.StatementAdapter.evaluate(StatementAdapter.java:36)
	at com.carrotsearch.randomizedtesting.ThreadLeakControl$StatementRunner.run(ThreadLeakControl.java:368)
	at com.carrotsearch.randomizedtesting.ThreadLeakControl.forkTimeoutingTask(ThreadLeakControl.java:817)
	at com.carrotsearch.randomizedtesting.ThreadLeakControl$3.evaluate(ThreadLeakControl.java:468)
	at com.carrotsearch.randomizedtesting.RandomizedRunner.runSingleTest(RandomizedRunner.java:944)
	at com.carrotsearch.randomizedtesting.RandomizedRunner$5.evaluate(RandomizedRunner.java:830)
	at com.carrotsearch.randomizedtesting.RandomizedRunner$6.evaluate(RandomizedRunner.java:880)
	at com.carrotsearch.randomizedtesting.RandomizedRunner$7.evaluate(RandomizedRunner.java:891)
	at org.apache.lucene.util.AbstractBeforeAfterRule$1.evaluate(AbstractBeforeAfterRule.java:45)
	at com.carrotsearch.randomizedtesting.rules.StatementAdapter.evaluate(StatementAdapter.java:36)
	at org.apache.lucene.util.TestRuleStoreClassName$1.evaluate(TestRuleStoreClassName.java:41)
	at com.carrotsearch.randomizedtesting.rules.NoShadowingOrOverridesOnMethodsRule$1.evaluate(NoShadowingOrOverridesOnMethodsRule.java:40)
	at com.carrotsearch.randomizedtesting.rules.NoShadowingOrOverridesOnMethodsRule$1.evaluate(NoShadowingOrOverridesOnMethodsRule.java:40)
	at com.carrotsearch.randomizedtesting.rules.StatementAdapter.evaluate(StatementAdapter.java:36)
	at com.carrotsearch.randomizedtesting.rules.StatementAdapter.evaluate(StatementAdapter.java:36)
	at org.apache.lucene.util.TestRuleAssertionsRequired$1.evaluate(TestRuleAssertionsRequired.java:53)
	at org.apache.lucene.util.TestRuleMarkFailure$1.evaluate(TestRuleMarkFailure.java:47)
	at org.apache.lucene.util.TestRuleIgnoreAfterMaxFailures$1.evaluate(TestRuleIgnoreAfterMaxFailures.java:64)
	at org.apache.lucene.util.TestRuleIgnoreTestSuites$1.evaluate(TestRuleIgnoreTestSuites.java:54)
	at com.carrotsearch.randomizedtesting.rules.StatementAdapter.evaluate(StatementAdapter.java:36)
	at com.carrotsearch.randomizedtesting.ThreadLeakControl$StatementRunner.run(ThreadLeakControl.java:368)
	at java.base/java.lang.Thread.run(Thread.java:844)
Caused by: java.lang.ArrayIndexOutOfBoundsException: 1770
	at org.apache.lucene.store.ByteArrayIndexInput.readByte(ByteArrayIndexInput.java:145)
	at org.apache.lucene.store.BaseDirectoryTestCase.lambda$testSeekPastEOF$12(BaseDirectoryTestCase.java:518)
	at org.apache.lucene.util.LuceneTestCase.expectThrows(LuceneTestCase.java:2675)
	... 37 more


FAILED:  org.apache.lucene.store.TestByteBuffersDirectory.testSeekPastEOF {impl=byte array (heap)}

Error Message:
Unexpected exception type, expected EOFException but got java.lang.ArrayIndexOutOfBoundsException: 1770

Stack Trace:
junit.framework.AssertionFailedError: Unexpected exception type, expected EOFException but got java.lang.ArrayIndexOutOfBoundsException: 1770
	at __randomizedtesting.SeedInfo.seed([BDFA8CEDB7C93AC1:5DBC4714B74C4450]:0)
	at org.apache.lucene.util.LuceneTestCase.expectThrows(LuceneTestCase.java:2680)
	at org.apache.lucene.util.LuceneTestCase.expectThrows(LuceneTestCase.java:2669)
	at org.apache.lucene.store.BaseDirectoryTestCase.testSeekPastEOF(BaseDirectoryTestCase.java:516)
	at java.base/jdk.internal.reflect.NativeMethodAccessorImpl.invoke0(Native Method)
	at java.base/jdk.internal.reflect.NativeMethodAccessorImpl.invoke(NativeMethodAccessorImpl.java:62)
	at java.base/jdk.internal.reflect.DelegatingMethodAccessorImpl.invoke(DelegatingMethodAccessorImpl.java:43)
	at java.base/java.lang.reflect.Method.invoke(Method.java:564)
	at com.carrotsearch.randomizedtesting.RandomizedRunner.invoke(RandomizedRunner.java:1742)
	at com.carrotsearch.randomizedtesting.RandomizedRunner$8.evaluate(RandomizedRunner.java:935)
	at com.carrotsearch.randomizedtesting.RandomizedRunner$9.evaluate(RandomizedRunner.java:971)
	at com.carrotsearch.randomizedtesting.RandomizedRunner$10.evaluate(RandomizedRunner.java:985)
	at org.apache.lucene.util.TestRuleSetupTeardownChained$1.evaluate(TestRuleSetupTeardownChained.java:49)
	at org.apache.lucene.util.AbstractBeforeAfterRule$1.evaluate(AbstractBeforeAfterRule.java:45)
	at org.apache.lucene.util.TestRuleThreadAndTestName$1.evaluate(TestRuleThreadAndTestName.java:48)
	at org.apache.lucene.util.TestRuleIgnoreAfterMaxFailures$1.evaluate(TestRuleIgnoreAfterMaxFailures.java:64)
	at org.apache.lucene.util.TestRuleMarkFailure$1.evaluate(TestRuleMarkFailure.java:47)
	at com.carrotsearch.randomizedtesting.rules.StatementAdapter.evaluate(StatementAdapter.java:36)
	at com.carrotsearch.randomizedtesting.ThreadLeakControl$StatementRunner.run(ThreadLeakControl.java:368)
	at com.carrotsearch.randomizedtesting.ThreadLeakControl.forkTimeoutingTask(ThreadLeakControl.java:817)
	at com.carrotsearch.randomizedtesting.ThreadLeakControl$3.evaluate(ThreadLeakControl.java:468)
	at com.carrotsearch.randomizedtesting.RandomizedRunner.runSingleTest(RandomizedRunner.java:944)
	at com.carrotsearch.randomizedtesting.RandomizedRunner$5.evaluate(RandomizedRunner.java:830)
	at com.carrotsearch.randomizedtesting.RandomizedRunner$6.evaluate(RandomizedRunner.java:880)
	at com.carrotsearch.randomizedtesting.RandomizedRunner$7.evaluate(RandomizedRunner.java:891)
	at org.apache.lucene.util.AbstractBeforeAfterRule$1.evaluate(AbstractBeforeAfterRule.java:45)
	at com.carrotsearch.randomizedtesting.rules.StatementAdapter.evaluate(StatementAdapter.java:36)
	at org.apache.lucene.util.TestRuleStoreClassName$1.evaluate(TestRuleStoreClassName.java:41)
	at com.carrotsearch.randomizedtesting.rules.NoShadowingOrOverridesOnMethodsRule$1.evaluate(NoShadowingOrOverridesOnMethodsRule.java:40)
	at com.carrotsearch.randomizedtesting.rules.NoShadowingOrOverridesOnMethodsRule$1.evaluate(NoShadowingOrOverridesOnMethodsRule.java:40)
	at com.carrotsearch.randomizedtesting.rules.StatementAdapter.evaluate(StatementAdapter.java:36)
	at com.carrotsearch.randomizedtesting.rules.StatementAdapter.evaluate(StatementAdapter.java:36)
	at org.apache.lucene.util.TestRuleAssertionsRequired$1.evaluate(TestRuleAssertionsRequired.java:53)
	at org.apache.lucene.util.TestRuleMarkFailure$1.evaluate(TestRuleMarkFailure.java:47)
	at org.apache.lucene.util.TestRuleIgnoreAfterMaxFailures$1.evaluate(TestRuleIgnoreAfterMaxFailures.java:64)
	at org.apache.lucene.util.TestRuleIgnoreTestSuites$1.evaluate(TestRuleIgnoreTestSuites.java:54)
	at com.carrotsearch.randomizedtesting.rules.StatementAdapter.evaluate(StatementAdapter.java:36)
	at com.carrotsearch.randomizedtesting.ThreadLeakControl$StatementRunner.run(ThreadLeakControl.java:368)
	at java.base/java.lang.Thread.run(Thread.java:844)
Caused by: java.lang.ArrayIndexOutOfBoundsException: 1770
	at org.apache.lucene.store.ByteArrayIndexInput.readByte(ByteArrayIndexInput.java:145)
	at org.apache.lucene.store.BaseDirectoryTestCase.lambda$testSeekPastEOF$12(BaseDirectoryTestCase.java:518)
	at org.apache.lucene.util.LuceneTestCase.expectThrows(LuceneTestCase.java:2675)
	... 37 more


FAILED:  org.apache.lucene.store.TestByteBuffersDirectory.testSeekPastEOF {impl=byte array (heap)}

Error Message:
Unexpected exception type, expected EOFException but got java.lang.ArrayIndexOutOfBoundsException: 1770

Stack Trace:
junit.framework.AssertionFailedError: Unexpected exception type, expected EOFException but got java.lang.ArrayIndexOutOfBoundsException: 1770
	at __randomizedtesting.SeedInfo.seed([BDFA8CEDB7C93AC1:5DBC4714B74C4450]:0)
	at org.apache.lucene.util.LuceneTestCase.expectThrows(LuceneTestCase.java:2680)
	at org.apache.lucene.util.LuceneTestCase.expectThrows(LuceneTestCase.java:2669)
	at org.apache.lucene.store.BaseDirectoryTestCase.testSeekPastEOF(BaseDirectoryTestCase.java:516)
	at java.base/jdk.internal.reflect.NativeMethodAccessorImpl.invoke0(Native Method)
	at java.base/jdk.internal.reflect.NativeMethodAccessorImpl.invoke(NativeMethodAccessorImpl.java:62)
	at java.base/jdk.internal.reflect.DelegatingMethodAccessorImpl.invoke(DelegatingMethodAccessorImpl.java:43)
	at java.base/java.lang.reflect.Method.invoke(Method.java:564)
	at com.carrotsearch.randomizedtesting.RandomizedRunner.invoke(RandomizedRunner.java:1742)
	at com.carrotsearch.randomizedtesting.RandomizedRunner$8.evaluate(RandomizedRunner.java:935)
	at com.carrotsearch.randomizedtesting.RandomizedRunner$9.evaluate(RandomizedRunner.java:971)
	at com.carrotsearch.randomizedtesting.RandomizedRunner$10.evaluate(RandomizedRunner.java:985)
	at org.apache.lucene.util.TestRuleSetupTeardownChained$1.evaluate(TestRuleSetupTeardownChained.java:49)
	at org.apache.lucene.util.AbstractBeforeAfterRule$1.evaluate(AbstractBeforeAfterRule.java:45)
	at org.apache.lucene.util.TestRuleThreadAndTestName$1.evaluate(TestRuleThreadAndTestName.java:48)
	at org.apache.lucene.util.TestRuleIgnoreAfterMaxFailures$1.evaluate(TestRuleIgnoreAfterMaxFailures.java:64)
	at org.apache.lucene.util.TestRuleMarkFailure$1.evaluate(TestRuleMarkFailure.java:47)
	at com.carrotsearch.randomizedtesting.rules.StatementAdapter.evaluate(StatementAdapter.java:36)
	at com.carrotsearch.randomizedtesting.ThreadLeakControl$StatementRunner.run(ThreadLeakControl.java:368)
	at com.carrotsearch.randomizedtesting.ThreadLeakControl.forkTimeoutingTask(ThreadLeakControl.java:817)
	at com.carrotsearch.randomizedtesting.ThreadLeakControl$3.evaluate(ThreadLeakControl.java:468)
	at com.carrotsearch.randomizedtesting.RandomizedRunner.runSingleTest(RandomizedRunner.java:944)
	at com.carrotsearch.randomizedtesting.RandomizedRunner$5.evaluate(RandomizedRunner.java:830)
	at com.carrotsearch.randomizedtesting.RandomizedRunner$6.evaluate(RandomizedRunner.java:880)
	at com.carrotsearch.randomizedtesting.RandomizedRunner$7.evaluate(RandomizedRunner.java:891)
	at org.apache.lucene.util.AbstractBeforeAfterRule$1.evaluate(AbstractBeforeAfterRule.java:45)
	at com.carrotsearch.randomizedtesting.rules.StatementAdapter.evaluate(StatementAdapter.java:36)
	at org.apache.lucene.util.TestRuleStoreClassName$1.evaluate(TestRuleStoreClassName.java:41)
	at com.carrotsearch.randomizedtesting.rules.NoShadowingOrOverridesOnMethodsRule$1.evaluate(NoShadowingOrOverridesOnMethodsRule.java:40)
	at com.carrotsearch.randomizedtesting.rules.NoShadowingOrOverridesOnMethodsRule$1.evaluate(NoShadowingOrOverridesOnMethodsRule.java:40)
	at com.carrotsearch.randomizedtesting.rules.StatementAdapter.evaluate(StatementAdapter.java:36)
	at com.carrotsearch.randomizedtesting.rules.StatementAdapter.evaluate(StatementAdapter.java:36)
	at org.apache.lucene.util.TestRuleAssertionsRequired$1.evaluate(TestRuleAssertionsRequired.java:53)
	at org.apache.lucene.util.TestRuleMarkFailure$1.evaluate(TestRuleMarkFailure.java:47)
	at org.apache.lucene.util.TestRuleIgnoreAfterMaxFailures$1.evaluate(TestRuleIgnoreAfterMaxFailures.java:64)
	at org.apache.lucene.util.TestRuleIgnoreTestSuites$1.evaluate(TestRuleIgnoreTestSuites.java:54)
	at com.carrotsearch.randomizedtesting.rules.StatementAdapter.evaluate(StatementAdapter.java:36)
	at com.carrotsearch.randomizedtesting.ThreadLeakControl$StatementRunner.run(ThreadLeakControl.java:368)
	at java.base/java.lang.Thread.run(Thread.java:844)
Caused by: java.lang.ArrayIndexOutOfBoundsException: 1770
	at org.apache.lucene.store.ByteArrayIndexInput.readByte(ByteArrayIndexInput.java:145)
	at org.apache.lucene.store.BaseDirectoryTestCase.lambda$testSeekPastEOF$12(BaseDirectoryTestCase.java:518)
	at org.apache.lucene.util.LuceneTestCase.expectThrows(LuceneTestCase.java:2675)
	... 37 more


FAILED:  org.apache.lucene.store.TestByteBuffersDirectory.testSeekPastEOF {impl=byte array (heap)}

Error Message:
Unexpected exception type, expected EOFException but got java.lang.ArrayIndexOutOfBoundsException: 1770

Stack Trace:
junit.framework.AssertionFailedError: Unexpected exception type, expected EOFException but got java.lang.ArrayIndexOutOfBoundsException: 1770
	at __randomizedtesting.SeedInfo.seed([BDFA8CEDB7C93AC1:5DBC4714B74C4450]:0)
	at org.apache.lucene.util.LuceneTestCase.expectThrows(LuceneTestCase.java:2680)
	at org.apache.lucene.util.LuceneTestCase.expectThrows(LuceneTestCase.java:2669)
	at org.apache.lucene.store.BaseDirectoryTestCase.testSeekPastEOF(BaseDirectoryTestCase.java:516)
	at java.base/jdk.internal.reflect.NativeMethodAccessorImpl.invoke0(Native Method)
	at java.base/jdk.internal.reflect.NativeMethodAccessorImpl.invoke(NativeMethodAccessorImpl.java:62)
	at java.base/jdk.internal.reflect.DelegatingMethodAccessorImpl.invoke(DelegatingMethodAccessorImpl.java:43)
	at java.base/java.lang.reflect.Method.invoke(Method.java:564)
	at com.carrotsearch.randomizedtesting.RandomizedRunner.invoke(RandomizedRunner.java:1742)
	at com.carrotsearch.randomizedtesting.RandomizedRunner$8.evaluate(RandomizedRunner.java:935)
	at com.carrotsearch.randomizedtesting.RandomizedRunner$9.evaluate(RandomizedRunner.java:971)
	at com.carrotsearch.randomizedtesting.RandomizedRunner$10.evaluate(RandomizedRunner.java:985)
	at org.apache.lucene.util.TestRuleSetupTeardownChained$1.evaluate(TestRuleSetupTeardownChained.java:49)
	at org.apache.lucene.util.AbstractBeforeAfterRule$1.evaluate(AbstractBeforeAfterRule.java:45)
	at org.apache.lucene.util.TestRuleThreadAndTestName$1.evaluate(TestRuleThreadAndTestName.java:48)
	at org.apache.lucene.util.TestRuleIgnoreAfterMaxFailures$1.evaluate(TestRuleIgnoreAfterMaxFailures.java:64)
	at org.apache.lucene.util.TestRuleMarkFailure$1.evaluate(TestRuleMarkFailure.java:47)
	at com.carrotsearch.randomizedtesting.rules.StatementAdapter.evaluate(StatementAdapter.java:36)
	at com.carrotsearch.randomizedtesting.ThreadLeakControl$StatementRunner.run(ThreadLeakControl.java:368)
	at com.carrotsearch.randomizedtesting.ThreadLeakControl.forkTimeoutingTask(ThreadLeakControl.java:817)
	at com.carrotsearch.randomizedtesting.ThreadLeakControl$3.evaluate(ThreadLeakControl.java:468)
	at com.carrotsearch.randomizedtesting.RandomizedRunner.runSingleTest(RandomizedRunner.java:944)
	at com.carrotsearch.randomizedtesting.RandomizedRunner$5.evaluate(RandomizedRunner.java:830)
	at com.carrotsearch.randomizedtesting.RandomizedRunner$6.evaluate(RandomizedRunner.java:880)
	at com.carrotsearch.randomizedtesting.RandomizedRunner$7.evaluate(RandomizedRunner.java:891)
	at org.apache.lucene.util.AbstractBeforeAfterRule$1.evaluate(AbstractBeforeAfterRule.java:45)
	at com.carrotsearch.randomizedtesting.rules.StatementAdapter.evaluate(StatementAdapter.java:36)
	at org.apache.lucene.util.TestRuleStoreClassName$1.evaluate(TestRuleStoreClassName.java:41)
	at com.carrotsearch.randomizedtesting.rules.NoShadowingOrOverridesOnMethodsRule$1.evaluate(NoShadowingOrOverridesOnMethodsRule.java:40)
	at com.carrotsearch.randomizedtesting.rules.NoShadowingOrOverridesOnMethodsRule$1.evaluate(NoShadowingOrOverridesOnMethodsRule.java:40)
	at com.carrotsearch.randomizedtesting.rules.StatementAdapter.evaluate(StatementAdapter.java:36)
	at com.carrotsearch.randomizedtesting.rules.StatementAdapter.evaluate(StatementAdapter.java:36)
	at org.apache.lucene.util.TestRuleAssertionsRequired$1.evaluate(TestRuleAssertionsRequired.java:53)
	at org.apache.lucene.util.TestRuleMarkFailure$1.evaluate(TestRuleMarkFailure.java:47)
	at org.apache.lucene.util.TestRuleIgnoreAfterMaxFailures$1.evaluate(TestRuleIgnoreAfterMaxFailures.java:64)
	at org.apache.lucene.util.TestRuleIgnoreTestSuites$1.evaluate(TestRuleIgnoreTestSuites.java:54)
	at com.carrotsearch.randomizedtesting.rules.StatementAdapter.evaluate(StatementAdapter.java:36)
	at com.carrotsearch.randomizedtesting.ThreadLeakControl$StatementRunner.run(ThreadLeakControl.java:368)
	at java.base/java.lang.Thread.run(Thread.java:844)
Caused by: java.lang.ArrayIndexOutOfBoundsException: 1770
	at org.apache.lucene.store.ByteArrayIndexInput.readByte(ByteArrayIndexInput.java:145)
	at org.apache.lucene.store.BaseDirectoryTestCase.lambda$testSeekPastEOF$12(BaseDirectoryTestCase.java:518)
	at org.apache.lucene.util.LuceneTestCase.expectThrows(LuceneTestCase.java:2675)
	... 37 more


FAILED:  org.apache.lucene.store.TestByteBuffersDirectory.testSeekPastEOF {impl=byte array (heap)}

Error Message:
Unexpected exception type, expected EOFException but got java.lang.ArrayIndexOutOfBoundsException: 1770

Stack Trace:
junit.framework.AssertionFailedError: Unexpected exception type, expected EOFException but got java.lang.ArrayIndexOutOfBoundsException: 1770
	at __randomizedtesting.SeedInfo.seed([BDFA8CEDB7C93AC1:5DBC4714B74C4450]:0)
	at org.apache.lucene.util.LuceneTestCase.expectThrows(LuceneTestCase.java:2680)
	at org.apache.lucene.util.LuceneTestCase.expectThrows(LuceneTestCase.java:2669)
	at org.apache.lucene.store.BaseDirectoryTestCase.testSeekPastEOF(BaseDirectoryTestCase.java:516)
	at java.base/jdk.internal.reflect.NativeMethodAccessorImpl.invoke0(Native Method)
	at java.base/jdk.internal.reflect.NativeMethodAccessorImpl.invoke(NativeMethodAccessorImpl.java:62)
	at java.base/jdk.internal.reflect.DelegatingMethodAccessorImpl.invoke(DelegatingMethodAccessorImpl.java:43)
	at java.base/java.lang.reflect.Method.invoke(Method.java:564)
	at com.carrotsearch.randomizedtesting.RandomizedRunner.invoke(RandomizedRunner.java:1742)
	at com.carrotsearch.randomizedtesting.RandomizedRunner$8.evaluate(RandomizedRunner.java:935)
	at com.carrotsearch.randomizedtesting.RandomizedRunner$9.evaluate(RandomizedRunner.java:971)
	at com.carrotsearch.randomizedtesting.RandomizedRunner$10.evaluate(RandomizedRunner.java:985)
	at org.apache.lucene.util.TestRuleSetupTeardownChained$1.evaluate(TestRuleSetupTeardownChained.java:49)
	at org.apache.lucene.util.AbstractBeforeAfterRule$1.evaluate(AbstractBeforeAfterRule.java:45)
	at org.apache.lucene.util.TestRuleThreadAndTestName$1.evaluate(TestRuleThreadAndTestName.java:48)
	at org.apache.lucene.util.TestRuleIgnoreAfterMaxFailures$1.evaluate(TestRuleIgnoreAfterMaxFailures.java:64)
	at org.apache.lucene.util.TestRuleMarkFailure$1.evaluate(TestRuleMarkFailure.java:47)
	at com.carrotsearch.randomizedtesting.rules.StatementAdapter.evaluate(StatementAdapter.java:36)
	at com.carrotsearch.randomizedtesting.ThreadLeakControl$StatementRunner.run(ThreadLeakControl.java:368)
	at com.carrotsearch.randomizedtesting.ThreadLeakControl.forkTimeoutingTask(ThreadLeakControl.java:817)
	at com.carrotsearch.randomizedtesting.ThreadLeakControl$3.evaluate(ThreadLeakControl.java:468)
	at com.carrotsearch.randomizedtesting.RandomizedRunner.runSingleTest(RandomizedRunner.java:944)
	at com.carrotsearch.randomizedtesting.RandomizedRunner$5.evaluate(RandomizedRunner.java:830)
	at com.carrotsearch.randomizedtesting.RandomizedRunner$6.evaluate(RandomizedRunner.java:880)
	at com.carrotsearch.randomizedtesting.RandomizedRunner$7.evaluate(RandomizedRunner.java:891)
	at org.apache.lucene.util.AbstractBeforeAfterRule$1.evaluate(AbstractBeforeAfterRule.java:45)
	at com.carrotsearch.randomizedtesting.rules.StatementAdapter.evaluate(StatementAdapter.java:36)
	at org.apache.lucene.util.TestRuleStoreClassName$1.evaluate(TestRuleStoreClassName.java:41)
	at com.carrotsearch.randomizedtesting.rules.NoShadowingOrOverridesOnMethodsRule$1.evaluate(NoShadowingOrOverridesOnMethodsRule.java:40)
	at com.carrotsearch.randomizedtesting.rules.NoShadowingOrOverridesOnMethodsRule$1.evaluate(NoShadowingOrOverridesOnMethodsRule.java:40)
	at com.carrotsearch.randomizedtesting.rules.StatementAdapter.evaluate(StatementAdapter.java:36)
	at com.carrotsearch.randomizedtesting.rules.StatementAdapter.evaluate(StatementAdapter.java:36)
	at org.apache.lucene.util.TestRuleAssertionsRequired$1.evaluate(TestRuleAssertionsRequired.java:53)
	at org.apache.lucene.util.TestRuleMarkFailure$1.evaluate(TestRuleMarkFailure.java:47)
	at org.apache.lucene.util.TestRuleIgnoreAfterMaxFailures$1.evaluate(TestRuleIgnoreAfterMaxFailures.java:64)
	at org.apache.lucene.util.TestRuleIgnoreTestSuites$1.evaluate(TestRuleIgnoreTestSuites.java:54)
	at com.carrotsearch.randomizedtesting.rules.StatementAdapter.evaluate(StatementAdapter.java:36)
	at com.carrotsearch.randomizedtesting.ThreadLeakControl$StatementRunner.run(ThreadLeakControl.java:368)
	at java.base/java.lang.Thread.run(Thread.java:844)
Caused by: java.lang.ArrayIndexOutOfBoundsException: 1770
	at org.apache.lucene.store.ByteArrayIndexInput.readByte(ByteArrayIndexInput.java:145)
	at org.apache.lucene.store.BaseDirectoryTestCase.lambda$testSeekPastEOF$12(BaseDirectoryTestCase.java:518)
	at org.apache.lucene.util.LuceneTestCase.expectThrows(LuceneTestCase.java:2675)
	... 37 more


FAILED:  org.apache.lucene.store.TestByteBuffersDirectory.testSeekPastEOF {impl=byte array (heap)}

Error Message:
Unexpected exception type, expected EOFException but got java.lang.ArrayIndexOutOfBoundsException: 1770

Stack Trace:
junit.framework.AssertionFailedError: Unexpected exception type, expected EOFException but got java.lang.ArrayIndexOutOfBoundsException: 1770
	at __randomizedtesting.SeedInfo.seed([BDFA8CEDB7C93AC1:5DBC4714B74C4450]:0)
	at org.apache.lucene.util.LuceneTestCase.expectThrows(LuceneTestCase.java:2680)
	at org.apache.lucene.util.LuceneTestCase.expectThrows(LuceneTestCase.java:2669)
	at org.apache.lucene.store.BaseDirectoryTestCase.testSeekPastEOF(BaseDirectoryTestCase.java:516)
	at java.base/jdk.internal.reflect.NativeMethodAccessorImpl.invoke0(Native Method)
	at java.base/jdk.internal.reflect.NativeMethodAccessorImpl.invoke(NativeMethodAccessorImpl.java:62)
	at java.base/jdk.internal.reflect.DelegatingMethodAccessorImpl.invoke(DelegatingMethodAccessorImpl.java:43)
	at java.base/java.lang.reflect.Method.invoke(Method.java:564)
	at com.carrotsearch.randomizedtesting.RandomizedRunner.invoke(RandomizedRunner.java:1742)
	at com.carrotsearch.randomizedtesting.RandomizedRunner$8.evaluate(RandomizedRunner.java:935)
	at com.carrotsearch.randomizedtesting.RandomizedRunner$9.evaluate(RandomizedRunner.java:971)
	at com.carrotsearch.randomizedtesting.RandomizedRunner$10.evaluate(RandomizedRunner.java:985)
	at org.apache.lucene.util.TestRuleSetupTeardownChained$1.evaluate(TestRuleSetupTeardownChained.java:49)
	at org.apache.lucene.util.AbstractBeforeAfterRule$1.evaluate(AbstractBeforeAfterRule.java:45)
	at org.apache.lucene.util.TestRuleThreadAndTestName$1.evaluate(TestRuleThreadAndTestName.java:48)
	at org.apache.lucene.util.TestRuleIgnoreAfterMaxFailures$1.evaluate(TestRuleIgnoreAfterMaxFailures.java:64)
	at org.apache.lucene.util.TestRuleMarkFailure$1.evaluate(TestRuleMarkFailure.java:47)
	at com.carrotsearch.randomizedtesting.rules.StatementAdapter.evaluate(StatementAdapter.java:36)
	at com.carrotsearch.randomizedtesting.ThreadLeakControl$StatementRunner.run(ThreadLeakControl.java:368)
	at com.carrotsearch.randomizedtesting.ThreadLeakControl.forkTimeoutingTask(ThreadLeakControl.java:817)
	at com.carrotsearch.randomizedtesting.ThreadLeakControl$3.evaluate(ThreadLeakControl.java:468)
	at com.carrotsearch.randomizedtesting.RandomizedRunner.runSingleTest(RandomizedRunner.java:944)
	at com.carrotsearch.randomizedtesting.RandomizedRunner$5.evaluate(RandomizedRunner.java:830)
	at com.carrotsearch.randomizedtesting.RandomizedRunner$6.evaluate(RandomizedRunner.java:880)
	at com.carrotsearch.randomizedtesting.RandomizedRunner$7.evaluate(RandomizedRunner.java:891)
	at org.apache.lucene.util.AbstractBeforeAfterRule$1.evaluate(AbstractBeforeAfterRule.java:45)
	at com.carrotsearch.randomizedtesting.rules.StatementAdapter.evaluate(StatementAdapter.java:36)
	at org.apache.lucene.util.TestRuleStoreClassName$1.evaluate(TestRuleStoreClassName.java:41)
	at com.carrotsearch.randomizedtesting.rules.NoShadowingOrOverridesOnMethodsRule$1.evaluate(NoShadowingOrOverridesOnMethodsRule.java:40)
	at com.carrotsearch.randomizedtesting.rules.NoShadowingOrOverridesOnMethodsRule$1.evaluate(NoShadowingOrOverridesOnMethodsRule.java:40)
	at com.carrotsearch.randomizedtesting.rules.StatementAdapter.evaluate(StatementAdapter.java:36)
	at com.carrotsearch.randomizedtesting.rules.StatementAdapter.evaluate(StatementAdapter.java:36)
	at org.apache.lucene.util.TestRuleAssertionsRequired$1.evaluate(TestRuleAssertionsRequired.java:53)
	at org.apache.lucene.util.TestRuleMarkFailure$1.evaluate(TestRuleMarkFailure.java:47)
	at org.apache.lucene.util.TestRuleIgnoreAfterMaxFailures$1.evaluate(TestRuleIgnoreAfterMaxFailures.java:64)
	at org.apache.lucene.util.TestRuleIgnoreTestSuites$1.evaluate(TestRuleIgnoreTestSuites.java:54)
	at com.carrotsearch.randomizedtesting.rules.StatementAdapter.evaluate(StatementAdapter.java:36)
	at com.carrotsearch.randomizedtesting.ThreadLeakControl$StatementRunner.run(ThreadLeakControl.java:368)
	at java.base/java.lang.Thread.run(Thread.java:844)
Caused by: java.lang.ArrayIndexOutOfBoundsException: 1770
	at org.apache.lucene.store.ByteArrayIndexInput.readByte(ByteArrayIndexInput.java:145)
	at org.apache.lucene.store.BaseDirectoryTestCase.lambda$testSeekPastEOF$12(BaseDirectoryTestCase.java:518)
	at org.apache.lucene.util.LuceneTestCase.expectThrows(LuceneTestCase.java:2675)
	... 37 more




Build Log:
[...truncated 546 lines...]
   [junit4] Suite: org.apache.lucene.store.TestByteBuffersDirectory
   [junit4] IGNOR/A 0.00s J0 | TestByteBuffersDirectory.testPendingDeletions {impl=lucene's buffers (heap)}
   [junit4]    > Assumption #1: we can only install VirusCheckingFS on an FSDirectory
   [junit4] IGNOR/A 0.00s J0 | TestByteBuffersDirectory.testFsyncDoesntCreateNewFiles {impl=lucene's buffers (heap)}
   [junit4]    > Assumption #1: test only works for FSDirectory subclasses
   [junit4] IGNOR/A 0.00s J0 | TestByteBuffersDirectory.testPendingDeletions {impl=many buffers (heap)}
   [junit4]    > Assumption #1: we can only install VirusCheckingFS on an FSDirectory
   [junit4] IGNOR/A 0.00s J0 | TestByteBuffersDirectory.testFsyncDoesntCreateNewFiles {impl=many buffers (heap)}
   [junit4]    > Assumption #1: test only works for FSDirectory subclasses
   [junit4] IGNOR/A 0.00s J0 | TestByteBuffersDirectory.testPendingDeletions {impl=one buffer (heap)}
   [junit4]    > Assumption #1: we can only install VirusCheckingFS on an FSDirectory
   [junit4] IGNOR/A 0.00s J0 | TestByteBuffersDirectory.testFsyncDoesntCreateNewFiles {impl=one buffer (heap)}
   [junit4]    > Assumption #1: test only works for FSDirectory subclasses
   [junit4]   2> NOTE: reproduce with: ant test  -Dtestcase=TestByteBuffersDirectory -Dtests.method=testSeekPastEOF -Dtests.seed=BDFA8CEDB7C93AC1 -Dtests.slow=true -Dtests.locale=sr-RS -Dtests.timezone=Europe/Astrakhan -Dtests.asserts=true -Dtests.file.encoding=US-ASCII
   [junit4] FAILURE 0.00s J0 | TestByteBuffersDirectory.testSeekPastEOF {impl=byte array (heap)} <<<
   [junit4]    > Throwable #1: junit.framework.AssertionFailedError: Unexpected exception type, expected EOFException but got java.lang.ArrayIndexOutOfBoundsException: 1770
   [junit4]    > 	at __randomizedtesting.SeedInfo.seed([BDFA8CEDB7C93AC1:5DBC4714B74C4450]:0)
   [junit4]    > 	at org.apache.lucene.util.LuceneTestCase.expectThrows(LuceneTestCase.java:2680)
   [junit4]    > 	at org.apache.lucene.util.LuceneTestCase.expectThrows(LuceneTestCase.java:2669)
   [junit4]    > 	at org.apache.lucene.store.BaseDirectoryTestCase.testSeekPastEOF(BaseDirectoryTestCase.java:516)
   [junit4]    > 	at java.base/jdk.internal.reflect.NativeMethodAccessorImpl.invoke0(Native Method)
   [junit4]    > 	at java.base/jdk.internal.reflect.NativeMethodAccessorImpl.invoke(NativeMethodAccessorImpl.java:62)
   [junit4]    > 	at java.base/jdk.internal.reflect.DelegatingMethodAccessorImpl.invoke(DelegatingMethodAccessorImpl.java:43)
   [junit4]    > 	at java.base/java.lang.reflect.Method.invoke(Method.java:564)
   [junit4]    > 	at java.base/java.lang.Thread.run(Thread.java:844)
   [junit4]    > Caused by: java.lang.ArrayIndexOutOfBoundsException: 1770
   [junit4]    > 	at org.apache.lucene.store.ByteArrayIndexInput.readByte(ByteArrayIndexInput.java:145)
   [junit4]    > 	at org.apache.lucene.store.BaseDirectoryTestCase.lambda$testSeekPastEOF$12(BaseDirectoryTestCase.java:518)
   [junit4]    > 	at org.apache.lucene.util.LuceneTestCase.expectThrows(LuceneTestCase.java:2675)
   [junit4]    > 	... 37 more
   [junit4] IGNOR/A 0.00s J0 | TestByteBuffersDirectory.testPendingDeletions {impl=byte array (heap)}
   [junit4]    > Assumption #1: we can only install VirusCheckingFS on an FSDirectory
   [junit4] IGNOR/A 0.00s J0 | TestByteBuffersDirectory.testFsyncDoesntCreateNewFiles {impl=byte array (heap)}
   [junit4]    > Assumption #1: test only works for FSDirectory subclasses
   [junit4]   2> NOTE: leaving temporary files on disk at: /Users/jenkins/workspace/Lucene-Solr-master-MacOSX/lucene/build/core/test/J0/temp/lucene.store.TestByteBuffersDirectory_BDFA8CEDB7C93AC1-001
   [junit4]   2> NOTE: test params are: codec=Lucene80, sim=Asserting(org.apache.lucene.search.similarities.AssertingSimilarity@2c972cf9), locale=sr-RS, timezone=Europe/Astrakhan
   [junit4]   2> NOTE: Mac OS X 10.11.6 x86_64/Oracle Corporation 9 (64-bit)/cpus=3,threads=1,free=157933784,total=235929600
   [junit4]   2> NOTE: All tests run in this JVM: [TestCharFilter, TestField, TestDistributionLL, TestNRTReaderWithThreads, TestExternalCodecs, TestDocIdsWriter, TestTermVectorsReader, TestSwappedIndexFiles, TestBasicModelIn, TestIndependenceStandardized, TestFileSwitchDirectory, TestSortedSetSortField, TestIndexWriterOutOfFileDescriptors, TestControlledRealTimeReopenThread, TestDocInverterPerFieldErrorInfo, TestBooleanSimilarity, TestParallelCompositeReader, TestPagedBytes, TestTermStates, TestMultiTermsEnum, TestPerFieldDocValuesFormat, TestRAMDirectory, TestSparseFixedBitDocIdSet, TestAtomicUpdate, TestFloatRangeFieldQueries, TestAxiomaticF2EXP, TestCharsRef, TestBytesRefArray, TestSpanExplanations, TestRollingBuffer, TestDaciukMihovAutomatonBuilder, TestLongDistanceFeatureQuery, TestPhraseQuery, TestByteBuffersDirectory]
   [junit4] Completed [76/510 (1!)] on J0 in 7.17s, 168 tests, 1 failure, 8 skipped <<< FAILURES!

[...truncated 57202 lines...]
[repro] Jenkins log URL: https://jenkins.thetaphi.de/job/Lucene-Solr-master-MacOSX/4903/consoleText

[repro] Revision: 856e28d8cf07cc34bc1361784bf00e7aceb3af97

[repro] Ant options: "-Dargs=-XX:+UseCompressedOops -XX:+UseParallelGC"
[repro] Repro line:  ant test  -Dtestcase=TestByteBuffersDirectory -Dtests.method=testSeekPastEOF -Dtests.seed=BDFA8CEDB7C93AC1 -Dtests.slow=true -Dtests.locale=sr-RS -Dtests.timezone=Europe/Astrakhan -Dtests.asserts=true -Dtests.file.encoding=US-ASCII

[repro] ant clean

[...truncated 6 lines...]
[repro] Test suites by module:
[repro]    lucene/core
[repro]       TestByteBuffersDirectory
[repro] ant compile-test

[...truncated 163 lines...]
[repro] ant test-nocompile -Dtests.dups=5 -Dtests.maxfailures=5 -Dtests.class="*.TestByteBuffersDirectory" -Dtests.showOutput=onerror "-Dargs=-XX:+UseCompressedOops -XX:+UseParallelGC" -Dtests.seed=BDFA8CEDB7C93AC1 -Dtests.slow=true -Dtests.locale=sr-RS -Dtests.timezone=Europe/Astrakhan -Dtests.asserts=true -Dtests.file.encoding=US-ASCII

[...truncated 31 lines...]
   [junit4] Suite: org.apache.lucene.store.TestByteBuffersDirectory
   [junit4] OK      0.05s J0 | TestByteBuffersDirectory.testMapOfStrings {impl=lucene's buffers (heap)}
   [junit4] OK      7.41s J0 | TestByteBuffersDirectory.testThreadSafetyInListAll {impl=lucene's buffers (heap)}
   [junit4] OK      0.01s J0 | TestByteBuffersDirectory.testDeleteFile {impl=lucene's buffers (heap)}
   [junit4] OK      0.00s J0 | TestByteBuffersDirectory.testDoubleCloseInput {impl=lucene's buffers (heap)}
   [junit4] OK      0.01s J0 | TestByteBuffersDirectory.testChecksum {impl=lucene's buffers (heap)}
   [junit4] OK      0.03s J0 | TestByteBuffersDirectory.testCopyBytesWithThreads {impl=lucene's buffers (heap)}
   [junit4] OK      0.00s J0 | TestByteBuffersDirectory.testVLong {impl=lucene's buffers (heap)}
   [junit4] OK      0.01s J0 | TestByteBuffersDirectory.testCreateOutputForExistingFile {impl=lucene's buffers (heap)}
   [junit4] OK      0.02s J0 | TestByteBuffersDirectory.testCreateTempOutput {impl=lucene's buffers (heap)}
   [junit4] OK      0.28s J0 | TestByteBuffersDirectory.testRandomByte {impl=lucene's buffers (heap)}
   [junit4] OK      0.11s J0 | TestByteBuffersDirectory.testRandomLong {impl=lucene's buffers (heap)}
   [junit4] OK      0.02s J0 | TestByteBuffersDirectory.testInt {impl=lucene's buffers (heap)}
   [junit4] OK      0.01s J0 | TestByteBuffersDirectory.testVInt {impl=lucene's buffers (heap)}
   [junit4] OK      0.00s J0 | TestByteBuffersDirectory.testListAllIsSorted {impl=lucene's buffers (heap)}
   [junit4] OK      0.02s J0 | TestByteBuffersDirectory.testRandomShort {impl=lucene's buffers (heap)}
   [junit4] OK      0.01s J0 | TestByteBuffersDirectory.testLargeWrites {impl=lucene's buffers (heap)}
   [junit4] OK      0.00s J0 | TestByteBuffersDirectory.testFileExistsInListAfterCreated {impl=lucene's buffers (heap)}
   [junit4] OK      0.00s J0 | TestByteBuffersDirectory.testIllegalEOF {impl=lucene's buffers (heap)}
   [junit4] OK      0.00s J0 | TestByteBuffersDirectory.testZInt {impl=lucene's buffers (heap)}
   [junit4] OK      0.01s J0 | TestByteBuffersDirectory.testSeekPastEOF {impl=lucene's buffers (heap)}
   [junit4] OK      0.41s J0 | TestByteBuffersDirectory.testBuildIndex {impl=lucene's buffers (heap)}
   [junit4] OK      0.01s J0 | TestByteBuffersDirectory.testString {impl=lucene's buffers (heap)}
   [junit4] OK      0.01s J0 | TestByteBuffersDirectory.testSeekBeyondEndOfFile {impl=lucene's buffers (heap)}
   [junit4] OK      0.01s J0 | TestByteBuffersDirectory.testLong {impl=lucene's buffers (heap)}
   [junit4] OK      0.00s J0 | TestByteBuffersDirectory.testSeekToEndOfFile {impl=lucene's buffers (heap)}
   [junit4] OK      0.00s J0 | TestByteBuffersDirectory.testSeekToEOFThenBack {impl=lucene's buffers (heap)}
   [junit4] OK      0.00s J0 | TestByteBuffersDirectory.testByte {impl=lucene's buffers (heap)}
   [junit4] OK      0.00s J0 | TestByteBuffersDirectory.testShort {impl=lucene's buffers (heap)}
   [junit4] OK      0.00s J0 | TestByteBuffersDirectory.testIndexOutputToString {impl=lucene's buffers (heap)}
   [junit4] OK      0.00s J0 | TestByteBuffersDirectory.testZLong {impl=lucene's buffers (heap)}
   [junit4] OK      0.05s J0 | TestByteBuffersDirectory.testCopyBytes {impl=lucene's buffers (heap)}
   [junit4] OK      0.02s J0 | TestByteBuffersDirectory.testSliceOutOfBounds {impl=lucene's buffers (heap)}
   [junit4] OK      0.01s J0 | TestByteBuffersDirectory.testRename {impl=lucene's buffers (heap)}
   [junit4] IGNOR/A 0.02s J0 | TestByteBuffersDirectory.testPendingDeletions {impl=lucene's buffers (heap)}
   [junit4]    > Assumption #1: we can only install VirusCheckingFS on an FSDirectory
   [junit4] OK      0.00s J0 | TestByteBuffersDirectory.testDoubleCloseOutput {impl=lucene's buffers (heap)}
   [junit4] OK      0.02s J0 | TestByteBuffersDirectory.testSliceOfSlice {impl=lucene's buffers (heap)}
   [junit4] OK      0.07s J0 | TestByteBuffersDirectory.testCopyFrom {impl=lucene's buffers (heap)}
   [junit4] OK      0.00s J0 | TestByteBuffersDirectory.testSetOfStrings {impl=lucene's buffers (heap)}
   [junit4] OK      0.00s J0 | TestByteBuffersDirectory.testDetectClose {impl=lucene's buffers (heap)}
   [junit4] OK      0.18s J0 | TestByteBuffersDirectory.testRandomInt {impl=lucene's buffers (heap)}
   [junit4] OK      0.03s J0 | TestByteBuffersDirectory.testNoDir {impl=lucene's buffers (heap)}
   [junit4] IGNOR/A 0.00s J0 | TestByteBuffersDirectory.testFsyncDoesntCreateNewFiles {impl=lucene's buffers (heap)}
   [junit4]    > Assumption #1: test only works for FSDirectory subclasses
   [junit4] OK      0.01s J0 | TestByteBuffersDirectory.testMapOfStrings {impl=many buffers (heap)}
   [junit4] OK      2.76s J0 | TestByteBuffersDirectory.testThreadSafetyInListAll {impl=many buffers (heap)}
   [junit4] OK      0.00s J0 | TestByteBuffersDirectory.testDeleteFile {impl=many buffers (heap)}
   [junit4] OK      0.00s J0 | TestByteBuffersDirectory.testDoubleCloseInput {impl=many buffers (heap)}
   [junit4] OK      0.00s J0 | TestByteBuffersDirectory.testChecksum {impl=many buffers (heap)}
   [junit4] OK      0.02s J0 | TestByteBuffersDirectory.testCopyBytesWithThreads {impl=many buffers (heap)}
   [junit4] OK      0.00s J0 | TestByteBuffersDirectory.testVLong {impl=many buffers (heap)}
   [junit4] OK      0.00s J0 | TestByteBuffersDirectory.testCreateOutputForExistingFile {impl=many buffers (heap)}
   [junit4] OK      0.00s J0 | TestByteBuffersDirectory.testCreateTempOutput {impl=many buffers (heap)}
   [junit4] OK      0.17s J0 | TestByteBuffersDirectory.testRandomByte {impl=many buffers (heap)}
   [junit4] OK      0.03s J0 | TestByteBuffersDirectory.testRandomLong {impl=many buffers (heap)}
   [junit4] OK      0.00s J0 | TestByteBuffersDirectory.testInt {impl=many buffers (heap)}
   [junit4] OK      0.00s J0 | TestByteBuffersDirectory.testVInt {impl=many buffers (heap)}
   [junit4] OK      0.00s J0 | TestByteBuffersDirectory.testListAllIsSorted {impl=many buffers (heap)}
   [junit4] OK      0.02s J0 | TestByteBuffersDirectory.testRandomShort {impl=many buffers (heap)}
   [junit4] OK      0.00s J0 | TestByteBuffersDirectory.testLargeWrites {impl=many buffers (heap)}
   [junit4] OK      0.00s J0 | TestByteBuffersDirectory.testFileExistsInListAfterCreated {impl=many buffers (heap)}
   [junit4] OK      0.00s J0 | TestByteBuffersDirectory.testIllegalEOF {impl=many buffers (heap)}
   [junit4] OK      0.00s J0 | TestByteBuffersDirectory.testZInt {impl=many buffers (heap)}
   [junit4] OK      0.00s J0 | TestByteBuffersDirectory.testSeekPastEOF {impl=many buffers (heap)}
   [junit4] OK      0.01s J0 | TestByteBuffersDirectory.testBuildIndex {impl=many buffers (heap)}
   [junit4] OK      0.00s J0 | TestByteBuffersDirectory.testString {impl=many buffers (heap)}
   [junit4] OK      0.00s J0 | TestByteBuffersDirectory.testSeekBeyondEndOfFile {impl=many buffers (heap)}
   [junit4] OK      0.00s J0 | TestByteBuffersDirectory.testLong {impl=many buffers (heap)}
   [junit4] OK      0.00s J0 | TestByteBuffersDirectory.testSeekToEndOfFile {impl=many buffers (heap)}
   [junit4] OK      0.00s J0 | TestByteBuffersDirectory.testSeekToEOFThenBack {impl=many buffers (heap)}
   [junit4] OK      0.00s J0 | TestByteBuffersDirectory.testByte {impl=many buffers (heap)}
   [junit4] OK      0.00s J0 | TestByteBuffersDirectory.testShort {impl=many buffers (heap)}
   [junit4] OK      0.00s J0 | TestByteBuffersDirectory.testIndexOutputToString {impl=many buffers (heap)}
   [junit4] OK      0.01s J0 | TestByteBuffersDirectory.testZLong {impl=many buffers (heap)}
   [junit4] OK      0.03s J0 | TestByteBuffersDirectory.testCopyBytes {impl=many buffers (heap)}
   [junit4] OK      0.00s J0 | TestByteBuffersDirectory.testSliceOutOfBounds {impl=many buffers (heap)}
   [junit4] OK      0.01s J0 | TestByteBuffersDirectory.testRename {impl=many buffers (heap)}
   [junit4] IGNOR/A 0.00s J0 | TestByteBuffersDirectory.testPendingDeletions {impl=many buffers (heap)}
   [junit4]    > Assumption #1: we can only install VirusCheckingFS on an FSDirectory
   [junit4] OK      0.00s J0 | TestByteBuffersDirectory.testDoubleCloseOutput {impl=many buffers (heap)}
   [junit4] OK      0.01s J0 | TestByteBuffersDirectory.testSliceOfSlice {impl=many buffers (heap)}
   [junit4] OK      0.07s J0 | TestByteBuffersDirectory.testCopyFrom {impl=many buffers (heap)}
   [junit4] OK      0.00s J0 | TestByteBuffersDirectory.testSetOfStrings {impl=many buffers (heap)}
   [junit4] OK      0.00s J0 | TestByteBuffersDirectory.testDetectClose {impl=many buffers (heap)}
   [junit4] OK      0.14s J0 | TestByteBuffersDirectory.testRandomInt {impl=many buffers (heap)}
   [junit4] OK      0.01s J0 | TestByteBuffersDirectory.testNoDir {impl=many buffers (heap)}
   [junit4] IGNOR/A 0.00s J0 | TestByteBuffersDirectory.testFsyncDoesntCreateNewFiles {impl=many buffers (heap)}
   [junit4]    > Assumption #1: test only works for FSDirectory subclasses
   [junit4] OK      0.00s J0 | TestByteBuffersDirectory.testMapOfStrings {impl=one buffer (heap)}
   [junit4] OK      1.24s J0 | TestByteBuffersDirectory.testThreadSafetyInListAll {impl=one buffer (heap)}
   [junit4] OK      0.00s J0 | TestByteBuffersDirectory.testDeleteFile {impl=one buffer (heap)}
   [junit4] OK      0.00s J0 | TestByteBuffersDirectory.testDoubleCloseInput {impl=one buffer (heap)}
   [junit4] OK      0.00s J0 | TestByteBuffersDirectory.testChecksum {impl=one buffer (heap)}
   [junit4] OK      0.01s J0 | TestByteBuffersDirectory.testCopyBytesWithThreads {impl=one buffer (heap)}
   [junit4] OK      0.00s J0 | TestByteBuffersDirectory.testVLong {impl=one buffer (heap)}
   [junit4] OK      0.00s J0 | TestByteBuffersDirectory.testCreateOutputForExistingFile {impl=one buffer (heap)}
   [junit4] OK      0.00s J0 | TestByteBuffersDirectory.testCreateTempOutput {impl=one buffer (heap)}
   [junit4] OK      0.16s J0 | TestByteBuffersDirectory.testRandomByte {impl=one buffer (heap)}
   [junit4] OK      0.08s J0 | TestByteBuffersDirectory.testRandomLong {impl=one buffer (heap)}
   [junit4] OK      0.00s J0 | TestByteBuffersDirectory.testInt {impl=one buffer (heap)}
   [junit4] OK      0.00s J0 | TestByteBuffersDirectory.testVInt {impl=one buffer (heap)}
   [junit4] OK      0.01s J0 | TestByteBuffersDirectory.testListAllIsSorted {impl=one buffer (heap)}
   [junit4] OK      0.00s J0 | TestByteBuffersDirectory.testRandomShort {impl=one buffer (heap)}
   [junit4] OK      0.00s J0 | TestByteBuffersDirectory.testLargeWrites {impl=one buffer (heap)}
   [junit4] OK      0.00s J0 | TestByteBuffersDirectory.testFileExistsInListAfterCreated {impl=one buffer (heap)}
   [junit4] OK      0.00s J0 | TestByteBuffersDirectory.testIllegalEOF {impl=one buffer (heap)}
   [junit4] OK      0.00s J0 | TestByteBuffersDirectory.testZInt {impl=one buffer (heap)}
   [junit4] OK      0.00s J0 | TestByteBuffersDirectory.testSeekPastEOF {impl=one buffer (heap)}
   [junit4] OK      0.01s J0 | TestByteBuffersDirectory.testBuildIndex {impl=one buffer (heap)}
   [junit4] OK      0.00s J0 | TestByteBuffersDirectory.testString {impl=one buffer (heap)}
   [junit4] OK      0.00s J0 | TestByteBuffersDirectory.testSeekBeyondEndOfFile {impl=one buffer (heap)}
   [junit4] OK      0.00s J0 | TestByteBuffersDirectory.testLong {impl=one buffer (heap)}
   [junit4] OK      0.00s J0 | TestByteBuffersDirectory.testSeekToEndOfFile {impl=one buffer (heap)}
   [junit4] OK      0.01s J0 | TestByteBuffersDirectory.testSeekToEOFThenBack {impl=one buffer (heap)}
   [junit4] OK      0.00s J0 | TestByteBuffersDirectory.testByte {impl=one buffer (heap)}
   [junit4] OK      0.00s J0 | TestByteBuffersDirectory.testShort {impl=one buffer (heap)}
   [junit4] OK      0.05s J0 | TestByteBuffersDirectory.testIndexOutputToString {impl=one buffer (heap)}
   [junit4] OK      0.01s J0 | TestByteBuffersDirectory.testZLong {impl=one buffer (heap)}
   [junit4] OK      0.05s J0 | TestByteBuffersDirectory.testCopyBytes {impl=one buffer (heap)}
   [junit4] OK      0.01s J0 | TestByteBuffersDirectory.testSliceOutOfBounds {impl=one buffer (heap)}
   [junit4] OK      0.00s J0 | TestByteBuffersDirectory.testRename {impl=one buffer (heap)}
   [junit4] IGNOR/A 0.01s J0 | TestByteBuffersDirectory.testPendingDeletions {impl=one buffer (heap)}
   [junit4]    > Assumption #1: we can only install VirusCheckingFS on an FSDirectory
   [junit4] OK      0.00s J0 | TestByteBuffersDirectory.testDoubleCloseOutput {impl=one buffer (heap)}
   [junit4] OK      0.00s J0 | TestByteBuffersDirectory.testSliceOfSlice {impl=one buffer (heap)}
   [junit4] OK      0.05s J0 | TestByteBuffersDirectory.testCopyFrom {impl=one buffer (heap)}
   [junit4] OK      0.00s J0 | TestByteBuffersDirectory.testSetOfStrings {impl=one buffer (heap)}
   [junit4] OK      0.00s J0 | TestByteBuffersDirectory.testDetectClose {impl=one buffer (heap)}
   [junit4] OK      0.06s J0 | TestByteBuffersDirectory.testRandomInt {impl=one buffer (heap)}
   [junit4] OK      0.00s J0 | TestByteBuffersDirectory.testNoDir {impl=one buffer (heap)}
   [junit4] IGNOR/A 0.00s J0 | TestByteBuffersDirectory.testFsyncDoesntCreateNewFiles {impl=one buffer (heap)}
   [junit4]    > Assumption #1: test only works for FSDirectory subclasses
   [junit4] OK      0.01s J0 | TestByteBuffersDirectory.testMapOfStrings {impl=byte array (heap)}
   [junit4] OK      0.29s J0 | TestByteBuffersDirectory.testThreadSafetyInListAll {impl=byte array (heap)}
   [junit4] OK      0.00s J0 | TestByteBuffersDirectory.testDeleteFile {impl=byte array (heap)}
   [junit4] OK      0.00s J0 | TestByteBuffersDirectory.testDoubleCloseInput {impl=byte array (heap)}
   [junit4] OK      0.00s J0 | TestByteBuffersDirectory.testChecksum {impl=byte array (heap)}
   [junit4] OK      0.01s J0 | TestByteBuffersDirectory.testCopyBytesWithThreads {impl=byte array (heap)}
   [junit4] OK      0.00s J0 | TestByteBuffersDirectory.testVLong {impl=byte array (heap)}
   [junit4] OK      0.00s J0 | TestByteBuffersDirectory.testCreateOutputForExistingFile {impl=byte array (heap)}
   [junit4] OK      0.00s J0 | TestByteBuffersDirectory.testCreateTempOutput {impl=byte array (heap)}
   [junit4] OK      0.19s J0 | TestByteBuffersDirectory.testRandomByte {impl=byte array (heap)}
   [junit4] OK      0.04s J0 | TestByteBuffersDirectory.testRandomLong {impl=byte array (heap)}
   [junit4] OK      0.00s J0 | TestByteBuffersDirectory.testInt {impl=byte array (heap)}
   [junit4] OK      0.00s J0 | TestByteBuffersDirectory.testVInt {impl=byte array (heap)}
   [junit4] OK      0.01s J0 | TestByteBuffersDirectory.testListAllIsSorted {impl=byte array (heap)}
   [junit4] OK      0.01s J0 | TestByteBuffersDirectory.testRandomShort {impl=byte array (heap)}
   [junit4] OK      0.00s J0 | TestByteBuffersDirectory.testLargeWrites {impl=byte array (heap)}
   [junit4] OK      0.00s J0 | TestByteBuffersDirectory.testFileExistsInListAfterCreated {impl=byte array (heap)}
   [junit4] OK      0.00s J0 | TestByteBuffersDirectory.testIllegalEOF {impl=byte array (heap)}
   [junit4] OK      0.00s J0 | TestByteBuffersDirectory.testZInt {impl=byte array (heap)}
   [junit4]   2> NOTE: reproduce with: ant test  -Dtestcase=TestByteBuffersDirectory -Dtests.method=testSeekPastEOF -Dtests.seed=BDFA8CEDB7C93AC1 -Dtests.slow=true -Dtests.badapples=true -Dtests.locale=sr-RS -Dtests.timezone=Europe/Astrakhan -Dtests.asserts=true -Dtests.file.encoding=US-ASCII
   [junit4] FAILURE 0.00s J0 | TestByteBuffersDirectory.testSeekPastEOF {impl=byte array (heap)} <<<
   [junit4]    > Throwable #1: junit.framework.AssertionFailedError: Unexpected exception type, expected EOFException but got java.lang.ArrayIndexOutOfBoundsException: 1770
   [junit4]    > 	at __randomizedtesting.SeedInfo.seed([BDFA8CEDB7C93AC1:5DBC4714B74C4450]:0)
   [junit4]    > 	at org.apache.lucene.util.LuceneTestCase.expectThrows(LuceneTestCase.java:2680)
   [junit4]    > 	at org.apache.lucene.util.LuceneTestCase.expectThrows(LuceneTestCase.java:2669)
   [junit4]    > 	at org.apache.lucene.store.BaseDirectoryTestCase.testSeekPastEOF(BaseDirectoryTestCase.java:516)
   [junit4]    > 	at java.base/jdk.internal.reflect.NativeMethodAccessorImpl.invoke0(Native Method)
   [junit4]    > 	at java.base/jdk.internal.reflect.NativeMethodAccessorImpl.invoke(NativeMethodAccessorImpl.java:62)
   [junit4]    > 	at java.base/jdk.internal.reflect.DelegatingMethodAccessorImpl.invoke(DelegatingMethodAccessorImpl.java:43)
   [junit4]    > 	at java.base/java.lang.reflect.Method.invoke(Method.java:564)
   [junit4]    > 	at java.base/java.lang.Thread.run(Thread.java:844)
   [junit4]    > Caused by: java.lang.ArrayIndexOutOfBoundsException: 1770
   [junit4]    > 	at org.apache.lucene.store.ByteArrayIndexInput.readByte(ByteArrayIndexInput.java:145)
   [junit4]    > 	at org.apache.lucene.store.BaseDirectoryTestCase.lambda$testSeekPastEOF$12(BaseDirectoryTestCase.java:518)
   [junit4]    > 	at org.apache.lucene.util.LuceneTestCase.expectThrows(LuceneTestCase.java:2675)
   [junit4]    > 	... 37 more
   [junit4] OK      0.01s J0 | TestByteBuffersDirectory.testBuildIndex {impl=byte array (heap)}
   [junit4] OK      0.00s J0 | TestByteBuffersDirectory.testString {impl=byte array (heap)}
   [junit4] OK      0.00s J0 | TestByteBuffersDirectory.testSeekBeyondEndOfFile {impl=byte array (heap)}
   [junit4] OK      0.00s J0 | TestByteBuffersDirectory.testLong {impl=byte array (heap)}
   [junit4] OK      0.00s J0 | TestByteBuffersDirectory.testSeekToEndOfFile {impl=byte array (heap)}
   [junit4] OK      0.00s J0 | TestByteBuffersDirectory.testSeekToEOFThenBack {impl=byte array (heap)}
   [junit4] OK      0.00s J0 | TestByteBuffersDirectory.testByte {impl=byte array (heap)}
   [junit4] OK      0.00s J0 | TestByteBuffersDirectory.testShort {impl=byte array (heap)}
   [junit4] OK      0.01s J0 | TestByteBuffersDirectory.testIndexOutputToString {impl=byte array (heap)}
   [junit4] OK      0.00s J0 | TestByteBuffersDirectory.testZLong {impl=byte array (heap)}
   [junit4] OK      0.02s J0 | TestByteBuffersDirectory.testCopyBytes {impl=byte array (heap)}
   [junit4] OK      0.00s J0 | TestByteBuffersDirectory.testSliceOutOfBounds {impl=byte array (heap)}
   [junit4] OK      0.00s J0 | TestByteBuffersDirectory.testRename {impl=byte array (heap)}
   [junit4] IGNOR/A 0.00s J0 | TestByteBuffersDirectory.testPendingDeletions {impl=byte array (heap)}
   [junit4]    > Assumption #1: we can only install VirusCheckingFS on an FSDirectory
   [junit4] OK      0.00s J0 | TestByteBuffersDirectory.testDoubleCloseOutput {impl=byte array (heap)}
   [junit4] OK      0.00s J0 | TestByteBuffersDirectory.testSliceOfSlice {impl=byte array (heap)}
   [junit4] OK      0.03s J0 | TestByteBuffersDirectory.testCopyFrom {impl=byte array (heap)}
   [junit4] OK      0.00s J0 | TestByteBuffersDirectory.testSetOfStrings {impl=byte array (heap)}
   [junit4] OK      0.00s J0 | TestByteBuffersDirectory.testDetectClose {impl=byte array (heap)}
   [junit4] OK      0.11s J0 | TestByteBuffersDirectory.testRandomInt {impl=byte array (heap)}
   [junit4] OK      0.00s J0 | TestByteBuffersDirectory.testNoDir {impl=byte array (heap)}
   [junit4] IGNOR/A 0.00s J0 | TestByteBuffersDirectory.testFsyncDoesntCreateNewFiles {impl=byte array (heap)}
   [junit4]    > Assumption #1: test only works for FSDirectory subclasses
   [junit4]   2> NOTE: leaving temporary files on disk at: /Users/jenkins/workspace/Lucene-Solr-master-MacOSX/lucene/build/core/test/J0/temp/lucene.store.TestByteBuffersDirectory_BDFA8CEDB7C93AC1-001
   [junit4]   2> NOTE: test params are: codec=Lucene80, sim=Asserting(org.apache.lucene.search.similarities.AssertingSimilarity@754a3492), locale=sr-RS, timezone=Europe/Astrakhan
   [junit4]   2> NOTE: Mac OS X 10.11.6 x86_64/Oracle Corporation 9 (64-bit)/cpus=3,threads=1,free=102366560,total=213385216
   [junit4]   2> NOTE: All tests run in this JVM: [TestByteBuffersDirectory]
   [junit4] Completed [1/5 (1!)] on J0 in 15.22s, 168 tests, 1 failure, 8 skipped <<< FAILURES!

[...truncated 1 lines...]
   [junit4] Suite: org.apache.lucene.store.TestByteBuffersDirectory
   [junit4] OK      0.09s J1 | TestByteBuffersDirectory.testMapOfStrings {impl=lucene's buffers (heap)}
   [junit4] OK      7.48s J1 | TestByteBuffersDirectory.testThreadSafetyInListAll {impl=lucene's buffers (heap)}
   [junit4] OK      0.00s J1 | TestByteBuffersDirectory.testDeleteFile {impl=lucene's buffers (heap)}
   [junit4] OK      0.00s J1 | TestByteBuffersDirectory.testDoubleCloseInput {impl=lucene's buffers (heap)}
   [junit4] OK      0.00s J1 | TestByteBuffersDirectory.testChecksum {impl=lucene's buffers (heap)}
   [junit4] OK      0.04s J1 | TestByteBuffersDirectory.testCopyBytesWithThreads {impl=lucene's buffers (heap)}
   [junit4] OK      0.00s J1 | TestByteBuffersDirectory.testVLong {impl=lucene's buffers (heap)}
   [junit4] OK      0.01s J1 | TestByteBuffersDirectory.testCreateOutputForExistingFile {impl=lucene's buffers (heap)}
   [junit4] OK      0.02s J1 | TestByteBuffersDirectory.testCreateTempOutput {impl=lucene's buffers (heap)}
   [junit4] OK      0.17s J1 | TestByteBuffersDirectory.testRandomByte {impl=lucene's buffers (heap)}
   [junit4] OK      0.16s J1 | TestByteBuffersDirectory.testRandomLong {impl=lucene's buffers (heap)}
   [junit4] OK      0.00s J1 | TestByteBuffersDirectory.testInt {impl=lucene's buffers (heap)}
   [junit4] OK      0.00s J1 | TestByteBuffersDirectory.testVInt {impl=lucene's buffers (heap)}
   [junit4] OK      0.00s J1 | TestByteBuffersDirectory.testListAllIsSorted {impl=lucene's buffers (heap)}
   [junit4] OK      0.01s J1 | TestByteBuffersDirectory.testRandomShort {impl=lucene's buffers (heap)}
   [junit4] OK      0.01s J1 | TestByteBuffersDirectory.testLargeWrites {impl=lucene's buffers (heap)}
   [junit4] OK      0.00s J1 | TestByteBuffersDirectory.testFileExistsInListAfterCreated {impl=lucene's buffers (heap)}
   [junit4] OK      0.00s J1 | TestByteBuffersDirectory.testIllegalEOF {impl=lucene's buffers (heap)}
   [junit4] OK      0.00s J1 | TestByteBuffersDirectory.testZInt {impl=lucene's buffers (heap)}
   [junit4] OK      0.01s J1 | TestByteBuffersDirectory.testSeekPastEOF {impl=lucene's buffers (heap)}
   [junit4] OK      0.35s J1 | TestByteBuffersDirectory.testBuildIndex {impl=lucene's buffers (heap)}
   [junit4] OK      0.01s J1 | TestByteBuffersDirectory.testString {impl=lucene's buffers (heap)}
   [junit4] OK      0.01s J1 | TestByteBuffersDirectory.testSeekBeyondEndOfFile {impl=lucene's buffers (heap)}
   [junit4] OK      0.01s J1 | TestByteBuffersDirectory.testLong {impl=lucene's buffers (heap)}
   [junit4] OK      0.00s J1 | TestByteBuffersDirectory.testSeekToEndOfFile {impl=lucene's buffers (heap)}
   [junit4] OK      0.00s J1 | TestByteBuffersDirectory.testSeekToEOFThenBack {impl=lucene's buffers (heap)}
   [junit4] OK      0.01s J1 | TestByteBuffersDirectory.testByte {impl=lucene's buffers (heap)}
   [junit4] OK      0.00s J1 | TestByteBuffersDirectory.testShort {impl=lucene's buffers (heap)}
   [junit4] OK      0.01s J1 | TestByteBuffersDirectory.testIndexOutputToString {impl=lucene's buffers (heap)}
   [junit4] OK      0.00s J1 | TestByteBuffersDirectory.testZLong {impl=lucene's buffers (heap)}
   [junit4] OK      0.03s J1 | TestByteBuffersDirectory.testCopyBytes {impl=lucene's buffers (heap)}
   [junit4] OK      0.00s J1 | TestByteBuffersDirectory.testSliceOutOfBounds {impl=lucene's buffers (heap)}
   [junit4] OK      0.02s J1 | TestByteBuffersDirectory.testRename {impl=lucene's buffers (heap)}
   [junit4] IGNOR/A 0.01s J1 | TestByteBuffersDirectory.testPendingDeletions {impl=lucene's buffers (heap)}
   [junit4]    > Assumption #1: we can only install VirusCheckingFS on an FSDirectory
   [junit4] OK      0.02s J1 | TestByteBuffersDirectory.testDoubleCloseOutput {impl=lucene's buffers (heap)}
   [junit4] OK      0.00s J1 | TestByteBuffersDirectory.testSliceOfSlice {impl=lucene's buffers (heap)}
   [junit4] OK      0.06s J1 | TestByteBuffersDirectory.testCopyFrom {impl=lucene's buffers (heap)}
   [junit4] OK      0.00s J1 | TestByteBuffersDirectory.testSetOfStrings {impl=lucene's buffers (heap)}
   [junit4] OK      0.01s J1 | TestByteBuffersDirectory.testDetectClose {impl=lucene's buffers (heap)}
   [junit4] OK      0.17s J1 | TestByteBuffersDirectory.testRandomInt {impl=lucene's buffers (heap)}
   [junit4] OK      0.02s J1 | TestByteBuffersDirectory.testNoDir {impl=lucene's buffers (heap)}
   [junit4] IGNOR/A 0.00s J1 | TestByteBuffersDirectory.testFsyncDoesntCreateNewFiles {impl=lucene's buffers (heap)}
   [junit4]    > Assumption #1: test only works for FSDirectory subclasses
   [junit4] OK      0.01s J1 | TestByteBuffersDirectory.testMapOfStrings {impl=many buffers (heap)}
   [junit4] OK      3.12s J1 | TestByteBuffersDirectory.testThreadSafetyInListAll {impl=many buffers (heap)}
   [junit4] OK      0.00s J1 | TestByteBuffersDirectory.testDeleteFile {impl=many buffers (heap)}
   [junit4] OK      0.00s J1 | TestByteBuffersDirectory.testDoubleCloseInput {impl=many buffers (heap)}
   [junit4] OK      0.00s J1 | TestByteBuffersDirectory.testChecksum {impl=many buffers (heap)}
   [junit4] OK      0.02s J1 | TestByteBuffersDirectory.testCopyBytesWithThreads {impl=many buffers (heap)}
   [junit4] OK      0.00s J1 | TestByteBuffersDirectory.testVLong {impl=many buffers (heap)}
   [junit4] OK      0.00s J1 | TestByteBuffersDirectory.testCreateOutputForExistingFile {impl=many buffers (heap)}
   [junit4] OK      0.00s J1 | TestByteBuffersDirectory.testCreateTempOutput {impl=many buffers (heap)}
   [junit4] OK      0.18s J1 | TestByteBuffersDirectory.testRandomByte {impl=many buffers (heap)}
   [junit4] OK      0.05s J1 | TestByteBuffersDirectory.testRandomLong {impl=many buffers (heap)}
   [junit4] OK      0.00s J1 | TestByteBuffersDirectory.testInt {impl=many buffers (heap)}
   [junit4] OK      0.00s J1 | TestByteBuffersDirectory.testVInt {impl=many buffers (heap)}
   [junit4] OK      0.02s J1 | TestByteBuffersDirectory.testListAllIsSorted {impl=many buffers (heap)}
   [junit4] OK      0.02s J1 | TestByteBuffersDirectory.testRandomShort {impl=many buffers (heap)}
   [junit4] OK      0.00s J1 | TestByteBuffersDirectory.testLargeWrites {impl=many buffers (heap)}
   [junit4] OK      0.01s J1 | TestByteBuffersDirectory.testFileExistsInListAfterCreated {impl=many buffers (heap)}
   [junit4] OK      0.00s J1 | TestByteBuffersDirectory.testIllegalEOF {impl=many buffers (heap)}
   [junit4] OK      0.00s J1 | TestByteBuffersDirectory.testZInt {impl=many buffers (heap)}
   [junit4] OK      0.01s J1 | TestByteBuffersDirectory.testSeekPastEOF {impl=many buffers (heap)}
   [junit4] OK      0.01s J1 | TestByteBuffersDirectory.testBuildIndex {impl=many buffers (heap)}
   [junit4] OK      0.02s J1 | TestByteBuffersDirectory.testString {impl=many buffers (heap)}
   [junit4] OK      0.00s J1 | TestByteBuffersDirectory.testSeekBeyondEndOfFile {impl=many buffers (heap)}
   [junit4] OK      0.00s J1 | TestByteBuffersDirectory.testLong {impl=many buffers (heap)}
   [junit4] OK      0.02s J1 | TestByteBuffersDirectory.testSeekToEndOfFile {impl=many buffers (heap)}
   [junit4] OK      0.00s J1 | TestByteBuffersDirectory.testSeekToEOFThenBack {impl=many buffers (heap)}
   [junit4] OK      0.00s J1 | TestByteBuffersDirectory.testByte {impl=many buffers (heap)}
   [junit4] OK      0.00s J1 | TestByteBuffersDirectory.testShort {impl=many buffers (heap)}
   [junit4] OK      0.00s J1 | TestByteBuffersDirectory.testIndexOutputToString {impl=many buffers (heap)}
   [junit4] OK      0.00s J1 | TestByteBuffersDirectory.testZLong {impl=many buffers (heap)}
   [junit4] OK      0.03s J1 | TestByteBuffersDirectory.testCopyBytes {impl=many buffers (heap)}
   [junit4] OK      0.00s J1 | TestByteBuffersDirectory.testSliceOutOfBounds {impl=many buffers (heap)}
   [junit4] OK      0.01s J1 | TestByteBuffersDirectory.testRename {impl=many buffers (heap)}
   [junit4] IGNOR/A 0.00s J1 | TestByteBuffersDirectory.testPendingDeletions {impl=many buffers (heap)}
   [junit4]    > Assumption #1: we can only install VirusCheckingFS on an FSDirectory
   [junit4] OK      0.00s J1 | TestByteBuffersDirectory.testDoubleCloseOutput {impl=many buffers (heap)}
   [junit4] OK      0.00s J1 | TestByteBuffersDirectory.testSliceOfSlice {impl=many buffers (heap)}
   [junit4] OK      0.12s J1 | TestByteBuffersDirectory.testCopyFrom {impl=many buffers (heap)}
   [junit4] OK      0.00s J1 | TestByteBuffersDirectory.testSetOfStrings {impl=many buffers (heap)}
   [junit4] OK      0.00s J1 | TestByteBuffersDirectory.testDetectClose {impl=many buffers (heap)}
   [junit4] OK      0.15s J1 | TestByteBuffersDirectory.testRandomInt {impl=many buffers (heap)}
   [junit4] OK      0.00s J1 | TestByteBuffersDirectory.testNoDir {impl=many buffers (heap)}
   [junit4] IGNOR/A 0.00s J1 | TestByteBuffersDirectory.testFsyncDoesntCreateNewFiles {impl=many buffers (heap)}
   [junit4]    > Assumption #1: test only works for FSDirectory subclasses
   [junit4] OK      0.01s J1 | TestByteBuffersDirectory.testMapOfStrings {impl=one buffer (heap)}
   [junit4] OK      0.77s J1 | TestByteBuffersDirectory.testThreadSafetyInListAll {impl=one buffer (heap)}
   [junit4] OK      0.00s J1 | TestByteBuffersDirectory.testDeleteFile {impl=one buffer (heap)}
   [junit4] OK      0.00s J1 | TestByteBuffersDirectory.testDoubleCloseInput {impl=one buffer (heap)}
   [junit4] OK      0.00s J1 | TestByteBuffersDirectory.testChecksum {impl=one buffer (heap)}
   [junit4] OK      0.01s J1 | TestByteBuffersDirectory.testCopyBytesWithThreads {impl=one buffer (heap)}
   [junit4] OK      0.00s J1 | TestByteBuffersDirectory.testVLong {impl=one buffer (heap)}
   [junit4] OK      0.00s J1 | TestByteBuffersDirectory.testCreateOutputForExistingFile {impl=one buffer (heap)}
   [junit4] OK      0.00s J1 | TestByteBuffersDirectory.testCreateTempOutput {impl=one buffer (heap)}
   [junit4] OK      0.03s J1 | TestByteBuffersDirectory.testRandomByte {impl=one buffer (heap)}
   [junit4] OK      0.02s J1 | TestByteBuffersDirectory.testRandomLong {impl=one buffer (heap)}
   [junit4] OK      0.00s J1 | TestByteBuffersDirectory.testInt {impl=one buffer (heap)}
   [junit4] OK      0.00s J1 | TestByteBuffersDirectory.testVInt {impl=one buffer (heap)}
   [junit4] OK      0.00s J1 | TestByteBuffersDirectory.testListAllIsSorted {impl=one buffer (heap)}
   [junit4] OK      0.01s J1 | TestByteBuffersDirectory.testRandomShort {impl=one buffer (heap)}
   [junit4] OK      0.00s J1 | TestByteBuffersDirectory.testLargeWrites {impl=one buffer (heap)}
   [junit4] OK      0.00s J1 | TestByteBuffersDirectory.testFileExistsInListAfterCreated {impl=one buffer (heap)}
   [junit4] OK      0.00s J1 | TestByteBuffersDirectory.testIllegalEOF {impl=one buffer (heap)}
   [junit4] OK      0.00s J1 | TestByteBuffersDirectory.testZInt {impl=one buffer (heap)}
   [junit4] OK      0.00s J1 | TestByteBuffersDirectory.testSeekPastEOF {impl=one buffer (heap)}
   [junit4] OK      0.00s J1 | TestByteBuffersDirectory.testBuildIndex {impl=one buffer (heap)}
   [junit4] OK      0.00s J1 | TestByteBuffersDirectory.testString {impl=one buffer (heap)}
   [junit4] OK      0.00s J1 | TestByteBuffersDirectory.testSeekBeyondEndOfFile {impl=one buffer (heap)}
   [junit4] OK      0.00s J1 | TestByteBuffersDirectory.testLong {impl=one buffer (heap)}
   [junit4] OK      0.00s J1 | TestByteBuffersDirectory.testSeekToEndOfFile {impl=one buffer (heap)}
   [junit4] OK      0.00s J1 | TestByteBuffersDirectory.testSeekToEOFThenBack {impl=one buffer (heap)}
   [junit4] OK      0.00s J1 | TestByteBuffersDirectory.testByte {impl=one buffer (heap)}
   [junit4] OK      0.00s J1 | TestByteBuffersDirectory.testShort {impl=one buffer (heap)}
   [junit4] OK      0.00s J1 | TestByteBuffersDirectory.testIndexOutputToString {impl=one buffer (heap)}
   [junit4] OK      0.00s J1 | TestByteBuffersDirectory.testZLong {impl=one buffer (heap)}
   [junit4] OK      0.01s J1 | TestByteBuffersDirectory.testCopyBytes {impl=one buffer (heap)}
   [junit4] OK      0.00s J1 | TestByteBuffersDirectory.testSliceOutOfBounds {impl=one buffer (heap)}
   [junit4] OK      0.00s J1 | TestByteBuffersDirectory.testRename {impl=one buffer (heap)}
   [junit4] IGNOR/A 0.00s J1 | TestByteBuffersDirectory.testPendingDeletions {impl=one buffer (heap)}
   [junit4]    > Assumption #1: we can only install VirusCheckingFS on an FSDirectory
   [junit4] OK      0.00s J1 | TestByteBuffersDirectory.testDoubleCloseOutput {impl=one buffer (heap)}
   [junit4] OK      0.00s J1 | TestByteBuffersDirectory.testSliceOfSlice {impl=one buffer (heap)}
   [junit4] OK      0.05s J1 | TestByteBuffersDirectory.testCopyFrom {impl=one buffer (heap)}
   [junit4] OK      0.00s J1 | TestByteBuffersDirectory.testSetOfStrings {impl=one buffer (heap)}
   [junit4] OK      0.00s J1 | TestByteBuffersDirectory.testDetectClose {impl=one buffer (heap)}
   [junit4] OK      0.05s J1 | TestByteBuffersDirectory.testRandomInt {impl=one buffer (heap)}
   [junit4] OK      0.00s J1 | TestByteBuffersDirectory.testNoDir {impl=one buffer (heap)}
   [junit4] IGNOR/A 0.00s J1 | TestByteBuffersDirectory.testFsyncDoesntCreateNewFiles {impl=one buffer (heap)}
   [junit4]    > Assumption #1: test only works for FSDirectory subclasses
   [junit4] OK      0.00s J1 | TestByteBuffersDirectory.testMapOfStrings {impl=byte array (heap)}
   [junit4] OK      0.62s J1 | TestByteBuffersDirectory.testThreadSafetyInListAll {impl=byte array (heap)}
   [junit4] OK      0.00s J1 | TestByteBuffersDirectory.testDeleteFile {impl=byte array (heap)}
   [junit4] OK      0.00s J1 | TestByteBuffersDirectory.testDoubleCloseInput {impl=byte array (heap)}
   [junit4] OK      0.00s J1 | TestByteBuffersDirectory.testChecksum {impl=byte array (heap)}
   [junit4] OK      0.01s J1 | TestByteBuffersDirectory.testCopyBytesWithThreads {impl=byte array (heap)}
   [junit4] OK      0.00s J1 | TestByteBuffersDirectory.testVLong {impl=byte array (heap)}
   [junit4] OK      0.00s J1 | TestByteBuffersDirectory.testCreateOutputForExistingFile {impl=byte array (heap)}
   [junit4] OK      0.00s J1 | TestByteBuffersDirectory.testCreateTempOutput {impl=byte array (heap)}
   [junit4] OK      0.17s J1 | TestByteBuffersDirectory.testRandomByte {impl=byte array (heap)}
   [junit4] OK      0.03s J1 | TestByteBuffersDirectory.testRandomLong {impl=byte array (heap)}
   [junit4] OK      0.00s J1 | TestByteBuffersDirectory.testInt {impl=byte array (heap)}
   [junit4] OK      0.00s J1 | TestByteBuffersDirectory.testVInt {impl=byte array (heap)}
   [junit4] OK      0.01s J1 | TestByteBuffersDirectory.testListAllIsSorted {impl=byte array (heap)}
   [junit4] OK      0.00s J1 | TestByteBuffersDirectory.testRandomShort {impl=byte array (heap)}
   [junit4] OK      0.00s J1 | TestByteBuffersDirectory.testLargeWrites {impl=byte array (heap)}
   [junit4] OK      0.00s J1 | TestByteBuffersDirectory.testFileExistsInListAfterCreated {impl=byte array (heap)}
   [junit4] OK      0.00s J1 | TestByteBuffersDirectory.testIllegalEOF {impl=byte array (heap)}
   [junit4] OK      0.00s J1 | TestByteBuffersDirectory.testZInt {impl=byte array (heap)}
   [junit4]   2> NOTE: reproduce with: ant test  -Dtestcase=TestByteBuffersDirectory -Dtests.method=testSeekPastEOF -Dtests.seed=BDFA8CEDB7C93AC1 -Dtests.slow=true -Dtests.badapples=true -Dtests.locale=sr-RS -Dtests.timezone=Europe/Astrakhan -Dtests.asserts=true -Dtests.file.encoding=US-ASCII
   [junit4] FAILURE 0.00s J1 | TestByteBuffersDirectory.testSeekPastEOF {impl=byte array (heap)} <<<
   [junit4]    > Throwable #1: junit.framework.AssertionFailedError: Unexpected exception type, expected EOFException but got java.lang.ArrayIndexOutOfBoundsException: 1770
   [junit4]    > 	at __randomizedtesting.SeedInfo.seed([BDFA8CEDB7C93AC1:5DBC4714B74C4450]:0)
   [junit4]    > 	at org.apache.lucene.util.LuceneTestCase.expectThrows(LuceneTestCase.java:2680)
   [junit4]    > 	at org.apache.lucene.util.LuceneTestCase.expectThrows(LuceneTestCase.java:2669)
   [junit4]    > 	at org.apache.lucene.store.BaseDirectoryTestCase.testSeekPastEOF(BaseDirectoryTestCase.java:516)
   [junit4]    > 	at java.base/jdk.internal.reflect.NativeMethodAccessorImpl.invoke0(Native Method)
   [junit4]    > 	at java.base/jdk.internal.reflect.NativeMethodAccessorImpl.invoke(NativeMethodAccessorImpl.java:62)
   [junit4]    > 	at java.base/jdk.internal.reflect.DelegatingMethodAccessorImpl.invoke(DelegatingMethodAccessorImpl.java:43)
   [junit4]    > 	at java.base/java.lang.reflect.Method.invoke(Method.java:564)
   [junit4]    > 	at java.base/java.lang.Thread.run(Thread.java:844)
   [junit4]    > Caused by: java.lang.ArrayIndexOutOfBoundsException: 1770
   [junit4]    > 	at org.apache.lucene.store.ByteArrayIndexInput.readByte(ByteArrayIndexInput.java:145)
   [junit4]    > 	at org.apache.lucene.store.BaseDirectoryTestCase.lambda$testSeekPastEOF$12(BaseDirectoryTestCase.java:518)
   [junit4]    > 	at org.apache.lucene.util.LuceneTestCase.expectThrows(LuceneTestCase.java:2675)
   [junit4]    > 	... 37 more
   [junit4] OK      0.00s J1 | TestByteBuffersDirectory.testBuildIndex {impl=byte array (heap)}
   [junit4] OK      0.00s J1 | TestByteBuffersDirectory.testString {impl=byte array (heap)}
   [junit4] OK      0.00s J1 | TestByteBuffersDirectory.testSeekBeyondEndOfFile {impl=byte array (heap)}
   [junit4] OK      0.00s J1 | TestByteBuffersDirectory.testLong {impl=byte array (heap)}
   [junit4] OK      0.00s J1 | TestByteBuffersDirectory.testSeekToEndOfFile {impl=byte array (heap)}
   [junit4] OK      0.00s J1 | TestByteBuffersDirectory.testSeekToEOFThenBack {impl=byte array (heap)}
   [junit4] OK      0.00s J1 | TestByteBuffersDirectory.testByte {impl=byte array (heap)}
   [junit4] OK      0.00s J1 | TestByteBuffersDirectory.testShort {impl=byte array (heap)}
   [junit4] OK      0.00s J1 | TestByteBuffersDirectory.testIndexOutputToString {impl=byte array (heap)}
   [junit4] OK      0.00s J1 | TestByteBuffersDirectory.testZLong {impl=byte array (heap)}
   [junit4] OK      0.04s J1 | TestByteBuffersDirectory.testCopyBytes {impl=byte array (heap)}
   [junit4] OK      0.00s J1 | TestByteBuffersDirectory.testSliceOutOfBounds {impl=byte array (heap)}
   [junit4] OK      0.00s J1 | TestByteBuffersDirectory.testRename {impl=byte array (heap)}
   [junit4] IGNOR/A 0.00s J1 | TestByteBuffersDirectory.testPendingDeletions {impl=byte array (heap)}
   [junit4]    > Assumption #1: we can only install VirusCheckingFS on an FSDirectory
   [junit4] OK      0.00s J1 | TestByteBuffersDirectory.testDoubleCloseOutput {impl=byte array (heap)}
   [junit4] OK      0.00s J1 | TestByteBuffersDirectory.testSliceOfSlice {impl=byte array (heap)}
   [junit4] OK      0.05s J1 | TestByteBuffersDirectory.testCopyFrom {impl=byte array (heap)}
   [junit4] OK      0.00s J1 | TestByteBuffersDirectory.testSetOfStrings {impl=byte array (heap)}
   [junit4] OK      0.00s J1 | TestByteBuffersDirectory.testDetectClose {impl=byte array (heap)}
   [junit4] OK      0.10s J1 | TestByteBuffersDirectory.testRandomInt {impl=byte array (heap)}
   [junit4] OK      0.00s J1 | TestByteBuffersDirectory.testNoDir {impl=byte array (heap)}
   [junit4] IGNOR/A 0.00s J1 | TestByteBuffersDirectory.testFsyncDoesntCreateNewFiles {impl=byte array (heap)}
   [junit4]    > Assumption #1: test only works for FSDirectory subclasses
   [junit4]   2> NOTE: leaving temporary files on disk at: /Users/jenkins/workspace/Lucene-Solr-master-MacOSX/lucene/build/core/test/J1/temp/lucene.store.TestByteBuffersDirectory_BDFA8CEDB7C93AC1-001
   [junit4]   2> NOTE: test params are: codec=Lucene80, sim=Asserting(org.apache.lucene.search.similarities.AssertingSimilarity@22b6c835), locale=sr-RS, timezone=Europe/Astrakhan
   [junit4]   2> NOTE: Mac OS X 10.11.6 x86_64/Oracle Corporation 9 (64-bit)/cpus=3,threads=1,free=68580744,total=112197632
   [junit4]   2> NOTE: All tests run in this JVM: [TestByteBuffersDirectory]
   [junit4] Completed [2/5 (2!)] on J1 in 15.14s, 168 tests, 1 failure, 8 skipped <<< FAILURES!

[...truncated 2 lines...]
   [junit4] Suite: org.apache.lucene.store.TestByteBuffersDirectory
   [junit4] OK      0.00s J0 | TestByteBuffersDirectory.testMapOfStrings {impl=lucene's buffers (heap)}
   [junit4] OK      2.87s J0 | TestByteBuffersDirectory.testThreadSafetyInListAll {impl=lucene's buffers (heap)}
   [junit4] OK      0.00s J0 | TestByteBuffersDirectory.testDeleteFile {impl=lucene's buffers (heap)}
   [junit4] OK      0.00s J0 | TestByteBuffersDirectory.testDoubleCloseInput {impl=lucene's buffers (heap)}
   [junit4] OK      0.00s J0 | TestByteBuffersDirectory.testChecksum {impl=lucene's buffers (heap)}
   [junit4] OK      0.01s J0 | TestByteBuffersDirectory.testCopyBytesWithThreads {impl=lucene's buffers (heap)}
   [junit4] OK      0.00s J0 | TestByteBuffersDirectory.testVLong {impl=lucene's buffers (heap)}
   [junit4] OK      0.00s J0 | TestByteBuffersDirectory.testCreateOutputForExistingFile {impl=lucene's buffers (heap)}
   [junit4] OK      0.00s J0 | TestByteBuffersDirectory.testCreateTempOutput {impl=lucene's buffers (heap)}
   [junit4] OK      0.02s J0 | TestByteBuffersDirectory.testRandomByte {impl=lucene's buffers (heap)}
   [junit4] OK      0.01s J0 | TestByteBuffersDirectory.testRandomLong {impl=lucene's buffers (heap)}
   [junit4] OK      0.00s J0 | TestByteBuffersDirectory.testInt {impl=lucene's buffers (heap)}
   [junit4] OK      0.00s J0 | TestByteBuffersDirectory.testVInt {impl=lucene's buffers (heap)}
   [junit4] OK      0.00s J0 | TestByteBuffersDirectory.testListAllIsSorted {impl=lucene's buffers (heap)}
   [junit4] OK      0.00s J0 | TestByteBuffersDirectory.testRandomShort {impl=lucene's buffers (heap)}
   [junit4] OK      0.00s J0 | TestByteBuffersDirectory.testLargeWrites {impl=lucene's buffers (heap)}
   [junit4] OK      0.00s J0 | TestByteBuffersDirectory.testFileExistsInListAfterCreated {impl=lucene's buffers (heap)}
   [junit4] OK      0.00s J0 | TestByteBuffersDirectory.testIllegalEOF {impl=lucene's buffers (heap)}
   [junit4] OK      0.00s J0 | TestByteBuffersDirectory.testZInt {impl=lucene's buffers (heap)}
   [junit4] OK      0.00s J0 | TestByteBuffersDirectory.testSeekPastEOF {impl=lucene's buffers (heap)}
   [junit4] OK      0.00s J0 | TestByteBuffersDirectory.testBuildIndex {impl=lucene's buffers (heap)}
   [junit4] OK      0.00s J0 | TestByteBuffersDirectory.testString {impl=lucene's buffers (heap)}
   [junit4] OK      0.00s J0 | TestByteBuffersDirectory.testSeekBeyondEndOfFile {impl=lucene's buffers (heap)}
   [junit4] OK      0.00s J0 | TestByteBuffersDirectory.testLong {impl=lucene's buffers (heap)}
   [junit4] OK      0.00s J0 | TestByteBuffersDirectory.testSeekToEndOfFile {impl=lucene's buffers (heap)}
   [junit4] OK      0.00s J0 | TestByteBuffersDirectory.testSeekToEOFThenBack {impl=lucene's buffers (heap)}
   [junit4] OK      0.00s J0 | TestByteBuffersDirectory.testByte {impl=lucene's buffers (heap)}
   [junit4] OK      0.00s J0 | TestByteBuffersDirectory.testShort {impl=lucene's buffers (heap)}
   [junit4] OK      0.00s J0 | TestByteBuffersDirectory.testIndexOutputToString {impl=lucene's buffers (heap)}
   [junit4] OK      0.00s J0 | TestByteBuffersDirectory.testZLong {impl=lucene's buffers (heap)}
   [junit4] OK      0.01s J0 | TestByteBuffersDirectory.testCopyBytes {impl=lucene's buffers (heap)}
   [junit4] OK      0.00s J0 | TestByteBuffersDirectory.testSliceOutOfBounds {impl=lucene's buffers (heap)}
   [junit4] OK      0.01s J0 | TestByteBuffersDirectory.testRename {impl=lucene's buffers (heap)}
   [junit4] IGNOR/A 0.00s J0 | TestByteBuffersDirectory.testPendingDeletions {impl=lucene's buffers (heap)}
   [junit4]    > Assumption #1: we can only install VirusCheckingFS on an FSDirectory
   [junit4] OK      0.00s J0 | TestByteBuffersDirectory.testDoubleCloseOutput {impl=lucene's buffers (heap)}
   [junit4] OK      0.00s J0 | TestByteBuffersDirectory.testSliceOfSlice {impl=lucene's buffers (heap)}
   [junit4] OK      0.05s J0 | TestByteBuffersDirectory.testCopyFrom {impl=lucene's buffers (heap)}
   [junit4] OK      0.00s J0 | TestByteBuffersDirectory.testSetOfStrings {impl=lucene's buffers (heap)}
   [junit4] OK      0.00s J0 | TestByteBuffersDirectory.testDetectClose {impl=lucene's buffers (heap)}
   [junit4] OK      0.08s J0 | TestByteBuffersDirectory.testRandomInt {impl=lucene's buffers (heap)}
   [junit4] OK      0.00s J0 | TestByteBuffersDirectory.testNoDir {impl=lucene's buffers (heap)}
   [junit4] IGNOR/A 0.00s J0 | TestByteBuffersDirectory.testFsyncDoesntCreateNewFiles {impl=lucene's buffers (heap)}
   [junit4]    > Assumption #1: test only works for FSDirectory subclasses
   [junit4] OK      0.00s J0 | TestByteBuffersDirectory.testMapOfStrings {impl=many buffers (heap)}
   [junit4] OK      0.97s J0 | TestByteBuffersDirectory.testThreadSafetyInListAll {impl=many buffers (heap)}
   [junit4] OK      0.00s J0 | TestByteBuffersDirectory.testDeleteFile {impl=many buffers (heap)}
   [junit4] OK      0.00s J0 | TestByteBuffersDirectory.testDoubleCloseInput {impl=many buffers (heap)}
   [junit4] OK      0.00s J0 | TestByteBuffersDirectory.testChecksum {impl=many buffers (heap)}
   [junit4] OK      0.01s J0 | TestByteBuffersDirectory.testCopyBytesWithThreads {impl=many buffers (heap)}
   [junit4] OK      0.00s J0 | TestByteBuffersDirectory.testVLong {impl=many buffers (heap)}
   [junit4] OK      0.00s J0 | TestByteBuffersDirectory.testCreateOutputForExistingFile {impl=many buffers (heap)}
   [junit4] OK      0.00s J0 | TestByteBuffersDirectory.testCreateTempOutput {impl=many buffers (heap)}
   [junit4] OK      0.04s J0 | TestByteBuffersDirectory.testRandomByte {impl=many buffers (heap)}
   [junit4] OK      0.01s J0 | TestByteBuffersDirectory.testRandomLong {impl=many buffers (heap)}
   [junit4] OK      0.00s J0 | TestByteBuffersDirectory.testInt {impl=many buffers (heap)}
   [junit4] OK      0.00s J0 | TestByteBuffersDirectory.testVInt {impl=many buffers (heap)}
   [junit4] OK      0.00s J0 | TestByteBuffersDirectory.testListAllIsSorted {impl=many buffers (heap)}
   [junit4] OK      0.00s J0 | TestByteBuffersDirectory.testRandomShort {impl=many buffers (heap)}
   [junit4] OK      0.00s J0 | TestByteBuffersDirectory.testLargeWrites {impl=many buffers (heap)}
   [junit4] OK      0.00s J0 | TestByteBuffersDirectory.testFileExistsInListAfterCreated {impl=many buffers (heap)}
   [junit4] OK      0.00s J0 | TestByteBuffersDirectory.testIllegalEOF {impl=many buffers (heap)}
   [junit4] OK      0.00s J0 | TestByteBuffersDirectory.testZInt {impl=many buffers (heap)}
   [junit4] OK      0.00s J0 | TestByteBuffersDirectory.testSeekPastEOF {impl=many buffers (heap)}
   [junit4] OK      0.01s J0 | TestByteBuffersDirectory.testBuildIndex {impl=many buffers (heap)}
   [junit4] OK      0.00s J0 | TestByteBuffersDirectory.testString {impl=many buffers (heap)}
   [junit4] OK      0.00s J0 | TestByteBuffersDirectory.testSeekBeyondEndOfFile {impl=many buffers (heap)}
   [junit4] OK      0.00s J0 | TestByteBuffersDirectory.testLong {impl=many buffers (heap)}
   [junit4] OK      0.00s J0 | TestByteBuffersDirectory.testSeekToEndOfFile {impl=many buffers (heap)}
   [junit4] OK      0.00s J0 | TestByteBuffersDirectory.testSeekToEOFThenBack {impl=many buffers (heap)}
   [junit4] OK      0.00s J0 | TestByteBuffersDirectory.testByte {impl=many buffers (heap)}
   [junit4] OK      0.00s J0 | TestByteBuffersDirectory.testShort {impl=many buffers (heap)}
   [junit4] OK      0.00s J0 | TestByteBuffersDirectory.testIndexOutputToString {impl=many buffers (heap)}
   [junit4] OK      0.00s J0 | TestByteBuffersDirectory.testZLong {impl=many buffers (heap)}
   [junit4] OK      0.00s J0 | TestByteBuffersDirectory.testCopyBytes {impl=many buffers (heap)}
   [junit4] OK      0.00s J0 | TestByteBuffersDirectory.testSliceOutOfBounds {impl=many buffers (heap)}
   [junit4] OK      0.00s J0 | TestByteBuffersDirectory.testRename {impl=many buffers (heap)}
   [junit4] IGNOR/A 0.00s J0 | TestByteBuffersDirectory.testPendingDeletions {impl=many buffers (heap)}
   [junit4]    > Assumption #1: we can only install VirusCheckingFS on an FSDirectory
   [junit4] OK      0.00s J0 | TestByteBuffersDirectory.testDoubleCloseOutput {impl=many buffers (heap)}
   [junit4] OK      0.00s J0 | TestByteBuffersDirectory.testSliceOfSlice {impl=many buffers (heap)}
   [junit4] OK      0.03s J0 | TestByteBuffersDirectory.testCopyFrom {impl=many buffers (heap)}
   [junit4] OK      0.00s J0 | TestByteBuffersDirectory.testSetOfStrings {impl=many buffers (heap)}
   [junit4] OK      0.00s J0 | TestByteBuffersDirectory.testDetectClose {impl=many buffers (heap)}
   [junit4] OK      0.04s J0 | TestByteBuffersDirectory.testRandomInt {impl=many buffers (heap)}
   [junit4] OK      0.00s J0 | TestByteBuffersDirectory.testNoDir {impl=many buffers (heap)}
   [junit4] IGNOR/A 0.00s J0 | TestByteBuffersDirectory.testFsyncDoesntCreateNewFiles {impl=many buffers (heap)}
   [junit4]    > Assumption #1: test only works for FSDirectory subclasses
   [junit4] OK      0.00s J0 | TestByteBuffersDirectory.testMapOfStrings {impl=one buffer (heap)}
   [junit4] OK      0.42s J0 | TestByteBuffersDirectory.testThreadSafetyInListAll {impl=one buffer (heap)}
   [junit4] OK      0.00s J0 | TestByteBuffersDirectory.testDeleteFile {impl=one buffer (heap)}
   [junit4] OK      0.01s J0 | TestByteBuffersDirectory.testDoubleCloseInput {impl=one buffer (heap)}
   [junit4] OK      0.00s J0 | TestByteBuffersDirectory.testChecksum {impl=one buffer (heap)}
   [junit4] OK      0.01s J0 | TestByteBuffersDirectory.testCopyBytesWithThreads {impl=one buffer (heap)}
   [junit4] OK      0.00s J0 | TestByteBuffersDirectory.testVLong {impl=one buffer (heap)}
   [junit4] OK      0.00s J0 | TestByteBuffersDirectory.testCreateOutputForExistingFile {impl=one buffer (heap)}
   [junit4] OK      0.00s J0 | TestByteBuffersDirectory.testCreateTempOutput {impl=one buffer (heap)}
   [junit4] OK      0.02s J0 | TestByteBuffersDirectory.testRandomByte {impl=one buffer (heap)}
   [junit4] OK      0.03s J0 | TestByteBuffersDirectory.testRandomLong {impl=one buffer (heap)}
   [junit4] OK      0.00s J0 | TestByteBuffersDirectory.testInt {impl=one buffer (heap)}
   [junit4] OK      0.00s J0 | TestByteBuffersDirectory.testVInt {impl=one buffer (heap)}
   [junit4] OK      0.00s J0 | TestByteBuffersDirectory.testListAllIsSorted {impl=one buffer (heap)}
   [junit4] OK      0.00s J0 | TestByteBuffersDirectory.testRandomShort {impl=one buffer (heap)}
   [junit4] OK      0.00s J0 | TestByteBuffersDirectory.testLargeWrites {impl=one buffer (heap)}
   [junit4] OK      0.00s J0 | TestByteBuffersDirectory.testFileExistsInListAfterCreated {impl=one buffer (heap)}
   [junit4] OK      0.00s J0 | TestByteBuffersDirectory.testIllegalEOF {impl=one buffer (heap)}
   [junit4] OK      0.00s J0 | TestByteBuffersDirectory.testZInt {impl=one buffer (heap)}
   [junit4] OK      0.00s J0 | TestByteBuffersDirectory.testSeekPastEOF {impl=one buffer (heap)}
   [junit4] OK      0.00s J0 | TestByteBuffersDirectory.testBuildIndex {impl=one buffer (heap)}
   [junit4] OK      0.00s J0 | TestByteBuffersDirectory.testString {impl=one buffer (heap)}
   [junit4] OK      0.00s J0 | TestByteBuffersDirectory.testSeekBeyondEndOfFile {impl=one buffer (heap)}
   [junit4] OK      0.00s J0 | TestByteBuffersDirectory.testLong {impl=one buffer (heap)}
   [junit4] OK      0.00s J0 | TestByteBuffersDirectory.testSeekToEndOfFile {impl=one buffer (heap)}
   [junit4] OK      0.00s J0 | TestByteBuffersDirectory.testSeekToEOFThenBack {impl=one buffer (heap)}
   [junit4] OK      0.00s J0 | TestByteBuffersDirectory.testByte {impl=one buffer (heap)}
   [junit4] OK      0.00s J0 | TestByteBuffersDirectory.testShort {impl=one buffer (heap)}
   [junit4] OK      0.00s J0 | TestByteBuffersDirectory.testIndexOutputToString {impl=one buffer (heap)}
   [junit4] OK      0.00s J0 | TestByteBuffersDirectory.testZLong {impl=one buffer (heap)}
   [junit4] OK      0.00s J0 | TestByteBuffersDirectory.testCopyBytes {impl=one buffer (heap)}
   [junit4] OK      0.00s J0 | TestByteBuffersDirectory.testSliceOutOfBounds {impl=one buffer (heap)}
   [junit4] OK      0.00s J0 | TestByteBuffersDirectory.testRename {impl=one buffer (heap)}
   [junit4] IGNOR/A 0.00s J0 | TestByteBuffersDirectory.testPendingDeletions {impl=one buffer (heap)}
   [junit4]    > Assumption #1: we can only install VirusCheckingFS on an FSDirectory
   [junit4] OK      0.00s J0 | TestByteBuffersDirectory.testDoubleCloseOutput {impl=one buffer (heap)}
   [junit4] OK      0.00s J0 | TestByteBuffersDirectory.testSliceOfSlice {impl=one buffer (heap)}
   [junit4] OK      0.04s J0 | TestByteBuffersDirectory.testCopyFrom {impl=one buffer (heap)}
   [junit4] OK      0.15s J0 | TestByteBuffersDirectory.testSetOfStrings {impl=one buffer (heap)}
   [junit4] OK      0.01s J0 | TestByteBuffersDirectory.testDetectClose {impl=one buffer (heap)}
   [junit4] OK      0.06s J0 | TestByteBuffersDirectory.testRandomInt {impl=one buffer (heap)}
   [junit4] OK      0.00s J0 | TestByteBuffersDirectory.testNoDir {impl=one buffer (heap)}
   [junit4] IGNOR/A 0.00s J0 | TestByteBuffersDirectory.testFsyncDoesntCreateNewFiles {impl=one buffer (heap)}
   [junit4]    > Assumption #1: test only works for FSDirectory subclasses
   [junit4] OK      0.00s J0 | TestByteBuffersDirectory.testMapOfStrings {impl=byte array (heap)}
   [junit4] OK      0.33s J0 | TestByteBuffersDirectory.testThreadSafetyInListAll {impl=byte array (heap)}
   [junit4] OK      0.00s J0 | TestByteBuffersDirectory.testDeleteFile {impl=byte array (heap)}
   [junit4] OK      0.00s J0 | TestByteBuffersDirectory.testDoubleCloseInput {impl=byte array (heap)}
   [junit4] OK      0.00s J0 | TestByteBuffersDirectory.testChecksum {impl=byte array (heap)}
   [junit4] OK      0.01s J0 | TestByteBuffersDirectory.testCopyBytesWithThreads {impl=byte array (heap)}
   [junit4] OK      0.00s J0 | TestByteBuffersDirectory.testVLong {impl=byte array (heap)}
   [junit4] OK      0.00s J0 | TestByteBuffersDirectory.testCreateOutputForExistingFile {impl=byte array (heap)}
   [junit4] OK      0.00s J0 | TestByteBuffersDirectory.testCreateTempOutput {impl=byte array (heap)}
   [junit4] OK      0.02s J0 | TestByteBuffersDirectory.testRandomByte {impl=byte array (heap)}
   [junit4] OK      0.01s J0 | TestByteBuffersDirectory.testRandomLong {impl=byte array (heap)}
   [junit4] OK      0.00s J0 | TestByteBuffersDirectory.testInt {impl=byte array (heap)}
   [junit4] OK      0.01s J0 | TestByteBuffersDirectory.testVInt {impl=byte array (heap)}
   [junit4] OK      0.00s J0 | TestByteBuffersDirectory.testListAllIsSorted {impl=byte array (heap)}
   [junit4] OK      0.00s J0 | TestByteBuffersDirectory.testRandomShort {impl=byte array (heap)}
   [junit4] OK      0.00s J0 | TestByteBuffersDirectory.testLargeWrites {impl=byte array (heap)}
   [junit4] OK      0.00s J0 | TestByteBuffersDirectory.testFileExistsInListAfterCreated {impl=byte array (heap)}
   [junit4] OK      0.00s J0 | TestByteBuffersDirectory.testIllegalEOF {impl=byte array (heap)}
   [junit4] OK      0.00s J0 | TestByteBuffersDirectory.testZInt {impl=byte array (heap)}
   [junit4]   2> NOTE: reproduce with: ant test  -Dtestcase=TestByteBuffersDirectory -Dtests.method=testSeekPastEOF -Dtests.seed=BDFA8CEDB7C93AC1 -Dtests.slow=true -Dtests.badapples=true -Dtests.locale=sr-RS -Dtests.timezone=Europe/Astrakhan -Dtests.asserts=true -Dtests.file.encoding=US-ASCII
   [junit4] FAILURE 0.00s J0 | TestByteBuffersDirectory.testSeekPastEOF {impl=byte array (heap)} <<<
   [junit4]    > Throwable #1: junit.framework.AssertionFailedError: Unexpected exception type, expected EOFException but got java.lang.ArrayIndexOutOfBoundsException: 1770
   [junit4]    > 	at __randomizedtesting.SeedInfo.seed([BDFA8CEDB7C93AC1:5DBC4714B74C4450]:0)
   [junit4]    > 	at org.apache.lucene.util.LuceneTestCase.expectThrows(LuceneTestCase.java:2680)
   [junit4]    > 	at org.apache.lucene.util.LuceneTestCase.expectThrows(LuceneTestCase.java:2669)
   [junit4]    > 	at org.apache.lucene.store.BaseDirectoryTestCase.testSeekPastEOF(BaseDirectoryTestCase.java:516)
   [junit4]    > 	at java.base/jdk.internal.reflect.NativeMethodAccessorImpl.invoke0(Native Method)
   [junit4]    > 	at java.base/jdk.internal.reflect.NativeMethodAccessorImpl.invoke(NativeMethodAccessorImpl.java:62)
   [junit4]    > 	at java.base/jdk.internal.reflect.DelegatingMethodAccessorImpl.invoke(DelegatingMethodAccessorImpl.java:43)
   [junit4]    > 	at java.base/java.lang.reflect.Method.invoke(Method.java:564)
   [junit4]    > 	at java.base/java.lang.Thread.run(Thread.java:844)
   [junit4]    > Caused by: java.lang.ArrayIndexOutOfBoundsException: 1770
   [junit4]    > 	at org.apache.lucene.store.ByteArrayIndexInput.readByte(ByteArrayIndexInput.java:145)
   [junit4]    > 	at org.apache.lucene.store.BaseDirectoryTestCase.lambda$testSeekPastEOF$12(BaseDirectoryTestCase.java:518)
   [junit4]    > 	at org.apache.lucene.util.LuceneTestCase.expectThrows(LuceneTestCase.java:2675)
   [junit4]    > 	... 37 more
   [ju

[...truncated too long message...]

heap)}
   [junit4] OK      0.00s J0 | TestByteBuffersDirectory.testRename {impl=one buffer (heap)}
   [junit4] IGNOR/A 0.00s J0 | TestByteBuffersDirectory.testPendingDeletions {impl=one buffer (heap)}
   [junit4]    > Assumption #1: we can only install VirusCheckingFS on an FSDirectory
   [junit4] OK      0.00s J0 | TestByteBuffersDirectory.testDoubleCloseOutput {impl=one buffer (heap)}
   [junit4] OK      0.00s J0 | TestByteBuffersDirectory.testSliceOfSlice {impl=one buffer (heap)}
   [junit4] OK      0.01s J0 | TestByteBuffersDirectory.testCopyFrom {impl=one buffer (heap)}
   [junit4] OK      0.00s J0 | TestByteBuffersDirectory.testSetOfStrings {impl=one buffer (heap)}
   [junit4] OK      0.00s J0 | TestByteBuffersDirectory.testDetectClose {impl=one buffer (heap)}
   [junit4] OK      0.06s J0 | TestByteBuffersDirectory.testRandomInt {impl=one buffer (heap)}
   [junit4] OK      0.00s J0 | TestByteBuffersDirectory.testNoDir {impl=one buffer (heap)}
   [junit4] IGNOR/A 0.00s J0 | TestByteBuffersDirectory.testFsyncDoesntCreateNewFiles {impl=one buffer (heap)}
   [junit4]    > Assumption #1: test only works for FSDirectory subclasses
   [junit4] OK      0.00s J0 | TestByteBuffersDirectory.testMapOfStrings {impl=byte array (heap)}
   [junit4] OK      0.01s J0 | TestByteBuffersDirectory.testThreadSafetyInListAll {impl=byte array (heap)}
   [junit4] OK      0.00s J0 | TestByteBuffersDirectory.testDeleteFile {impl=byte array (heap)}
   [junit4] OK      0.00s J0 | TestByteBuffersDirectory.testDoubleCloseInput {impl=byte array (heap)}
   [junit4] OK      0.00s J0 | TestByteBuffersDirectory.testChecksum {impl=byte array (heap)}
   [junit4] OK      0.01s J0 | TestByteBuffersDirectory.testCopyBytesWithThreads {impl=byte array (heap)}
   [junit4] OK      0.00s J0 | TestByteBuffersDirectory.testVLong {impl=byte array (heap)}
   [junit4] OK      0.00s J0 | TestByteBuffersDirectory.testCreateOutputForExistingFile {impl=byte array (heap)}
   [junit4] OK      0.00s J0 | TestByteBuffersDirectory.testCreateTempOutput {impl=byte array (heap)}
   [junit4] OK      0.02s J0 | TestByteBuffersDirectory.testRandomByte {impl=byte array (heap)}
   [junit4] OK      0.01s J0 | TestByteBuffersDirectory.testRandomLong {impl=byte array (heap)}
   [junit4] OK      0.00s J0 | TestByteBuffersDirectory.testInt {impl=byte array (heap)}
   [junit4] OK      0.00s J0 | TestByteBuffersDirectory.testVInt {impl=byte array (heap)}
   [junit4] OK      0.00s J0 | TestByteBuffersDirectory.testListAllIsSorted {impl=byte array (heap)}
   [junit4] OK      0.00s J0 | TestByteBuffersDirectory.testRandomShort {impl=byte array (heap)}
   [junit4] OK      0.00s J0 | TestByteBuffersDirectory.testLargeWrites {impl=byte array (heap)}
   [junit4] OK      0.00s J0 | TestByteBuffersDirectory.testFileExistsInListAfterCreated {impl=byte array (heap)}
   [junit4] OK      0.00s J0 | TestByteBuffersDirectory.testIllegalEOF {impl=byte array (heap)}
   [junit4] OK      0.00s J0 | TestByteBuffersDirectory.testZInt {impl=byte array (heap)}
   [junit4]   2> NOTE: reproduce with: ant test  -Dtestcase=TestByteBuffersDirectory -Dtests.method=testSeekPastEOF -Dtests.seed=BDFA8CEDB7C93AC1 -Dtests.slow=true -Dtests.badapples=true -Dtests.locale=sr-RS -Dtests.timezone=Europe/Astrakhan -Dtests.asserts=true -Dtests.file.encoding=US-ASCII
   [junit4] FAILURE 0.00s J0 | TestByteBuffersDirectory.testSeekPastEOF {impl=byte array (heap)} <<<
   [junit4]    > Throwable #1: junit.framework.AssertionFailedError: Unexpected exception type, expected EOFException but got java.lang.ArrayIndexOutOfBoundsException: 1770
   [junit4]    > 	at __randomizedtesting.SeedInfo.seed([BDFA8CEDB7C93AC1:5DBC4714B74C4450]:0)
   [junit4]    > 	at org.apache.lucene.util.LuceneTestCase.expectThrows(LuceneTestCase.java:2680)
   [junit4]    > 	at org.apache.lucene.util.LuceneTestCase.expectThrows(LuceneTestCase.java:2669)
   [junit4]    > 	at org.apache.lucene.store.BaseDirectoryTestCase.testSeekPastEOF(BaseDirectoryTestCase.java:516)
   [junit4]    > 	at java.base/jdk.internal.reflect.NativeMethodAccessorImpl.invoke0(Native Method)
   [junit4]    > 	at java.base/jdk.internal.reflect.NativeMethodAccessorImpl.invoke(NativeMethodAccessorImpl.java:62)
   [junit4]    > 	at java.base/jdk.internal.reflect.DelegatingMethodAccessorImpl.invoke(DelegatingMethodAccessorImpl.java:43)
   [junit4]    > 	at java.base/java.lang.reflect.Method.invoke(Method.java:564)
   [junit4]    > 	at java.base/java.lang.Thread.run(Thread.java:844)
   [junit4]    > Caused by: java.lang.ArrayIndexOutOfBoundsException: 1770
   [junit4]    > 	at org.apache.lucene.store.ByteArrayIndexInput.readByte(ByteArrayIndexInput.java:145)
   [junit4]    > 	at org.apache.lucene.store.BaseDirectoryTestCase.lambda$testSeekPastEOF$12(BaseDirectoryTestCase.java:518)
   [junit4]    > 	at org.apache.lucene.util.LuceneTestCase.expectThrows(LuceneTestCase.java:2675)
   [junit4]    > 	... 37 more
   [junit4] OK      0.00s J0 | TestByteBuffersDirectory.testBuildIndex {impl=byte array (heap)}
   [junit4] OK      0.00s J0 | TestByteBuffersDirectory.testString {impl=byte array (heap)}
   [junit4] OK      0.00s J0 | TestByteBuffersDirectory.testSeekBeyondEndOfFile {impl=byte array (heap)}
   [junit4] OK      0.00s J0 | TestByteBuffersDirectory.testLong {impl=byte array (heap)}
   [junit4] OK      0.00s J0 | TestByteBuffersDirectory.testSeekToEndOfFile {impl=byte array (heap)}
   [junit4] OK      0.00s J0 | TestByteBuffersDirectory.testSeekToEOFThenBack {impl=byte array (heap)}
   [junit4] OK      0.00s J0 | TestByteBuffersDirectory.testByte {impl=byte array (heap)}
   [junit4] OK      0.00s J0 | TestByteBuffersDirectory.testShort {impl=byte array (heap)}
   [junit4] OK      0.00s J0 | TestByteBuffersDirectory.testIndexOutputToString {impl=byte array (heap)}
   [junit4] OK      0.00s J0 | TestByteBuffersDirectory.testZLong {impl=byte array (heap)}
   [junit4] OK      0.00s J0 | TestByteBuffersDirectory.testCopyBytes {impl=byte array (heap)}
   [junit4] OK      0.00s J0 | TestByteBuffersDirectory.testSliceOutOfBounds {impl=byte array (heap)}
   [junit4] OK      0.00s J0 | TestByteBuffersDirectory.testRename {impl=byte array (heap)}
   [junit4] IGNOR/A 0.00s J0 | TestByteBuffersDirectory.testPendingDeletions {impl=byte array (heap)}
   [junit4]    > Assumption #1: we can only install VirusCheckingFS on an FSDirectory
   [junit4] OK      0.00s J0 | TestByteBuffersDirectory.testDoubleCloseOutput {impl=byte array (heap)}
   [junit4] OK      0.00s J0 | TestByteBuffersDirectory.testSliceOfSlice {impl=byte array (heap)}
   [junit4] OK      0.02s J0 | TestByteBuffersDirectory.testCopyFrom {impl=byte array (heap)}
   [junit4] OK      0.00s J0 | TestByteBuffersDirectory.testSetOfStrings {impl=byte array (heap)}
   [junit4] OK      0.00s J0 | TestByteBuffersDirectory.testDetectClose {impl=byte array (heap)}
   [junit4] OK      0.03s J0 | TestByteBuffersDirectory.testRandomInt {impl=byte array (heap)}
   [junit4] OK      0.00s J0 | TestByteBuffersDirectory.testNoDir {impl=byte array (heap)}
   [junit4] IGNOR/A 0.00s J0 | TestByteBuffersDirectory.testFsyncDoesntCreateNewFiles {impl=byte array (heap)}
   [junit4]    > Assumption #1: test only works for FSDirectory subclasses
   [junit4]   2> NOTE: leaving temporary files on disk at: /Users/jenkins/workspace/Lucene-Solr-master-MacOSX/lucene/build/core/test/J0/temp/lucene.store.TestByteBuffersDirectory_BDFA8CEDB7C93AC1-003
   [junit4]   2> NOTE: test params are: codec=Lucene80, sim=Asserting(org.apache.lucene.search.similarities.AssertingSimilarity@16f7523f), locale=sr-RS, timezone=Europe/Astrakhan
   [junit4]   2> NOTE: Mac OS X 10.11.6 x86_64/Oracle Corporation 9 (64-bit)/cpus=3,threads=1,free=66776656,total=125304832
   [junit4]   2> NOTE: All tests run in this JVM: [TestByteBuffersDirectory, TestByteBuffersDirectory, TestByteBuffersDirectory]
   [junit4] Completed [5/5 (5!)] on J0 in 0.88s, 168 tests, 1 failure, 8 skipped <<< FAILURES!

[...truncated 14 lines...]
BUILD FAILED
/Users/jenkins/workspace/Lucene-Solr-master-MacOSX/lucene/common-build.xml:1567: The following error occurred while executing this line:
/Users/jenkins/workspace/Lucene-Solr-master-MacOSX/lucene/common-build.xml:1092: There were test failures: 5 suites, 840 tests, 5 failures, 40 ignored (40 assumptions) [seed: BDFA8CEDB7C93AC1]

Total time: 25 seconds

[repro] Setting last failure code to 256

[repro] Failures:
[repro]   5/5 failed: org.apache.lucene.store.TestByteBuffersDirectory
[repro] Exiting with code 256
+ mv lucene/build lucene/build.repro
+ mv solr/build solr/build.repro
mv: rename solr/build to solr/build.repro: No such file or directory
+ true
+ mv lucene/build.orig lucene/build
+ mv solr/build.orig solr/build
Archiving artifacts
Setting ANT_1_8_2_HOME=/Users/jenkins/tools/hudson.tasks.Ant_AntInstallation/ANT_1.8.2
[WARNINGS] Parsing warnings in console log with parser Java Compiler (javac)
Setting ANT_1_8_2_HOME=/Users/jenkins/tools/hudson.tasks.Ant_AntInstallation/ANT_1.8.2
Setting ANT_1_8_2_HOME=/Users/jenkins/tools/hudson.tasks.Ant_AntInstallation/ANT_1.8.2
<Git Blamer> Using GitBlamer to create author and commit information for all warnings.
<Git Blamer> GIT_COMMIT=856e28d8cf07cc34bc1361784bf00e7aceb3af97, workspace=/Users/jenkins/workspace/Lucene-Solr-master-MacOSX
[WARNINGS] Computing warning deltas based on reference build #4902
Recording test results
Setting ANT_1_8_2_HOME=/Users/jenkins/tools/hudson.tasks.Ant_AntInstallation/ANT_1.8.2
Build step 'Publish JUnit test result report' changed build result to UNSTABLE
Email was triggered for: Unstable (Test Failures)
Sending email for trigger: Unstable (Test Failures)
Setting ANT_1_8_2_HOME=/Users/jenkins/tools/hudson.tasks.Ant_AntInstallation/ANT_1.8.2
Setting ANT_1_8_2_HOME=/Users/jenkins/tools/hudson.tasks.Ant_AntInstallation/ANT_1.8.2
Setting ANT_1_8_2_HOME=/Users/jenkins/tools/hudson.tasks.Ant_AntInstallation/ANT_1.8.2
Setting ANT_1_8_2_HOME=/Users/jenkins/tools/hudson.tasks.Ant_AntInstallation/ANT_1.8.2

Mime
View raw message