lucene-dev mailing list archives

Site index · List index
Message view « Date » · « Thread »
Top « Date » · « Thread »
From Policeman Jenkins Server <jenk...@thetaphi.de>
Subject [JENKINS] Lucene-Solr-7.x-Linux (64bit/jdk-10.0.1) - Build # 3008 - Unstable!
Date Wed, 31 Oct 2018 05:37:15 GMT
Build: https://jenkins.thetaphi.de/job/Lucene-Solr-7.x-Linux/3008/
Java: 64bit/jdk-10.0.1 -XX:+UseCompressedOops -XX:+UseParallelGC

8 tests failed.
FAILED:  org.apache.solr.cloud.TestTlogReplica.testRecovery

Error Message:
Can not find doc 7 in https://127.0.0.1:44245/solr

Stack Trace:
java.lang.AssertionError: Can not find doc 7 in https://127.0.0.1:44245/solr
	at __randomizedtesting.SeedInfo.seed([525CC9489E970BC7:93ACB0E4B3C7C160]:0)
	at org.junit.Assert.fail(Assert.java:93)
	at org.junit.Assert.assertTrue(Assert.java:43)
	at org.junit.Assert.assertNotNull(Assert.java:526)
	at org.apache.solr.cloud.TestTlogReplica.checkRTG(TestTlogReplica.java:902)
	at org.apache.solr.cloud.TestTlogReplica.testRecovery(TestTlogReplica.java:567)
	at java.base/jdk.internal.reflect.NativeMethodAccessorImpl.invoke0(Native Method)
	at java.base/jdk.internal.reflect.NativeMethodAccessorImpl.invoke(NativeMethodAccessorImpl.java:62)
	at java.base/jdk.internal.reflect.DelegatingMethodAccessorImpl.invoke(DelegatingMethodAccessorImpl.java:43)
	at java.base/java.lang.reflect.Method.invoke(Method.java:564)
	at com.carrotsearch.randomizedtesting.RandomizedRunner.invoke(RandomizedRunner.java:1742)
	at com.carrotsearch.randomizedtesting.RandomizedRunner$8.evaluate(RandomizedRunner.java:935)
	at com.carrotsearch.randomizedtesting.RandomizedRunner$9.evaluate(RandomizedRunner.java:971)
	at com.carrotsearch.randomizedtesting.RandomizedRunner$10.evaluate(RandomizedRunner.java:985)
	at com.carrotsearch.randomizedtesting.rules.SystemPropertiesRestoreRule$1.evaluate(SystemPropertiesRestoreRule.java:57)
	at org.apache.lucene.util.TestRuleSetupTeardownChained$1.evaluate(TestRuleSetupTeardownChained.java:49)
	at org.apache.lucene.util.AbstractBeforeAfterRule$1.evaluate(AbstractBeforeAfterRule.java:45)
	at org.apache.lucene.util.TestRuleThreadAndTestName$1.evaluate(TestRuleThreadAndTestName.java:48)
	at org.apache.lucene.util.TestRuleIgnoreAfterMaxFailures$1.evaluate(TestRuleIgnoreAfterMaxFailures.java:64)
	at org.apache.lucene.util.TestRuleMarkFailure$1.evaluate(TestRuleMarkFailure.java:47)
	at com.carrotsearch.randomizedtesting.rules.StatementAdapter.evaluate(StatementAdapter.java:36)
	at com.carrotsearch.randomizedtesting.ThreadLeakControl$StatementRunner.run(ThreadLeakControl.java:368)
	at com.carrotsearch.randomizedtesting.ThreadLeakControl.forkTimeoutingTask(ThreadLeakControl.java:817)
	at com.carrotsearch.randomizedtesting.ThreadLeakControl$3.evaluate(ThreadLeakControl.java:468)
	at com.carrotsearch.randomizedtesting.RandomizedRunner.runSingleTest(RandomizedRunner.java:944)
	at com.carrotsearch.randomizedtesting.RandomizedRunner$5.evaluate(RandomizedRunner.java:830)
	at com.carrotsearch.randomizedtesting.RandomizedRunner$6.evaluate(RandomizedRunner.java:880)
	at com.carrotsearch.randomizedtesting.RandomizedRunner$7.evaluate(RandomizedRunner.java:891)
	at com.carrotsearch.randomizedtesting.rules.StatementAdapter.evaluate(StatementAdapter.java:36)
	at com.carrotsearch.randomizedtesting.rules.SystemPropertiesRestoreRule$1.evaluate(SystemPropertiesRestoreRule.java:57)
	at org.apache.lucene.util.AbstractBeforeAfterRule$1.evaluate(AbstractBeforeAfterRule.java:45)
	at com.carrotsearch.randomizedtesting.rules.StatementAdapter.evaluate(StatementAdapter.java:36)
	at org.apache.lucene.util.TestRuleStoreClassName$1.evaluate(TestRuleStoreClassName.java:41)
	at com.carrotsearch.randomizedtesting.rules.NoShadowingOrOverridesOnMethodsRule$1.evaluate(NoShadowingOrOverridesOnMethodsRule.java:40)
	at com.carrotsearch.randomizedtesting.rules.NoShadowingOrOverridesOnMethodsRule$1.evaluate(NoShadowingOrOverridesOnMethodsRule.java:40)
	at com.carrotsearch.randomizedtesting.rules.StatementAdapter.evaluate(StatementAdapter.java:36)
	at com.carrotsearch.randomizedtesting.rules.StatementAdapter.evaluate(StatementAdapter.java:36)
	at org.apache.lucene.util.TestRuleAssertionsRequired$1.evaluate(TestRuleAssertionsRequired.java:53)
	at org.apache.lucene.util.TestRuleMarkFailure$1.evaluate(TestRuleMarkFailure.java:47)
	at org.apache.lucene.util.TestRuleIgnoreAfterMaxFailures$1.evaluate(TestRuleIgnoreAfterMaxFailures.java:64)
	at org.apache.lucene.util.TestRuleIgnoreTestSuites$1.evaluate(TestRuleIgnoreTestSuites.java:54)
	at com.carrotsearch.randomizedtesting.rules.StatementAdapter.evaluate(StatementAdapter.java:36)
	at com.carrotsearch.randomizedtesting.ThreadLeakControl$StatementRunner.run(ThreadLeakControl.java:368)
	at java.base/java.lang.Thread.run(Thread.java:844)


FAILED:  org.apache.solr.cloud.TestTlogReplica.testRecovery

Error Message:
Can not find doc 7 in https://127.0.0.1:44813/solr

Stack Trace:
java.lang.AssertionError: Can not find doc 7 in https://127.0.0.1:44813/solr
	at __randomizedtesting.SeedInfo.seed([525CC9489E970BC7:93ACB0E4B3C7C160]:0)
	at org.junit.Assert.fail(Assert.java:93)
	at org.junit.Assert.assertTrue(Assert.java:43)
	at org.junit.Assert.assertNotNull(Assert.java:526)
	at org.apache.solr.cloud.TestTlogReplica.checkRTG(TestTlogReplica.java:902)
	at org.apache.solr.cloud.TestTlogReplica.testRecovery(TestTlogReplica.java:567)
	at java.base/jdk.internal.reflect.NativeMethodAccessorImpl.invoke0(Native Method)
	at java.base/jdk.internal.reflect.NativeMethodAccessorImpl.invoke(NativeMethodAccessorImpl.java:62)
	at java.base/jdk.internal.reflect.DelegatingMethodAccessorImpl.invoke(DelegatingMethodAccessorImpl.java:43)
	at java.base/java.lang.reflect.Method.invoke(Method.java:564)
	at com.carrotsearch.randomizedtesting.RandomizedRunner.invoke(RandomizedRunner.java:1742)
	at com.carrotsearch.randomizedtesting.RandomizedRunner$8.evaluate(RandomizedRunner.java:935)
	at com.carrotsearch.randomizedtesting.RandomizedRunner$9.evaluate(RandomizedRunner.java:971)
	at com.carrotsearch.randomizedtesting.RandomizedRunner$10.evaluate(RandomizedRunner.java:985)
	at com.carrotsearch.randomizedtesting.rules.SystemPropertiesRestoreRule$1.evaluate(SystemPropertiesRestoreRule.java:57)
	at org.apache.lucene.util.TestRuleSetupTeardownChained$1.evaluate(TestRuleSetupTeardownChained.java:49)
	at org.apache.lucene.util.AbstractBeforeAfterRule$1.evaluate(AbstractBeforeAfterRule.java:45)
	at org.apache.lucene.util.TestRuleThreadAndTestName$1.evaluate(TestRuleThreadAndTestName.java:48)
	at org.apache.lucene.util.TestRuleIgnoreAfterMaxFailures$1.evaluate(TestRuleIgnoreAfterMaxFailures.java:64)
	at org.apache.lucene.util.TestRuleMarkFailure$1.evaluate(TestRuleMarkFailure.java:47)
	at com.carrotsearch.randomizedtesting.rules.StatementAdapter.evaluate(StatementAdapter.java:36)
	at com.carrotsearch.randomizedtesting.ThreadLeakControl$StatementRunner.run(ThreadLeakControl.java:368)
	at com.carrotsearch.randomizedtesting.ThreadLeakControl.forkTimeoutingTask(ThreadLeakControl.java:817)
	at com.carrotsearch.randomizedtesting.ThreadLeakControl$3.evaluate(ThreadLeakControl.java:468)
	at com.carrotsearch.randomizedtesting.RandomizedRunner.runSingleTest(RandomizedRunner.java:944)
	at com.carrotsearch.randomizedtesting.RandomizedRunner$5.evaluate(RandomizedRunner.java:830)
	at com.carrotsearch.randomizedtesting.RandomizedRunner$6.evaluate(RandomizedRunner.java:880)
	at com.carrotsearch.randomizedtesting.RandomizedRunner$7.evaluate(RandomizedRunner.java:891)
	at com.carrotsearch.randomizedtesting.rules.StatementAdapter.evaluate(StatementAdapter.java:36)
	at com.carrotsearch.randomizedtesting.rules.SystemPropertiesRestoreRule$1.evaluate(SystemPropertiesRestoreRule.java:57)
	at org.apache.lucene.util.AbstractBeforeAfterRule$1.evaluate(AbstractBeforeAfterRule.java:45)
	at com.carrotsearch.randomizedtesting.rules.StatementAdapter.evaluate(StatementAdapter.java:36)
	at org.apache.lucene.util.TestRuleStoreClassName$1.evaluate(TestRuleStoreClassName.java:41)
	at com.carrotsearch.randomizedtesting.rules.NoShadowingOrOverridesOnMethodsRule$1.evaluate(NoShadowingOrOverridesOnMethodsRule.java:40)
	at com.carrotsearch.randomizedtesting.rules.NoShadowingOrOverridesOnMethodsRule$1.evaluate(NoShadowingOrOverridesOnMethodsRule.java:40)
	at com.carrotsearch.randomizedtesting.rules.StatementAdapter.evaluate(StatementAdapter.java:36)
	at com.carrotsearch.randomizedtesting.rules.StatementAdapter.evaluate(StatementAdapter.java:36)
	at org.apache.lucene.util.TestRuleAssertionsRequired$1.evaluate(TestRuleAssertionsRequired.java:53)
	at org.apache.lucene.util.TestRuleMarkFailure$1.evaluate(TestRuleMarkFailure.java:47)
	at org.apache.lucene.util.TestRuleIgnoreAfterMaxFailures$1.evaluate(TestRuleIgnoreAfterMaxFailures.java:64)
	at org.apache.lucene.util.TestRuleIgnoreTestSuites$1.evaluate(TestRuleIgnoreTestSuites.java:54)
	at com.carrotsearch.randomizedtesting.rules.StatementAdapter.evaluate(StatementAdapter.java:36)
	at com.carrotsearch.randomizedtesting.ThreadLeakControl$StatementRunner.run(ThreadLeakControl.java:368)
	at java.base/java.lang.Thread.run(Thread.java:844)


FAILED:  org.apache.solr.cloud.TestTlogReplica.testRecovery

Error Message:
Can not find doc 7 in https://127.0.0.1:39827/solr

Stack Trace:
java.lang.AssertionError: Can not find doc 7 in https://127.0.0.1:39827/solr
	at __randomizedtesting.SeedInfo.seed([525CC9489E970BC7:93ACB0E4B3C7C160]:0)
	at org.junit.Assert.fail(Assert.java:93)
	at org.junit.Assert.assertTrue(Assert.java:43)
	at org.junit.Assert.assertNotNull(Assert.java:526)
	at org.apache.solr.cloud.TestTlogReplica.checkRTG(TestTlogReplica.java:902)
	at org.apache.solr.cloud.TestTlogReplica.testRecovery(TestTlogReplica.java:567)
	at java.base/jdk.internal.reflect.NativeMethodAccessorImpl.invoke0(Native Method)
	at java.base/jdk.internal.reflect.NativeMethodAccessorImpl.invoke(NativeMethodAccessorImpl.java:62)
	at java.base/jdk.internal.reflect.DelegatingMethodAccessorImpl.invoke(DelegatingMethodAccessorImpl.java:43)
	at java.base/java.lang.reflect.Method.invoke(Method.java:564)
	at com.carrotsearch.randomizedtesting.RandomizedRunner.invoke(RandomizedRunner.java:1742)
	at com.carrotsearch.randomizedtesting.RandomizedRunner$8.evaluate(RandomizedRunner.java:935)
	at com.carrotsearch.randomizedtesting.RandomizedRunner$9.evaluate(RandomizedRunner.java:971)
	at com.carrotsearch.randomizedtesting.RandomizedRunner$10.evaluate(RandomizedRunner.java:985)
	at com.carrotsearch.randomizedtesting.rules.SystemPropertiesRestoreRule$1.evaluate(SystemPropertiesRestoreRule.java:57)
	at org.apache.lucene.util.TestRuleSetupTeardownChained$1.evaluate(TestRuleSetupTeardownChained.java:49)
	at org.apache.lucene.util.AbstractBeforeAfterRule$1.evaluate(AbstractBeforeAfterRule.java:45)
	at org.apache.lucene.util.TestRuleThreadAndTestName$1.evaluate(TestRuleThreadAndTestName.java:48)
	at org.apache.lucene.util.TestRuleIgnoreAfterMaxFailures$1.evaluate(TestRuleIgnoreAfterMaxFailures.java:64)
	at org.apache.lucene.util.TestRuleMarkFailure$1.evaluate(TestRuleMarkFailure.java:47)
	at com.carrotsearch.randomizedtesting.rules.StatementAdapter.evaluate(StatementAdapter.java:36)
	at com.carrotsearch.randomizedtesting.ThreadLeakControl$StatementRunner.run(ThreadLeakControl.java:368)
	at com.carrotsearch.randomizedtesting.ThreadLeakControl.forkTimeoutingTask(ThreadLeakControl.java:817)
	at com.carrotsearch.randomizedtesting.ThreadLeakControl$3.evaluate(ThreadLeakControl.java:468)
	at com.carrotsearch.randomizedtesting.RandomizedRunner.runSingleTest(RandomizedRunner.java:944)
	at com.carrotsearch.randomizedtesting.RandomizedRunner$5.evaluate(RandomizedRunner.java:830)
	at com.carrotsearch.randomizedtesting.RandomizedRunner$6.evaluate(RandomizedRunner.java:880)
	at com.carrotsearch.randomizedtesting.RandomizedRunner$7.evaluate(RandomizedRunner.java:891)
	at com.carrotsearch.randomizedtesting.rules.StatementAdapter.evaluate(StatementAdapter.java:36)
	at com.carrotsearch.randomizedtesting.rules.SystemPropertiesRestoreRule$1.evaluate(SystemPropertiesRestoreRule.java:57)
	at org.apache.lucene.util.AbstractBeforeAfterRule$1.evaluate(AbstractBeforeAfterRule.java:45)
	at com.carrotsearch.randomizedtesting.rules.StatementAdapter.evaluate(StatementAdapter.java:36)
	at org.apache.lucene.util.TestRuleStoreClassName$1.evaluate(TestRuleStoreClassName.java:41)
	at com.carrotsearch.randomizedtesting.rules.NoShadowingOrOverridesOnMethodsRule$1.evaluate(NoShadowingOrOverridesOnMethodsRule.java:40)
	at com.carrotsearch.randomizedtesting.rules.NoShadowingOrOverridesOnMethodsRule$1.evaluate(NoShadowingOrOverridesOnMethodsRule.java:40)
	at com.carrotsearch.randomizedtesting.rules.StatementAdapter.evaluate(StatementAdapter.java:36)
	at com.carrotsearch.randomizedtesting.rules.StatementAdapter.evaluate(StatementAdapter.java:36)
	at org.apache.lucene.util.TestRuleAssertionsRequired$1.evaluate(TestRuleAssertionsRequired.java:53)
	at org.apache.lucene.util.TestRuleMarkFailure$1.evaluate(TestRuleMarkFailure.java:47)
	at org.apache.lucene.util.TestRuleIgnoreAfterMaxFailures$1.evaluate(TestRuleIgnoreAfterMaxFailures.java:64)
	at org.apache.lucene.util.TestRuleIgnoreTestSuites$1.evaluate(TestRuleIgnoreTestSuites.java:54)
	at com.carrotsearch.randomizedtesting.rules.StatementAdapter.evaluate(StatementAdapter.java:36)
	at com.carrotsearch.randomizedtesting.ThreadLeakControl$StatementRunner.run(ThreadLeakControl.java:368)
	at java.base/java.lang.Thread.run(Thread.java:844)


FAILED:  org.apache.solr.cloud.TestTlogReplica.testRecovery

Error Message:
Can not find doc 7 in https://127.0.0.1:33319/solr

Stack Trace:
java.lang.AssertionError: Can not find doc 7 in https://127.0.0.1:33319/solr
	at __randomizedtesting.SeedInfo.seed([525CC9489E970BC7:93ACB0E4B3C7C160]:0)
	at org.junit.Assert.fail(Assert.java:93)
	at org.junit.Assert.assertTrue(Assert.java:43)
	at org.junit.Assert.assertNotNull(Assert.java:526)
	at org.apache.solr.cloud.TestTlogReplica.checkRTG(TestTlogReplica.java:902)
	at org.apache.solr.cloud.TestTlogReplica.testRecovery(TestTlogReplica.java:567)
	at java.base/jdk.internal.reflect.NativeMethodAccessorImpl.invoke0(Native Method)
	at java.base/jdk.internal.reflect.NativeMethodAccessorImpl.invoke(NativeMethodAccessorImpl.java:62)
	at java.base/jdk.internal.reflect.DelegatingMethodAccessorImpl.invoke(DelegatingMethodAccessorImpl.java:43)
	at java.base/java.lang.reflect.Method.invoke(Method.java:564)
	at com.carrotsearch.randomizedtesting.RandomizedRunner.invoke(RandomizedRunner.java:1742)
	at com.carrotsearch.randomizedtesting.RandomizedRunner$8.evaluate(RandomizedRunner.java:935)
	at com.carrotsearch.randomizedtesting.RandomizedRunner$9.evaluate(RandomizedRunner.java:971)
	at com.carrotsearch.randomizedtesting.RandomizedRunner$10.evaluate(RandomizedRunner.java:985)
	at com.carrotsearch.randomizedtesting.rules.SystemPropertiesRestoreRule$1.evaluate(SystemPropertiesRestoreRule.java:57)
	at org.apache.lucene.util.TestRuleSetupTeardownChained$1.evaluate(TestRuleSetupTeardownChained.java:49)
	at org.apache.lucene.util.AbstractBeforeAfterRule$1.evaluate(AbstractBeforeAfterRule.java:45)
	at org.apache.lucene.util.TestRuleThreadAndTestName$1.evaluate(TestRuleThreadAndTestName.java:48)
	at org.apache.lucene.util.TestRuleIgnoreAfterMaxFailures$1.evaluate(TestRuleIgnoreAfterMaxFailures.java:64)
	at org.apache.lucene.util.TestRuleMarkFailure$1.evaluate(TestRuleMarkFailure.java:47)
	at com.carrotsearch.randomizedtesting.rules.StatementAdapter.evaluate(StatementAdapter.java:36)
	at com.carrotsearch.randomizedtesting.ThreadLeakControl$StatementRunner.run(ThreadLeakControl.java:368)
	at com.carrotsearch.randomizedtesting.ThreadLeakControl.forkTimeoutingTask(ThreadLeakControl.java:817)
	at com.carrotsearch.randomizedtesting.ThreadLeakControl$3.evaluate(ThreadLeakControl.java:468)
	at com.carrotsearch.randomizedtesting.RandomizedRunner.runSingleTest(RandomizedRunner.java:944)
	at com.carrotsearch.randomizedtesting.RandomizedRunner$5.evaluate(RandomizedRunner.java:830)
	at com.carrotsearch.randomizedtesting.RandomizedRunner$6.evaluate(RandomizedRunner.java:880)
	at com.carrotsearch.randomizedtesting.RandomizedRunner$7.evaluate(RandomizedRunner.java:891)
	at com.carrotsearch.randomizedtesting.rules.StatementAdapter.evaluate(StatementAdapter.java:36)
	at com.carrotsearch.randomizedtesting.rules.SystemPropertiesRestoreRule$1.evaluate(SystemPropertiesRestoreRule.java:57)
	at org.apache.lucene.util.AbstractBeforeAfterRule$1.evaluate(AbstractBeforeAfterRule.java:45)
	at com.carrotsearch.randomizedtesting.rules.StatementAdapter.evaluate(StatementAdapter.java:36)
	at org.apache.lucene.util.TestRuleStoreClassName$1.evaluate(TestRuleStoreClassName.java:41)
	at com.carrotsearch.randomizedtesting.rules.NoShadowingOrOverridesOnMethodsRule$1.evaluate(NoShadowingOrOverridesOnMethodsRule.java:40)
	at com.carrotsearch.randomizedtesting.rules.NoShadowingOrOverridesOnMethodsRule$1.evaluate(NoShadowingOrOverridesOnMethodsRule.java:40)
	at com.carrotsearch.randomizedtesting.rules.StatementAdapter.evaluate(StatementAdapter.java:36)
	at com.carrotsearch.randomizedtesting.rules.StatementAdapter.evaluate(StatementAdapter.java:36)
	at org.apache.lucene.util.TestRuleAssertionsRequired$1.evaluate(TestRuleAssertionsRequired.java:53)
	at org.apache.lucene.util.TestRuleMarkFailure$1.evaluate(TestRuleMarkFailure.java:47)
	at org.apache.lucene.util.TestRuleIgnoreAfterMaxFailures$1.evaluate(TestRuleIgnoreAfterMaxFailures.java:64)
	at org.apache.lucene.util.TestRuleIgnoreTestSuites$1.evaluate(TestRuleIgnoreTestSuites.java:54)
	at com.carrotsearch.randomizedtesting.rules.StatementAdapter.evaluate(StatementAdapter.java:36)
	at com.carrotsearch.randomizedtesting.ThreadLeakControl$StatementRunner.run(ThreadLeakControl.java:368)
	at java.base/java.lang.Thread.run(Thread.java:844)


FAILED:  org.apache.solr.cloud.autoscaling.IndexSizeTriggerTest.testSplitIntegration

Error Message:
did not finish processing in time

Stack Trace:
java.lang.AssertionError: did not finish processing in time
	at __randomizedtesting.SeedInfo.seed([525CC9489E970BC7:6BD27008B168C239]:0)
	at org.junit.Assert.fail(Assert.java:93)
	at org.junit.Assert.assertTrue(Assert.java:43)
	at org.apache.solr.cloud.autoscaling.IndexSizeTriggerTest.testSplitIntegration(IndexSizeTriggerTest.java:316)
	at java.base/jdk.internal.reflect.NativeMethodAccessorImpl.invoke0(Native Method)
	at java.base/jdk.internal.reflect.NativeMethodAccessorImpl.invoke(NativeMethodAccessorImpl.java:62)
	at java.base/jdk.internal.reflect.DelegatingMethodAccessorImpl.invoke(DelegatingMethodAccessorImpl.java:43)
	at java.base/java.lang.reflect.Method.invoke(Method.java:564)
	at com.carrotsearch.randomizedtesting.RandomizedRunner.invoke(RandomizedRunner.java:1742)
	at com.carrotsearch.randomizedtesting.RandomizedRunner$8.evaluate(RandomizedRunner.java:935)
	at com.carrotsearch.randomizedtesting.RandomizedRunner$9.evaluate(RandomizedRunner.java:971)
	at com.carrotsearch.randomizedtesting.RandomizedRunner$10.evaluate(RandomizedRunner.java:985)
	at com.carrotsearch.randomizedtesting.rules.SystemPropertiesRestoreRule$1.evaluate(SystemPropertiesRestoreRule.java:57)
	at org.apache.lucene.util.TestRuleSetupTeardownChained$1.evaluate(TestRuleSetupTeardownChained.java:49)
	at org.apache.lucene.util.AbstractBeforeAfterRule$1.evaluate(AbstractBeforeAfterRule.java:45)
	at org.apache.lucene.util.TestRuleThreadAndTestName$1.evaluate(TestRuleThreadAndTestName.java:48)
	at org.apache.lucene.util.TestRuleIgnoreAfterMaxFailures$1.evaluate(TestRuleIgnoreAfterMaxFailures.java:64)
	at org.apache.lucene.util.TestRuleMarkFailure$1.evaluate(TestRuleMarkFailure.java:47)
	at com.carrotsearch.randomizedtesting.rules.StatementAdapter.evaluate(StatementAdapter.java:36)
	at com.carrotsearch.randomizedtesting.ThreadLeakControl$StatementRunner.run(ThreadLeakControl.java:368)
	at com.carrotsearch.randomizedtesting.ThreadLeakControl.forkTimeoutingTask(ThreadLeakControl.java:817)
	at com.carrotsearch.randomizedtesting.ThreadLeakControl$3.evaluate(ThreadLeakControl.java:468)
	at com.carrotsearch.randomizedtesting.RandomizedRunner.runSingleTest(RandomizedRunner.java:944)
	at com.carrotsearch.randomizedtesting.RandomizedRunner$5.evaluate(RandomizedRunner.java:830)
	at com.carrotsearch.randomizedtesting.RandomizedRunner$6.evaluate(RandomizedRunner.java:880)
	at com.carrotsearch.randomizedtesting.RandomizedRunner$7.evaluate(RandomizedRunner.java:891)
	at com.carrotsearch.randomizedtesting.rules.StatementAdapter.evaluate(StatementAdapter.java:36)
	at com.carrotsearch.randomizedtesting.rules.SystemPropertiesRestoreRule$1.evaluate(SystemPropertiesRestoreRule.java:57)
	at org.apache.lucene.util.AbstractBeforeAfterRule$1.evaluate(AbstractBeforeAfterRule.java:45)
	at com.carrotsearch.randomizedtesting.rules.StatementAdapter.evaluate(StatementAdapter.java:36)
	at org.apache.lucene.util.TestRuleStoreClassName$1.evaluate(TestRuleStoreClassName.java:41)
	at com.carrotsearch.randomizedtesting.rules.NoShadowingOrOverridesOnMethodsRule$1.evaluate(NoShadowingOrOverridesOnMethodsRule.java:40)
	at com.carrotsearch.randomizedtesting.rules.NoShadowingOrOverridesOnMethodsRule$1.evaluate(NoShadowingOrOverridesOnMethodsRule.java:40)
	at com.carrotsearch.randomizedtesting.rules.StatementAdapter.evaluate(StatementAdapter.java:36)
	at com.carrotsearch.randomizedtesting.rules.StatementAdapter.evaluate(StatementAdapter.java:36)
	at org.apache.lucene.util.TestRuleAssertionsRequired$1.evaluate(TestRuleAssertionsRequired.java:53)
	at org.apache.lucene.util.TestRuleMarkFailure$1.evaluate(TestRuleMarkFailure.java:47)
	at org.apache.lucene.util.TestRuleIgnoreAfterMaxFailures$1.evaluate(TestRuleIgnoreAfterMaxFailures.java:64)
	at org.apache.lucene.util.TestRuleIgnoreTestSuites$1.evaluate(TestRuleIgnoreTestSuites.java:54)
	at com.carrotsearch.randomizedtesting.rules.StatementAdapter.evaluate(StatementAdapter.java:36)
	at com.carrotsearch.randomizedtesting.ThreadLeakControl$StatementRunner.run(ThreadLeakControl.java:368)
	at java.base/java.lang.Thread.run(Thread.java:844)


FAILED:  org.apache.solr.cloud.autoscaling.sim.TestSimPolicyCloud.testCreateCollectionAddReplica

Error Message:
Timeout waiting for collection to become active Live Nodes: [127.0.0.1:10010_solr, 127.0.0.1:10008_solr, 127.0.0.1:10009_solr, 127.0.0.1:10007_solr, 127.0.0.1:10011_solr] Last available state: DocCollection(testCreateCollectionAddReplica//clusterstate.json/43)={   "replicationFactor":"1",   "pullReplicas":"0",   "router":{"name":"compositeId"},   "maxShardsPerNode":"1",   "autoAddReplicas":"false",   "nrtReplicas":"1",   "tlogReplicas":"0",   "autoCreated":"true",   "policy":"c1",   "shards":{"shard1":{       "replicas":{"core_node1":{           "core":"testCreateCollectionAddReplica_shard1_replica_n1",           "SEARCHER.searcher.maxDoc":0,           "SEARCHER.searcher.deletedDocs":0,           "INDEX.sizeInBytes":10240,           "node_name":"127.0.0.1:10011_solr",           "state":"active",           "type":"NRT",           "INDEX.sizeInGB":9.5367431640625E-6,           "SEARCHER.searcher.numDocs":0}},       "range":"80000000-7fffffff",       "state":"active"}}}

Stack Trace:
java.lang.AssertionError: Timeout waiting for collection to become active
Live Nodes: [127.0.0.1:10010_solr, 127.0.0.1:10008_solr, 127.0.0.1:10009_solr, 127.0.0.1:10007_solr, 127.0.0.1:10011_solr]
Last available state: DocCollection(testCreateCollectionAddReplica//clusterstate.json/43)={
  "replicationFactor":"1",
  "pullReplicas":"0",
  "router":{"name":"compositeId"},
  "maxShardsPerNode":"1",
  "autoAddReplicas":"false",
  "nrtReplicas":"1",
  "tlogReplicas":"0",
  "autoCreated":"true",
  "policy":"c1",
  "shards":{"shard1":{
      "replicas":{"core_node1":{
          "core":"testCreateCollectionAddReplica_shard1_replica_n1",
          "SEARCHER.searcher.maxDoc":0,
          "SEARCHER.searcher.deletedDocs":0,
          "INDEX.sizeInBytes":10240,
          "node_name":"127.0.0.1:10011_solr",
          "state":"active",
          "type":"NRT",
          "INDEX.sizeInGB":9.5367431640625E-6,
          "SEARCHER.searcher.numDocs":0}},
      "range":"80000000-7fffffff",
      "state":"active"}}}
	at __randomizedtesting.SeedInfo.seed([525CC9489E970BC7:D27CAC668FD4E361]:0)
	at org.apache.solr.cloud.CloudTestUtils.waitForState(CloudTestUtils.java:70)
	at org.apache.solr.cloud.autoscaling.sim.TestSimPolicyCloud.testCreateCollectionAddReplica(TestSimPolicyCloud.java:123)
	at java.base/jdk.internal.reflect.NativeMethodAccessorImpl.invoke0(Native Method)
	at java.base/jdk.internal.reflect.NativeMethodAccessorImpl.invoke(NativeMethodAccessorImpl.java:62)
	at java.base/jdk.internal.reflect.DelegatingMethodAccessorImpl.invoke(DelegatingMethodAccessorImpl.java:43)
	at java.base/java.lang.reflect.Method.invoke(Method.java:564)
	at com.carrotsearch.randomizedtesting.RandomizedRunner.invoke(RandomizedRunner.java:1742)
	at com.carrotsearch.randomizedtesting.RandomizedRunner$8.evaluate(RandomizedRunner.java:935)
	at com.carrotsearch.randomizedtesting.RandomizedRunner$9.evaluate(RandomizedRunner.java:971)
	at com.carrotsearch.randomizedtesting.RandomizedRunner$10.evaluate(RandomizedRunner.java:985)
	at org.junit.rules.ExpectedException$ExpectedExceptionStatement.evaluate(ExpectedException.java:110)
	at com.carrotsearch.randomizedtesting.rules.SystemPropertiesRestoreRule$1.evaluate(SystemPropertiesRestoreRule.java:57)
	at org.apache.lucene.util.TestRuleSetupTeardownChained$1.evaluate(TestRuleSetupTeardownChained.java:49)
	at org.apache.lucene.util.AbstractBeforeAfterRule$1.evaluate(AbstractBeforeAfterRule.java:45)
	at org.apache.lucene.util.TestRuleThreadAndTestName$1.evaluate(TestRuleThreadAndTestName.java:48)
	at org.apache.lucene.util.TestRuleIgnoreAfterMaxFailures$1.evaluate(TestRuleIgnoreAfterMaxFailures.java:64)
	at org.apache.lucene.util.TestRuleMarkFailure$1.evaluate(TestRuleMarkFailure.java:47)
	at com.carrotsearch.randomizedtesting.rules.StatementAdapter.evaluate(StatementAdapter.java:36)
	at com.carrotsearch.randomizedtesting.ThreadLeakControl$StatementRunner.run(ThreadLeakControl.java:368)
	at com.carrotsearch.randomizedtesting.ThreadLeakControl.forkTimeoutingTask(ThreadLeakControl.java:817)
	at com.carrotsearch.randomizedtesting.ThreadLeakControl$3.evaluate(ThreadLeakControl.java:468)
	at com.carrotsearch.randomizedtesting.RandomizedRunner.runSingleTest(RandomizedRunner.java:944)
	at com.carrotsearch.randomizedtesting.RandomizedRunner$5.evaluate(RandomizedRunner.java:830)
	at com.carrotsearch.randomizedtesting.RandomizedRunner$6.evaluate(RandomizedRunner.java:880)
	at com.carrotsearch.randomizedtesting.RandomizedRunner$7.evaluate(RandomizedRunner.java:891)
	at com.carrotsearch.randomizedtesting.rules.StatementAdapter.evaluate(StatementAdapter.java:36)
	at com.carrotsearch.randomizedtesting.rules.SystemPropertiesRestoreRule$1.evaluate(SystemPropertiesRestoreRule.java:57)
	at org.apache.lucene.util.AbstractBeforeAfterRule$1.evaluate(AbstractBeforeAfterRule.java:45)
	at com.carrotsearch.randomizedtesting.rules.StatementAdapter.evaluate(StatementAdapter.java:36)
	at org.apache.lucene.util.TestRuleStoreClassName$1.evaluate(TestRuleStoreClassName.java:41)
	at com.carrotsearch.randomizedtesting.rules.NoShadowingOrOverridesOnMethodsRule$1.evaluate(NoShadowingOrOverridesOnMethodsRule.java:40)
	at com.carrotsearch.randomizedtesting.rules.NoShadowingOrOverridesOnMethodsRule$1.evaluate(NoShadowingOrOverridesOnMethodsRule.java:40)
	at com.carrotsearch.randomizedtesting.rules.StatementAdapter.evaluate(StatementAdapter.java:36)
	at com.carrotsearch.randomizedtesting.rules.StatementAdapter.evaluate(StatementAdapter.java:36)
	at org.apache.lucene.util.TestRuleAssertionsRequired$1.evaluate(TestRuleAssertionsRequired.java:53)
	at org.apache.lucene.util.TestRuleMarkFailure$1.evaluate(TestRuleMarkFailure.java:47)
	at org.apache.lucene.util.TestRuleIgnoreAfterMaxFailures$1.evaluate(TestRuleIgnoreAfterMaxFailures.java:64)
	at org.apache.lucene.util.TestRuleIgnoreTestSuites$1.evaluate(TestRuleIgnoreTestSuites.java:54)
	at com.carrotsearch.randomizedtesting.rules.StatementAdapter.evaluate(StatementAdapter.java:36)
	at com.carrotsearch.randomizedtesting.ThreadLeakControl$StatementRunner.run(ThreadLeakControl.java:368)
	at java.base/java.lang.Thread.run(Thread.java:844)
Caused by: java.util.concurrent.TimeoutException: last ClusterState: znodeVersion: 44
live nodes:[127.0.0.1:10010_solr, 127.0.0.1:10008_solr, 127.0.0.1:10009_solr, 127.0.0.1:10007_solr, 127.0.0.1:10011_solr]
collections:{testCreateCollectionAddReplica=DocCollection(testCreateCollectionAddReplica//clusterstate.json/43)={
  "replicationFactor":"1",
  "pullReplicas":"0",
  "router":{"name":"compositeId"},
  "maxShardsPerNode":"1",
  "autoAddReplicas":"false",
  "nrtReplicas":"1",
  "tlogReplicas":"0",
  "autoCreated":"true",
  "policy":"c1",
  "shards":{"shard1":{
      "replicas":{"core_node1":{
          "core":"testCreateCollectionAddReplica_shard1_replica_n1",
          "SEARCHER.searcher.maxDoc":0,
          "SEARCHER.searcher.deletedDocs":0,
          "INDEX.sizeInBytes":10240,
          "node_name":"127.0.0.1:10011_solr",
          "state":"active",
          "type":"NRT",
          "INDEX.sizeInGB":9.5367431640625E-6,
          "SEARCHER.searcher.numDocs":0}},
      "range":"80000000-7fffffff",
      "state":"active"}}}}, last coll state: DocCollection(testCreateCollectionAddReplica//clusterstate.json/43)={
  "replicationFactor":"1",
  "pullReplicas":"0",
  "router":{"name":"compositeId"},
  "maxShardsPerNode":"1",
  "autoAddReplicas":"false",
  "nrtReplicas":"1",
  "tlogReplicas":"0",
  "autoCreated":"true",
  "policy":"c1",
  "shards":{"shard1":{
      "replicas":{"core_node1":{
          "core":"testCreateCollectionAddReplica_shard1_replica_n1",
          "SEARCHER.searcher.maxDoc":0,
          "SEARCHER.searcher.deletedDocs":0,
          "INDEX.sizeInBytes":10240,
          "node_name":"127.0.0.1:10011_solr",
          "state":"active",
          "type":"NRT",
          "INDEX.sizeInGB":9.5367431640625E-6,
          "SEARCHER.searcher.numDocs":0}},
      "range":"80000000-7fffffff",
      "state":"active"}}}
	at org.apache.solr.cloud.CloudTestUtils.waitForState(CloudTestUtils.java:112)
	at org.apache.solr.cloud.CloudTestUtils.waitForState(CloudTestUtils.java:64)
	... 40 more


FAILED:  org.apache.solr.cloud.autoscaling.sim.TestSimPolicyCloud.testCreateCollectionSplitShard

Error Message:
java.util.concurrent.ExecutionException: org.apache.solr.common.SolrException: java.util.concurrent.TimeoutException: last ClusterState: znodeVersion: 15 live nodes:[127.0.0.1:10016_solr, 127.0.0.1:10012_solr, 127.0.0.1:10014_solr, 127.0.0.1:10013_solr, 127.0.0.1:10015_solr] collections:{testCreateCollectionSplitShard=DocCollection(testCreateCollectionSplitShard//clusterstate.json/14)={   "replicationFactor":"1",   "pullReplicas":"0",   "router":{"name":"compositeId"},   "maxShardsPerNode":"1",   "autoAddReplicas":"false",   "nrtReplicas":"2",   "tlogReplicas":"0",   "autoCreated":"true",   "policy":"c1",   "shards":{     "shard1":{       "replicas":{         "core_node1":{           "core":"testCreateCollectionSplitShard_shard1_replica_n1",           "leader":"true",           "SEARCHER.searcher.maxDoc":0,           "SEARCHER.searcher.deletedDocs":0,           "INDEX.sizeInBytes":10240,           "node_name":"127.0.0.1:10015_solr",           "state":"active",           "type":"NRT",           "INDEX.sizeInGB":9.5367431640625E-6,           "SEARCHER.searcher.numDocs":0},         "core_node2":{           "core":"testCreateCollectionSplitShard_shard1_replica_n2",           "SEARCHER.searcher.maxDoc":0,           "SEARCHER.searcher.deletedDocs":0,           "INDEX.sizeInBytes":10240,           "node_name":"127.0.0.1:10012_solr",           "state":"active",           "type":"NRT",           "INDEX.sizeInGB":9.5367431640625E-6,           "SEARCHER.searcher.numDocs":0}},       "range":"80000000-7fffffff",       "state":"active",       "__buffered_updates__":0},     "shard1_1":{       "parent":"shard1",       "stateTimestamp":"1540969180437206200",       "range":"0-7fffffff",       "state":"construction",       "replicas":{         "core_node10":{           "leader":"true",           "core":"testCreateCollectionSplitShard_shard1_1_replica_n9",           "SEARCHER.searcher.maxDoc":0,           "SEARCHER.searcher.deletedDocs":0,           "INDEX.sizeInBytes":10240,           "node_name":"127.0.0.1:10012_solr",           "base_url":"http://127.0.0.1:10012/solr",           "state":"active",           "type":"NRT",           "INDEX.sizeInGB":9.5367431640625E-6,           "SEARCHER.searcher.numDocs":0},         "core_node12":{           "core":"testCreateCollectionSplitShard_shard1_1_replica_n11",           "SEARCHER.searcher.maxDoc":0,           "SEARCHER.searcher.deletedDocs":0,           "INDEX.sizeInBytes":10240,           "node_name":"127.0.0.1:10015_solr",           "base_url":"http://127.0.0.1:10015/solr",           "state":"active",           "type":"NRT",           "INDEX.sizeInGB":9.5367431640625E-6,           "SEARCHER.searcher.numDocs":0}}},     "shard1_0":{       "parent":"shard1",       "stateTimestamp":"1540969180437092800",       "range":"80000000-ffffffff",       "state":"construction",       "replicas":{         "core_node6":{           "core":"testCreateCollectionSplitShard_shard1_0_replica_n5",           "SEARCHER.searcher.maxDoc":0,           "SEARCHER.searcher.deletedDocs":0,           "INDEX.sizeInBytes":20480,           "node_name":"127.0.0.1:10015_solr",           "base_url":"http://127.0.0.1:10015/solr",           "state":"active",           "type":"NRT",           "INDEX.sizeInGB":1.9073486328125E-5,           "SEARCHER.searcher.numDocs":0},         "core_node8":{           "core":"testCreateCollectionSplitShard_shard1_0_replica_n7",           "SEARCHER.searcher.maxDoc":0,           "SEARCHER.searcher.deletedDocs":0,           "INDEX.sizeInBytes":20480,           "node_name":"127.0.0.1:10012_solr",           "base_url":"http://127.0.0.1:10012/solr",           "state":"active",           "type":"NRT",           "INDEX.sizeInGB":1.9073486328125E-5,           "SEARCHER.searcher.numDocs":0}}}}}}, last coll state: DocCollection(testCreateCollectionSplitShard//clusterstate.json/14)={   "replicationFactor":"1",   "pullReplicas":"0",   "router":{"name":"compositeId"},   "maxShardsPerNode":"1",   "autoAddReplicas":"false",   "nrtReplicas":"2",   "tlogReplicas":"0",   "autoCreated":"true",   "policy":"c1",   "shards":{     "shard1":{       "replicas":{         "core_node1":{           "core":"testCreateCollectionSplitShard_shard1_replica_n1",           "leader":"true",           "SEARCHER.searcher.maxDoc":0,           "SEARCHER.searcher.deletedDocs":0,           "INDEX.sizeInBytes":10240,           "node_name":"127.0.0.1:10015_solr",           "state":"active",           "type":"NRT",           "INDEX.sizeInGB":9.5367431640625E-6,           "SEARCHER.searcher.numDocs":0},         "core_node2":{           "core":"testCreateCollectionSplitShard_shard1_replica_n2",           "SEARCHER.searcher.maxDoc":0,           "SEARCHER.searcher.deletedDocs":0,           "INDEX.sizeInBytes":10240,           "node_name":"127.0.0.1:10012_solr",           "state":"active",           "type":"NRT",           "INDEX.sizeInGB":9.5367431640625E-6,           "SEARCHER.searcher.numDocs":0}},       "range":"80000000-7fffffff",       "state":"active",       "__buffered_updates__":0},     "shard1_1":{       "parent":"shard1",       "stateTimestamp":"1540969180437206200",       "range":"0-7fffffff",       "state":"construction",       "replicas":{         "core_node10":{           "leader":"true",           "core":"testCreateCollectionSplitShard_shard1_1_replica_n9",           "SEARCHER.searcher.maxDoc":0,           "SEARCHER.searcher.deletedDocs":0,           "INDEX.sizeInBytes":10240,           "node_name":"127.0.0.1:10012_solr",           "base_url":"http://127.0.0.1:10012/solr",           "state":"active",           "type":"NRT",           "INDEX.sizeInGB":9.5367431640625E-6,           "SEARCHER.searcher.numDocs":0},         "core_node12":{           "core":"testCreateCollectionSplitShard_shard1_1_replica_n11",           "SEARCHER.searcher.maxDoc":0,           "SEARCHER.searcher.deletedDocs":0,           "INDEX.sizeInBytes":10240,           "node_name":"127.0.0.1:10015_solr",           "base_url":"http://127.0.0.1:10015/solr",           "state":"active",           "type":"NRT",           "INDEX.sizeInGB":9.5367431640625E-6,           "SEARCHER.searcher.numDocs":0}}},     "shard1_0":{       "parent":"shard1",       "stateTimestamp":"1540969180437092800",       "range":"80000000-ffffffff",       "state":"construction",       "replicas":{         "core_node6":{           "core":"testCreateCollectionSplitShard_shard1_0_replica_n5",           "SEARCHER.searcher.maxDoc":0,           "SEARCHER.searcher.deletedDocs":0,           "INDEX.sizeInBytes":20480,           "node_name":"127.0.0.1:10015_solr",           "base_url":"http://127.0.0.1:10015/solr",           "state":"active",           "type":"NRT",           "INDEX.sizeInGB":1.9073486328125E-5,           "SEARCHER.searcher.numDocs":0},         "core_node8":{           "core":"testCreateCollectionSplitShard_shard1_0_replica_n7",           "SEARCHER.searcher.maxDoc":0,           "SEARCHER.searcher.deletedDocs":0,           "INDEX.sizeInBytes":20480,           "node_name":"127.0.0.1:10012_solr",           "base_url":"http://127.0.0.1:10012/solr",           "state":"active",           "type":"NRT",           "INDEX.sizeInGB":1.9073486328125E-5,           "SEARCHER.searcher.numDocs":0}}}}}

Stack Trace:
java.io.IOException: java.util.concurrent.ExecutionException: org.apache.solr.common.SolrException: java.util.concurrent.TimeoutException: last ClusterState: znodeVersion: 15
live nodes:[127.0.0.1:10016_solr, 127.0.0.1:10012_solr, 127.0.0.1:10014_solr, 127.0.0.1:10013_solr, 127.0.0.1:10015_solr]
collections:{testCreateCollectionSplitShard=DocCollection(testCreateCollectionSplitShard//clusterstate.json/14)={
  "replicationFactor":"1",
  "pullReplicas":"0",
  "router":{"name":"compositeId"},
  "maxShardsPerNode":"1",
  "autoAddReplicas":"false",
  "nrtReplicas":"2",
  "tlogReplicas":"0",
  "autoCreated":"true",
  "policy":"c1",
  "shards":{
    "shard1":{
      "replicas":{
        "core_node1":{
          "core":"testCreateCollectionSplitShard_shard1_replica_n1",
          "leader":"true",
          "SEARCHER.searcher.maxDoc":0,
          "SEARCHER.searcher.deletedDocs":0,
          "INDEX.sizeInBytes":10240,
          "node_name":"127.0.0.1:10015_solr",
          "state":"active",
          "type":"NRT",
          "INDEX.sizeInGB":9.5367431640625E-6,
          "SEARCHER.searcher.numDocs":0},
        "core_node2":{
          "core":"testCreateCollectionSplitShard_shard1_replica_n2",
          "SEARCHER.searcher.maxDoc":0,
          "SEARCHER.searcher.deletedDocs":0,
          "INDEX.sizeInBytes":10240,
          "node_name":"127.0.0.1:10012_solr",
          "state":"active",
          "type":"NRT",
          "INDEX.sizeInGB":9.5367431640625E-6,
          "SEARCHER.searcher.numDocs":0}},
      "range":"80000000-7fffffff",
      "state":"active",
      "__buffered_updates__":0},
    "shard1_1":{
      "parent":"shard1",
      "stateTimestamp":"1540969180437206200",
      "range":"0-7fffffff",
      "state":"construction",
      "replicas":{
        "core_node10":{
          "leader":"true",
          "core":"testCreateCollectionSplitShard_shard1_1_replica_n9",
          "SEARCHER.searcher.maxDoc":0,
          "SEARCHER.searcher.deletedDocs":0,
          "INDEX.sizeInBytes":10240,
          "node_name":"127.0.0.1:10012_solr",
          "base_url":"http://127.0.0.1:10012/solr",
          "state":"active",
          "type":"NRT",
          "INDEX.sizeInGB":9.5367431640625E-6,
          "SEARCHER.searcher.numDocs":0},
        "core_node12":{
          "core":"testCreateCollectionSplitShard_shard1_1_replica_n11",
          "SEARCHER.searcher.maxDoc":0,
          "SEARCHER.searcher.deletedDocs":0,
          "INDEX.sizeInBytes":10240,
          "node_name":"127.0.0.1:10015_solr",
          "base_url":"http://127.0.0.1:10015/solr",
          "state":"active",
          "type":"NRT",
          "INDEX.sizeInGB":9.5367431640625E-6,
          "SEARCHER.searcher.numDocs":0}}},
    "shard1_0":{
      "parent":"shard1",
      "stateTimestamp":"1540969180437092800",
      "range":"80000000-ffffffff",
      "state":"construction",
      "replicas":{
        "core_node6":{
          "core":"testCreateCollectionSplitShard_shard1_0_replica_n5",
          "SEARCHER.searcher.maxDoc":0,
          "SEARCHER.searcher.deletedDocs":0,
          "INDEX.sizeInBytes":20480,
          "node_name":"127.0.0.1:10015_solr",
          "base_url":"http://127.0.0.1:10015/solr",
          "state":"active",
          "type":"NRT",
          "INDEX.sizeInGB":1.9073486328125E-5,
          "SEARCHER.searcher.numDocs":0},
        "core_node8":{
          "core":"testCreateCollectionSplitShard_shard1_0_replica_n7",
          "SEARCHER.searcher.maxDoc":0,
          "SEARCHER.searcher.deletedDocs":0,
          "INDEX.sizeInBytes":20480,
          "node_name":"127.0.0.1:10012_solr",
          "base_url":"http://127.0.0.1:10012/solr",
          "state":"active",
          "type":"NRT",
          "INDEX.sizeInGB":1.9073486328125E-5,
          "SEARCHER.searcher.numDocs":0}}}}}}, last coll state: DocCollection(testCreateCollectionSplitShard//clusterstate.json/14)={
  "replicationFactor":"1",
  "pullReplicas":"0",
  "router":{"name":"compositeId"},
  "maxShardsPerNode":"1",
  "autoAddReplicas":"false",
  "nrtReplicas":"2",
  "tlogReplicas":"0",
  "autoCreated":"true",
  "policy":"c1",
  "shards":{
    "shard1":{
      "replicas":{
        "core_node1":{
          "core":"testCreateCollectionSplitShard_shard1_replica_n1",
          "leader":"true",
          "SEARCHER.searcher.maxDoc":0,
          "SEARCHER.searcher.deletedDocs":0,
          "INDEX.sizeInBytes":10240,
          "node_name":"127.0.0.1:10015_solr",
          "state":"active",
          "type":"NRT",
          "INDEX.sizeInGB":9.5367431640625E-6,
          "SEARCHER.searcher.numDocs":0},
        "core_node2":{
          "core":"testCreateCollectionSplitShard_shard1_replica_n2",
          "SEARCHER.searcher.maxDoc":0,
          "SEARCHER.searcher.deletedDocs":0,
          "INDEX.sizeInBytes":10240,
          "node_name":"127.0.0.1:10012_solr",
          "state":"active",
          "type":"NRT",
          "INDEX.sizeInGB":9.5367431640625E-6,
          "SEARCHER.searcher.numDocs":0}},
      "range":"80000000-7fffffff",
      "state":"active",
      "__buffered_updates__":0},
    "shard1_1":{
      "parent":"shard1",
      "stateTimestamp":"1540969180437206200",
      "range":"0-7fffffff",
      "state":"construction",
      "replicas":{
        "core_node10":{
          "leader":"true",
          "core":"testCreateCollectionSplitShard_shard1_1_replica_n9",
          "SEARCHER.searcher.maxDoc":0,
          "SEARCHER.searcher.deletedDocs":0,
          "INDEX.sizeInBytes":10240,
          "node_name":"127.0.0.1:10012_solr",
          "base_url":"http://127.0.0.1:10012/solr",
          "state":"active",
          "type":"NRT",
          "INDEX.sizeInGB":9.5367431640625E-6,
          "SEARCHER.searcher.numDocs":0},
        "core_node12":{
          "core":"testCreateCollectionSplitShard_shard1_1_replica_n11",
          "SEARCHER.searcher.maxDoc":0,
          "SEARCHER.searcher.deletedDocs":0,
          "INDEX.sizeInBytes":10240,
          "node_name":"127.0.0.1:10015_solr",
          "base_url":"http://127.0.0.1:10015/solr",
          "state":"active",
          "type":"NRT",
          "INDEX.sizeInGB":9.5367431640625E-6,
          "SEARCHER.searcher.numDocs":0}}},
    "shard1_0":{
      "parent":"shard1",
      "stateTimestamp":"1540969180437092800",
      "range":"80000000-ffffffff",
      "state":"construction",
      "replicas":{
        "core_node6":{
          "core":"testCreateCollectionSplitShard_shard1_0_replica_n5",
          "SEARCHER.searcher.maxDoc":0,
          "SEARCHER.searcher.deletedDocs":0,
          "INDEX.sizeInBytes":20480,
          "node_name":"127.0.0.1:10015_solr",
          "base_url":"http://127.0.0.1:10015/solr",
          "state":"active",
          "type":"NRT",
          "INDEX.sizeInGB":1.9073486328125E-5,
          "SEARCHER.searcher.numDocs":0},
        "core_node8":{
          "core":"testCreateCollectionSplitShard_shard1_0_replica_n7",
          "SEARCHER.searcher.maxDoc":0,
          "SEARCHER.searcher.deletedDocs":0,
          "INDEX.sizeInBytes":20480,
          "node_name":"127.0.0.1:10012_solr",
          "base_url":"http://127.0.0.1:10012/solr",
          "state":"active",
          "type":"NRT",
          "INDEX.sizeInGB":1.9073486328125E-5,
          "SEARCHER.searcher.numDocs":0}}}}}
	at __randomizedtesting.SeedInfo.seed([525CC9489E970BC7:87D2BAB32EDD8A79]:0)
	at org.apache.solr.cloud.autoscaling.sim.SimCloudManager.request(SimCloudManager.java:654)
	at org.apache.solr.cloud.autoscaling.sim.SimCloudManager$1.request(SimCloudManager.java:224)
	at org.apache.solr.client.solrj.SolrRequest.process(SolrRequest.java:194)
	at org.apache.solr.client.solrj.SolrRequest.process(SolrRequest.java:211)
	at org.apache.solr.cloud.autoscaling.sim.TestSimPolicyCloud.testCreateCollectionSplitShard(TestSimPolicyCloud.java:168)
	at java.base/jdk.internal.reflect.NativeMethodAccessorImpl.invoke0(Native Method)
	at java.base/jdk.internal.reflect.NativeMethodAccessorImpl.invoke(NativeMethodAccessorImpl.java:62)
	at java.base/jdk.internal.reflect.DelegatingMethodAccessorImpl.invoke(DelegatingMethodAccessorImpl.java:43)
	at java.base/java.lang.reflect.Method.invoke(Method.java:564)
	at com.carrotsearch.randomizedtesting.RandomizedRunner.invoke(RandomizedRunner.java:1742)
	at com.carrotsearch.randomizedtesting.RandomizedRunner$8.evaluate(RandomizedRunner.java:935)
	at com.carrotsearch.randomizedtesting.RandomizedRunner$9.evaluate(RandomizedRunner.java:971)
	at com.carrotsearch.randomizedtesting.RandomizedRunner$10.evaluate(RandomizedRunner.java:985)
	at org.junit.rules.ExpectedException$ExpectedExceptionStatement.evaluate(ExpectedException.java:110)
	at com.carrotsearch.randomizedtesting.rules.SystemPropertiesRestoreRule$1.evaluate(SystemPropertiesRestoreRule.java:57)
	at org.apache.lucene.util.TestRuleSetupTeardownChained$1.evaluate(TestRuleSetupTeardownChained.java:49)
	at org.apache.lucene.util.AbstractBeforeAfterRule$1.evaluate(AbstractBeforeAfterRule.java:45)
	at org.apache.lucene.util.TestRuleThreadAndTestName$1.evaluate(TestRuleThreadAndTestName.java:48)
	at org.apache.lucene.util.TestRuleIgnoreAfterMaxFailures$1.evaluate(TestRuleIgnoreAfterMaxFailures.java:64)
	at org.apache.lucene.util.TestRuleMarkFailure$1.evaluate(TestRuleMarkFailure.java:47)
	at com.carrotsearch.randomizedtesting.rules.StatementAdapter.evaluate(StatementAdapter.java:36)
	at com.carrotsearch.randomizedtesting.ThreadLeakControl$StatementRunner.run(ThreadLeakControl.java:368)
	at com.carrotsearch.randomizedtesting.ThreadLeakControl.forkTimeoutingTask(ThreadLeakControl.java:817)
	at com.carrotsearch.randomizedtesting.ThreadLeakControl$3.evaluate(ThreadLeakControl.java:468)
	at com.carrotsearch.randomizedtesting.RandomizedRunner.runSingleTest(RandomizedRunner.java:944)
	at com.carrotsearch.randomizedtesting.RandomizedRunner$5.evaluate(RandomizedRunner.java:830)
	at com.carrotsearch.randomizedtesting.RandomizedRunner$6.evaluate(RandomizedRunner.java:880)
	at com.carrotsearch.randomizedtesting.RandomizedRunner$7.evaluate(RandomizedRunner.java:891)
	at com.carrotsearch.randomizedtesting.rules.StatementAdapter.evaluate(StatementAdapter.java:36)
	at com.carrotsearch.randomizedtesting.rules.SystemPropertiesRestoreRule$1.evaluate(SystemPropertiesRestoreRule.java:57)
	at org.apache.lucene.util.AbstractBeforeAfterRule$1.evaluate(AbstractBeforeAfterRule.java:45)
	at com.carrotsearch.randomizedtesting.rules.StatementAdapter.evaluate(StatementAdapter.java:36)
	at org.apache.lucene.util.TestRuleStoreClassName$1.evaluate(TestRuleStoreClassName.java:41)
	at com.carrotsearch.randomizedtesting.rules.NoShadowingOrOverridesOnMethodsRule$1.evaluate(NoShadowingOrOverridesOnMethodsRule.java:40)
	at com.carrotsearch.randomizedtesting.rules.NoShadowingOrOverridesOnMethodsRule$1.evaluate(NoShadowingOrOverridesOnMethodsRule.java:40)
	at com.carrotsearch.randomizedtesting.rules.StatementAdapter.evaluate(StatementAdapter.java:36)
	at com.carrotsearch.randomizedtesting.rules.StatementAdapter.evaluate(StatementAdapter.java:36)
	at org.apache.lucene.util.TestRuleAssertionsRequired$1.evaluate(TestRuleAssertionsRequired.java:53)
	at org.apache.lucene.util.TestRuleMarkFailure$1.evaluate(TestRuleMarkFailure.java:47)
	at org.apache.lucene.util.TestRuleIgnoreAfterMaxFailures$1.evaluate(TestRuleIgnoreAfterMaxFailures.java:64)
	at org.apache.lucene.util.TestRuleIgnoreTestSuites$1.evaluate(TestRuleIgnoreTestSuites.java:54)
	at com.carrotsearch.randomizedtesting.rules.StatementAdapter.evaluate(StatementAdapter.java:36)
	at com.carrotsearch.randomizedtesting.ThreadLeakControl$StatementRunner.run(ThreadLeakControl.java:368)
	at java.base/java.lang.Thread.run(Thread.java:844)
Caused by: java.util.concurrent.ExecutionException: org.apache.solr.common.SolrException: java.util.concurrent.TimeoutException: last ClusterState: znodeVersion: 15
live nodes:[127.0.0.1:10016_solr, 127.0.0.1:10012_solr, 127.0.0.1:10014_solr, 127.0.0.1:10013_solr, 127.0.0.1:10015_solr]
collections:{testCreateCollectionSplitShard=DocCollection(testCreateCollectionSplitShard//clusterstate.json/14)={
  "replicationFactor":"1",
  "pullReplicas":"0",
  "router":{"name":"compositeId"},
  "maxShardsPerNode":"1",
  "autoAddReplicas":"false",
  "nrtReplicas":"2",
  "tlogReplicas":"0",
  "autoCreated":"true",
  "policy":"c1",
  "shards":{
    "shard1":{
      "replicas":{
        "core_node1":{
          "core":"testCreateCollectionSplitShard_shard1_replica_n1",
          "leader":"true",
          "SEARCHER.searcher.maxDoc":0,
          "SEARCHER.searcher.deletedDocs":0,
          "INDEX.sizeInBytes":10240,
          "node_name":"127.0.0.1:10015_solr",
          "state":"active",
          "type":"NRT",
          "INDEX.sizeInGB":9.5367431640625E-6,
          "SEARCHER.searcher.numDocs":0},
        "core_node2":{
          "core":"testCreateCollectionSplitShard_shard1_replica_n2",
          "SEARCHER.searcher.maxDoc":0,
          "SEARCHER.searcher.deletedDocs":0,
          "INDEX.sizeInBytes":10240,
          "node_name":"127.0.0.1:10012_solr",
          "state":"active",
          "type":"NRT",
          "INDEX.sizeInGB":9.5367431640625E-6,
          "SEARCHER.searcher.numDocs":0}},
      "range":"80000000-7fffffff",
      "state":"active",
      "__buffered_updates__":0},
    "shard1_1":{
      "parent":"shard1",
      "stateTimestamp":"1540969180437206200",
      "range":"0-7fffffff",
      "state":"construction",
      "replicas":{
        "core_node10":{
          "leader":"true",
          "core":"testCreateCollectionSplitShard_shard1_1_replica_n9",
          "SEARCHER.searcher.maxDoc":0,
          "SEARCHER.searcher.deletedDocs":0,
          "INDEX.sizeInBytes":10240,
          "node_name":"127.0.0.1:10012_solr",
          "base_url":"http://127.0.0.1:10012/solr",
          "state":"active",
          "type":"NRT",
          "INDEX.sizeInGB":9.5367431640625E-6,
          "SEARCHER.searcher.numDocs":0},
        "core_node12":{
          "core":"testCreateCollectionSplitShard_shard1_1_replica_n11",
          "SEARCHER.searcher.maxDoc":0,
          "SEARCHER.searcher.deletedDocs":0,
          "INDEX.sizeInBytes":10240,
          "node_name":"127.0.0.1:10015_solr",
          "base_url":"http://127.0.0.1:10015/solr",
          "state":"active",
          "type":"NRT",
          "INDEX.sizeInGB":9.5367431640625E-6,
          "SEARCHER.searcher.numDocs":0}}},
    "shard1_0":{
      "parent":"shard1",
      "stateTimestamp":"1540969180437092800",
      "range":"80000000-ffffffff",
      "state":"construction",
      "replicas":{
        "core_node6":{
          "core":"testCreateCollectionSplitShard_shard1_0_replica_n5",
          "SEARCHER.searcher.maxDoc":0,
          "SEARCHER.searcher.deletedDocs":0,
          "INDEX.sizeInBytes":20480,
          "node_name":"127.0.0.1:10015_solr",
          "base_url":"http://127.0.0.1:10015/solr",
          "state":"active",
          "type":"NRT",
          "INDEX.sizeInGB":1.9073486328125E-5,
          "SEARCHER.searcher.numDocs":0},
        "core_node8":{
          "core":"testCreateCollectionSplitShard_shard1_0_replica_n7",
          "SEARCHER.searcher.maxDoc":0,
          "SEARCHER.searcher.deletedDocs":0,
          "INDEX.sizeInBytes":20480,
          "node_name":"127.0.0.1:10012_solr",
          "base_url":"http://127.0.0.1:10012/solr",
          "state":"active",
          "type":"NRT",
          "INDEX.sizeInGB":1.9073486328125E-5,
          "SEARCHER.searcher.numDocs":0}}}}}}, last coll state: DocCollection(testCreateCollectionSplitShard//clusterstate.json/14)={
  "replicationFactor":"1",
  "pullReplicas":"0",
  "router":{"name":"compositeId"},
  "maxShardsPerNode":"1",
  "autoAddReplicas":"false",
  "nrtReplicas":"2",
  "tlogReplicas":"0",
  "autoCreated":"true",
  "policy":"c1",
  "shards":{
    "shard1":{
      "replicas":{
        "core_node1":{
          "core":"testCreateCollectionSplitShard_shard1_replica_n1",
          "leader":"true",
          "SEARCHER.searcher.maxDoc":0,
          "SEARCHER.searcher.deletedDocs":0,
          "INDEX.sizeInBytes":10240,
          "node_name":"127.0.0.1:10015_solr",
          "state":"active",
          "type":"NRT",
          "INDEX.sizeInGB":9.5367431640625E-6,
          "SEARCHER.searcher.numDocs":0},
        "core_node2":{
          "core":"testCreateCollectionSplitShard_shard1_replica_n2",
          "SEARCHER.searcher.maxDoc":0,
          "SEARCHER.searcher.deletedDocs":0,
          "INDEX.sizeInBytes":10240,
          "node_name":"127.0.0.1:10012_solr",
          "state":"active",
          "type":"NRT",
          "INDEX.sizeInGB":9.5367431640625E-6,
          "SEARCHER.searcher.numDocs":0}},
      "range":"80000000-7fffffff",
      "state":"active",
      "__buffered_updates__":0},
    "shard1_1":{
      "parent":"shard1",
      "stateTimestamp":"1540969180437206200",
      "range":"0-7fffffff",
      "state":"construction",
      "replicas":{
        "core_node10":{
          "leader":"true",
          "core":"testCreateCollectionSplitShard_shard1_1_replica_n9",
          "SEARCHER.searcher.maxDoc":0,
          "SEARCHER.searcher.deletedDocs":0,
          "INDEX.sizeInBytes":10240,
          "node_name":"127.0.0.1:10012_solr",
          "base_url":"http://127.0.0.1:10012/solr",
          "state":"active",
          "type":"NRT",
          "INDEX.sizeInGB":9.5367431640625E-6,
          "SEARCHER.searcher.numDocs":0},
        "core_node12":{
          "core":"testCreateCollectionSplitShard_shard1_1_replica_n11",
          "SEARCHER.searcher.maxDoc":0,
          "SEARCHER.searcher.deletedDocs":0,
          "INDEX.sizeInBytes":10240,
          "node_name":"127.0.0.1:10015_solr",
          "base_url":"http://127.0.0.1:10015/solr",
          "state":"active",
          "type":"NRT",
          "INDEX.sizeInGB":9.5367431640625E-6,
          "SEARCHER.searcher.numDocs":0}}},
    "shard1_0":{
      "parent":"shard1",
      "stateTimestamp":"1540969180437092800",
      "range":"80000000-ffffffff",
      "state":"construction",
      "replicas":{
        "core_node6":{
          "core":"testCreateCollectionSplitShard_shard1_0_replica_n5",
          "SEARCHER.searcher.maxDoc":0,
          "SEARCHER.searcher.deletedDocs":0,
          "INDEX.sizeInBytes":20480,
          "node_name":"127.0.0.1:10015_solr",
          "base_url":"http://127.0.0.1:10015/solr",
          "state":"active",
          "type":"NRT",
          "INDEX.sizeInGB":1.9073486328125E-5,
          "SEARCHER.searcher.numDocs":0},
        "core_node8":{
          "core":"testCreateCollectionSplitShard_shard1_0_replica_n7",
          "SEARCHER.searcher.maxDoc":0,
          "SEARCHER.searcher.deletedDocs":0,
          "INDEX.sizeInBytes":20480,
          "node_name":"127.0.0.1:10012_solr",
          "base_url":"http://127.0.0.1:10012/solr",
          "state":"active",
          "type":"NRT",
          "INDEX.sizeInGB":1.9073486328125E-5,
          "SEARCHER.searcher.numDocs":0}}}}}
	at java.base/java.util.concurrent.FutureTask.report(FutureTask.java:122)
	at java.base/java.util.concurrent.FutureTask.get(FutureTask.java:191)
	at org.apache.solr.cloud.autoscaling.sim.SimCloudManager.request(SimCloudManager.java:652)
	... 43 more
Caused by: org.apache.solr.common.SolrException: java.util.concurrent.TimeoutException: last ClusterState: znodeVersion: 15
live nodes:[127.0.0.1:10016_solr, 127.0.0.1:10012_solr, 127.0.0.1:10014_solr, 127.0.0.1:10013_solr, 127.0.0.1:10015_solr]
collections:{testCreateCollectionSplitShard=DocCollection(testCreateCollectionSplitShard//clusterstate.json/14)={
  "replicationFactor":"1",
  "pullReplicas":"0",
  "router":{"name":"compositeId"},
  "maxShardsPerNode":"1",
  "autoAddReplicas":"false",
  "nrtReplicas":"2",
  "tlogReplicas":"0",
  "autoCreated":"true",
  "policy":"c1",
  "shards":{
    "shard1":{
      "replicas":{
        "core_node1":{
          "core":"testCreateCollectionSplitShard_shard1_replica_n1",
          "leader":"true",
          "SEARCHER.searcher.maxDoc":0,
          "SEARCHER.searcher.deletedDocs":0,
          "INDEX.sizeInBytes":10240,
          "node_name":"127.0.0.1:10015_solr",
          "state":"active",
          "type":"NRT",
          "INDEX.sizeInGB":9.5367431640625E-6,
          "SEARCHER.searcher.numDocs":0},
        "core_node2":{
          "core":"testCreateCollectionSplitShard_shard1_replica_n2",
          "SEARCHER.searcher.maxDoc":0,
          "SEARCHER.searcher.deletedDocs":0,
          "INDEX.sizeInBytes":10240,
          "node_name":"127.0.0.1:10012_solr",
          "state":"active",
          "type":"NRT",
          "INDEX.sizeInGB":9.5367431640625E-6,
          "SEARCHER.searcher.numDocs":0}},
      "range":"80000000-7fffffff",
      "state":"active",
      "__buffered_updates__":0},
    "shard1_1":{
      "parent":"shard1",
      "stateTimestamp":"1540969180437206200",
      "range":"0-7fffffff",
      "state":"construction",
      "replicas":{
        "core_node10":{
          "leader":"true",
          "core":"testCreateCollectionSplitShard_shard1_1_replica_n9",
          "SEARCHER.searcher.maxDoc":0,
          "SEARCHER.searcher.deletedDocs":0,
          "INDEX.sizeInBytes":10240,
          "node_name":"127.0.0.1:10012_solr",
          "base_url":"http://127.0.0.1:10012/solr",
          "state":"active",
          "type":"NRT",
          "INDEX.sizeInGB":9.5367431640625E-6,
          "SEARCHER.searcher.numDocs":0},
        "core_node12":{
          "core":"testCreateCollectionSplitShard_shard1_1_replica_n11",
          "SEARCHER.searcher.maxDoc":0,
          "SEARCHER.searcher.deletedDocs":0,
          "INDEX.sizeInBytes":10240,
          "node_name":"127.0.0.1:10015_solr",
          "base_url":"http://127.0.0.1:10015/solr",
          "state":"active",
          "type":"NRT",
          "INDEX.sizeInGB":9.5367431640625E-6,
          "SEARCHER.searcher.numDocs":0}}},
    "shard1_0":{
      "parent":"shard1",
      "stateTimestamp":"1540969180437092800",
      "range":"80000000-ffffffff",
      "state":"construction",
      "replicas":{
        "core_node6":{
          "core":"testCreateCollectionSplitShard_shard1_0_replica_n5",
          "SEARCHER.searcher.maxDoc":0,
          "SEARCHER.searcher.deletedDocs":0,
          "INDEX.sizeInBytes":20480,
          "node_name":"127.0.0.1:10015_solr",
          "base_url":"http://127.0.0.1:10015/solr",
          "state":"active",
          "type":"NRT",
          "INDEX.sizeInGB":1.9073486328125E-5,
          "SEARCHER.searcher.numDocs":0},
        "core_node8":{
          "core":"testCreateCollectionSplitShard_shard1_0_replica_n7",
          "SEARCHER.searcher.maxDoc":0,
          "SEARCHER.searcher.deletedDocs":0,
          "INDEX.sizeInBytes":20480,
          "node_name":"127.0.0.1:10012_solr",
          "base_url":"http://127.0.0.1:10012/solr",
          "state":"active",
          "type":"NRT",
          "INDEX.sizeInGB":1.9073486328125E-5,
          "SEARCHER.searcher.numDocs":0}}}}}}, last coll state: DocCollection(testCreateCollectionSplitShard//clusterstate.json/14)={
  "replicationFactor":"1",
  "pullReplicas":"0",
  "router":{"name":"compositeId"},
  "maxShardsPerNode":"1",
  "autoAddReplicas":"false",
  "nrtReplicas":"2",
  "tlogReplicas":"0",
  "autoCreated":"true",
  "policy":"c1",
  "shards":{
    "shard1":{
      "replicas":{
        "core_node1":{
          "core":"testCreateCollectionSplitShard_shard1_replica_n1",
          "leader":"true",
          "SEARCHER.searcher.maxDoc":0,
          "SEARCHER.searcher.deletedDocs":0,
          "INDEX.sizeInBytes":10240,
          "node_name":"127.0.0.1:10015_solr",
          "state":"active",
          "type":"NRT",
          "INDEX.sizeInGB":9.5367431640625E-6,
          "SEARCHER.searcher.numDocs":0},
        "core_node2":{
          "core":"testCreateCollectionSplitShard_shard1_replica_n2",
          "SEARCHER.searcher.maxDoc":0,
          "SEARCHER.searcher.deletedDocs":0,
          "INDEX.sizeInBytes":10240,
          "node_name":"127.0.0.1:10012_solr",
          "state":"active",
          "type":"NRT",
          "INDEX.sizeInGB":9.5367431640625E-6,
          "SEARCHER.searcher.numDocs":0}},
      "range":"80000000-7fffffff",
      "state":"active",
      "__buffered_updates__":0},
    "shard1_1":{
      "parent":"shard1",
      "stateTimestamp":"1540969180437206200",
      "range":"0-7fffffff",
      "state":"construction",
      "replicas":{
        "core_node10":{
          "leader":"true",
          "core":"testCreateCollectionSplitShard_shard1_1_replica_n9",
          "SEARCHER.searcher.maxDoc":0,
          "SEARCHER.searcher.deletedDocs":0,
          "INDEX.sizeInBytes":10240,
          "node_name":"127.0.0.1:10012_solr",
          "base_url":"http://127.0.0.1:10012/solr",
          "state":"active",
          "type":"NRT",
          "INDEX.sizeInGB":9.5367431640625E-6,
          "SEARCHER.searcher.numDocs":0},
        "core_node12":{
          "core":"testCreateCollectionSplitShard_shard1_1_replica_n11",
          "SEARCHER.searcher.maxDoc":0,
          "SEARCHER.searcher.deletedDocs":0,
          "INDEX.sizeInBytes":10240,
          "node_name":"127.0.0.1:10015_solr",
          "base_url":"http://127.0.0.1:10015/solr",
          "state":"active",
          "type":"NRT",
          "INDEX.sizeInGB":9.5367431640625E-6,
          "SEARCHER.searcher.numDocs":0}}},
    "shard1_0":{
      "parent":"shard1",
      "stateTimestamp":"1540969180437092800",
      "range":"80000000-ffffffff",
      "state":"construction",
      "replicas":{
        "core_node6":{
          "core":"testCreateCollectionSplitShard_shard1_0_replica_n5",
          "SEARCHER.searcher.maxDoc":0,
          "SEARCHER.searcher.deletedDocs":0,
          "INDEX.sizeInBytes":20480,
          "node_name":"127.0.0.1:10015_solr",
          "base_url":"http://127.0.0.1:10015/solr",
          "state":"active",
          "type":"NRT",
          "INDEX.sizeInGB":1.9073486328125E-5,
          "SEARCHER.searcher.numDocs":0},
        "core_node8":{
          "core":"testCreateCollectionSplitShard_shard1_0_replica_n7",
          "SEARCHER.searcher.maxDoc":0,
          "SEARCHER.searcher.deletedDocs":0,
          "INDEX.sizeInBytes":20480,
          "node_name":"127.0.0.1:10012_solr",
          "base_url":"http://127.0.0.1:10012/solr",
          "state":"active",
          "type":"NRT",
          "INDEX.sizeInGB":1.9073486328125E-5,
          "SEARCHER.searcher.numDocs":0}}}}}
	at org.apache.solr.cloud.autoscaling.sim.SimCloudManager.simHandleSolrRequest(SimCloudManager.java:854)
	at org.apache.solr.cloud.autoscaling.sim.SimCloudManager.lambda$request$15(SimCloudManager.java:651)
	at java.base/java.util.concurrent.FutureTask.run(FutureTask.java:264)
	at org.apache.solr.common.util.ExecutorUtil$MDCAwareThreadPoolExecutor.lambda$execute$0(ExecutorUtil.java:209)
	at java.base/java.util.concurrent.ThreadPoolExecutor.runWorker(ThreadPoolExecutor.java:1135)
	at java.base/java.util.concurrent.ThreadPoolExecutor$Worker.run(ThreadPoolExecutor.java:635)
	... 1 more
Caused by: java.util.concurrent.TimeoutException: last ClusterState: znodeVersion: 15
live nodes:[127.0.0.1:10016_solr, 127.0.0.1:10012_solr, 127.0.0.1:10014_solr, 127.0.0.1:10013_solr, 127.0.0.1:10015_solr]
collections:{testCreateCollectionSplitShard=DocCollection(testCreateCollectionSplitShard//clusterstate.json/14)={
  "replicationFactor":"1",
  "pullReplicas":"0",
  "router":{"name":"compositeId"},
  "maxShardsPerNode":"1",
  "autoAddReplicas":"false",
  "nrtReplicas":"2",
  "tlogReplicas":"0",
  "autoCreated":"true",
  "policy":"c1",
  "shards":{
    "shard1":{
      "replicas":{
        "core_node1":{
          "core":"testCreateCollectionSplitShard_shard1_replica_n1",
          "leader":"true",
          "SEARCHER.searcher.maxDoc":0,
          "SEARCHER.searcher.deletedDocs":0,
          "INDEX.sizeInBytes":10240,
          "node_name":"127.0.0.1:10015_solr",
          "state":"active",
          "type":"NRT",
          "INDEX.sizeInGB":9.5367431640625E-6,
          "SEARCHER.searcher.numDocs":0},
        "core_node2":{
          "core":"testCreateCollectionSplitShard_shard1_replica_n2",
          "SEARCHER.searcher.maxDoc":0,
          "SEARCHER.searcher.deletedDocs":0,
          "INDEX.sizeInBytes":10240,
          "node_name":"127.0.0.1:10012_solr",
          "state":"active",
          "type":"NRT",
          "INDEX.sizeInGB":9.5367431640625E-6,
          "SEARCHER.searcher.numDocs":0}},
      "range":"80000000-7fffffff",
      "state":"active",
      "__buffered_updates__":0},
    "shard1_1":{
      "parent":"shard1",
      "stateTimestamp":"1540969180437206200",
      "range":"0-7fffffff",
      "state":"construction",
      "replicas":{
        "core_node10":{
          "leader":"true",
          "core":"testCreateCollectionSplitShard_shard1_1_replica_n9",
          "SEARCHER.searcher.maxDoc":0,
          "SEARCHER.searcher.deletedDocs":0,
          "INDEX.sizeInBytes":10240,
          "node_name":"127.0.0.1:10012_solr",
          "base_url":"http://127.0.0.1:10012/solr",
          "state":"active",
          "type":"NRT",
          "INDEX.sizeInGB":9.5367431640625E-6,
          "SEARCHER.searcher.numDocs":0},
        "core_node12":{
          "core":"testCreateCollectionSplitShard_shard1_1_replica_n11",
          "SEARCHER.searcher.maxDoc":0,
          "SEARCHER.searcher.deletedDocs":0,
          "INDEX.sizeInBytes":10240,
          "node_name":"127.0.0.1:10015_solr",
          "base_url":"http://127.0.0.1:10015/solr",
          "state":"active",
          "type":"NRT",
          "INDEX.sizeInGB":9.5367431640625E-6,
          "SEARCHER.searcher.numDocs":0}}},
    "shard1_0":{
      "parent":"shard1",
      "stateTimestamp":"1540969180437092800",
      "range":"80000000-ffffffff",
      "state":"construction",
      "replicas":{
        "core_node6":{
          "core":"testCreateCollectionSplitShard_shard1_0_replica_n5",
          "SEARCHER.searcher.maxDoc":0,
          "SEARCHER.searcher.deletedDocs":0,
          "INDEX.sizeInBytes":20480,
          "node_name":"127.0.0.1:10015_solr",
          "base_url":"http://127.0.0.1:10015/solr",
          "state":"active",
          "type":"NRT",
          "INDEX.sizeInGB":1.9073486328125E-5,
          "SEARCHER.searcher.numDocs":0},
        "core_node8":{
          "core":"testCreateCollectionSplitShard_shard1_0_replica_n7",
          "SEARCHER.searcher.maxDoc":0,
          "SEARCHER.searcher.deletedDocs":0,
          "INDEX.sizeInBytes":20480,
          "node_name":"127.0.0.1:10012_solr",
          "base_url":"http://127.0.0.1:10012/solr",
          "state":"active",
          "type":"NRT",
          "INDEX.sizeInGB":1.9073486328125E-5,
          "SEARCHER.searcher.numDocs":0}}}}}}, last coll state: DocCollection(testCreateCollectionSplitShard//clusterstate.json/14)={
  "replicationFactor":"1",
  "pullReplicas":"0",
  "router":{"name":"compositeId"},
  "maxShardsPerNode":"1",
  "autoAddReplicas":"false",
  "nrtReplicas":"2",
  "tlogReplicas":"0",
  "autoCreated":"true",
  "policy":"c1",
  "shards":{
    "shard1":{
      "replicas":{
        "core_node1":{
          "core":"testCreateCollectionSplitShard_shard1_replica_n1",
          "leader":"true",
          "SEARCHER.searcher.maxDoc":0,
          "SEARCHER.searcher.deletedDocs":0,
          "INDEX.sizeInBytes":10240,
          "node_name":"127.0.0.1:10015_solr",
          "state":"active",
          "type":"NRT",
          "INDEX.sizeInGB":9.5367431640625E-6,
          "SEARCHER.searcher.numDocs":0},
        "core_node2":{
          "core":"testCreateCollectionSplitShard_shard1_replica_n2",
          "SEARCHER.searcher.maxDoc":0,
          "SEARCHER.searcher.deletedDocs":0,
          "INDEX.sizeInBytes":10240,
          "node_name":"127.0.0.1:10012_solr",
          "state":"active",
          "type":"NRT",
          "INDEX.sizeInGB":9.5367431640625E-6,
          "SEARCHER.searcher.numDocs":0}},
      "range":"80000000-7fffffff",
      "state":"active",
      "__buffered_updates__":0},
    "shard1_1":{
      "parent":"shard1",
      "stateTimestamp":"1540969180437206200",
      "range":"0-7fffffff",
      "state":"construction",
      "replicas":{
        "core_node10":{
          "leader":"true",
          "core":"testCreateCollectionSplitShard_shard1_1_replica_n9",
          "SEARCHER.searcher.maxDoc":0,
          "SEARCHER.searcher.deletedDocs":0,
          "INDEX.sizeInBytes":10240,
          "node_name":"127.0.0.1:10012_solr",
          "base_url":"http://127.0.0.1:10012/solr",
          "state":"active",
          "type":"NRT",
          "INDEX.sizeInGB":9.5367431640625E-6,
          "SEARCHER.searcher.numDocs":0},
        "core_node12":{
          "core":"testCreateCollectionSplitShard_shard1_1_replica_n11",
          "SEARCHER.searcher.maxDoc":0,
          "SEARCHER.searcher.deletedDocs":0,
          "INDEX.sizeInBytes":10240,
          "node_name":"127.0.0.1:10015_solr",
          "base_url":"http://127.0.0.1:10015/solr",
          "state":"active",
          "type":"NRT",
          "INDEX.sizeInGB":9.5367431640625E-6,
          "SEARCHER.searcher.numDocs":0}}},
    "shard1_0":{
      "parent":"shard1",
      "stateTimestamp":"1540969180437092800",
      "range":"80000000-ffffffff",
      "state":"construction",
      "replicas":{
        "core_node6":{
          "core":"testCreateCollectionSplitShard_shard1_0_replica_n5",
          "SEARCHER.searcher.maxDoc":0,
          "SEARCHER.searcher.deletedDocs":0,
          "INDEX.sizeInBytes":20480,
          "node_name":"127.0.0.1:10015_solr",
          "base_url":"http://127.0.0.1:10015/solr",
          "state":"active",
          "type":"NRT",
          "INDEX.sizeInGB":1.9073486328125E-5,
          "SEARCHER.searcher.numDocs":0},
        "core_node8":{
          "core":"testCreateCollectionSplitShard_shard1_0_replica_n7",
          "SEARCHER.searcher.maxDoc":0,
          "SEARCHER.searcher.deletedDocs":0,
          "INDEX.sizeInBytes":20480,
          "node_name":"127.0.0.1:10012_solr",
          "base_url":"http://127.0.0.1:10012/solr",
          "state":"active",
          "type":"NRT",
          "INDEX.sizeInGB":1.9073486328125E-5,
          "SEARCHER.searcher.numDocs":0}}}}}
	at org.apache.solr.cloud.CloudTestUtils.waitForState(CloudTestUtils.java:112)
	at org.apache.solr.cloud.autoscaling.sim.SimClusterStateProvider.simSplitShard(SimClusterStateProvider.java:1246)
	at org.apache.solr.cloud.autoscaling.sim.SimCloudManager.simHandleSolrRequest(SimCloudManager.java:852)
	... 6 more


FAILED:  org.apache.solr.cloud.autoscaling.sim.TestSimPolicyCloud.testCreateCollectionAddReplica

Error Message:
Timeout waiting for collection to become active Live Nodes: [127.0.0.1:10017_solr, 127.0.0.1:10018_solr, 127.0.0.1:10016_solr, 127.0.0.1:10019_solr, 127.0.0.1:10015_solr] Last available state: DocCollection(testCreateCollectionAddReplica//clusterstate.json/44)={   "replicationFactor":"1",   "pullReplicas":"0",   "router":{"name":"compositeId"},   "maxShardsPerNode":"1",   "autoAddReplicas":"false",   "nrtReplicas":"1",   "tlogReplicas":"0",   "autoCreated":"true",   "policy":"c1",   "shards":{"shard1":{       "replicas":{"core_node1":{           "core":"testCreateCollectionAddReplica_shard1_replica_n1",           "SEARCHER.searcher.maxDoc":0,           "SEARCHER.searcher.deletedDocs":0,           "INDEX.sizeInBytes":10240,           "node_name":"127.0.0.1:10015_solr",           "state":"active",           "type":"NRT",           "INDEX.sizeInGB":9.5367431640625E-6,           "SEARCHER.searcher.numDocs":0}},       "range":"80000000-7fffffff",       "state":"active"}}}

Stack Trace:
java.lang.AssertionError: Timeout waiting for collection to become active
Live Nodes: [127.0.0.1:10017_solr, 127.0.0.1:10018_solr, 127.0.0.1:10016_solr, 127.0.0.1:10019_solr, 127.0.0.1:10015_solr]
Last available state: DocCollection(testCreateCollectionAddReplica//clusterstate.json/44)={
  "replicationFactor":"1",
  "pullReplicas":"0",
  "router":{"name":"compositeId"},
  "maxShardsPerNode":"1",
  "autoAddReplicas":"false",
  "nrtReplicas":"1",
  "tlogReplicas":"0",
  "autoCreated":"true",
  "policy":"c1",
  "shards":{"shard1":{
      "replicas":{"core_node1":{
          "core":"testCreateCollectionAddReplica_shard1_replica_n1",
          "SEARCHER.searcher.maxDoc":0,
          "SEARCHER.searcher.deletedDocs":0,
          "INDEX.sizeInBytes":10240,
          "node_name":"127.0.0.1:10015_solr",
          "state":"active",
          "type":"NRT",
          "INDEX.sizeInGB":9.5367431640625E-6,
          "SEARCHER.searcher.numDocs":0}},
      "range":"80000000-7fffffff",
      "state":"active"}}}
	at __randomizedtesting.SeedInfo.seed([525CC9489E970BC7:D27CAC668FD4E361]:0)
	at org.apache.solr.cloud.CloudTestUtils.waitForState(CloudTestUtils.java:70)
	at org.apache.solr.cloud.autoscaling.sim.TestSimPolicyCloud.testCreateCollectionAddReplica(TestSimPolicyCloud.java:123)
	at java.base/jdk.internal.reflect.NativeMethodAccessorImpl.invoke0(Native Method)
	at java.base/jdk.internal.reflect.NativeMethodAccessorImpl.invoke(NativeMethodAccessorImpl.java:62)
	at java.base/jdk.internal.reflect.DelegatingMethodAccessorImpl.invoke(DelegatingMethodAccessorImpl.java:43)
	at java.base/java.lang.reflect.Method.invoke(Method.java:564)
	at com.carrotsearch.randomizedtesting.RandomizedRunner.invoke(RandomizedRunner.java:1742)
	at com.carrotsearch.randomizedtesting.RandomizedRunner$8.evaluate(RandomizedRunner.java:935)
	at com.carrotsearch.randomizedtesting.RandomizedRunner$9.evaluate(RandomizedRunner.java:971)
	at com.carrotsearch.randomizedtesting.RandomizedRunner$10.evaluate(RandomizedRunner.java:985)
	at org.junit.rules.ExpectedException$ExpectedExceptionStatement.evaluate(ExpectedException.java:110)
	at com.carrotsearch.randomizedtesting.rules.SystemPropertiesRestoreRule$1.evaluate(SystemPropertiesRestoreRule.java:57)
	at org.apache.lucene.util.TestRuleSetupTeardownChained$1.evaluate(TestRuleSetupTeardownChained.java:49)
	at org.apache.lucene.util.AbstractBeforeAfterRule$1.evaluate(AbstractBeforeAfterRule.java:45)
	at org.apache.lucene.util.TestRuleThreadAndTestName$1.evaluate(TestRuleThreadAndTestName.java:48)
	at org.apache.lucene.util.TestRuleIgnoreAfterMaxFailures$1.evaluate(TestRuleIgnoreAfterMaxFailures.java:64)
	at org.apache.lucene.util.TestRuleMarkFailure$1.evaluate(TestRuleMarkFailure.java:47)
	at com.carrotsearch.randomizedtesting.rules.StatementAdapter.evaluate(StatementAdapter.java:36)
	at com.carrotsearch.randomizedtesting.ThreadLeakControl$StatementRunner.run(ThreadLeakControl.java:368)
	at com.carrotsearch.randomizedtesting.ThreadLeakControl.forkTimeoutingTask(ThreadLeakControl.java:817)
	at com.carrotsearch.randomizedtesting.ThreadLeakControl$3.evaluate(ThreadLeakControl.java:468)
	at com.carrotsearch.randomizedtesting.RandomizedRunner.runSingleTest(RandomizedRunner.java:944)
	at com.carrotsearch.randomizedtesting.RandomizedRunner$5.evaluate(RandomizedRunner.java:830)
	at com.carrotsearch.randomizedtesting.RandomizedRunner$6.evaluate(RandomizedRunner.java:880)
	at com.carrotsearch.randomizedtesting.RandomizedRunner$7.evaluate(RandomizedRunner.java:891)
	at com.carrotsearch.randomizedtesting.rules.StatementAdapter.evaluate(StatementAdapter.java:36)
	at com.carrotsearch.randomizedtesting.rules.SystemPropertiesRestoreRule$1.evaluate(SystemPropertiesRestoreRule.java:57)
	at org.apache.lucene.util.AbstractBeforeAfterRule$1.evaluate(AbstractBeforeAfterRule.java:45)
	at com.carrotsearch.randomizedtesting.rules.StatementAdapter.evaluate(StatementAdapter.java:36)
	at org.apache.lucene.util.TestRuleStoreClassName$1.evaluate(TestRuleStoreClassName.java:41)
	at com.carrotsearch.randomizedtesting.rules.NoShadowingOrOverridesOnMethodsRule$1.evaluate(NoShadowingOrOverridesOnMethodsRule.java:40)
	at com.carrotsearch.randomizedtesting.rules.NoShadowingOrOverridesOnMethodsRule$1.evaluate(NoShadowingOrOverridesOnMethodsRule.java:40)
	at com.carrotsearch.randomizedtesting.rules.StatementAdapter.evaluate(StatementAdapter.java:36)
	at com.carrotsearch.randomizedtesting.rules.StatementAdapter.evaluate(StatementAdapter.java:36)
	at org.apache.lucene.util.TestRuleAssertionsRequired$1.evaluate(TestRuleAssertionsRequired.java:53)
	at org.apache.lucene.util.TestRuleMarkFailure$1.evaluate(TestRuleMarkFailure.java:47)
	at org.apache.lucene.util.TestRuleIgnoreAfterMaxFailures$1.evaluate(TestRuleIgnoreAfterMaxFailures.java:64)
	at org.apache.lucene.util.TestRuleIgnoreTestSuites$1.evaluate(TestRuleIgnoreTestSuites.java:54)
	at com.carrotsearch.randomizedtesting.rules.StatementAdapter.evaluate(StatementAdapter.java:36)
	at com.carrotsearch.randomizedtesting.ThreadLeakControl$StatementRunner.run(ThreadLeakControl.java:368)
	at java.base/java.lang.Thread.run(Thread.java:844)
Caused by: java.util.concurrent.TimeoutException: last ClusterState: znodeVersion: 45
live nodes:[127.0.0.1:10017_solr, 127.0.0.1:10018_solr, 127.0.0.1:10016_solr, 127.0.0.1:10019_solr, 127.0.0.1:10015_solr]
collections:{testCreateCollectionAddReplica=DocCollection(testCreateCollectionAddReplica//clusterstate.json/44)={
  "replicationFactor":"1",
  "pullReplicas":"0",
  "router":{"name":"compositeId"},
  "maxShardsPerNode":"1",
  "autoAddReplicas":"false",
  "nrtReplicas":"1",
  "tlogReplicas":"0",
  "autoCreated":"true",
  "policy":"c1",
  "shards":{"shard1":{
      "replicas":{"core_node1":{
          "core":"testCreateCollectionAddReplica_shard1_replica_n1",
          "SEARCHER.searcher.maxDoc":0,
          "SEARCHER.searcher.deletedDocs":0,
          "INDEX.sizeInBytes":10240,
          "node_name":"127.0.0.1:10015_solr",
          "state":"active",
          "type":"NRT",
          "INDEX.sizeInGB":9.5367431640625E-6,
          "SEARCHER.searcher.numDocs":0}},
      "range":"80000000-7fffffff",
      "state":"active"}}}}, last coll state: DocCollection(testCreateCollectionAddReplica//clusterstate.json/44)={
  "replicationFactor":"1",
  "pullReplicas":"0",
  "router":{"name":"compositeId"},
  "maxShardsPerNode":"1",
  "autoAddReplicas":"false",
  "nrtReplicas":"1",
  "tlogReplicas":"0",
  "autoCreated":"true",
  "policy":"c1",
  "shards":{"shard1":{
      "replicas":{"core_node1":{
          "core":"testCreateCollectionAddReplica_shard1_replica_n1",
          "SEARCHER.searcher.maxDoc":0,
          "SEARCHER.searcher.deletedDocs":0,
          "INDEX.sizeInBytes":10240,
          "node_name":"127.0.0.1:10015_solr",
          "state":"active",
          "type":"NRT",
          "INDEX.sizeInGB":9.5367431640625E-6,
          "SEARCHER.searcher.numDocs":0}},
      "range":"80000000-7fffffff",
      "state":"active"}}}
	at org.apache.solr.cloud.CloudTestUtils.waitForState(CloudTestUtils.java:112)
	at org.apache.solr.cloud.CloudTestUtils.waitForState(CloudTestUtils.java:64)
	... 40 more




Build Log:
[...truncated 12829 lines...]
   [junit4] Suite: org.apache.solr.cloud.autoscaling.IndexSizeTriggerTest
   [junit4]   2> Creating dataDir: /home/jenkins/workspace/Lucene-Solr-7.x-Linux/solr/build/solr-core/test/J1/temp/solr.cloud.autoscaling.IndexSizeTriggerTest_525CC9489E970BC7-001/init-core-data-001
   [junit4]   2> 223467 WARN  (SUITE-IndexSizeTriggerTest-seed#[525CC9489E970BC7]-worker) [    ] o.a.s.SolrTestCaseJ4 startTrackingSearchers: numOpens=5 numCloses=5
   [junit4]   2> 223467 INFO  (SUITE-IndexSizeTriggerTest-seed#[525CC9489E970BC7]-worker) [    ] o.a.s.SolrTestCaseJ4 Using PointFields (NUMERIC_POINTS_SYSPROP=true) w/NUMERIC_DOCVALUES_SYSPROP=false
   [junit4]   2> 223468 INFO  (SUITE-IndexSizeTriggerTest-seed#[525CC9489E970BC7]-worker) [    ] o.a.s.SolrTestCaseJ4 Randomized ssl (true) and clientAuth (false) via: @org.apache.solr.util.RandomizeSSL(reason="", ssl=0.0/0.0, value=0.0/0.0, clientAuth=0.0/0.0)
   [junit4]   2> 223468 INFO  (SUITE-IndexSizeTriggerTest-seed#[525CC9489E970BC7]-worker) [    ] o.a.s.SolrTestCaseJ4 SecureRandom sanity checks: test.solr.allowed.securerandom=null & java.security.egd=file:/dev/./urandom
   [junit4]   2> 223468 INFO  (SUITE-IndexSizeTriggerTest-seed#[525CC9489E970BC7]-worker) [    ] o.a.s.c.MiniSolrCloudCluster Starting cluster of 2 servers in /home/jenkins/workspace/Lucene-Solr-7.x-Linux/solr/build/solr-core/test/J1/temp/solr.cloud.autoscaling.IndexSizeTriggerTest_525CC9489E970BC7-001/tempDir-001
   [junit4]   2> 223468 INFO  (SUITE-IndexSizeTriggerTest-seed#[525CC9489E970BC7]-worker) [    ] o.a.s.c.ZkTestServer STARTING ZK TEST SERVER
   [junit4]   2> 223468 INFO  (Thread-551) [    ] o.a.s.c.ZkTestServer client port:0.0.0.0/0.0.0.0:0
   [junit4]   2> 223468 INFO  (Thread-551) [    ] o.a.s.c.ZkTestServer Starting server
   [junit4]   2> 223477 ERROR (Thread-551) [    ] o.a.z.s.ZooKeeperServer ZKShutdownHandler is not registered, so ZooKeeper server won't take any action on ERROR or SHUTDOWN server state changes
   [junit4]   2> 223568 INFO  (SUITE-IndexSizeTriggerTest-seed#[525CC9489E970BC7]-worker) [    ] o.a.s.c.ZkTestServer start zk server on port:33357
   [junit4]   2> 223576 INFO  (zkConnectionManagerCallback-812-thread-1) [    ] o.a.s.c.c.ConnectionManager zkClient has connected
   [junit4]   2> 223585 INFO  (jetty-launcher-809-thread-1) [    ] o.e.j.s.Server jetty-9.4.11.v20180605; built: 2018-06-05T18:24:03.829Z; git: d5fc0523cfa96bfebfbda19606cad384d772f04c; jvm 10.0.1+10
   [junit4]   2> 223588 INFO  (jetty-launcher-809-thread-2) [    ] o.e.j.s.Server jetty-9.4.11.v20180605; built: 2018-06-05T18:24:03.829Z; git: d5fc0523cfa96bfebfbda19606cad384d772f04c; jvm 10.0.1+10
   [junit4]   2> 223627 INFO  (jetty-launcher-809-thread-1) [    ] o.e.j.s.session DefaultSessionIdManager workerName=node0
   [junit4]   2> 223627 INFO  (jetty-launcher-809-thread-1) [    ] o.e.j.s.session No SessionScavenger set, using defaults
   [junit4]   2> 223627 INFO  (jetty-launcher-809-thread-1) [    ] o.e.j.s.session node0 Scavenging every 660000ms
   [junit4]   2> 223647 INFO  (jetty-launcher-809-thread-1) [    ] o.e.j.s.h.ContextHandler Started o.e.j.s.ServletContextHandler@131c8126{/solr,null,AVAILABLE}
   [junit4]   2> 223652 INFO  (jetty-launcher-809-thread-1) [    ] o.e.j.s.AbstractConnector Started ServerConnector@76e696ad{SSL,[ssl, http/1.1]}{127.0.0.1:43233}
   [junit4]   2> 223652 INFO  (jetty-launcher-809-thread-2) [    ] o.e.j.s.session DefaultSessionIdManager workerName=node0
   [junit4]   2> 223652 INFO  (jetty-launcher-809-thread-2) [    ] o.e.j.s.session No SessionScavenger set, using defaults
   [junit4]   2> 223652 INFO  (jetty-launcher-809-thread-1) [    ] o.e.j.s.Server Started @223683ms
   [junit4]   2> 223652 INFO  (jetty-launcher-809-thread-2) [    ] o.e.j.s.session node0 Scavenging every 600000ms
   [junit4]   2> 223652 INFO  (jetty-launcher-809-thread-1) [    ] o.a.s.c.s.e.JettySolrRunner Jetty properties: {hostContext=/solr, hostPort=43233}
   [junit4]   2> 223653 ERROR (jetty-launcher-809-thread-1) [    ] o.a.s.u.StartupLoggingUtils Missing Java Option solr.log.dir. Logging may be missing or incomplete.
   [junit4]   2> 223653 INFO  (jetty-launcher-809-thread-1) [    ] o.a.s.s.SolrDispatchFilter Using logger factory org.apache.logging.slf4j.Log4jLoggerFactory
   [junit4]   2> 223653 INFO  (jetty-launcher-809-thread-1) [    ] o.a.s.s.SolrDispatchFilter  ___      _       Welcome to Apache Solr? version 7.6.0
   [junit4]   2> 223653 INFO  (jetty-launcher-809-thread-1) [    ] o.a.s.s.SolrDispatchFilter / __| ___| |_ _   Starting in cloud mode on port null
   [junit4]   2> 223653 INFO  (jetty-launcher-809-thread-1) [    ] o.a.s.s.SolrDispatchFilter \__ \/ _ \ | '_|  Install dir: null
   [junit4]   2> 223653 INFO  (jetty-launcher-809-thread-1) [    ] o.a.s.s.SolrDispatchFilter |___/\___/_|_|    Start time: 2018-10-31T04:37:34.710187Z
   [junit4]   2> 223655 INFO  (jetty-launcher-809-thread-2) [    ] o.e.j.s.h.ContextHandler Started o.e.j.s.ServletContextHandler@73879c35{/solr,null,AVAILABLE}
   [junit4]   2> 223656 INFO  (jetty-launcher-809-thread-2) [    ] o.e.j.s.AbstractConnector Started ServerConnector@47f43e89{SSL,[ssl, http/1.1]}{127.0.0.1:46495}
   [junit4]   2> 223656 INFO  (jetty-launcher-809-thread-2) [    ] o.e.j.s.Server Started @223687ms
   [junit4]   2> 223656 INFO  (jetty-launcher-809-thread-2) [    ] o.a.s.c.s.e.JettySolrRunner Jetty properties: {hostContext=/solr, hostPort=46495}
   [junit4]   2> 223656 INFO  (zkConnectionManagerCallback-814-thread-1) [    ] o.a.s.c.c.ConnectionManager zkClient has connected
   [junit4]   2> 223656 ERROR (jetty-launcher-809-thread-2) [    ] o.a.s.u.StartupLoggingUtils Missing Java Option solr.log.dir. Logging may be missing or incomplete.
   [junit4]   2> 223656 INFO  (jetty-launcher-809-thread-2) [    ] o.a.s.s.SolrDispatchFilter Using logger factory org.apache.logging.slf4j.Log4jLoggerFactory
   [junit4]   2> 223656 INFO  (jetty-launcher-809-thread-2) [    ] o.a.s.s.SolrDispatchFilter  ___      _       Welcome to Apache Solr? version 7.6.0
   [junit4]   2> 223656 INFO  (jetty-launcher-809-thread-2) [    ] o.a.s.s.SolrDispatchFilter / __| ___| |_ _   Starting in cloud mode on port null
   [junit4]   2> 223656 INFO  (jetty-launcher-809-thread-2) [    ] o.a.s.s.SolrDispatchFilter \__ \/ _ \ | '_|  Install dir: null
   [junit4]   2> 223656 INFO  (jetty-launcher-809-thread-2) [    ] o.a.s.s.SolrDispatchFilter |___/\___/_|_|    Start time: 2018-10-31T04:37:34.713762Z
   [junit4]   2> 223656 INFO  (jetty-launcher-809-thread-1) [    ] o.a.s.s.SolrDispatchFilter solr.xml found in ZooKeeper. Loading...
   [junit4]   2> 223659 INFO  (zkConnectionManagerCallback-816-thread-1) [    ] o.a.s.c.c.ConnectionManager zkClient has connected
   [junit4]   2> 223659 INFO  (jetty-launcher-809-thread-2) [    ] o.a.s.s.SolrDispatchFilter solr.xml found in ZooKeeper. Loading...
   [junit4]   2> 223714 INFO  (jetty-launcher-809-thread-1) [    ] o.a.s.c.ZkContainer Zookeeper client=127.0.0.1:33357/solr
   [junit4]   2> 223715 INFO  (zkConnectionManagerCallback-820-thread-1) [    ] o.a.s.c.c.ConnectionManager zkClient has connected
   [junit4]   2> 223718 INFO  (zkConnectionManagerCallback-822-thread-1) [    ] o.a.s.c.c.ConnectionManager zkClient has connected
   [junit4]   2> 223735 INFO  (jetty-launcher-809-thread-2) [    ] o.a.s.c.ZkContainer Zookeeper client=127.0.0.1:33357/solr
   [junit4]   2> 223736 INFO  (zkConnectionManagerCallback-828-thread-1) [    ] o.a.s.c.c.ConnectionManager zkClient has connected
   [junit4]   2> 223737 INFO  (zkConnectionManagerCallback-830-thread-1) [    ] o.a.s.c.c.ConnectionManager zkClient has connected
   [junit4]   2> 223741 INFO  (jetty-launcher-809-thread-2) [n:127.0.0.1:46495_solr    ] o.a.s.c.OverseerElectionContext I am going to be the leader 127.0.0.1:46495_solr
   [junit4]   2> 223742 INFO  (jetty-launcher-809-thread-2) [n:127.0.0.1:46495_solr    ] o.a.s.c.Overseer Overseer (id=72079542494822406-127.0.0.1:46495_solr-n_0000000000) starting
   [junit4]   2> 223745 INFO  (zkConnectionManagerCallback-837-thread-1) [    ] o.a.s.c.c.ConnectionManager zkClient has connected
   [junit4]   2> 223746 INFO  (jetty-launcher-809-thread-2) [n:127.0.0.1:46495_solr    ] o.a.s.c.s.i.ZkClientClusterStateProvider Cluster at 127.0.0.1:33357/solr ready
   [junit4]   2> 223746 INFO  (OverseerStateUpdate-72079542494822406-127.0.0.1:46495_solr-n_0000000000) [n:127.0.0.1:46495_solr    ] o.a.s.c.Overseer Starting to work on the main queue : 127.0.0.1:46495_solr
   [junit4]   2> 223746 INFO  (jetty-launcher-809-thread-2) [n:127.0.0.1:46495_solr    ] o.a.s.c.ZkController Register node as live in ZooKeeper:/live_nodes/127.0.0.1:46495_solr
   [junit4]   2> 223747 DEBUG (OverseerAutoScalingTriggerThread-72079542494822406-127.0.0.1:46495_solr-n_0000000000) [    ] o.a.s.c.a.OverseerTriggerThread Adding .auto_add_replicas and .scheduled_maintenance triggers
   [junit4]   2> 223747 INFO  (zkCallback-829-thread-1) [    ] o.a.s.c.c.ZkStateReader Updated live nodes from ZooKeeper... (0) -> (1)
   [junit4]   2> 223751 INFO  (zkCallback-836-thread-1) [    ] o.a.s.c.c.ZkStateReader Updated live nodes from ZooKeeper... (0) -> (1)
   [junit4]   2> 223751 DEBUG (OverseerAutoScalingTriggerThread-72079542494822406-127.0.0.1:46495_solr-n_0000000000) [    ] o.a.s.c.a.OverseerTriggerThread Refreshing /autoscaling.json with znode version 1
   [junit4]   2> 223752 DEBUG (OverseerAutoScalingTriggerThread-72079542494822406-127.0.0.1:46495_solr-n_0000000000) [    ] o.a.s.c.a.OverseerTriggerThread Current znodeVersion 1, lastZnodeVersion -1
   [junit4]   2> 223752 DEBUG (OverseerAutoScalingTriggerThread-72079542494822406-127.0.0.1:46495_solr-n_0000000000) [    ] o.a.s.c.a.OverseerTriggerThread Processed trigger updates upto znodeVersion 1
   [junit4]   2> 223754 DEBUG (OverseerAutoScalingTriggerThread-72079542494822

[...truncated too long message...]

O  (zkCallback-254-thread-1) [    ] o.a.s.c.c.ZkStateReader Updated live nodes from ZooKeeper... (2) -> (1)
   [junit4]   2> 203621 INFO  (zkCallback-237-thread-4) [    ] o.a.s.c.c.ZkStateReader Updated live nodes from ZooKeeper... (2) -> (1)
   [junit4]   2> 203621 INFO  (zkCallback-261-thread-1) [    ] o.a.s.c.c.ZkStateReader Updated live nodes from ZooKeeper... (2) -> (1)
   [junit4]   2> 203623 INFO  (jetty-closer-134-thread-2) [    ] o.e.j.s.h.ContextHandler Stopped o.e.j.s.ServletContextHandler@6071981{/solr,null,UNAVAILABLE}
   [junit4]   2> 203623 INFO  (jetty-closer-134-thread-2) [    ] o.e.j.s.session node0 Stopped scavenging
   [junit4]   2> 203623 INFO  (jetty-closer-134-thread-1) [    ] o.a.s.m.SolrMetricManager Closing metric reporters for registry=solr.jetty, tag=null
   [junit4]   2> 203624 INFO  (jetty-closer-134-thread-1) [    ] o.a.s.m.r.SolrJmxReporter Closing reporter [org.apache.solr.metrics.reporters.SolrJmxReporter@24b4e668: rootName = solr_39827, domain = solr.jetty, service url = null, agent id = null] for registry solr.jetty / com.codahale.metrics.MetricRegistry@5a0ff50e
   [junit4]   2> 203624 INFO  (jetty-closer-134-thread-1) [    ] o.a.s.c.ZkController Remove node as live in ZooKeeper:/live_nodes/127.0.0.1:39827_solr
   [junit4]   2> 203624 INFO  (jetty-closer-134-thread-1) [    ] o.a.s.m.SolrMetricManager Closing metric reporters for registry=solr.cluster, tag=null
   [junit4]   2> 203625 INFO  (zkCallback-237-thread-4) [    ] o.a.s.c.c.ZkStateReader Updated live nodes from ZooKeeper... (1) -> (0)
   [junit4]   2> 203625 INFO  (zkCallback-244-thread-1) [    ] o.a.s.c.c.ZkStateReader Updated live nodes from ZooKeeper... (1) -> (0)
   [junit4]   2> 203626 INFO  (jetty-closer-134-thread-1) [    ] o.a.s.c.Overseer Overseer (id=72079741563306009-127.0.0.1:39827_solr-n_0000000005) closing
   [junit4]   2> 203626 INFO  (OverseerStateUpdate-72079741563306009-127.0.0.1:39827_solr-n_0000000005) [n:127.0.0.1:39827_solr    ] o.a.s.c.Overseer Overseer Loop exiting : 127.0.0.1:39827_solr
   [junit4]   2> 203626 WARN  (OverseerAutoScalingTriggerThread-72079741563306009-127.0.0.1:39827_solr-n_0000000005) [    ] o.a.s.c.a.OverseerTriggerThread OverseerTriggerThread woken up but we are closed, exiting.
   [junit4]   2> 203627 INFO  (jetty-closer-134-thread-1) [    ] o.e.j.s.h.ContextHandler Stopped o.e.j.s.ServletContextHandler@286d72ab{/solr,null,UNAVAILABLE}
   [junit4]   2> 203627 INFO  (jetty-closer-134-thread-1) [    ] o.e.j.s.session node0 Stopped scavenging
   [junit4]   2> 203628 ERROR (SUITE-TestTlogReplica-seed#[525CC9489E970BC7]-worker) [    ] o.a.z.s.ZooKeeperServer ZKShutdownHandler is not registered, so ZooKeeper server won't take any action on ERROR or SHUTDOWN server state changes
   [junit4]   2> 203628 INFO  (SUITE-TestTlogReplica-seed#[525CC9489E970BC7]-worker) [    ] o.a.s.c.ZkTestServer connecting to 127.0.0.1:42855 42855
   [junit4]   2> 203820 INFO  (Thread-101) [    ] o.a.s.c.ZkTestServer connecting to 127.0.0.1:42855 42855
   [junit4]   2> 203821 WARN  (Thread-101) [    ] o.a.s.c.ZkTestServer Watch limit violations: 
   [junit4]   2> Maximum concurrent create/delete watches above limit:
   [junit4]   2> 
   [junit4]   2> 	32	/solr/configs/conf
   [junit4]   2> 	32	/solr/collections/tlog_replica_test_create_delete/terms/shard2
   [junit4]   2> 	29	/solr/collections/tlog_replica_test_create_delete/terms/shard1
   [junit4]   2> 	19	/solr/collections/tlog_replica_test_real_time_get/terms/shard1
   [junit4]   2> 	19	/solr/collections/tlog_replica_test_remove_leader/terms/shard1
   [junit4]   2> 	18	/solr/collections/tlog_replica_test_recovery/terms/shard1
   [junit4]   2> 	17	/solr/collections/tlog_replica_test_kill_tlog_replica/terms/shard1
   [junit4]   2> 	16	/solr/collections/tlog_replica_test_kill_leader/terms/shard1
   [junit4]   2> 	15	/solr/aliases.json
   [junit4]   2> 	15	/solr/collections/tlog_replica_test_basic_leader_election/terms/shard1
   [junit4]   2> 	13	/solr/collections/tlog_replica_test_out_of_order_db_qwith_in_place_updates/terms/shard1
   [junit4]   2> 	11	/solr/collections/tlog_replica_test_delete_by_id/terms/shard1
   [junit4]   2> 	11	/solr/collections/tlog_replica_test_only_leader_indexes/terms/shard1
   [junit4]   2> 	9	/solr/collections/tlog_replica_test_add_docs/terms/shard1
   [junit4]   2> 	8	/solr/collections/tlog_replica_test_add_remove_tlog_replica/terms/shard2
   [junit4]   2> 	7	/solr/security.json
   [junit4]   2> 	7	/solr/collections/tlog_replica_test_add_remove_tlog_replica/terms/shard1
   [junit4]   2> 
   [junit4]   2> Maximum concurrent data watches above limit:
   [junit4]   2> 
   [junit4]   2> 	26	/solr/collections/tlog_replica_test_create_delete/state.json
   [junit4]   2> 	24	/solr/collections/tlog_replica_test_out_of_order_db_qwith_in_place_updates/state.json
   [junit4]   2> 	15	/solr/clusterstate.json
   [junit4]   2> 	15	/solr/clusterprops.json
   [junit4]   2> 	11	/solr/collections/tlog_replica_test_kill_leader/state.json
   [junit4]   2> 	11	/solr/collections/tlog_replica_test_basic_leader_election/state.json
   [junit4]   2> 	9	/solr/collections/tlog_replica_test_remove_leader/state.json
   [junit4]   2> 	8	/solr/collections/tlog_replica_test_recovery/state.json
   [junit4]   2> 	7	/solr/collections/tlog_replica_test_real_time_get/state.json
   [junit4]   2> 	5	/solr/collections/tlog_replica_test_kill_tlog_replica/state.json
   [junit4]   2> 	4	/solr/autoscaling.json
   [junit4]   2> 	3	/solr/collections/tlog_replica_test_add_docs/state.json
   [junit4]   2> 	3	/solr/collections/tlog_replica_test_real_time_get/leader_elect/shard1/election/72079741563306009-core_node5-n_0000000000
   [junit4]   2> 	3	/solr/overseer_elect/election/72079741563305988-127.0.0.1:39827_solr-n_0000000001
   [junit4]   2> 	3	/solr/collections/tlog_replica_test_add_remove_tlog_replica/state.json
   [junit4]   2> 	3	/solr/collections/tlog_replica_test_only_leader_indexes/state.json
   [junit4]   2> 	3	/solr/collections/tlog_replica_test_delete_by_id/state.json
   [junit4]   2> 	2	/solr/collections/tlog_replica_test_create_delete/leader_elect/shard2/election/72079741563306005-core_node11-n_0000000000
   [junit4]   2> 	2	/solr/collections/tlog_replica_test_create_delete/leader_elect/shard2/election/72079741563306005-core_node16-n_0000000000
   [junit4]   2> 	2	/solr/collections/tlog_replica_test_recovery/leader_elect/shard1/election/72079741563306005-core_node3-n_0000000000
   [junit4]   2> 	2	/solr/collections/tlog_replica_test_create_delete/leader_elect/shard1/election/72079741563306005-core_node9-n_0000000000
   [junit4]   2> 
   [junit4]   2> Maximum concurrent children watches above limit:
   [junit4]   2> 
   [junit4]   2> 	15	/solr/live_nodes
   [junit4]   2> 	15	/solr/collections
   [junit4]   2> 	4	/solr/overseer/queue
   [junit4]   2> 	4	/solr/autoscaling/events/.scheduled_maintenance
   [junit4]   2> 	4	/solr/autoscaling/events/.auto_add_replicas
   [junit4]   2> 	4	/solr/overseer/collection-queue-work
   [junit4]   2> 	4	/solr/overseer/queue-work
   [junit4]   2> 
   [junit4]   2> NOTE: leaving temporary files on disk at: /home/jenkins/workspace/Lucene-Solr-7.x-Linux/solr/build/solr-core/test/J0/temp/solr.cloud.TestTlogReplica_525CC9489E970BC7-002
   [junit4]   2> Oct 31, 2018 5:29:50 AM com.carrotsearch.randomizedtesting.ThreadLeakControl checkThreadLeaks
   [junit4]   2> WARNING: Will linger awaiting termination of 1 leaked thread(s).
   [junit4]   2> NOTE: test params are: codec=Lucene70, sim=RandomSimilarity(queryNorm=true): {}, locale=ha, timezone=Africa/Sao_Tome
   [junit4]   2> NOTE: Linux 4.15.0-38-generic amd64/Oracle Corporation 10.0.1 (64-bit)/cpus=8,threads=1,free=179497016,total=522715136
   [junit4]   2> NOTE: All tests run in this JVM: [TestTlogReplica, TestTlogReplica]
   [junit4] Completed [14/15 (6!)] on J0 in 98.73s, 13 tests, 1 failure <<< FAILURES!

[...truncated 32 lines...]
BUILD FAILED
/home/jenkins/workspace/Lucene-Solr-7.x-Linux/lucene/common-build.xml:1567: The following error occurred while executing this line:
/home/jenkins/workspace/Lucene-Solr-7.x-Linux/lucene/common-build.xml:1092: There were test failures: 15 suites, 125 tests, 1 error, 5 failures [seed: 525CC9489E970BC7]

Total time: 3 minutes 41 seconds

[repro] Setting last failure code to 256

[repro] Failures:
[repro]   0/5 failed: org.apache.solr.cloud.autoscaling.IndexSizeTriggerTest
[repro]   2/5 failed: org.apache.solr.cloud.autoscaling.sim.TestSimPolicyCloud
[repro]   4/5 failed: org.apache.solr.cloud.TestTlogReplica
[repro] Exiting with code 256
+ mv lucene/build lucene/build.repro
+ mv solr/build solr/build.repro
+ mv lucene/build.orig lucene/build
+ mv solr/build.orig solr/build
Archiving artifacts
Setting ANT_1_8_2_HOME=/var/lib/jenkins/tools/hudson.tasks.Ant_AntInstallation/ANT_1.8.2
[WARNINGS] Parsing warnings in console log with parser Java Compiler (javac)
Setting ANT_1_8_2_HOME=/var/lib/jenkins/tools/hudson.tasks.Ant_AntInstallation/ANT_1.8.2
Setting ANT_1_8_2_HOME=/var/lib/jenkins/tools/hudson.tasks.Ant_AntInstallation/ANT_1.8.2
<Git Blamer> Using GitBlamer to create author and commit information for all warnings.
<Git Blamer> GIT_COMMIT=e8503da7c43b8ff3eb968c631ca2ac718a2c736b, workspace=/var/lib/jenkins/workspace/Lucene-Solr-7.x-Linux
[WARNINGS] Computing warning deltas based on reference build #3007
Recording test results
Setting ANT_1_8_2_HOME=/var/lib/jenkins/tools/hudson.tasks.Ant_AntInstallation/ANT_1.8.2
Build step 'Publish JUnit test result report' changed build result to UNSTABLE
Email was triggered for: Unstable (Test Failures)
Sending email for trigger: Unstable (Test Failures)
Setting ANT_1_8_2_HOME=/var/lib/jenkins/tools/hudson.tasks.Ant_AntInstallation/ANT_1.8.2
Setting ANT_1_8_2_HOME=/var/lib/jenkins/tools/hudson.tasks.Ant_AntInstallation/ANT_1.8.2
Setting ANT_1_8_2_HOME=/var/lib/jenkins/tools/hudson.tasks.Ant_AntInstallation/ANT_1.8.2
Setting ANT_1_8_2_HOME=/var/lib/jenkins/tools/hudson.tasks.Ant_AntInstallation/ANT_1.8.2

Mime
View raw message