lucene-dev mailing list archives

Site index · List index
Message view « Date » · « Thread »
Top « Date » · « Thread »
From Apache Jenkins Server <jenk...@builds.apache.org>
Subject [JENKINS] Lucene-Solr-Tests-master - Build # 2837 - Unstable
Date Mon, 01 Oct 2018 18:58:47 GMT
Build: https://builds.apache.org/job/Lucene-Solr-Tests-master/2837/

4 tests failed.
FAILED:  org.apache.solr.cloud.MultiThreadedOCPTest.test

Error Message:


Stack Trace:
java.lang.AssertionError
	at __randomizedtesting.SeedInfo.seed([8CF5354BE2DFDDD7:4A10A914C23B02F]:0)
	at org.junit.Assert.fail(Assert.java:92)
	at org.junit.Assert.assertTrue(Assert.java:43)
	at org.junit.Assert.assertTrue(Assert.java:54)
	at org.apache.solr.cloud.MultiThreadedOCPTest.testFillWorkQueue(MultiThreadedOCPTest.java:114)
	at org.apache.solr.cloud.MultiThreadedOCPTest.test(MultiThreadedOCPTest.java:69)
	at sun.reflect.NativeMethodAccessorImpl.invoke0(Native Method)
	at sun.reflect.NativeMethodAccessorImpl.invoke(NativeMethodAccessorImpl.java:62)
	at sun.reflect.DelegatingMethodAccessorImpl.invoke(DelegatingMethodAccessorImpl.java:43)
	at java.lang.reflect.Method.invoke(Method.java:498)
	at com.carrotsearch.randomizedtesting.RandomizedRunner.invoke(RandomizedRunner.java:1742)
	at com.carrotsearch.randomizedtesting.RandomizedRunner$8.evaluate(RandomizedRunner.java:935)
	at com.carrotsearch.randomizedtesting.RandomizedRunner$9.evaluate(RandomizedRunner.java:971)
	at com.carrotsearch.randomizedtesting.RandomizedRunner$10.evaluate(RandomizedRunner.java:985)
	at org.apache.solr.BaseDistributedSearchTestCase$ShardsRepeatRule$ShardsFixedStatement.callStatement(BaseDistributedSearchTestCase.java:1008)
	at org.apache.solr.BaseDistributedSearchTestCase$ShardsRepeatRule$ShardsStatement.evaluate(BaseDistributedSearchTestCase.java:983)
	at com.carrotsearch.randomizedtesting.rules.SystemPropertiesRestoreRule$1.evaluate(SystemPropertiesRestoreRule.java:57)
	at org.apache.lucene.util.TestRuleSetupTeardownChained$1.evaluate(TestRuleSetupTeardownChained.java:49)
	at org.apache.lucene.util.AbstractBeforeAfterRule$1.evaluate(AbstractBeforeAfterRule.java:45)
	at org.apache.lucene.util.TestRuleThreadAndTestName$1.evaluate(TestRuleThreadAndTestName.java:48)
	at org.apache.lucene.util.TestRuleIgnoreAfterMaxFailures$1.evaluate(TestRuleIgnoreAfterMaxFailures.java:64)
	at org.apache.lucene.util.TestRuleMarkFailure$1.evaluate(TestRuleMarkFailure.java:47)
	at com.carrotsearch.randomizedtesting.rules.StatementAdapter.evaluate(StatementAdapter.java:36)
	at com.carrotsearch.randomizedtesting.ThreadLeakControl$StatementRunner.run(ThreadLeakControl.java:368)
	at com.carrotsearch.randomizedtesting.ThreadLeakControl.forkTimeoutingTask(ThreadLeakControl.java:817)
	at com.carrotsearch.randomizedtesting.ThreadLeakControl$3.evaluate(ThreadLeakControl.java:468)
	at com.carrotsearch.randomizedtesting.RandomizedRunner.runSingleTest(RandomizedRunner.java:944)
	at com.carrotsearch.randomizedtesting.RandomizedRunner$5.evaluate(RandomizedRunner.java:830)
	at com.carrotsearch.randomizedtesting.RandomizedRunner$6.evaluate(RandomizedRunner.java:880)
	at com.carrotsearch.randomizedtesting.RandomizedRunner$7.evaluate(RandomizedRunner.java:891)
	at com.carrotsearch.randomizedtesting.rules.StatementAdapter.evaluate(StatementAdapter.java:36)
	at com.carrotsearch.randomizedtesting.rules.SystemPropertiesRestoreRule$1.evaluate(SystemPropertiesRestoreRule.java:57)
	at org.apache.lucene.util.AbstractBeforeAfterRule$1.evaluate(AbstractBeforeAfterRule.java:45)
	at com.carrotsearch.randomizedtesting.rules.StatementAdapter.evaluate(StatementAdapter.java:36)
	at org.apache.lucene.util.TestRuleStoreClassName$1.evaluate(TestRuleStoreClassName.java:41)
	at com.carrotsearch.randomizedtesting.rules.NoShadowingOrOverridesOnMethodsRule$1.evaluate(NoShadowingOrOverridesOnMethodsRule.java:40)
	at com.carrotsearch.randomizedtesting.rules.NoShadowingOrOverridesOnMethodsRule$1.evaluate(NoShadowingOrOverridesOnMethodsRule.java:40)
	at com.carrotsearch.randomizedtesting.rules.StatementAdapter.evaluate(StatementAdapter.java:36)
	at com.carrotsearch.randomizedtesting.rules.StatementAdapter.evaluate(StatementAdapter.java:36)
	at com.carrotsearch.randomizedtesting.rules.StatementAdapter.evaluate(StatementAdapter.java:36)
	at org.apache.lucene.util.TestRuleAssertionsRequired$1.evaluate(TestRuleAssertionsRequired.java:53)
	at org.apache.lucene.util.TestRuleMarkFailure$1.evaluate(TestRuleMarkFailure.java:47)
	at org.apache.lucene.util.TestRuleIgnoreAfterMaxFailures$1.evaluate(TestRuleIgnoreAfterMaxFailures.java:64)
	at org.apache.lucene.util.TestRuleIgnoreTestSuites$1.evaluate(TestRuleIgnoreTestSuites.java:54)
	at com.carrotsearch.randomizedtesting.rules.StatementAdapter.evaluate(StatementAdapter.java:36)
	at com.carrotsearch.randomizedtesting.ThreadLeakControl$StatementRunner.run(ThreadLeakControl.java:368)
	at java.lang.Thread.run(Thread.java:748)


FAILED:  org.apache.solr.cloud.api.collections.ShardSplitTest.testSplitMixedReplicaTypesLink

Error Message:
unexpected shard state expected:<inactive> but was:<active>

Stack Trace:
java.lang.AssertionError: unexpected shard state expected:<inactive> but was:<active>
	at __randomizedtesting.SeedInfo.seed([8CF5354BE2DFDDD7:B09BFC124707764E]:0)
	at org.junit.Assert.fail(Assert.java:93)
	at org.junit.Assert.failNotEquals(Assert.java:647)
	at org.junit.Assert.assertEquals(Assert.java:128)
	at org.apache.solr.cloud.api.collections.ShardSplitTest.verifyShard(ShardSplitTest.java:374)
	at org.apache.solr.cloud.api.collections.ShardSplitTest.doSplitMixedReplicaTypes(ShardSplitTest.java:366)
	at org.apache.solr.cloud.api.collections.ShardSplitTest.testSplitMixedReplicaTypesLink(ShardSplitTest.java:338)
	at sun.reflect.NativeMethodAccessorImpl.invoke0(Native Method)
	at sun.reflect.NativeMethodAccessorImpl.invoke(NativeMethodAccessorImpl.java:62)
	at sun.reflect.DelegatingMethodAccessorImpl.invoke(DelegatingMethodAccessorImpl.java:43)
	at java.lang.reflect.Method.invoke(Method.java:498)
	at com.carrotsearch.randomizedtesting.RandomizedRunner.invoke(RandomizedRunner.java:1742)
	at com.carrotsearch.randomizedtesting.RandomizedRunner$8.evaluate(RandomizedRunner.java:935)
	at com.carrotsearch.randomizedtesting.RandomizedRunner$9.evaluate(RandomizedRunner.java:971)
	at com.carrotsearch.randomizedtesting.RandomizedRunner$10.evaluate(RandomizedRunner.java:985)
	at org.apache.solr.BaseDistributedSearchTestCase$ShardsRepeatRule$ShardsFixedStatement.callStatement(BaseDistributedSearchTestCase.java:1008)
	at org.apache.solr.BaseDistributedSearchTestCase$ShardsRepeatRule$ShardsStatement.evaluate(BaseDistributedSearchTestCase.java:983)
	at com.carrotsearch.randomizedtesting.rules.SystemPropertiesRestoreRule$1.evaluate(SystemPropertiesRestoreRule.java:57)
	at org.apache.lucene.util.TestRuleSetupTeardownChained$1.evaluate(TestRuleSetupTeardownChained.java:49)
	at org.apache.lucene.util.AbstractBeforeAfterRule$1.evaluate(AbstractBeforeAfterRule.java:45)
	at org.apache.lucene.util.TestRuleThreadAndTestName$1.evaluate(TestRuleThreadAndTestName.java:48)
	at org.apache.lucene.util.TestRuleIgnoreAfterMaxFailures$1.evaluate(TestRuleIgnoreAfterMaxFailures.java:64)
	at org.apache.lucene.util.TestRuleMarkFailure$1.evaluate(TestRuleMarkFailure.java:47)
	at com.carrotsearch.randomizedtesting.rules.StatementAdapter.evaluate(StatementAdapter.java:36)
	at com.carrotsearch.randomizedtesting.ThreadLeakControl$StatementRunner.run(ThreadLeakControl.java:368)
	at com.carrotsearch.randomizedtesting.ThreadLeakControl.forkTimeoutingTask(ThreadLeakControl.java:817)
	at com.carrotsearch.randomizedtesting.ThreadLeakControl$3.evaluate(ThreadLeakControl.java:468)
	at com.carrotsearch.randomizedtesting.RandomizedRunner.runSingleTest(RandomizedRunner.java:944)
	at com.carrotsearch.randomizedtesting.RandomizedRunner$5.evaluate(RandomizedRunner.java:830)
	at com.carrotsearch.randomizedtesting.RandomizedRunner$6.evaluate(RandomizedRunner.java:880)
	at com.carrotsearch.randomizedtesting.RandomizedRunner$7.evaluate(RandomizedRunner.java:891)
	at com.carrotsearch.randomizedtesting.rules.StatementAdapter.evaluate(StatementAdapter.java:36)
	at com.carrotsearch.randomizedtesting.rules.SystemPropertiesRestoreRule$1.evaluate(SystemPropertiesRestoreRule.java:57)
	at org.apache.lucene.util.AbstractBeforeAfterRule$1.evaluate(AbstractBeforeAfterRule.java:45)
	at com.carrotsearch.randomizedtesting.rules.StatementAdapter.evaluate(StatementAdapter.java:36)
	at org.apache.lucene.util.TestRuleStoreClassName$1.evaluate(TestRuleStoreClassName.java:41)
	at com.carrotsearch.randomizedtesting.rules.NoShadowingOrOverridesOnMethodsRule$1.evaluate(NoShadowingOrOverridesOnMethodsRule.java:40)
	at com.carrotsearch.randomizedtesting.rules.NoShadowingOrOverridesOnMethodsRule$1.evaluate(NoShadowingOrOverridesOnMethodsRule.java:40)
	at com.carrotsearch.randomizedtesting.rules.StatementAdapter.evaluate(StatementAdapter.java:36)
	at com.carrotsearch.randomizedtesting.rules.StatementAdapter.evaluate(StatementAdapter.java:36)
	at com.carrotsearch.randomizedtesting.rules.StatementAdapter.evaluate(StatementAdapter.java:36)
	at org.apache.lucene.util.TestRuleAssertionsRequired$1.evaluate(TestRuleAssertionsRequired.java:53)
	at org.apache.lucene.util.TestRuleMarkFailure$1.evaluate(TestRuleMarkFailure.java:47)
	at org.apache.lucene.util.TestRuleIgnoreAfterMaxFailures$1.evaluate(TestRuleIgnoreAfterMaxFailures.java:64)
	at org.apache.lucene.util.TestRuleIgnoreTestSuites$1.evaluate(TestRuleIgnoreTestSuites.java:54)
	at com.carrotsearch.randomizedtesting.rules.StatementAdapter.evaluate(StatementAdapter.java:36)
	at com.carrotsearch.randomizedtesting.ThreadLeakControl$StatementRunner.run(ThreadLeakControl.java:368)
	at java.lang.Thread.run(Thread.java:748)


FAILED:  org.apache.solr.cloud.cdcr.CdcrBidirectionalTest.testBiDir

Error Message:
Captured an uncaught exception in thread: Thread[id=3204, name=cdcr-replicator-1496-thread-1, state=RUNNABLE, group=TGRP-CdcrBidirectionalTest]

Stack Trace:
com.carrotsearch.randomizedtesting.UncaughtExceptionError: Captured an uncaught exception in thread: Thread[id=3204, name=cdcr-replicator-1496-thread-1, state=RUNNABLE, group=TGRP-CdcrBidirectionalTest]
	at __randomizedtesting.SeedInfo.seed([8CF5354BE2DFDDD7:C92EC5A9FAF19195]:0)
Caused by: java.lang.AssertionError: 1613143176642560000 != 1613143176641511424
	at __randomizedtesting.SeedInfo.seed([8CF5354BE2DFDDD7]:0)
	at org.apache.solr.update.CdcrUpdateLog$CdcrLogReader.forwardSeek(CdcrUpdateLog.java:611)
	at org.apache.solr.handler.CdcrReplicator.run(CdcrReplicator.java:125)
	at org.apache.solr.handler.CdcrReplicatorScheduler.lambda$null$0(CdcrReplicatorScheduler.java:81)
	at org.apache.solr.common.util.ExecutorUtil$MDCAwareThreadPoolExecutor.lambda$execute$0(ExecutorUtil.java:209)
	at java.util.concurrent.ThreadPoolExecutor.runWorker(ThreadPoolExecutor.java:1149)
	at java.util.concurrent.ThreadPoolExecutor$Worker.run(ThreadPoolExecutor.java:624)
	at java.lang.Thread.run(Thread.java:748)


FAILED:  org.apache.solr.security.TestPKIAuthenticationPlugin.test

Error Message:


Stack Trace:
java.lang.NullPointerException
	at __randomizedtesting.SeedInfo.seed([8CF5354BE2DFDDD7:4A10A914C23B02F]:0)
	at org.apache.solr.security.TestPKIAuthenticationPlugin.test(TestPKIAuthenticationPlugin.java:105)
	at sun.reflect.NativeMethodAccessorImpl.invoke0(Native Method)
	at sun.reflect.NativeMethodAccessorImpl.invoke(NativeMethodAccessorImpl.java:62)
	at sun.reflect.DelegatingMethodAccessorImpl.invoke(DelegatingMethodAccessorImpl.java:43)
	at java.lang.reflect.Method.invoke(Method.java:498)
	at com.carrotsearch.randomizedtesting.RandomizedRunner.invoke(RandomizedRunner.java:1742)
	at com.carrotsearch.randomizedtesting.RandomizedRunner$8.evaluate(RandomizedRunner.java:935)
	at com.carrotsearch.randomizedtesting.RandomizedRunner$9.evaluate(RandomizedRunner.java:971)
	at com.carrotsearch.randomizedtesting.RandomizedRunner$10.evaluate(RandomizedRunner.java:985)
	at com.carrotsearch.randomizedtesting.rules.SystemPropertiesRestoreRule$1.evaluate(SystemPropertiesRestoreRule.java:57)
	at org.apache.lucene.util.TestRuleSetupTeardownChained$1.evaluate(TestRuleSetupTeardownChained.java:49)
	at org.apache.lucene.util.AbstractBeforeAfterRule$1.evaluate(AbstractBeforeAfterRule.java:45)
	at org.apache.lucene.util.TestRuleThreadAndTestName$1.evaluate(TestRuleThreadAndTestName.java:48)
	at org.apache.lucene.util.TestRuleIgnoreAfterMaxFailures$1.evaluate(TestRuleIgnoreAfterMaxFailures.java:64)
	at org.apache.lucene.util.TestRuleMarkFailure$1.evaluate(TestRuleMarkFailure.java:47)
	at com.carrotsearch.randomizedtesting.rules.StatementAdapter.evaluate(StatementAdapter.java:36)
	at com.carrotsearch.randomizedtesting.ThreadLeakControl$StatementRunner.run(ThreadLeakControl.java:368)
	at com.carrotsearch.randomizedtesting.ThreadLeakControl.forkTimeoutingTask(ThreadLeakControl.java:817)
	at com.carrotsearch.randomizedtesting.ThreadLeakControl$3.evaluate(ThreadLeakControl.java:468)
	at com.carrotsearch.randomizedtesting.RandomizedRunner.runSingleTest(RandomizedRunner.java:944)
	at com.carrotsearch.randomizedtesting.RandomizedRunner$5.evaluate(RandomizedRunner.java:830)
	at com.carrotsearch.randomizedtesting.RandomizedRunner$6.evaluate(RandomizedRunner.java:880)
	at com.carrotsearch.randomizedtesting.RandomizedRunner$7.evaluate(RandomizedRunner.java:891)
	at com.carrotsearch.randomizedtesting.rules.StatementAdapter.evaluate(StatementAdapter.java:36)
	at com.carrotsearch.randomizedtesting.rules.SystemPropertiesRestoreRule$1.evaluate(SystemPropertiesRestoreRule.java:57)
	at org.apache.lucene.util.AbstractBeforeAfterRule$1.evaluate(AbstractBeforeAfterRule.java:45)
	at com.carrotsearch.randomizedtesting.rules.StatementAdapter.evaluate(StatementAdapter.java:36)
	at org.apache.lucene.util.TestRuleStoreClassName$1.evaluate(TestRuleStoreClassName.java:41)
	at com.carrotsearch.randomizedtesting.rules.NoShadowingOrOverridesOnMethodsRule$1.evaluate(NoShadowingOrOverridesOnMethodsRule.java:40)
	at com.carrotsearch.randomizedtesting.rules.NoShadowingOrOverridesOnMethodsRule$1.evaluate(NoShadowingOrOverridesOnMethodsRule.java:40)
	at com.carrotsearch.randomizedtesting.rules.StatementAdapter.evaluate(StatementAdapter.java:36)
	at com.carrotsearch.randomizedtesting.rules.StatementAdapter.evaluate(StatementAdapter.java:36)
	at com.carrotsearch.randomizedtesting.rules.StatementAdapter.evaluate(StatementAdapter.java:36)
	at org.apache.lucene.util.TestRuleAssertionsRequired$1.evaluate(TestRuleAssertionsRequired.java:53)
	at org.apache.lucene.util.TestRuleMarkFailure$1.evaluate(TestRuleMarkFailure.java:47)
	at org.apache.lucene.util.TestRuleIgnoreAfterMaxFailures$1.evaluate(TestRuleIgnoreAfterMaxFailures.java:64)
	at org.apache.lucene.util.TestRuleIgnoreTestSuites$1.evaluate(TestRuleIgnoreTestSuites.java:54)
	at com.carrotsearch.randomizedtesting.rules.StatementAdapter.evaluate(StatementAdapter.java:36)
	at com.carrotsearch.randomizedtesting.ThreadLeakControl$StatementRunner.run(ThreadLeakControl.java:368)
	at java.lang.Thread.run(Thread.java:748)




Build Log:
[...truncated 12652 lines...]
   [junit4] Suite: org.apache.solr.cloud.MultiThreadedOCPTest
   [junit4]   2> 531854 INFO  (SUITE-MultiThreadedOCPTest-seed#[8CF5354BE2DFDDD7]-worker) [    ] o.a.s.SolrTestCaseJ4 SecureRandom sanity checks: test.solr.allowed.securerandom=null & java.security.egd=file:/dev/./urandom
   [junit4]   2> Creating dataDir: /home/jenkins/jenkins-slave/workspace/Lucene-Solr-Tests-master/solr/build/solr-core/test/J0/temp/solr.cloud.MultiThreadedOCPTest_8CF5354BE2DFDDD7-001/init-core-data-001
   [junit4]   2> 531855 WARN  (SUITE-MultiThreadedOCPTest-seed#[8CF5354BE2DFDDD7]-worker) [    ] o.a.s.SolrTestCaseJ4 startTrackingSearchers: numOpens=33 numCloses=33
   [junit4]   2> 531856 INFO  (SUITE-MultiThreadedOCPTest-seed#[8CF5354BE2DFDDD7]-worker) [    ] o.a.s.SolrTestCaseJ4 Using PointFields (NUMERIC_POINTS_SYSPROP=true) w/NUMERIC_DOCVALUES_SYSPROP=false
   [junit4]   2> 531871 INFO  (SUITE-MultiThreadedOCPTest-seed#[8CF5354BE2DFDDD7]-worker) [    ] o.a.s.SolrTestCaseJ4 Randomized ssl (false) and clientAuth (true) via: @org.apache.solr.util.RandomizeSSL(reason=, ssl=NaN, value=NaN, clientAuth=NaN)
   [junit4]   2> 531871 INFO  (SUITE-MultiThreadedOCPTest-seed#[8CF5354BE2DFDDD7]-worker) [    ] o.a.s.BaseDistributedSearchTestCase Setting hostContext system property: /
   [junit4]   2> 531907 INFO  (TEST-MultiThreadedOCPTest.test-seed#[8CF5354BE2DFDDD7]) [    ] o.a.s.c.ZkTestServer STARTING ZK TEST SERVER
   [junit4]   2> 531923 INFO  (Thread-637) [    ] o.a.s.c.ZkTestServer client port:0.0.0.0/0.0.0.0:0
   [junit4]   2> 531923 INFO  (Thread-637) [    ] o.a.s.c.ZkTestServer Starting server
   [junit4]   2> 531939 ERROR (Thread-637) [    ] o.a.z.s.ZooKeeperServer ZKShutdownHandler is not registered, so ZooKeeper server won't take any action on ERROR or SHUTDOWN server state changes
   [junit4]   2> 532023 INFO  (TEST-MultiThreadedOCPTest.test-seed#[8CF5354BE2DFDDD7]) [    ] o.a.s.c.ZkTestServer start zk server on port:42410
   [junit4]   2> 532143 INFO  (zkConnectionManagerCallback-501-thread-1) [    ] o.a.s.c.c.ConnectionManager zkClient has connected
   [junit4]   2> 532243 INFO  (zkConnectionManagerCallback-503-thread-1) [    ] o.a.s.c.c.ConnectionManager zkClient has connected
   [junit4]   2> 532261 INFO  (TEST-MultiThreadedOCPTest.test-seed#[8CF5354BE2DFDDD7]) [    ] o.a.s.c.AbstractZkTestCase put /home/jenkins/jenkins-slave/workspace/Lucene-Solr-Tests-master/solr/core/src/test-files/solr/collection1/conf/solrconfig-tlog.xml to /configs/conf1/solrconfig.xml
   [junit4]   2> 532263 INFO  (TEST-MultiThreadedOCPTest.test-seed#[8CF5354BE2DFDDD7]) [    ] o.a.s.c.AbstractZkTestCase put /home/jenkins/jenkins-slave/workspace/Lucene-Solr-Tests-master/solr/core/src/test-files/solr/collection1/conf/schema.xml to /configs/conf1/schema.xml
   [junit4]   2> 532280 INFO  (TEST-MultiThreadedOCPTest.test-seed#[8CF5354BE2DFDDD7]) [    ] o.a.s.c.AbstractZkTestCase put /home/jenkins/jenkins-slave/workspace/Lucene-Solr-Tests-master/solr/core/src/test-files/solr/collection1/conf/solrconfig.snippet.randomindexconfig.xml to /configs/conf1/solrconfig.snippet.randomindexconfig.xml
   [junit4]   2> 532281 INFO  (TEST-MultiThreadedOCPTest.test-seed#[8CF5354BE2DFDDD7]) [    ] o.a.s.c.AbstractZkTestCase put /home/jenkins/jenkins-slave/workspace/Lucene-Solr-Tests-master/solr/core/src/test-files/solr/collection1/conf/stopwords.txt to /configs/conf1/stopwords.txt
   [junit4]   2> 532282 INFO  (TEST-MultiThreadedOCPTest.test-seed#[8CF5354BE2DFDDD7]) [    ] o.a.s.c.AbstractZkTestCase put /home/jenkins/jenkins-slave/workspace/Lucene-Solr-Tests-master/solr/core/src/test-files/solr/collection1/conf/protwords.txt to /configs/conf1/protwords.txt
   [junit4]   2> 532283 INFO  (TEST-MultiThreadedOCPTest.test-seed#[8CF5354BE2DFDDD7]) [    ] o.a.s.c.AbstractZkTestCase put /home/jenkins/jenkins-slave/workspace/Lucene-Solr-Tests-master/solr/core/src/test-files/solr/collection1/conf/currency.xml to /configs/conf1/currency.xml
   [junit4]   2> 532317 INFO  (TEST-MultiThreadedOCPTest.test-seed#[8CF5354BE2DFDDD7]) [    ] o.a.s.c.AbstractZkTestCase put /home/jenkins/jenkins-slave/workspace/Lucene-Solr-Tests-master/solr/core/src/test-files/solr/collection1/conf/enumsConfig.xml to /configs/conf1/enumsConfig.xml
   [junit4]   2> 532318 INFO  (TEST-MultiThreadedOCPTest.test-seed#[8CF5354BE2DFDDD7]) [    ] o.a.s.c.AbstractZkTestCase put /home/jenkins/jenkins-slave/workspace/Lucene-Solr-Tests-master/solr/core/src/test-files/solr/collection1/conf/open-exchange-rates.json to /configs/conf1/open-exchange-rates.json
   [junit4]   2> 532319 INFO  (TEST-MultiThreadedOCPTest.test-seed#[8CF5354BE2DFDDD7]) [    ] o.a.s.c.AbstractZkTestCase put /home/jenkins/jenkins-slave/workspace/Lucene-Solr-Tests-master/solr/core/src/test-files/solr/collection1/conf/mapping-ISOLatin1Accent.txt to /configs/conf1/mapping-ISOLatin1Accent.txt
   [junit4]   2> 532320 INFO  (TEST-MultiThreadedOCPTest.test-seed#[8CF5354BE2DFDDD7]) [    ] o.a.s.c.AbstractZkTestCase put /home/jenkins/jenkins-slave/workspace/Lucene-Solr-Tests-master/solr/core/src/test-files/solr/collection1/conf/old_synonyms.txt to /configs/conf1/old_synonyms.txt
   [junit4]   2> 532354 INFO  (TEST-MultiThreadedOCPTest.test-seed#[8CF5354BE2DFDDD7]) [    ] o.a.s.c.AbstractZkTestCase put /home/jenkins/jenkins-slave/workspace/Lucene-Solr-Tests-master/solr/core/src/test-files/solr/collection1/conf/synonyms.txt to /configs/conf1/synonyms.txt
   [junit4]   2> 532357 INFO  (TEST-MultiThreadedOCPTest.test-seed#[8CF5354BE2DFDDD7]) [    ] o.a.s.c.AbstractFullDistribZkTestBase Will use NRT replicas unless explicitly asked otherwise
   [junit4]   2> 533490 INFO  (TEST-MultiThreadedOCPTest.test-seed#[8CF5354BE2DFDDD7]) [    ] o.e.j.s.Server jetty-9.4.11.v20180605; built: 2018-06-05T18:24:03.829Z; git: d5fc0523cfa96bfebfbda19606cad384d772f04c; jvm 1.8.0_172-b11
   [junit4]   2> 533562 INFO  (TEST-MultiThreadedOCPTest.test-seed#[8CF5354BE2DFDDD7]) [    ] o.e.j.s.session DefaultSessionIdManager workerName=node0
   [junit4]   2> 533562 INFO  (TEST-MultiThreadedOCPTest.test-seed#[8CF5354BE2DFDDD7]) [    ] o.e.j.s.session No SessionScavenger set, using defaults
   [junit4]   2> 533562 INFO  (TEST-MultiThreadedOCPTest.test-seed#[8CF5354BE2DFDDD7]) [    ] o.e.j.s.session node0 Scavenging every 660000ms
   [junit4]   2> 533577 INFO  (TEST-MultiThreadedOCPTest.test-seed#[8CF5354BE2DFDDD7]) [    ] o.e.j.s.h.ContextHandler Started o.e.j.s.ServletContextHandler@a414b8e{/,null,AVAILABLE}
   [junit4]   2> 533577 INFO  (TEST-MultiThreadedOCPTest.test-seed#[8CF5354BE2DFDDD7]) [    ] o.e.j.s.AbstractConnector Started ServerConnector@2ce1b4d6{HTTP/1.1,[http/1.1]}{127.0.0.1:33998}
   [junit4]   2> 533577 INFO  (TEST-MultiThreadedOCPTest.test-seed#[8CF5354BE2DFDDD7]) [    ] o.e.j.s.Server Started @533971ms
   [junit4]   2> 533577 INFO  (TEST-MultiThreadedOCPTest.test-seed#[8CF5354BE2DFDDD7]) [    ] o.a.s.c.s.e.JettySolrRunner Jetty properties: {solr.data.dir=/home/jenkins/jenkins-slave/workspace/Lucene-Solr-Tests-master/solr/build/solr-core/test/J0/temp/solr.cloud.MultiThreadedOCPTest_8CF5354BE2DFDDD7-001/tempDir-001/control/data, hostContext=/, hostPort=33998, coreRootDirectory=/home/jenkins/jenkins-slave/workspace/Lucene-Solr-Tests-master/solr/build/solr-core/test/J0/temp/solr.cloud.MultiThreadedOCPTest_8CF5354BE2DFDDD7-001/control-001/cores}
   [junit4]   2> 533578 ERROR (TEST-MultiThreadedOCPTest.test-seed#[8CF5354BE2DFDDD7]) [    ] o.a.s.u.StartupLoggingUtils Missing Java Option solr.log.dir. Logging may be missing or incomplete.
   [junit4]   2> 533578 INFO  (TEST-MultiThreadedOCPTest.test-seed#[8CF5354BE2DFDDD7]) [    ] o.a.s.s.SolrDispatchFilter Using logger factory org.apache.logging.slf4j.Log4jLoggerFactory
   [junit4]   2> 533578 INFO  (TEST-MultiThreadedOCPTest.test-seed#[8CF5354BE2DFDDD7]) [    ] o.a.s.s.SolrDispatchFilter  ___      _       Welcome to Apache Solr? version 8.0.0
   [junit4]   2> 533578 INFO  (TEST-MultiThreadedOCPTest.test-seed#[8CF5354BE2DFDDD7]) [    ] o.a.s.s.SolrDispatchFilter / __| ___| |_ _   Starting in cloud mode on port null
   [junit4]   2> 533578 INFO  (TEST-MultiThreadedOCPTest.test-seed#[8CF5354BE2DFDDD7]) [    ] o.a.s.s.SolrDispatchFilter \__ \/ _ \ | '_|  Install dir: null
   [junit4]   2> 533578 INFO  (TEST-MultiThreadedOCPTest.test-seed#[8CF5354BE2DFDDD7]) [    ] o.a.s.s.SolrDispatchFilter |___/\___/_|_|    Start time: 2018-10-01T16:57:10.670Z
   [junit4]   2> 533705 INFO  (zkConnectionManagerCallback-505-thread-1) [    ] o.a.s.c.c.ConnectionManager zkClient has connected
   [junit4]   2> 533707 INFO  (TEST-MultiThreadedOCPTest.test-seed#[8CF5354BE2DFDDD7]) [    ] o.a.s.s.SolrDispatchFilter Loading solr.xml from SolrHome (not found in ZooKeeper)
   [junit4]   2> 533707 INFO  (TEST-MultiThreadedOCPTest.test-seed#[8CF5354BE2DFDDD7]) [    ] o.a.s.c.SolrXmlConfig Loading container configuration from /home/jenkins/jenkins-slave/workspace/Lucene-Solr-Tests-master/solr/build/solr-core/test/J0/temp/solr.cloud.MultiThreadedOCPTest_8CF5354BE2DFDDD7-001/control-001/solr.xml
   [junit4]   2> 533744 INFO  (TEST-MultiThreadedOCPTest.test-seed#[8CF5354BE2DFDDD7]) [    ] o.a.s.c.SolrXmlConfig Configuration parameter autoReplicaFailoverWorkLoopDelay is ignored
   [junit4]   2> 533744 INFO  (TEST-MultiThreadedOCPTest.test-seed#[8CF5354BE2DFDDD7]) [    ] o.a.s.c.SolrXmlConfig Configuration parameter autoReplicaFailoverBadNodeExpiration is ignored
   [junit4]   2> 533746 INFO  (TEST-MultiThreadedOCPTest.test-seed#[8CF5354BE2DFDDD7]) [    ] o.a.s.c.SolrXmlConfig MBean server found: com.sun.jmx.mbeanserver.JmxMBeanServer@6d545ec0, but no JMX reporters were configured - adding default JMX reporter.
   [junit4]   2> 534310 INFO  (TEST-MultiThreadedOCPTest.test-seed#[8CF5354BE2DFDDD7]) [    ] o.a.s.c.ZkContainer Zookeeper client=127.0.0.1:42410/solr
   [junit4]   2> 534343 INFO  (zkConnectionManagerCallback-509-thread-1) [    ] o.a.s.c.c.ConnectionManager zkClient has connected
   [junit4]   2> 534404 INFO  (zkConnectionManagerCallback-511-thread-1) [    ] o.a.s.c.c.ConnectionManager zkClient has connected
   [junit4]   2> 535151 INFO  (TEST-MultiThreadedOCPTest.test-seed#[8CF5354BE2DFDDD7]) [n:127.0.0.1:33998_    ] o.a.s.c.OverseerElectionContext I am going to be the leader 127.0.0.1:33998_
   [junit4]   2> 535152 INFO  (TEST-MultiThreadedOCPTest.test-seed#[8CF5354BE2DFDDD7]) [n:127.0.0.1:33998_    ] o.a.s.c.Overseer Overseer (id=73417494215327748-127.0.0.1:33998_-n_0000000000) starting
   [junit4]   2> 535216 INFO  (zkConnectionManagerCallback-518-thread-1) [    ] o.a.s.c.c.ConnectionManager zkClient has connected
   [junit4]   2> 535240 INFO  (TEST-MultiThreadedOCPTest.test-seed#[8CF5354BE2DFDDD7]) [n:127.0.0.1:33998_    ] o.a.s.c.s.i.ZkClientClusterStateProvider Cluster at 127.0.0.1:42410/solr ready
   [junit4]   2> 535289 INFO  (OverseerStateUpdate-73417494215327748-127.0.0.1:33998_-n_0000000000) [n:127.0.0.1:33998_    ] o.a.s.c.Overseer Starting to work on the main queue : 127.0.0.1:33998_
   [junit4]   2> 535298 INFO  (TEST-MultiThreadedOCPTest.test-seed#[8CF5354BE2DFDDD7]) [n:127.0.0.1:33998_    ] o.a.s.c.ZkController Register node as live in ZooKeeper:/live_nodes/127.0.0.1:33998_
   [junit4]   2> 535382 INFO  (OverseerStateUpdate-73417494215327748-127.0.0.1:33998_-n_0000000000) [n:127.0.0.1:33998_    ] o.a.s.c.c.ZkStateReader Updated live nodes from ZooKeeper... (0) -> (1)
   [junit4]   2> 535444 INFO  (zkCallback-517-thread-1) [    ] o.a.s.c.c.ZkStateReader Updated live nodes from ZooKeeper... (0) -> (1)
   [junit4]   2> 535517 INFO  (TEST-MultiThreadedOCPTest.test-seed#[8CF5354BE2DFDDD7]) [n:127.0.0.1:33998_    ] o.a.s.h.a.MetricsHistoryHandler No .system collection, keeping metrics history in memory.
   [junit4]   2> 535576 INFO  (TEST-MultiThreadedOCPTest.test-seed#[8CF5354BE2DFDDD7]) [n:127.0.0.1:33998_    ] o.a.s.m.r.SolrJmxReporter JMX monitoring for 'solr.node' (registry 'solr.node') enabled at server: com.sun.jmx.mbeanserver.JmxMBeanServer@6d545ec0
   [junit4]   2> 535612 INFO  (TEST-MultiThreadedOCPTest.test-seed#[8CF5354BE2DFDDD7]) [n:127.0.0.1:33998_    ] o.a.s.m.r.SolrJmxReporter JMX monitoring for 'solr.jvm' (registry 'solr.jvm') enabled at server: com.sun.jmx.mbeanserver.JmxMBeanServer@6d545ec0
   [junit4]   2> 535613 INFO  (TEST-MultiThreadedOCPTest.test-seed#[8CF5354BE2DFDDD7]) [n:127.0.0.1:33998_    ] o.a.s.m.r.SolrJmxReporter JMX monitoring for 'solr.jetty' (registry 'solr.jetty') enabled at server: com.sun.jmx.mbeanserver.JmxMBeanServer@6d545ec0
   [junit4]   2> 535614 INFO  (TEST-MultiThreadedOCPTest.test-seed#[8CF5354BE2DFDDD7]) [n:127.0.0.1:33998_    ] o.a.s.c.CorePropertiesLocator Found 0 core definitions underneath /home/jenkins/jenkins-slave/workspace/Lucene-Solr-Tests-master/solr/build/solr-core/test/J0/temp/solr.cloud.MultiThreadedOCPTest_8CF5354BE2DFDDD7-001/control-001/cores
   [junit4]   2> 535895 INFO  (zkConnectionManagerCallback-524-thread-1) [    ] o.a.s.c.c.ConnectionManager zkClient has connected
   [junit4]   2> 535955 INFO  (TEST-MultiThreadedOCPTest.test-seed#[8CF5354BE2DFDDD7]) [    ] o.a.s.c.c.ZkStateReader Updated live nodes from ZooKeeper... (0) -> (1)
   [junit4]   2> 536033 INFO  (TEST-MultiThreadedOCPTest.test-seed#[8CF5354BE2DFDDD7]) [    ] o.a.s.c.s.i.ZkClientClusterStateProvider Cluster at 127.0.0.1:42410/solr ready
   [junit4]   2> 536050 INFO  (qtp684862728-2441) [n:127.0.0.1:33998_    ] o.a.s.h.a.CollectionsHandler Invoked Collection Action :create with params collection.configName=conf1&name=control_collection&nrtReplicas=1&action=CREATE&numShards=1&createNodeSet=127.0.0.1:33998_&wt=javabin&version=2 and sendToOCPQueue=true
   [junit4]   2> 536354 INFO  (OverseerThreadFactory-1165-thread-1-processing-n:127.0.0.1:33998_) [n:127.0.0.1:33998_    ] o.a.s.c.a.c.CreateCollectionCmd Create collection control_collection
   [junit4]   2> 536737 INFO  (qtp684862728-2436) [n:127.0.0.1:33998_    x:control_collection_shard1_replica_n1] o.a.s.h.a.CoreAdminOperation core create command qt=/admin/cores&collection.configName=conf1&newCollection=true&name=control_collection_shard1_replica_n1&action=CREATE&numShards=1&collection=control_collection&shard=shard1&wt=javabin&version=2&replicaType=NRT
   [junit4]   2> 536738 INFO  (qtp684862728-2436) [n:127.0.0.1:33998_    x:control_collection_shard1_replica_n1] o.a.s.c.TransientSolrCoreCacheDefault Allocating transient cache for 4 transient cores
   [junit4]   2> 538085 INFO  (qtp684862728-2436) [n:127.0.0.1:33998_ c:control_collection s:shard1  x:control_collection_shard1_replica_n1] o.a.s.c.SolrConfig Using Lucene MatchVersion: 8.0.0
   [junit4]   2> 538116 INFO  (qtp684862728-2436) [n:127.0.0.1:33998_ c:control_collection s:shard1  x:control_collection_shard1_replica_n1] o.a.s.s.IndexSchema [control_collection_shard1_replica_n1] Schema name=test
   [junit4]   2> 539138 INFO  (qtp684862728-2436) [n:127.0.0.1:33998_ c:control_collection s:shard1  x:control_collection_shard1_replica_n1] o.a.s.s.IndexSchema Loaded schema test/1.0 with uniqueid field id
   [junit4]   2> 539270 INFO  (qtp684862728-2436) [n:127.0.0.1:33998_ c:control_collection s:shard1  x:control_collection_shard1_replica_n1] o.a.s.c.CoreContainer Creating SolrCore 'control_collection_shard1_replica_n1' using configuration from collection control_collection, trusted=true
   [junit4]   2> 539271 INFO  (qtp684862728-2436) [n:127.0.0.1:33998_ c:control_collection s:shard1  x:control_collection_shard1_replica_n1] o.a.s.m.r.SolrJmxReporter JMX monitoring for 'solr.core.control_collection.shard1.replica_n1' (registry 'solr.core.control_collection.shard1.replica_n1') enabled at server: com.sun.jmx.mbeanserver.JmxMBeanServer@6d545ec0
   [junit4]   2> 539271 INFO  (qtp684862728-2436) [n:127.0.0.1:33998_ c:control_collection s:shard1  x:control_collection_shard1_replica_n1] o.a.s.c.SolrCore [[control_collection_shard1_replica_n1] ] Opening new SolrCore at [/home/jenkins/jenkins-slave/workspace/Lucene-Solr-Tests-master/solr/build/solr-core/test/J0/temp/solr.cloud.MultiThreadedOCPTest_8CF5354BE2DFDDD7-001/control-001/cores/control_collection_shard1_replica_n1], dataDir=[/home/jenkins/jenkins-slave/workspace/Lucene-Solr-Tests-master/solr/build/solr-core/test/J0/temp/solr.cloud.MultiThreadedOCPTest_8CF5354BE2DFDDD7-001/control-001/cores/control_collection_shard1_replica_n1/data/]
   [junit4]   2> 539307 INFO  (qtp684862728-2436) [n:127.0.0.1:33998_ c:control_collection s:shard1  x:control_collection_shard1_replica_n1] o.a.s.u.RandomMergePolicy RandomMergePolicy wrapping class org.apache.lucene.index.TieredMergePolicy: [TieredMergePolicy: maxMergeAtOnce=31, maxMergeAtOnceExplicit=23, maxMergedSegmentMB=8.1533203125, floorSegmentMB=1.4375, forceMergeDeletesPctAllowed=0.7494260611669079, segmentsPerTier=32.0, maxCFSSegmentSizeMB=8.796093022207999E12, noCFSRatio=0.26427385425341954, deletesPctAllowed=46.58226665086998
   [junit4]   2> 539330 WARN  (qtp684862728-2436) [n:127.0.0.1:33998_ c:control_collection s:shard1  x:control_collection_shard1_replica_n1] o.a.s.c.RequestHandlers INVALID paramSet a in requestHandler {type = requestHandler,name = /dump,class = DumpRequestHandler,attributes = {initParams=a, name=/dump, class=DumpRequestHandler},args = {defaults={a=A,b=B}}}
   [junit4]   2> 539785 INFO  (qtp684862728-2436) [n:127.0.0.1:33998_ c:control_collection s:shard1  x:control_collection_shard1_replica_n1] o.a.s.u.UpdateHandler Using UpdateLog implementation: org.apache.solr.update.UpdateLog
   [junit4]   2> 539785 INFO  (qtp684862728-2436) [n:127.0.0.1:33998_ c:control_collection s:shard1  x:control_collection_shard1_replica_n1] o.a.s.u.UpdateLog Initializing UpdateLog: dataDir= defaultSyncLevel=FLUSH numRecordsToKeep=100 maxNumLogsToKeep=10 numVersionBuckets=65536
   [junit4]   2> 539786 INFO  (qtp684862728-2436) [n:127.0.0.1:33998_ c:control_collection s:shard1  x:control_collection_shard1_replica_n1] o.a.s.u.CommitTracker Hard AutoCommit: disabled
   [junit4]   2> 539786 INFO  (qtp684862728-2436) [n:127.0.0.1:33998_ c:control_collection s:shard1  x:control_collection_shard1_replica_n1] o.a.s.u.CommitTracker Soft AutoCommit: disabled
   [junit4]   2> 539787 INFO  (qtp684862728-2436) [n:127.0.0.1:33998_ c:control_collection s:shard1  x:control_collection_shard1_replica_n1] o.a.s.u.RandomMergePolicy RandomMergePolicy wrapping class org.apache.lucene.index.TieredMergePolicy: [TieredMergePolicy: maxMergeAtOnce=37, maxMergeAtOnceExplicit=37, maxMergedSegmentMB=2.8017578125, floorSegmentMB=0.66796875, forceMergeDeletesPctAllowed=10.189022506962377, segmentsPerTier=50.0, maxCFSSegmentSizeMB=8.796093022207999E12, noCFSRatio=0.33441521575470806, deletesPctAllowed=34.36809559880493
   [junit4]   2> 539804 INFO  (qtp684862728-2436) [n:127.0.0.1:33998_ c:control_collection s:shard1  x:control_collection_shard1_replica_n1] o.a.s.s.SolrIndexSearcher Opening [Searcher@489df4b5[control_collection_shard1_replica_n1] main]
   [junit4]   2> 539808 INFO  (qtp684862728-2436) [n:127.0.0.1:33998_ c:control_collection s:shard1  x:control_collection_shard1_replica_n1] o.a.s.r.ManagedResourceStorage Configured ZooKeeperStorageIO with znodeBase: /configs/conf1
   [junit4]   2> 539820 INFO  (qtp684862728-2436) [n:127.0.0.1:33998_ c:control_collection s:shard1  x:control_collection_shard1_replica_n1] o.a.s.r.ManagedResourceStorage Loaded null at path _rest_managed.json using ZooKeeperStorageIO:path=/configs/conf1
   [junit4]   2> 539821 INFO  (qtp684862728-2436) [n:127.0.0.1:33998_ c:control_collection s:shard1  x:control_collection_shard1_replica_n1] o.a.s.h.ReplicationHandler Commits will be reserved for 10000ms.
   [junit4]   2> 539822 INFO  (searcherExecutor-1170-thread-1-processing-n:127.0.0.1:33998_ x:control_collection_shard1_replica_n1 c:control_collection s:shard1) [n:127.0.0.1:33998_ c:control_collection s:shard1  x:control_collection_shard1_replica_n1] o.a.s.c.SolrCore [control_collection_shard1_replica_n1] Registered new searcher Searcher@489df4b5[control_collection_shard1_replica_n1] main{ExitableDirectoryReader(UninvertingDirectoryReader())}
   [junit4]   2> 539822 INFO  (qtp684862728-2436) [n:127.0.0.1:33998_ c:control_collection s:shard1  x:control_collection_shard1_replica_n1] o.a.s.u.UpdateLog Could not find max version in index or recent updates, using new clock 1613142988595134464
   [junit4]   2> 539844 INFO  (qtp684862728-2436) [n:127.0.0.1:33998_ c:control_collection s:shard1  x:control_collection_shard1_replica_n1] o.a.s.c.ZkShardTerms Successful update of terms at /collections/control_collection/terms/shard1 to Terms{values={core_node2=0}, version=0}
   [junit4]   2> 539859 INFO  (qtp684862728-2436) [n:127.0.0.1:33998_ c:control_collection s:shard1  x:control_collection_shard1_replica_n1] o.a.s.c.ShardLeaderElectionContext Enough replicas found to continue.
   [junit4]   2> 539860 INFO  (qtp684862728-2436) [n:127.0.0.1:33998_ c:control_collection s:shard1  x:control_collection_shard1_replica_n1] o.a.s.c.ShardLeaderElectionContext I may be the new leader - try and sync
   [junit4]   2> 539860 INFO  (qtp684862728-2436) [n:127.0.0.1:33998_ c:control_collection s:shard1  x:control_collection_shard1_replica_n1] o.a.s.c.SyncStrategy Sync replicas to http://127.0.0.1:33998/control_collection_shard1_replica_n1/
   [junit4]   2> 539860 INFO  (qtp684862728-2436) [n:127.0.0.1:33998_ c:control_collection s:shard1  x:control_collection_shard1_replica_n1] o.a.s.c.SyncStrategy Sync Success - now sync replicas to me
   [junit4]   2> 539860 INFO  (qtp684862728-2436) [n:127.0.0.1:33998_ c:control_collection s:shard1  x:control_collection_shard1_replica_n1] o.a.s.c.SyncStrategy http://127.0.0.1:33998/control_collection_shard1_replica_n1/ has no replicas
   [junit4]   2> 539860 INFO  (qtp684862728-2436) [n:127.0.0.1:33998_ c:control_collection s:shard1  x:control_collection_shard1_replica_n1] o.a.s.c.ShardLeaderElectionContext Found all replicas participating in election, clear LIR
   [junit4]   2> 539880 INFO  (qtp684862728-2436) [n:127.0.0.1:33998_ c:control_collection s:shard1  x:control_collection_shard1_replica_n1] o.a.s.c.ShardLeaderElectionContext I am the new leader: http://127.0.0.1:33998/control_collection_shard1_replica_n1/ shard1
   [junit4]   2> 539959 INFO  (qtp684862728-2436) [n:127.0.0.1:33998_ c:control_collection s:shard1  x:control_collection_shard1_replica_n1] o.a.s.c.ZkController I am the leader, no recovery necessary
   [junit4]   2> 539962 INFO  (qtp684862728-2436) [n:127.0.0.1:33998_ c:control_collection s:shard1  x:control_collection_shard1_replica_n1] o.a.s.s.HttpSolrCall [admin] webapp=null path=/admin/cores params={qt=/admin/cores&collection.configName=conf1&newCollection=true&name=control_collection_shard1_replica_n1&action=CREATE&numShards=1&collection=control_collection&shard=shard1&wt=javabin&version=2&replicaType=NRT} status=0 QTime=3225
   [junit4]   2> 540050 INFO  (qtp684862728-2441) [n:127.0.0.1:33998_    ] o.a.s.h.a.CollectionsHandler Wait for new collection to be active for at most 30 seconds. Check all shard replicas
   [junit4]   2> 540069 INFO  (zkCallback-510-thread-1) [    ] o.a.s.c.c.ZkStateReader A cluster state change: [WatchedEvent state:SyncConnected type:NodeDataChanged path:/collections/control_collection/state.json] for collection [control_collection] has occurred - updating... (live nodes size: [1])
   [junit4]   2> 540547 INFO  (OverseerCollectionConfigSetProcessor-73417494215327748-127.0.0.1:33998_-n_0000000000) [n:127.0.0.1:33998_    ] o.a.s.c.OverseerTaskQueue Response ZK path: /overseer/collection-queue-work/qnr-0000000000 doesn't exist.  Requestor may have disconnected from ZooKeeper
   [junit4]   2> 541050 INFO  (qtp684862728-2441) [n:127.0.0.1:33998_    ] o.a.s.s.HttpSolrCall [admin] webapp=null path=/admin/collections params={collection.configName=conf1&name=control_collection&nrtReplicas=1&action=CREATE&numShards=1&createNodeSet=127.0.0.1:33998_&wt=javabin&version=2} status=0 QTime=5000
   [junit4]   2> 541157 INFO  (zkConnectionManagerCallback-529-thread-1) [    ] o.a.s.c.c.ConnectionManager zkClient has connected
   [junit4]   2> 541158 INFO  (TEST-MultiThreadedOCPTest.test-seed#[8CF5354BE2DFDDD7]) [    ] o.a.s.c.c.ZkStateReader Updated live nodes from ZooKeeper... (0) -> (1)
   [junit4]   2> 541159 INFO  (TEST-MultiThreadedOCPTest.test-seed#[8CF5354BE2DFDDD7]) [    ] o.a.s.c.s.i.ZkClientClusterStateProvider Cluster at 127.0.0.1:42410/solr ready
   [junit4]   2> 541159 INFO  (TEST-MultiThreadedOCPTest.test-seed#[8CF5354BE2DFDDD7]) [    ] o.a.s.c.ChaosMonkey monkey: init - expire sessions:false cause connection loss:false
   [junit4]   2> 541177 INFO  (qtp684862728-2437) [n:127.0.0.1:33998_    ] o.a.s.h.a.CollectionsHandler Invoked Collection Action :create with params collection.configName=conf1&name=collection1&nrtReplicas=1&action=CREATE&numShards=2&createNodeSet=&stateFormat=1&wt=javabin&version=2 and sendToOCPQueue=true
   [junit4]   2> 541208 INFO  (OverseerThreadFactory-1165-thread-2-processing-n:127.0.0.1:33998_) [n:127.0.0.1:33998_    ] o.a.s.c.a.c.CreateCollectionCmd Create collection collection1
   [junit4]   2> 541441 WARN  (OverseerThreadFactory-1165-thread-2-processing-n:127.0.0.1:33998_) [n:127.0.0.1:33998_    ] o.a.s.c.a.c.CreateCollectionCmd It is unusual to create a collection (collection1) without cores.
   [junit4]   2> 541444 INFO  (qtp684862728-2437) [n:127.0.0.1:33998_    ] o.a.s.h.a.CollectionsHandler Wait for new collection to be active for at most 30 seconds. Check all shard replicas
   [junit4]   2> 541444 INFO  (qtp684862728-2437) [n:127.0.0.1:33998_    ] o.a.s.s.HttpSolrCall [admin] webapp=null path=/admin/collections params={collection.configName=conf1&name=collection1&nrtReplicas=1&action=CREATE&numShards=2&createNodeSet=&stateFormat=1&wt=javabin&version=2} status=0 QTime=266
   [junit4]   2> 542207 INFO  (TEST-MultiThreadedOCPTest.test-seed#[8CF5354BE2DFDDD7]) [    ] o.a.s.c.AbstractFullDistribZkTestBase create jetty 1 in directory /home/jenkins/jenkins-slave/workspace/Lucene-Solr-Tests-master/solr/build/solr-core/test/J0/temp/solr.cloud.MultiThreadedOCPTest_8CF5354BE2DFDDD7-001/shard-1-001 of type NRT
   [junit4]   2> 542208 INFO  (TEST-MultiThreadedOCPTest.test-seed#[8CF5354BE2DFDDD7]) [    ] o.e.j.s.Server jetty-9.4.11.v20180605; built: 2018-06-05T18:24:03.829Z; git: d5fc0523cfa96bfebfbda19606cad384d772f04c; jvm 1.8.0_172-b11
   [junit4]   2> 542249 INFO  (TEST-MultiThreadedOCPTest.test-seed#[8CF5354BE2DFDDD7]) [    ] o.e.j.s.session DefaultSessionIdManager workerName=node0
   [junit4]   2> 542250 INFO  (TEST-MultiThreadedOCPTest.test-seed#[8CF5354BE2DFDDD7]) [    ] o.e.j.s.session No SessionScavenger set, using defaults
   [junit4]   2> 542250 INFO  (TEST-MultiThreadedOCPTest.test-seed#[8CF5354BE2DFDDD7]) [    ] o.e.j.s.session node0 Scavenging every 660000ms
   [junit4]   2> 542250 INFO  (TEST-MultiThreadedOCPTest.test-seed#[8CF5354BE2DFDDD7]) [    ] o.e.j.s.h.ContextHandler Started o.e.j.s.ServletContextHandler@3ba06624{/,null,AVAILABLE}
   [junit4]   2> 542250 INFO  (TEST-MultiThreadedOCPTest.test-seed#[8CF5354BE2DFDDD7]) [    ] o.e.j.s.AbstractConnector Started ServerConnector@374dfc33{HTTP/1.1,[http/1.1]}{127.0.0.1:40400}
   [junit4]   2> 542251 INFO  (TEST-MultiThreadedOCPTest.test-seed#[8CF5354BE2DFDDD7]) [    ] o.e.j.s.Server Started @542644ms
   [junit4]   2> 542251 INFO  (TEST-MultiThreadedOCPTest.test-seed#[8CF5354BE2DFDDD7]) [    ] o.a.s.c.s.e.JettySolrRunner Jetty properties: {solr.data.dir=/home/jenkins/jenkins-slave/workspace/Lucene-Solr-Tests-master/solr/build/solr-core/test/J0/temp/solr.cloud.MultiThreadedOCPTest_8CF5354BE2DFDDD7-001/tempDir-001/jetty1, replicaType=NRT, solrconfig=solrconfig.xml, hostContext=/, hostPort=40400, coreRootDirectory=/home/jenkins/jenkins-slave/workspace/Lucene-Solr-Tests-master/solr/build/solr-core/test/J0/../../../../../../../../../../home/jenkins/jenkins-slave/workspace/Lucene-Solr-Tests-master/solr/build/solr-core/test/J0/temp/solr.cloud.MultiThreadedOCPTest_8CF5354BE2DFDDD7-001/shard-1-001/cores}
   [junit4]   2> 542251 ERROR (TEST-MultiThreadedOCPTest.test-seed#[8CF5354BE2DFDDD7]) [    ] o.a.s.u.StartupLoggingUtils Missing Java Option solr.log.dir. Logging may be missing or incomplete.
   [junit4]   2> 542251 INFO  (TEST-MultiThreadedOCPTest.test-seed#[8CF5354BE2DFDDD7]) [    ] o.a.s.s.SolrDispatchFilter Using logger factory org.apache.logging.slf4j.Log4jLoggerFactory
   [junit4]   2> 542251 INFO  (TEST-MultiThreadedOCPTest.test-seed#[8CF5354BE2DFDDD7]) [    ] o.a.s.s.SolrDispatchFilter  ___      _       Welcome to Apache Solr? version 8.0.0
   [junit4]   2> 542251 INFO  (TEST-MultiThreadedOCPTest.test-seed#[8CF5354BE2DFDDD7]) [    ] o.a.s.s.SolrDispatchFilter / __| ___| |_ _   Starting in cloud mode on port null
   [junit4]   2> 542251 INFO  (TEST-MultiThreadedOCPTest.test-seed#[8CF5354BE2DFDDD7]) [    ] o.a.s.s.SolrDispatchFilter \__ \/ _ \ | '_|  Install dir: null
   [junit4]   2> 542251 INFO  (TEST-MultiThreadedOCPTest.test-seed#[8CF5354BE2DFDDD7]) [    ] o.a.s.s.SolrDispatchFilter |___/\___/_|_|    Start time: 2018-10-01T16:57:19.343Z
   [junit4]   2> 542351 INFO  (zkConnectionManagerCallback-531-thread-1) [    ] o.a.s.c.c.ConnectionManager zkClient has connected
   [junit4]   2> 542376 INFO  (TEST-MultiThreadedOCPTest.test-seed#[8CF5354BE2DFDDD7]) [    ] o.a.s.s.SolrDispatchFilter Loading solr.xml from SolrHome (not found in ZooKeeper)
   [junit4]   2> 542376 INFO  (TEST-MultiThreadedOCPTest.test-seed#[8CF5354BE2DFDDD7]) [    ] o.a.s.c.SolrXmlConfig Loading container configuration from /home/jenkins/jenkins-slave/workspace/Lucene-Solr-Tests-master/solr/build/solr-core/test/J0/temp/solr.cloud.MultiThreadedOCPTest_8CF5354BE2DFDDD7-001/shard-1-001/solr.xml
   [junit4]   2> 542380 INFO  (TEST-MultiThreadedOCPTest.test-seed#[8CF5354BE2DFDDD7]) [    ] o.a.s.c.SolrXmlConfig Configuration parameter autoReplicaFailoverWorkLoopDelay is ignored
   [junit4]   2> 542380 INFO  (TEST-MultiThreadedOCPTest.test-seed#[8CF5354BE2DFDDD7]) [    ] o.a.s.c.SolrXmlConfig Configuration parameter autoReplicaFailoverBadNodeExpiration is ignored
   [junit4]   2> 542381 INFO  (TEST-MultiThreadedOCPTest.test-seed#[8CF5354BE2DFDDD7]) [    ] o.a.s.c.SolrXmlConfig MBean server found: com.sun.jmx.mbeanserver.JmxMBeanServer@6d545ec0, but no JMX reporters were configured - adding default JMX reporter.
   [junit4]   2> 543284 INFO  (OverseerCollectionConfigSetProcessor-73417494215327748-127.0.0.1:33998_-n_0000000000) [n:127.0.0.1:33998_    ] o.a.s.c.OverseerTaskQueue Response ZK path: /overseer/collection-queue-work/qnr-0000000002 doesn't exist.  Requestor may have disconnected from ZooKeeper
   [junit4]   2> 543642 INFO  (TEST-MultiThreadedOCPTest.test-seed#[8CF5354BE2DFDDD7]) [    ] o.a.s.c.ZkContainer Zookeeper client=127.0.0.1:42410/solr
   [junit4]   2> 543772 INFO  (zkConnectionManagerCallback-535-thread-1) [    ] o.a.s.c.c.ConnectionManager zkClient has connected
   [junit4]   2> 543833 INFO  (zkConnectionManagerCallback-537-thread-1) [    ] o.a.s.c.c.ConnectionManager zkClient has connected
   [junit4]   2> 543904 INFO  (TEST-MultiThreadedOCPTest.test-seed#[8CF5354BE2DFDDD7]) [    ] o.a.s.c.c.ZkStateReader Updated live nodes from ZooKeeper... (0) -> (1)
   [junit4]   2> 543941 INFO  (TEST-MultiThreadedOCPTest.test-seed#[8CF5354BE2DFDDD7]) [    ] o.a.s.c.TransientSolrCoreCacheDefault Allocating transient cache for 4 transient cores
   [junit4]   2> 543941 INFO  (TEST-MultiThreadedOCPTest.test-seed#[8CF5354BE2DFDDD7]) [    ] o.a.s.c.ZkController Register node as live in ZooKeeper:/live_nodes/127.0.0.1:40400_
   [junit4]   2> 543959 INFO  (zkCallback-517-thread-1) [    ] o.a.s.c.c.ZkStateReader Updated live nodes from ZooKeeper... (1) -> (2)
   [junit4]   2> 543997 INFO  (zkCallback-536-thread-1) [    ] o.a.s.c.c.ZkStateReader Updated live nodes from ZooKeeper... (1) -> (2)
   [junit4]   2> 543997 INFO  (zkCallback-528-thread-1) [    ] o.a.s.c.c.ZkStateReader Updated live nodes from ZooKeeper... (1) -> (2)
   [junit4]   2> 544008 INFO  (zkCallback-510-thread-2) [    ] o.a.s.c.c.ZkStateReader Updated live nodes from ZooKeeper... (1) -> (2)
   [junit4]   2> 544054 INFO  (zkConnectionManagerCallback-544-thread-1) [    ] o.a.s.c.c.ConnectionManager zkClient has connected
   [junit4]   2> 544055 INFO  (TEST-MultiThreadedOCPTest.test-seed#[8CF5354BE2DFDDD7]) [    ] o.a.s.c.c.ZkStateReader Updated live nodes from ZooKeeper... (0) -> (2)
   [junit4]   2> 544056 INFO  (TEST-MultiThreadedOCPTest.test-seed#[8CF5354BE2DFDDD7]) [    ] o.a.s.c.s.i.ZkClientClusterStateProvider Cluster at 127.0.0.1:42410/solr ready
   [junit4]   2> 544057 INFO  (TEST-MultiThreadedOCPTest.test-seed#[8CF5354BE2DFDDD7]) [    ] o.a.s.h.a.MetricsHistoryHandler No .system collection, keeping metrics history in memory.
   [junit4]   2> 544140 INFO  (TEST-MultiThreadedOCPTest.test-seed#[8CF5354BE2DFDDD7]) [    ] o.a.s.m.r.SolrJmxReporter JMX monitoring for 'solr.node' (registry 'solr.node') enabled at server: com.sun.jmx.mbeanserver.JmxMBeanServer@6d545ec0
   [junit4]   2> 544386 INFO  (TEST-MultiThreadedOCPTest.test-seed#[8CF5354BE2DFDDD7]) [    ] o.a.s.m.r.SolrJmxReporter JMX monitoring for 'solr.jvm' (registry 'solr.jvm') enabled at server: com.sun.jmx.mbeanserver.JmxMBeanServer@6d545ec0
   [junit4]   2> 544387 INFO  (TEST-MultiThreadedOCPTest.test-seed#[8CF5354BE2DFDDD7]) [    ] o.a.s.m.r.SolrJmxReporter JMX monitoring for 'solr.jetty' (registry 'solr.jetty') enabled at server: com.sun.jmx.mbeanserver.JmxMBeanServer@6d545ec0
   [junit4]   2> 544388 INFO  (TEST-MultiThreadedOCPTest.test-seed#[8CF5354BE2DFDDD7]) [    ] o.a.s.c.CorePropertiesLocator Found 0 core definitions underneath /home/jenkins/jenkins-slave/workspace/Lucene-Solr-Tests-master/solr/build/solr-core/test/J0/../../../../../../../../../../home/jenkins/jenkins-slave/workspace/Lucene-Solr-Tests-master/solr/build/solr-core/test/J0/temp/solr.cloud.MultiThreadedOCPTest_8CF5354BE2DFDDD7-001/shard-1-001/cores
   [junit4]   2> 544528 INFO  (qtp684862728-2443) [n:127.0.0.1:33998_    ] o.a.s.h.a.CollectionsHandler Invoked Collection Action :addreplica with params node=127.0.0.1:40400_&action=ADDREPLICA&collection=collection1&shard=shard2&type=NRT&wt=javabin&version=2 and sendToOCPQueue=true
   [junit4]   2> 544532 INFO  (OverseerThreadFactory-1165-thread-3-processing-n:127.0.0.1:33998_) [n:127.0.0.1:33998_ c:collection1 s:shard2  ] o.a.s.c.a.c.AddReplicaCmd Node Identified 127.0.0.1:40400_ for creating new replica of shard shard2 for collection collection1
   [junit4]   2> 544558 INFO  (qtp1948975764-2497) [n:127.0.0.1:40400_    x:collection1_shard2_replica_n41] o.a.s.h.a.CoreAdminOperation core create command qt=/admin/cores&collection.configName=conf1&name=collection1_shard2_replica_n41&action=CREATE&collection=collection1&shard=shard2&wt=javabin&version=2&replicaType=NRT
   [junit4]   2> 545827 INFO  (qtp1948975764-2497) [n:127.0.0.1:40400_ c:collection1 s:shard2  x:collection1_shard2_replica_n41] o.a.s.c.SolrConfig Using Lucene MatchVersion: 8.0.0
   [junit4]   2> 545920 INFO  (qtp1948975764-2497) [n:127.0.0.1:40400_ c:collection1 s:shard2  x:collection1_shard2_replica_n41] o.a.s.s.IndexSchema [collection1_shard2_replica_n41] Schema name=test
   [junit4]   2> 546713 INFO  (qtp1948975764-2497) [n:127.0.0.1:40400_ c:collection1 s:shard2  x:collection1_shard2_replica_n41] o.a.s.s.IndexSchema Loaded schema test/1.0 with uniqueid field id
   [junit4]   2> 546805 INFO  (qtp1948975764-2497) [n:127.0.0.1:40400_ c:collection1 s:shard2  x:collection1_shard2_replica_n41] o.a.s.c.CoreContainer Creating SolrCore 'collection1_shard2_replica_n41' using configuration from collection collection1, trusted=true
   [junit4]   2> 546805 INFO  (qtp1948975764-2497) [n:127.0.0.1:40400_ c:collection1 s:shard2  x:collection1_shard2_replica_n41] o.a.s.m.r.SolrJmxReporter JMX monitoring for 'solr.core.collection1.shard2.replica_n41' (registry 'solr.core.collection1.shard2.replica_n41') enabled at server: com.sun.jmx.mbeanserver.JmxMBeanServer@6d545ec0
   [junit4]   2> 546806 INFO  (qtp1948975764-2497) [n:127.0.0.1:40400_ c:collection1 s:shard2  x:collection1_shard2_replica_n41] o.a.s.c.SolrCore [[collection1_shard2_replica_n41] ] Opening new SolrCore at [/home/jenkins/jenkins-slave/workspace/Lucene-Solr-Tests-master/solr/build/solr-core/test/J0/temp/solr.cloud.MultiThreadedOCPTest_8CF5354BE2DFDDD7-001/shard-1-001/cores/collection1_shard2_replica_n41], dataDir=[/home/jenkins/jenkins-slave/workspace/Lucene-Solr-Tests-master/solr/build/solr-core/test/J0/../../../../../../../../../../home/jenkins/jenkins-slave/workspace/Lucene-Solr-Tests-master/solr/build/solr-core/test/J0/temp/solr.cloud.MultiThreadedOCPTest_8CF5354BE2DFDDD7-001/shard-1-001/cores/collection1_shard2_replica_n41/data/]
   [junit4]   2> 546820 INFO  (qtp1948975764-2497) [n:127.0.0.1:40400_ c:collection1 s:shard2  x:collection1_shard2_replica_n41] o.a.s.u.RandomMergePolicy RandomMergePolicy wrapping class org.apache.lucene.index.TieredMergePolicy: [TieredMergePolicy: maxMergeAtOnce=31, maxMergeAtOnceExplicit=23, maxMergedSegmentMB=8.1533203125, floorSegmentMB=1.4375, forceMergeDeletesPctAllowed=0.7494260611669079, segmentsPerTier=32.0, maxCFSSegmentSizeMB=8.796093022207999E12, noCFSRatio=0.26427385425341954, deletesPctAllowed=46.58226665086998
   [junit4]   2> 546862 WARN  (qtp1948975764-2497) [n:127.0.0.1:40400_ c:collection1 s:shard2  x:collection1_shard2_replica_n41] o.a.s.c.RequestHandlers INVALID paramSet a in requestHandler {type = requestHandler,name = /dump,class = DumpRequestHandler,attributes = {initParams=a, name=/dump, class=DumpRequestHandler},args = {defaults={a=A,b=B}}}
   [junit4]   2> 547148 INFO  (qtp1948975764-2497) [n:127.0.0.1:40400_ c:collection1 s:shard2  x:collection1_shard2_replica_n41] o.a.s.u.UpdateHandler Using UpdateLog implementation: org.apache.solr.update.UpdateLog
   [junit4]   2> 547148 INFO  (qtp1948975764-2497) [n:127.0.0.1:40400_ c:collection1 s:shard2  x:collection1_shard2_replica_n41] o.a.s.u.UpdateLog Initializing UpdateLog: dataDir= defaultSyncLevel=FLUSH numRecordsToKeep=100 maxNumLogsToKeep=10 numVersionBuckets=65536
   [junit4]   2> 547149 INFO  (qtp1948975764-2497) [n:127.0.0.1:40400_ c:collection1 s:shard2  x:collection1_shard2_replica_n41] o.a.s.u.CommitTracker Hard AutoCommit: disabled
   [junit4]   2> 547150 INFO  (qtp1948975764-2497) [n:127.0.0.1:40400_ c:collection1 s:shard2  x:collection1_shard2_replica_n41] o.a.s.u.CommitTracker Soft AutoCommit: disabled
   [junit4]   2> 547150 INFO  (qtp1948975764-2497) [n:127.0.0.1:40400_ c:collection1 s:shard2  x:collection1_shard2_replica_n41] o.a.s.u.RandomMergePolicy RandomMergePolicy wrapping class org.apache.lucene.index.TieredMergePolicy: [TieredMergePolicy: maxMergeAtOnce=37, maxMergeAtOnceExplicit=37, maxMergedSegmentMB=2.8017578125, floorSegmentMB=0.66796875, forceMergeDeletesPctAllowed=10.189022506962377, segmentsPerTier=50.0, maxCFSSegmentSizeMB=8.796093022207999E12, noCFSRatio=0.33441521575470806, deletesPctAllowed=34.36809559880493
   [junit4]   2> 547151 INFO  (qtp1948975764-2497) [n:127.0.0.1:40400_ c:collection1 s:shard2  x:collection1_shard2_replica_n41] o.a.s.s.SolrIndexSearcher Opening [Searcher@384d33c7[collection1_shard2_replica_n41] main]
   [junit4]   2> 547152 INFO  (qtp1948975764-2497) [n:127.0.0.1:40400_ c:collection1 s:shard2  x:collection1_shard2_replica_n41] o.a.s.r.ManagedResourceStorage Configured ZooKeeperStorageIO with znodeBase: /configs/conf1
   [junit4]   2> 547185 INFO  (qtp1948975764-2497) [n:127.0.0.1:40400_ c:collection1 s:shard2  x:collection1_shard2_replica_n41] o.a.s.r.ManagedResourceStorage Loaded null at path _rest_managed.json using ZooKeeperStorageIO:path=/configs/conf1
   [junit4]   2> 547185 INFO  (qtp1948975764-2497) [n:127.0.0.1:40400_ c:collection1 s:shard2  x:collection1_shard2_replica_n41] o.a.s.h.ReplicationHandler Commits will be reserved for 10000ms.
   [junit4]   2> 547186 INFO  (searcherExecutor-1184-thread-1-processing-n:127.0.0.1:40400_ x:collection1_shard2_replica_n41 c:collection1 s:shard2) [n:127.0.0.1:40400_ c:collection1 s:shard2  x:collection1_shard2_replica_n41] o.a.s.c.SolrCore [collection1_shard2_replica_n41] Registered new searcher Searcher@384d33c7[collection1_shard2_replica_n41] main{ExitableDirectoryReader(UninvertingDirectoryReader())}
   [junit4]   2> 547187 INFO  (qtp1948975764-2497) [n:127.0.0.1:40400_ c:collection1 s:shard2  x:collection1_shard2_replica_n41] o.a.s.u.UpdateLog Could not find max version in index or recent updates, using new clock 1613142996317896704
   [junit4]   2> 547194 INFO  (qtp1948975764-2497) [n:127.0.0.1:40400_ c:collection1 s:shard2  x:collection1_shard2_replica_n41] o.a.s.c.ZkShardTerms Successful update of terms at /collections/collection1/terms/shard2 to Terms{values={core_node42=0}, version=0}
   [junit4]   2> 547196 INFO  (qtp1948975764-2497) [n:127.0.0.1:40400_ c:collection1 s:shard2  x:collection1_shard2_replica_n41] o.a.s.c.ShardLeaderElectionContext Enough replicas found to continue.
   [junit4]   2> 547196 INFO  (qtp1948975764-2497) [n:127.0.0.1:40400_ c:collection1 s:shard2  x:collection1_shard2_replica_n41] o.a.s.c.ShardLeaderElectionContext I may be the new leader - try and sync
   [junit4]   2> 547196 INFO  (qtp1948975764-2497) [n:127.0.0.1:40400_ c:collection1 s:shard2  x:collection1_shard2_replica_n41] o.a.s.c.SyncStrategy Sync replicas to http://127.0.0.1:40400/collection1_shard2_replica_n41/
   [junit4]   2> 547196 INFO  (qtp1948975764-2497) [n:127.0.0.1:40400_ c:collection1 s:shard2  x:collection1_shard2_replica_n41] o.a.s.c.SyncStrategy Sync Success - now sync replicas to me
   [junit4]   2> 547196 INFO  (qtp1948975764-2497) [n:127.0.0.1:40400_ c:collection1 s:shard2  x:collection1_shard2_replica_n41] o.a.s.c.SyncStrategy http://127.0.0.1:40400/collection1_shard2_replica_n41/ has no replicas
   [junit4]   2> 547196 INFO  (qtp1948975764-2497) [n:127.0.0.1:40400_ c:collection1 s:shard2  x:collection1_shard2_replica_n41] o.a.s.c.ShardLeaderElectionContext Found all replicas participating in election, clear LIR
   [junit4]   2> 547220 INFO  (qtp1948975764-2497) [n:127.0.0.1:40400_ c:collection1 s:shard2  x:collection1_shard2_replica_n41] o.a.s.c.ShardLeaderElectionContext I am the new leader: http://127.0.0.1:40400/collection1_shard2_replica_n41/ shard2
   [junit4]   2> 547271 INFO  (qtp1948975764-2497) [n:127.0.0.1:40400_ c:collection1 s:shard2  x:collection1_shard2_replica_n41] o.a.s.c.ZkController I am the leader, no recovery necessary
   [junit4]   2> 547274 INFO  (qtp1948975764-2497) [n:127.0.0.1:40400_ c:collection1 s:shard2  x:collection1_shard2_replica_n41] o.a.s.s.HttpSolrCall [admin] webapp=null path=/admin/cores params={qt=/admin/cores&collection.configName=conf1&name=collection1_shard2_replica_n41&action=CREATE&collection=collection1&shard=shard2&wt=javabin&version=2&replicaType=NRT} status=0 QTime=2716
   [junit4]   2> 547297 INFO  (qtp684862728-2443) [n:127.0.0.1:33998_ c:collection1   ] o.a.s.s.HttpSolrCall [admin] webapp=null path=/admin/collections params={node=127.0.0.1:40400_&action=ADDREPLICA&collection=collection1&shard=shard2&type=NRT&wt=javabin&version=2} status=0 QTime=2768
   [junit4]   2> 548444 INFO  (TEST-MultiThreadedOCPTest.test-seed#[8CF5354BE2DFDDD7]) [    ] o.a.s.c.AbstractFullDistribZkTestBase create jetty 2 in directory /home/jenkins/jenkins-slave/workspace/Lucene-Solr-Tests-master/solr/build/solr-core/test/J0/temp/solr.cloud.MultiThreadedOCPTest_8CF5354BE2DFDDD7-001/shard-2-001 of type NRT
   [junit4]   2> 548445 INFO  (TEST-MultiThreadedOCPTest.test-seed#[8CF5354BE2DFDDD7]) [    ] o.e.j.s.Server jetty-9.4.11.v20180605; built: 2018-06-05T18:24:03.829Z; git: d5fc0523cfa96bfebfbda19606cad384d772f04c; jvm 1.8.0_172-b11
   [junit4]   2> 548446 INFO  (TEST-MultiThreadedOCPTest.test-seed#[8CF5354BE2DFDDD7]) [    ] o.e.j.s.session DefaultSessionIdManager workerName=node0
   [junit4]   2> 548446 INFO  (TEST-MultiThreadedOCPTest.test-seed#[8CF5354BE2DFDDD7]) [    ] o.e.j.s.session No SessionScavenger set, using defaults
   [junit4]   2> 548446 INFO  (TEST-MultiThreadedOCPTest.test-seed#[8CF5354BE2DFDDD7]) [    ] o.e.j.s.session node0 Scavenging every 660000ms
   [junit4]   2> 548446 INFO  (TEST-MultiThreadedOCPTest.test-seed#[8CF5354BE2DFDDD7]) [    ] o.e.j.s.h.ContextHandler Started o.e.j.s.ServletContextHandler@3fbb03ff{/,null,AVAILABLE}
   [junit4]   2> 548447 INFO  (TEST-MultiThreadedOCPTest.test-seed#[8CF5354BE2DFDDD7]) [    ] o.e.j.s.AbstractConnector Started ServerConnector@a4e92f5{HTTP/1.1,[http/1.1]}{127.0.0.1:39392}
   [junit4]   2> 548447 INFO  (TEST-MultiThreadedOCPTest.test-seed#[8CF5354BE2DFDDD7]) [    ] o.e.j.s.Server Started @548840ms
   [junit4]   2> 548447 INFO  (TEST-MultiThreadedOCPTest.test-seed#[8CF5354BE2DFDDD7]) [    ] o.a.s.c.s.e.JettySolrRunner Jetty properties: {solr.data.dir=/home/jenkins/jenkins-slave/workspace/Lucene-Solr-Tests-master/solr/build/solr-core/test/J0/temp/solr.cloud.MultiThreadedOCPTest_8CF5354BE2DFDDD7-001/tempDir-001/jetty2, replicaType=NRT, solrconfig=solrconfig.xml, hostContext=/, hostPort=39392, coreRootDirectory=/home/jenkins/jenkins-slave/workspace/Lucene-Solr-Tests-master/solr/build/solr-core/test/J0/temp/solr.cloud.MultiThreadedOCPTest_8CF5354BE2DFDDD7-001/shard-2-001/cores}
   [junit4]   2> 548447 ERROR (TEST-MultiThreadedOCPTest.test-seed#[8CF5354BE2DFDDD7]) [    ] o.a.s.u.StartupLoggingUtils Missing Java Option solr.log.dir. Logging may be missing or incomplete.
   [junit4]   2> 548461 INFO  (TEST-MultiThreadedOCPTest.test-seed#[8CF5354BE2DFDDD7]) [    ] o.a.s.s.SolrDispatchFilter Using logger factory org.apache.logging.slf4j.Log4jLoggerFactory
   [junit4]   2> 548461 INFO  (TEST-MultiThreadedOCPTest.test-seed#[8CF5354BE2DFDDD7]) [    ] o.a.s.s.SolrDispatchFilter  ___      _       Welcome to Apache Solr? version 8.0.0
   [junit4]   2> 548461 INFO  (TEST-MultiThreadedOCPTest.test-seed#[8CF5354BE2DFDDD7]) [    ] o.a.s.s.SolrDispatchFilter / __| ___| |_ _   Starting in cloud mode on port null
   [junit4]   2> 548461 INFO  (TEST-MultiThreadedOCPTest.test-seed#[8CF5354BE2DFDDD7]) [    ] o.a.s.s.SolrDispatchFilter \__ \/ _ \ | '_|  Install dir: null
   [junit4]   2> 548461 INFO  (TEST-MultiThreadedOCPTest.test-seed#[8CF5354BE2DFDDD7]) [    ] o.a.s.s.SolrDispatchFilter |___/\___/_|_|    Start time: 2018-10-01T16:57:25.553Z
   [junit4]   2> 548519 INFO  (zkConnectionManagerCallback-547-thread-1) [    ] o.a.s.c.c.ConnectionManager zkClient has connected
   [junit4]   2> 548521 INFO  (TEST-MultiThreadedOCPTest.test-seed#[8CF5354BE2DFDDD7]) [    ] o.a.s.s.SolrDispatchFilter Loading solr.xml from SolrHome (not found in ZooKeeper)
   [junit4]   2> 548521 INFO  (TEST-MultiThreadedOCPTest.test-seed#[8CF5354BE2DFDDD7]) [    ] o.a.s.c.SolrXmlConfig Loading container configuration from /home/jenkins/jenkins-slave/workspace/Lucene-Solr-Tests-master/solr/build/solr-core/test/J0/temp/solr.cloud.MultiThreadedOCPTest_8CF5354BE2DFDDD7-001/shard-2-001/solr.xml
   [junit4]   2> 548537 INFO  (TEST-MultiThreadedOCPTest.test-seed#[8CF5354BE2DFDDD7]) [    ] o.a.s.c.SolrXmlConfig Configuration parameter autoReplicaFailoverWorkLoopDelay is ignored
   [junit4]   2> 548537 INFO  (TEST-MultiThreadedOCPTest.test-seed#[8CF5354BE2DFDDD7]) [    ] o.a.s.c.SolrXmlConfig Configuration parameter autoReplicaFailoverBadNodeExpiration is ignored
   [junit4]   2> 548555 INFO  (TEST-MultiThreadedOCPTest.test-seed#[8CF5354BE2DFDDD7]) [    ] o.a.s.c.SolrXmlConfig MBean server found: com.sun.jmx.mbeanserver.JmxMBeanServer@6d545ec0, but no JMX reporters were configured - adding default JMX reporter.
   [junit4]   2> 548717 INFO  (OverseerCollectionConfigSetProcessor-73417494215327748-127.0.0.1:33998_-n_0000000000) [n:127.0.0.1:33998_    ] o.a.s.c.OverseerTaskQueue Response ZK path: /overseer/collection-queue-work/qnr-0000000004 doesn't exist.  Requestor may have disconnected from ZooKeeper
   [junit4]   2> 548962 INFO  (TEST-MultiThreadedOCPTest.test-seed#[8CF5354BE2DFDDD7]) [    ] o.a.s.c.ZkContainer Zookeeper client=127.0.0.1:42410/solr
   [junit4]   2> 548973 INFO  (zkConnectionManagerCallback-551-thread-1) [    ] o.a.s.c.c.ConnectionManager zkClient has connected
   [junit4]   2> 548976 INFO  (zkConnectionManagerCallback-553-thread-1) [    ] o.a.s.c.c.ConnectionManager zkClient has connected
   [junit4]   2> 548995 INFO  (TEST-MultiThreadedOCPTest.test-seed#[8CF5354BE2DFDDD7]) [    ] o.a.s.c.c.ZkStateReader Updated live nodes from ZooKeeper... (0) -> (2)
   [junit4]   2> 549000 INFO  (TEST-MultiThreadedOCPTest.test-seed#[8CF5354BE2DFDDD7]) [    ] o.a.s.c.TransientSolrCoreCacheDefault Allocating transient cache for 4 transient cores
   [junit4]   2> 549000 INFO  (TEST-MultiThreadedOCPTest.test-seed#[8CF5354BE2DFDDD7]) [    ] o.a.s.c.ZkController Register node as live in ZooKeeper:/live_nodes/127.0.0.1:39392_
   [junit4]   2> 549010 INFO  (zkCallback-510-thread-1) [    ] o.a.s.c.c.ZkStateReader Updated live nodes from ZooKeeper... (2) -> (3)
   [junit4]   2> 549011 INFO  (zkCallback-517-thread-1) [    ] o.a.s.c.c.ZkStateReader Updated live nodes from ZooKeeper... (2) -> (3)
   [junit4]   2> 549011 INFO  (zkCallback-543-thread-1) [    ] o.a.s.c.c.ZkStateReader Updated live nodes from ZooKeeper... (2) -> (3)
   [junit4]   2> 549011 INFO  (zkCallback-528-thread-1) [    ] o.a.s.c.c.ZkStateReader Updated live nodes from ZooKeeper... (2) -> (3)
   [junit4]   2> 549025 INFO  (zkCallback-536-thread-1) [    ] o.a.s.c.c.ZkStateReader Updated live nodes from ZooKeeper... (2) -> (3)
   [junit4]   2> 549026 INFO  (zkCallback-552-thread-1) [    ] o.a.s.c.c.ZkStateReader Updated live nodes from ZooKeeper... (2) -> (3)
   [junit4]   2> 549090 INFO  (zkConnectionManagerCallback-560-thread-1) [    ] o.a.s.c.c.ConnectionManager zkClient has connected
   [junit4]   2> 549092 INFO  (TEST-MultiThreadedOCPTest.test-seed#[8CF5354BE2DFDDD7]) [    ] o.a.s.c.c.ZkStateReader Updated live nodes from ZooKeeper... (0) -> (3)
   [junit4]   2> 549093 INFO  (TEST-MultiThreadedOCPTest.test-seed#[8CF5354BE2DFDDD7]) [    ] o.a.s.c.s.i.ZkClientClusterStateProvider Cluster at 127.0.0.1:42410/solr ready
   [junit4]   2> 549094 INFO  (TEST-MultiThreadedOCPTest.test-seed#[8CF5354BE2DFDDD7]) [    ] o.a.s.h.a.MetricsHistoryHandler No .system collection, keeping metrics history in memory.
   [junit4]   2> 549152 INFO  (TEST-MultiThreadedOCPTest.test-seed#[8CF5354BE2DFDDD7]) [    ] o.a.s.m.r.SolrJmxReporter JMX monitoring for 'solr.node' (registry 'solr.node') enabled at server: com.sun.jmx.mbeanserver.JmxMBeanServer@6d545ec0
   [junit4]   2> 549169 INFO  (TEST-MultiThreadedOCPTest.test-seed#[8CF5354BE2DFDDD7]) [    ] o.a.s.m.r.SolrJmxReporter JMX monitoring for 'solr.jvm' (registry 'solr.jvm') enabled at server: com.sun.jmx.mbeanserver.JmxMBeanServer@6d545ec0
   [junit4]   2> 549170 INFO  (TEST-MultiThreadedOCPTest.test-seed#[8CF5354BE2DFDDD7]) [    ] o.a.s.m.r.SolrJmxReporter JMX monitoring for 'solr.jetty' (registry 'solr.jetty') enabled at server: com.sun.jmx.mbeanserver.JmxMBeanServer@6d545ec0
   [junit4]   2> 549171 INFO  (TEST-MultiThreadedOCPTest.test-seed#[8CF5354BE2DFDDD7]) [    ] o.a.s.c.CorePropertiesLocator Found 0 core definitions underneath /home/jenkins/jenkins-slave/workspace/Lucene-Solr-Tests-master/solr/build/solr-core/test/J0/temp/solr.cloud.MultiThreadedOCPTest_8CF5354BE2DFDDD7-001/shard-2-001/cores
   [junit4]   2> 549265 INFO  (qtp684862728-2439) [n:127.0.0.1:33998_    ] o.a.s.h.a.CollectionsHandler Invoked Collection Action :addreplica with params node=127.0.0.1:39392_&action=ADDREPLICA&collection=collection1&shard=shard1&type=NRT&wt=javabin&version=2 and sendToOCPQueue=true
   [junit4]   2> 549268 INFO  (OverseerThreadFactory-1165-thread-4-processing-n:127.0.0.1:33998_) [n:127.0.0.1:33998_ c:collection1 s:shard1  ] o.a.s.c.a.c.AddReplicaCmd Node Identified 127.0.0.1:39392_ for creating new replica of shard shard1 for collection collection1
   [junit4]   2> 549280 INFO  (qtp431472367-2535) [n:127.0.0.1:39392_    x:collection1_shard1_replica_n43] o.a.s.h.a.CoreAdminOperation core create command qt=/admin/cores&collection.configName=conf1&name=collection1_shard1_replica_n43&action=CREATE&collection=collection1&shard=shard1&wt=javabin&version=2&replicaType=NRT
   [junit4]   2> 550407 INFO  (qtp431472367-2535) [n:127.0.0.1:39392_ c:collection1 s:shard1  x:collection1_shard1_replica_n43] o.a.s.c.SolrConfig Using Lucene MatchVersion: 8.0.0
   [junit4]   2> 550555 INFO  (qtp431472367-2535) [n:127.0.0.1:39392_ c:collection1 s:shard1  x:collection1_shard1_replica_n43] o.a.s.s.IndexSchema [collection1_shard1_replica_n43] Schema name=test
   [junit4]   2> 551266 INFO  (qtp431472367-2535) [n:127.0.0.1:39392_ c:collection1 s:shard1  x:collection1_shard1_replica_n43] o.a.s.s.IndexSchema Loaded schema test/1.0 with uniqueid field id
   [junit4]   2> 551359 INFO  (qtp431472367-2535) [n:127.0.0.1:39392_ c:collection1 s:shard1  x:collection1_shard1_replica_n43] o.a.s.c.CoreContainer Creating SolrCore 'collection1_shard1_replica_n43' using configuration from collection collection1, trusted=true
   [junit4]   2> 551372 INFO  (qtp431472367-2535) [n:127.0.0.1:39392_ c:collection1 s:shard1  x:collection1_shard1_replica_n43] o.a.s.m.r.SolrJmxReporter JMX monitoring for 'solr.core.collection1.shard1.replica_n43' (registry 'solr.core.collection1.shard1.replica_n43') enabled at server: com.sun.jmx.mbeanserver.JmxMBeanServer@6d545ec0
   [junit4]   2> 551372 INFO  (qtp431472367-2535) [n:127.0.0.1:39392_ c:collection1 s:shard1  x:collection1_shard1_replica_n43] o.a.s.c.SolrCore [[collection1_shard1_replica_n43] ] Opening new SolrCore at [/home/jenkins/jenkins-slave/workspace/Lucene-Solr-Tests-master/solr/build/solr-core/test/J0/temp/solr.cloud.MultiThreadedOCPTest_8CF5354BE2DFDDD7-001/shard-2-001/cores/collection1_shard1_replica_n43], dataDir=[/home/jenkins/jenkins-slave/workspace/Lucene-Solr-Tests-master/solr/build/solr-core/test/J0/temp/solr.cloud.MultiThreadedOCPTest_8CF5354BE2DFDDD7-001/shard-2-001/cores/collection1_shard1_replica_n43/data/]
   [junit4]   2> 551539 INFO  (qtp431472367-2535) [n:127.0.0.1:39392_ c:collection1 s:shard1  x:collection1_shard1_replica_n43] o.a.s.u.RandomMergePolicy RandomMergePolicy wrapping class org.apache.lucene.index.TieredMergePolicy: [TieredMergePolicy: maxMergeAtOnce=31, maxMergeAtOnceExplicit=23, maxMergedSegmentMB=8.1533203125, floorSegmentMB=1.4375, forceMergeDeletesPctAllowed=0.7494260611669079, segmentsPerTier=32.0, maxCFSSegmentSizeMB=8.796093022207999E12, noCFSRatio=0.26427385425341954, deletesPctAllowed=46.58226665086998
   [junit4]   2> 551543 WARN  (qtp431472367-2535) [n:127.0.0.1:39392_ c:collection1 s:shard1  x:collection1_shard1_replica_n43] o.a.s.c.RequestHandlers INVALID paramSet a in requestHandler {type = requestHandler,name = /dump,class = DumpRequestHandler,attributes = {initParams=a, name=/dump, class=DumpRequestHandler},args = {defaults={a=A,b=B}}}
   [junit4]   2> 552001 INFO  (qtp431472367-2535) [n:127.0.0.1:39392_ c:collection1 s:shard1  x:collection1_shard1_replica_n43] o.a.s.u.UpdateHandler Using UpdateLog implementation: org.apache.solr.update.UpdateLog
   [junit4]   2> 552001 INFO  (qtp431472367-2535) [n:127.0.0.1:39392_ c:collection1 s:shard1  x:collection1_shard1_replica_n43] o.a.s.u.UpdateLog Initializing UpdateLog: dataDir= defaultSyncLevel=FLUSH numRecordsToKeep=100 maxNumLogsToKeep=10 numVersionBuckets=65536
   [junit4]   2> 552002 INFO  (qtp431472367-2535) [n:127.0.0.1:39392_ c:collection1 s:shard1  x:collection1_shard1_replica_n43] o.a.s.u.CommitTracker Hard AutoCommit: disabled
   [junit4]   2> 552002 INFO  (qtp431472367-2535) [n:127.0.0.1:39392_ c:collection1 s:shard1  x:collection1_shard1_replica_n43] o.a.s.u.CommitTracker Soft AutoCommit: disabled
   [junit4]   2> 552003 INFO  (qtp431472367-2535) [n:127.0.0.1:39392_ c:collection1 s:shard1  x:collection1_shard1_replica_n43] o.a.s.u.RandomMergePolicy RandomMergePolicy wrapping class org.apache.lucene.index.TieredMergePolicy: [TieredMergePolicy: maxMergeAtOnce=37, maxMergeAtOnceExplicit=37, maxMergedSegmentMB=2.8017578125, floorSegmentMB=0.66796875, forceMergeDeletesPctAllowed=10.189022506962377, segmentsPerTier=50.0, maxCFSSegmentSizeMB=8.796093022207999E12, noCFSRatio=0.33441521575470806, deletesPctAllowed=34.36809559880493
   [junit4]   2> 552003 INFO  (qtp431472367-2535) [n:127.0.0.1:39392_ c:collection1 s:shard1  x:collection1_shard1_replica_n43] o.a.s.s.SolrIndexSearcher Opening [Searcher@346bb93a[collection1_shard1_replica_n43] main]
   [junit4]   2> 552013 INFO  (qtp431472367-2535) [n:127.0.0.1:39392_ c:collection1 s:shard1  x:collection1_shard1_replica_n43] o.a.s.r.ManagedResourceStorage Configured ZooKeeperStorageIO with znodeBase: /configs/conf1
   [junit4]   2> 552014 INFO  (qtp431472367-2535) [n:127.0.0.1:39392_ c:collection1 s:shard1  x:collection1_shard1_replica_n43] o.a.s.r.ManagedResourceStorage Loaded null at path _rest_managed.json using ZooKeeperStorageIO:path=/configs/conf1
   [junit4]   2> 552014 INFO  (qtp431472367-2535) [n:127.0.0.1:39392_ c:collection1 s:shard1  x:collection1_shard1_replica_n43] o.a.s.h.ReplicationHandler Commits will be reserved for 10000ms.
   [junit4]   2> 552014 INFO  (qtp431472367-2535) [n:127.0.0.1:39392_ c:collection1 s:shard1  x:collection1_shard1_replica_n43] o.a.s.u.UpdateLog Could not find max version in index or recent updates, using new clock 1613143001379373056
   [junit4]   2> 552017 INFO  (searcherExecutor-1198-thread-1-processing-n:127.0.0.1:39392_ x:collection1_shard1_replica_n43 c:collection1 s:shard1) [n:127.0.0.1:39392_ c:collection1 s:shard1  x:collection1_shard1_replica_n43] o.a.s.c.SolrCore [collection1_shard1_replica_n43] Registered new searcher Searcher@346bb93a[collection1_shard1_replica_n43] main{ExitableDirectoryReader(UninvertingDirectoryReader())}
   [junit4]   2> 552103 INFO  (qtp431472367-2535) [n:127.0.0.1:39392_ c:collection1 s:shard1  x:collection1_shard1_replica_n43] o.a.s.c.ZkShardTerms Successful update of terms at /collections/collection1/terms/shard1 to Terms{values={core_node44=0}, version=0}
   [junit4]   2> 552106 INFO  (qtp431472367-2535) [n:127.0.0.1:39392_ c:collection1 s:shard1  x:collection1_shard1_replica_n43] o.a.s.c.ShardLeaderElectionContext Enough replicas found to continue.
   [junit4]   2> 552106 INFO  (qtp431472367-2535) [n:127.0.0.1:39392_ c:collection1 s:shard1  x:collection1_shard1_replica_n43] o.a.s.c.ShardLeaderElectionContext I may be the new leader - try and sync
   [junit4]   2> 552106 INFO  (qtp431472367-2535) [n:127.0.0.1:39392_ c:collection1 s:shard1  x:collection1_shard1_replica_n43] o.a.s.c.SyncStrategy Sync replicas to http://127.0.0.1:39392/collection1_shard1_replica_n43/
   [junit4]   2> 552106 INFO  (qtp431472367-2535) [n:127.0.0.1:39392_ c:collection1 s:shard1  x:collection1_shard1_replica_n43] o.a.s.c.SyncStrategy Sync Success - now sync replicas to me
   [junit4]   2> 552106 INFO  (qtp431472367-2535) [n:127.0.0.1:39392_ c:collection1 s:shard1  x:collection1_shard1_replica_n43] o.a.s.c.SyncStrategy http://127.0.0.1:39392/collection1_shard1_replica_n43/ has no replicas
   [junit4]   2> 552106 INFO  (qtp431472367-2535) [n:127.0.0.1:39392_ c:collection1 s:shard1  x:collection1_shard1_replica_n43] o.a.s.c.ShardLeaderElectionContext Found all replicas participating in election, clear LIR
   [junit4]   2> 552295 INFO  (qtp431472367-2535) [n:127.0.0.1:39392_ c:collection1 s:shard1  x:collection1_shard1_replica_n43] o.a.s.c.ShardLeaderElectionContext I am the new leader: http://127.0.0.1:39392/collection1_shard1_replica_n43/ shard1
   [junit4]   2> 552345 INFO  (qtp431472367-2535) [n:127.0.0.1:39392_ c:collection1 s:shard1  x:collection1_shard1_replica_n43] o.a.s.c.ZkController I am the leader, no recovery necessary
   [junit4]   2> 552368 INFO  (qtp431472367-2535) [n:127.0.0.1:39392_ c:collection1 s:shard1  x:collection1_shard1_replica_n43] o.a.s.s.HttpSolrCall [admin] webapp=null path=/admin/cores params={qt=/admin/cores&collection.configName=conf1&name=collection1_shard1_replica_n43&action=CREATE&collection=collection1&shard=shard1&wt=javabin&version=2&replicaType=NRT} status=0 QTime=3088
   [junit4]   2> 552488 INFO  (qtp684862728-2439) [n:127.0.0.1:33998_ c:collection1   ] o.a.s.s.HttpSolrCall [admin] webapp=null path=/admin/collections params={node=127.0.0.1:39392_&action=ADDREPLICA&collection=collection1&shard=shard1&type=NRT&wt=javabin&version=2} status=0 QTime=3223
   [junit4]   2> 553326 INFO  (OverseerCollectionConfigSetProcessor-73417494215327748-127.0.0.1:33998_-n_0000000000) [n:127.0.0.1:33998_    ] o.a.s.c.OverseerTaskQueue Response ZK path: /overseer/collection-queue-work/qnr-0000000006 doesn't exist.  Requestor may have disconnected from ZooKeeper
   [junit4]   2> 553777 INFO  (TEST-MultiThreadedOCPTest.test-seed#[8CF5354BE2DFDDD7]) [    ] o.a.s.c.AbstractFullDistribZkTestBase create jetty 3 in directory /home/jenkins/jenkins-slave/workspace/Lucene-Solr-Tests-master/solr/build/solr-core/test/J0/temp/solr.cloud.MultiThreadedOCPTest_8CF5354BE2DFDDD7-001/shard-3-001 of type NRT
   [junit4]   2> 553799 INFO  (TEST-MultiThreadedOCPTest.test-seed#[8CF5354BE2DFDDD7]) [    ] o.e.j.s.Server jetty-9.4.11.v20180605; built: 2018-06-05T18:24:03.829Z; git: d5fc0523cfa96bfebfbda19606cad384d772f04c; jvm 1.8.0_172-b11
   [junit4]   2> 553818 INFO  (TEST-MultiThreadedOCPTest.test-seed#[8CF5354BE2DFDDD7]) [    ] o.e.j.s.session DefaultSessionIdManager workerName=node0
   [junit4]   2> 553819 INFO  (TEST-MultiThreadedOCPTest.test-seed#[8CF5354BE2DFDDD7]) [    ] o.e.j.s.session No SessionScavenger set, using defaults
   [junit4]   2> 553819 INFO  (TEST-MultiThreadedOCPTest.test-seed#[8CF5354BE2DFDDD7]) [    ] o.e.j.s.session node0 Scavenging every 600000ms
   [junit4]   2> 553827 INFO  (TEST-MultiThreadedOCPTest.test-seed#[8CF5354BE2DFDDD7]) [    ] o.e.j.s.h.ContextHandler Started o.e.j.s.ServletContextHandler@79d34545{/,null,AVAILABLE}
   [junit4]   2> 553828 INFO  (TEST-MultiThreadedOCPTest.test-seed#[8CF5354BE2DFDDD7]) [    ] o.e.j.s.AbstractConnector Started ServerConnector@23d1e8b4{HTTP/1.1,[http/1.1]}{127.0.0.1:44332}
   [junit4]   2> 553828 INFO  (TEST-MultiThreadedOCPTest.test-seed#[8CF5354BE2DFDDD7]) [    ] o.e.j.s.Server Started @554221ms
   [junit4]   2> 553828 INFO  (TEST-MultiThreadedOCPTest.test-seed#[8CF5354BE2DFDDD7]) [    ] o.a.s.c.s.e.JettySolrRunner Jetty properties: {solr.data.dir=/home/jenkins/jenkins-slave/workspace/Lucene-Solr-Tests-master/solr/build/solr-core/test/J0/temp/solr.cloud.MultiThreadedOCPTest_8CF5354BE2DFDDD7-001/tempDir-001/jetty3, solrconfig=solrconfig.xml, hostContext=/, hostPort=44332, coreRootDirectory=/home/jenkins/jenkins-slave/workspace/Lucene-Solr-Tests-master/solr/build/solr-core/test/J0/../../../../../../../../../../home/jenkins/jenkins-slave/workspace/Lucene-Solr-Tests-master/solr/build/solr-core/test/J0/temp/solr.cloud.MultiThreadedOCPTest_8CF5354BE2DFDDD7-001/shard-3-001/cores}
   [junit4]   2> 553828 ERROR (TEST-MultiThreadedOCPTest.test-seed#[8CF5354BE2DFDDD7]) [    ] o.a.s.u.StartupLoggingUtils Missing Java Option solr.log.dir. Logging may be missing or incomplete.
   [junit4]   2> 553884 INFO  (TEST-MultiThreadedOCPTest.test-seed#[8CF5354BE2DFDDD7]) [    ] o.a.s.s.SolrDispatchFilter Using logger factory org.apache.logging.slf4j.Log4jLoggerFactory
   [junit4]   2> 553884 INFO  (TEST-MultiThreadedOCPTest.test-seed#[8CF5354BE2DFDDD7]) [    ] o.a.s.s.SolrDispatchFilter  ___      _       Welcome to Apache Solr? version 8.0.0
   [junit4]   2> 553884 INFO  (TEST-MultiThreadedOCPTest.test-seed#[8CF5354BE2DFDDD7]) [    ] o.a.s.s.SolrDispatchFilter / __| ___| |_ _   Starting in cloud mode on port null
   [junit4]   2> 553884 INFO  (TEST-MultiThreadedOCPTest.test-seed#[8CF5354BE2DFDDD7]) [    ] o.a.s.s.SolrDispatchFilter \__ \/ _ \ | '_|  Install dir: null
   [junit4]   2> 553884 INFO  (TEST-MultiThreadedOCPTest.test-seed#[8CF5354BE2DFDDD7]) [    ] o.a.s.s.SolrDispatchFilter |___/\___/_|_|    Start time: 2018-10-01T16:57:30.976Z
   [junit4]   2> 553916 INFO  (zkConnectionManagerCallback-563-thread-1) [    ] o.a.s.c.c.ConnectionManager zkClient has connected
   [junit4]   2> 553938 INFO  (TEST-MultiThreadedOCPTest.test-seed#[8CF5354BE2DFDDD7]) [    ] o.a.s.s.SolrDispatchFilter Loading solr.xml from SolrHome (not found in ZooKeeper)
   [junit4]   2> 553938 INFO  (TEST-MultiThreadedOCPTest.test-seed#[8CF5354BE2DFDDD7]) [    ] o.a.s.c.SolrXmlConfig Loading container configuration from /home/jenkins/jenkins-slave/workspace/Lucene-Solr-Tests-master/solr/build/solr-core/test/J0/temp/solr.cloud.MultiThreadedOCPTest_8CF5354BE2DFDDD7-001/shard-3-001/solr.xml
   [junit4]   2> 553984 INFO  (TEST-MultiThreadedOCPTest.test-seed#[8CF5354BE2DFDDD7]) [    ] o.a.s.c.SolrXmlConfig Configuration parameter autoReplicaFailoverWorkLoopDelay is ignored
   [junit4]   2> 553984 INFO  (TEST-MultiThreadedOCPTest.test-seed#[8CF5354BE2DFDDD7]) [    ] o.a.s.c.SolrXmlConfig Configuration parameter autoReplicaFailoverBadNodeExpiration is ignored
   [junit4]   2> 553997 INFO  (TEST-MultiThreadedOCPTest.test-seed#[8CF5354BE2DFDDD7]) [    ] o.a.s.c.SolrXmlConfig MBean server found: com.sun.jmx.mbeanserver.JmxMBeanServer@6d545ec0, but no JMX reporters were configured - adding default JMX reporter.
   [junit4]   2> 554465 INFO  (TEST-MultiThreadedOCPTest.test-seed#[8CF5354BE2DFDDD7]) [    ] o.a.s.c.ZkContainer Zookeeper client=127.0.0.1:42410/solr
   [junit4]   2> 554481 INFO  (zkConnectionManagerCallback-567-thread-1) [    ] o.a.s.c.c.ConnectionManager zkClient has connected
   [junit4]   2> 554502 INFO  (zkConnectionManagerCallback-569-thread-1) [    ] o.a.s.c.c.ConnectionManager zkClient has connected
   [junit4]   2> 554547 INFO  (TEST-MultiThreadedOCPTest.test-seed#[8CF5354BE2DFDDD7]) [    ] o.a.s.c.c.ZkStateReader Updated live nodes from ZooKeeper... (0) -> (3)
   [junit4]   2> 554578 INFO  (TEST-MultiThreadedOCPTest.test-seed#[8CF5354BE2DFDDD7]) [    ] o.a.s.c.TransientSolrCoreCacheDefault Allocating transient cache for 4 transient cores
   [junit4]   2> 554578 INFO  (TEST-MultiThreadedOCPTest.test-seed#[8CF5354BE2DFDDD7]) [    ] o.a.s.c.ZkController Register node as live in ZooKeeper:/live_nodes/127.0.0.1:44332_
   [junit4]   2> 554594 INFO  (zkCallback-517-thread-1) [    ] o.a.s.c.c.ZkStateReader Updated live nodes from ZooKeeper... (3) -> (4)
   [junit4]   2> 554595 INFO  (zkCallback-543-thread-1) [    ] o.a.s.c.c.ZkStateReader Updated live nodes from ZooKeeper... (3) -> (4)
   [junit4]   2> 554602 INFO  (zkCallback-528-thread-1) [    ] o.a.s.c.c.ZkStateReader Updated live nodes from ZooKeeper... (3) -> (4)
   [junit4]   2> 554602 INFO  (zkCallback-559-thread-1) [    ] o.a.s.c.c.ZkStateReader Updated live nodes from ZooKeeper... (3) -> (4)
   [junit4]   2> 554610 INFO  (zkCallback-552-thread-1) [    ] o.a.s.c.c.ZkStateReader Updated live nodes from ZooKeeper... (3) -> (4)
   [junit4]   2> 554618 INFO  (zkCallback-510-thread-2) [    ] o.a.s.c.c.ZkStateReader Updated live nodes from ZooKeeper... (3) -> (4)
   [junit4]   2> 554618 INFO  (zkCallback-536-thread-1) [    ] o.a.s.c.c.ZkStateReader Updated live nodes from ZooKeeper... (3) -> (4)
   [junit4]   2> 554676 INFO  (zkCallback-568-thread-1) [    ] o.a.s.c.c.ZkStateReader Updated live nodes from ZooKeeper... (3) -> (4)
   [junit4]   2> 554718 INFO  (zkConnectionManagerCallback-576-thread-1) [    ] o.a.s.c.c.ConnectionManager zkClient has connected
   [junit4]   2> 554719 INFO  (TEST-MultiThreadedOCPTest.test-seed#[8CF5354BE2DFDDD7]) [    ] o.a.s.c.c.ZkStateReader Updated live nodes from ZooKeeper... (0) -> (4)
   [junit4]   2> 554733 INFO  (TEST-MultiThreadedOCPTest.test-seed#[8CF5354BE2DFDDD7]) [    ] o.a.s.c.s.i.ZkClientClusterStateProvider Cluster at 127.0.0.1:42410/solr ready
   [junit4]   2> 554733 INFO  (TEST-MultiThreadedOCPTest.test-seed#[8CF5354BE2DFDDD7]) [    ] o.a.s.h.a.MetricsHistoryHandler No .system collection, keeping metrics history in memory.
   [junit4]   2> 554837 INFO  (TEST-MultiThreadedOCPTest.test-seed#[8CF5354BE2DFDDD7]) [    ] o.a.s.m.r.SolrJmxReporter JMX monitoring for 'solr.node' (registry 'solr.node') enabled at server: com.sun.jmx.mbeanserver.JmxMBeanServer@6d545ec0
   [junit4]   2> 554909 INFO  (TEST-MultiThreadedOCPTest.test-seed#[8CF5354BE2DFDDD7]) [    ] o.a.s.m.r.SolrJmxReporter JMX monitoring for 'solr.jvm' (registry 'solr.jvm') enabled at server: com.sun.jmx.mbeanserver.JmxMBeanServer@6d545ec0
   [junit4]   2> 554909 INFO  (TEST-MultiThreadedOCPTest.test-seed#[8CF5354BE2DFDDD7]) [    ] o.a.s.m.r.SolrJmxReporter JMX monitoring for 'solr.jetty' (registry 'solr.jetty') enabled at server: com.sun.jmx.mbeanserver.JmxMBeanServer@6d545ec0
   [junit4]   2> 554927 INFO  (TEST-MultiThreadedOCPTest.test-seed#[8CF5354BE2DFDDD7]) [    ] o.a.s.c.CorePropertiesLocator Found 0 core definitions underneath /home/jenkins/jenkins-slave/workspace/Lucene-Solr-Tests-master/solr/build/solr-core/test/J0/../../../../../../../../../../home/jenkins/jenkins-slave/workspace/Lucene-Solr-Tests-master/solr/build/solr-core/test/J0/temp/solr.cloud.MultiThreadedOCPTest_8CF5354BE2DFDDD7-001/shard-3-001/cores
   [junit4]   2> 555122 INFO  (qtp684862728-2443) [n:127.0.0.1:33998_    ] o.a.s.h.a.CollectionsHandler Invoked Collection Action :addreplica with params node=127.0.0.1:44332_&action=ADDREPLICA&collection=collection1&shard=shard2&type=NRT&wt=javabin&version=2 and sendToOCPQueue=true
   [junit4]   2> 555125 INFO  (OverseerThreadFactory-1165-thread-5-processing-n:127.0.0.1:33998_) [n:127.0.0.1:33998_ c:collection1 s:shard2  ] o.a.s.c.a.c.AddReplicaCmd Node Identified 127.0.0.1:44332_ for creating new replica of shard shard2 for collection collection1
   [junit4]   2> 555175 INFO  (qtp931037256-2573) [n:127.0.0.1:44332_    x:collection1_shard2_replica_n45] o.a.s.h.a.CoreAdminOperation core create command qt=/admin/cores&collection.configName=conf1&name=collection1_shard2_replica_n45&action=CREATE&collection=collection1&shard=shard2&wt=javabin&version=2&replicaType=NRT
   [junit4]   2> 556312 INFO  (qtp931037256-2573) [n:127.0.0.1:44332_ c:collection1 s:shard2  x:collection1_shard2_replica_n45] o.a.s.c.SolrConfig Using Lucene MatchVersion: 8.0.0
   [junit4]   2> 556386 INFO  (qtp931037256-2573) [n:127.0.0.1:44332_ c:collection1 s:shard2  x:collection1_shard2_replica_n45] o.a.s.s.IndexSchema [collection1_shard2_replica_n45] Schema name=test
   [junit4]   2> 557051 INFO  (qtp931037256-2573) [n:127.0.0.1:44332_ c:collection1 s:shard2  x:collection1_shard2_replica_n45] o.a.s.s.IndexSchema Loaded schema test/1.0 with uniqueid field id
   [junit4]   2> 557131 INFO  (qtp931037256-2573) [n:127.0.0.1:44332_ c:collection1 s:shard2  x:collection1_shard2_replica_n45] o.a.s.c.CoreContainer Creating SolrCore 'collection1_shard2_replica_n45' using configuration from collection collection1, trusted=true
   [junit4]   2> 557132 INFO  (qtp931037256-2573) [n:127.0.0.1:44332_ c:collection1 s:shard2  x:collection1_shard2_replica_n45] o.a.s.m.r.SolrJmxReporter JMX monitoring for 'solr.core.collection1.shard2.replica_n45' (registry 'solr.core.collection1.shard2.replica_n45') enabled at server: com.sun.jmx.mbeanserver.JmxMBeanServer@6d545ec0
   [junit4]   2> 557132 INFO  (qtp931037256-2573) [n:127.0.0.1:44332_ c:collection1 s:shard2  x:collection1_shard2_replica_n45] o.a.s.c.SolrCore [[collection1_shard2_replica_n45] ] Opening new SolrCore at [/home/jenkins/jenkins-slave/workspace/Lucene-Solr-Tests-master/solr/build/solr-core/test/J0/temp/solr.cloud.MultiThreadedOCPTest_8CF5354BE2DFDDD7-001/shard-3-001/cores/collection1_shard2_replica_n45], dataDir=[/home/jenkins/jenkins-slave/workspace/Lucene-Solr-Tests-master/solr/build/solr-core/test/J0/../../../../../../../../../../home/jenkins/jenkins-slave/workspace/Lucene-Solr-Tests-master/solr/build/solr-core/test/J0/temp/solr.cloud.MultiThreadedOCPTest_8CF5354BE2DFDDD7-001/shard-3-001/cores/collection1_shard2_replica_n45/data/]
   [junit4]   2> 557146 INFO  (qtp931037256-2573) [n:127.0.0.1:44332_ c:collection1 s:shard2  x:collection1_shard2_replica_n45] o.a.s.u.RandomMergePolicy RandomMergePolicy wrapping class org.apache.lucene.index.TieredMergePolicy: [TieredMergePolicy: maxMergeAtOnce=31, maxMergeAtOnceExplicit=23, maxMergedSegmentMB=8.1533203125, floorSegmentMB=1.4375, forceMergeDeletesPctAllowed=0.7494260611669079, segmentsPerTier=32.0, maxCFSSegmentSizeMB=8.796093022207999E12, noCFSRatio=0.26427385425341954, deletesPctAllowed=46.58226665086998
   [junit4]   2> 557173 WARN  (qtp931037256-2573) [n:127.0.0.1:44332_ c:collection1 s:shard2  x:collection1_shard2_replica_n45] o.a.s.c.RequestHandlers INVALID paramSet a in requestHandler {type = requestHandler,name = /dump,class = DumpRequestHandler,attributes = {initParams=a, name=/dump, class=DumpRequestHandler},args = {defaults={a=A,b=B}}}
   [junit4]   2> 557347 INFO  (qtp931037256-2573) [n:127.0.0.1:44332_ c:collection1 s:shard2  x:collection1_shard2_replica_n45] o.a.s.u.UpdateHandler Using UpdateLog implementation: org.apache.solr.update.UpdateLog
   [junit4]   2> 557347 INFO  (qtp931037256-2573) [n:127.0.0.1:44332_ c:collection1 s:shard2  x:collection1_shard2_replica_n45] o.a.s.u.UpdateLog Initializing UpdateLog: dataDir= defaultSyncLevel=FLUSH numRecordsToKeep=100 maxNumLogsToKeep=10 numVersionBuckets=65536
   [junit4]   2> 557348 INFO  (qtp931037256-2573) [n:127.0.0.1:44332_ c:collection1 s:shard2  x:collection1_shard2_replica_n45] o.a.s.u.CommitTracker Hard AutoCommit: disabled
   [junit4]   2> 557348 INFO  (qtp931037256-2573) [n:127.0.0.1:44332_ c:collection1 s:shard2  x:collection1_shard2_replica_n45] o.a.s.u.CommitTracker Soft AutoCommit: disabled
   [junit4]   2> 557349 INFO  (qtp931037256-2573) [n:127.0.0.1:44332_ c:collection1 s:shard2  x:collection1_shard2_replica_n45] o.a.s.u.RandomMergePolicy RandomMergePolicy wrapping class org.apache.lucene.index.TieredMergePolicy: [TieredMergePolicy: maxMergeAtOnce=37, maxMergeAtOnceExplicit=37, maxMergedSegmentMB=2.8017578125, floorSegmentMB=0.66796875, forceMergeDeletesPctAllowed=10.189022506962377, segmentsPerTier=50.0, maxCFSSegmentSizeMB=8.796093022207999E12, noCFSRatio=0.33441521575470806, deletesPctAllowed=34.36809559880493
   [junit4]   2> 557349 INFO  (qtp931037256-2573) [n:127.0.0.1:44332_ c:collection1 s:shard2  x:collection1_shard2_replica_n45] o.a.s.s.SolrIndexSearcher Opening [Searcher@77d7cd8d[collection1_shard2_replica_n45] main]
   [junit4]   2> 557351 INFO  (qtp931037256-2573) [n:127.0.0.1:44332_ c:collection1 s:shard2  x:collection1_shard2_replica_n45] o.a.s.r.ManagedResourceStorage Configured ZooKeeperStorageIO with znodeBase: /configs/conf1
   [junit4]   2> 557351 INFO  (qtp931037256-2573) [n:127.0.0.1:44332_ c:collection1 s:shard2  x:collection1_shard2_replica_n45] o.a.s.r.ManagedResourceStorage Loaded null at path _rest_managed.json using ZooKeeperStorageIO:path=/configs/conf1
   [junit4]   2> 557351 INFO  (qtp931037256-2573) [n:127.0.0.1:44332_ c:collection1 s:shard2  x:collection1_shard2_replica_n45] o.a.s.h.ReplicationHandler Commits will be reserved for 10000ms.
   [junit4]   2> 557369 INFO  (searcherExecutor-1212-thread-1-processing-n:127.0.0.1:44332_ x:collection1_shard2_replica_n45 c:collection1 s:shard2) [n:127.0.0.1:44332_ c:collection1 s:shard2  x:collection1_shard2_replica_n45] o.a.s.c.SolrCore [collectio

[...truncated too long message...]

ivy-fail-disallowed-ivy-version:

ivy-fail:

ivy-fail:

ivy-configure:
[ivy:configure] :: loading settings :: file = /home/jenkins/jenkins-slave/workspace/Lucene-Solr-Tests-master/lucene/top-level-ivy-settings.xml

resolve:

ivy-availability-check:
[loadresource] Do not set property disallowed.ivy.jars.list as its length is 0.

-ivy-fail-disallowed-ivy-version:

ivy-fail:

ivy-configure:
[ivy:configure] :: loading settings :: file = /home/jenkins/jenkins-slave/workspace/Lucene-Solr-Tests-master/lucene/top-level-ivy-settings.xml

resolve:

ivy-availability-check:
[loadresource] Do not set property disallowed.ivy.jars.list as its length is 0.

-ivy-fail-disallowed-ivy-version:

ivy-fail:

ivy-fail:

ivy-configure:
[ivy:configure] :: loading settings :: file = /home/jenkins/jenkins-slave/workspace/Lucene-Solr-Tests-master/lucene/top-level-ivy-settings.xml

resolve:

ivy-availability-check:
[loadresource] Do not set property disallowed.ivy.jars.list as its length is 0.

-ivy-fail-disallowed-ivy-version:

ivy-fail:

ivy-configure:
[ivy:configure] :: loading settings :: file = /home/jenkins/jenkins-slave/workspace/Lucene-Solr-Tests-master/lucene/top-level-ivy-settings.xml

resolve:

ivy-availability-check:
[loadresource] Do not set property disallowed.ivy.jars.list as its length is 0.

-ivy-fail-disallowed-ivy-version:

ivy-fail:

ivy-fail:

ivy-configure:
[ivy:configure] :: loading settings :: file = /home/jenkins/jenkins-slave/workspace/Lucene-Solr-Tests-master/lucene/top-level-ivy-settings.xml

resolve:

ivy-availability-check:
[loadresource] Do not set property disallowed.ivy.jars.list as its length is 0.

-ivy-fail-disallowed-ivy-version:

ivy-fail:

ivy-fail:

ivy-configure:
[ivy:configure] :: loading settings :: file = /home/jenkins/jenkins-slave/workspace/Lucene-Solr-Tests-master/lucene/top-level-ivy-settings.xml

resolve:

ivy-availability-check:
[loadresource] Do not set property disallowed.ivy.jars.list as its length is 0.

-ivy-fail-disallowed-ivy-version:

ivy-fail:

ivy-fail:

ivy-configure:
[ivy:configure] :: loading settings :: file = /home/jenkins/jenkins-slave/workspace/Lucene-Solr-Tests-master/lucene/top-level-ivy-settings.xml

resolve:

ivy-availability-check:
[loadresource] Do not set property disallowed.ivy.jars.list as its length is 0.

-ivy-fail-disallowed-ivy-version:

ivy-fail:

ivy-fail:

ivy-configure:
[ivy:configure] :: loading settings :: file = /home/jenkins/jenkins-slave/workspace/Lucene-Solr-Tests-master/lucene/top-level-ivy-settings.xml

resolve:

ivy-availability-check:
[loadresource] Do not set property disallowed.ivy.jars.list as its length is 0.

-ivy-fail-disallowed-ivy-version:

ivy-fail:

ivy-fail:

ivy-configure:
[ivy:configure] :: loading settings :: file = /home/jenkins/jenkins-slave/workspace/Lucene-Solr-Tests-master/lucene/top-level-ivy-settings.xml

resolve:

ivy-availability-check:
[loadresource] Do not set property disallowed.ivy.jars.list as its length is 0.

-ivy-fail-disallowed-ivy-version:

ivy-fail:

ivy-fail:

ivy-configure:
[ivy:configure] :: loading settings :: file = /home/jenkins/jenkins-slave/workspace/Lucene-Solr-Tests-master/lucene/top-level-ivy-settings.xml

resolve:

ivy-availability-check:
[loadresource] Do not set property disallowed.ivy.jars.list as its length is 0.

-ivy-fail-disallowed-ivy-version:

ivy-fail:

ivy-fail:

ivy-configure:
[ivy:configure] :: loading settings :: file = /home/jenkins/jenkins-slave/workspace/Lucene-Solr-Tests-master/lucene/top-level-ivy-settings.xml

resolve:

ivy-availability-check:
[loadresource] Do not set property disallowed.ivy.jars.list as its length is 0.

-ivy-fail-disallowed-ivy-version:

ivy-fail:

ivy-fail:

ivy-configure:
[ivy:configure] :: loading settings :: file = /home/jenkins/jenkins-slave/workspace/Lucene-Solr-Tests-master/lucene/top-level-ivy-settings.xml

resolve:

ivy-availability-check:
[loadresource] Do not set property disallowed.ivy.jars.list as its length is 0.

-ivy-fail-disallowed-ivy-version:

ivy-fail:

ivy-fail:

ivy-configure:
[ivy:configure] :: loading settings :: file = /home/jenkins/jenkins-slave/workspace/Lucene-Solr-Tests-master/lucene/top-level-ivy-settings.xml

resolve:

ivy-availability-check:
[loadresource] Do not set property disallowed.ivy.jars.list as its length is 0.

-ivy-fail-disallowed-ivy-version:

ivy-fail:

ivy-fail:

ivy-configure:
[ivy:configure] :: loading settings :: file = /home/jenkins/jenkins-slave/workspace/Lucene-Solr-Tests-master/lucene/top-level-ivy-settings.xml

resolve:

jar-checksums:
    [mkdir] Created dir: /home/jenkins/jenkins-slave/workspace/Lucene-Solr-Tests-master/solr/null2053262483
     [copy] Copying 238 files to /home/jenkins/jenkins-slave/workspace/Lucene-Solr-Tests-master/solr/null2053262483
   [delete] Deleting directory /home/jenkins/jenkins-slave/workspace/Lucene-Solr-Tests-master/solr/null2053262483

check-working-copy:
[ivy:cachepath] :: resolving dependencies :: org.eclipse.jgit#org.eclipse.jgit-caller;working
[ivy:cachepath] 	confs: [default]
[ivy:cachepath] 	found org.eclipse.jgit#org.eclipse.jgit;4.6.0.201612231935-r in public
[ivy:cachepath] 	found com.jcraft#jsch;0.1.53 in public
[ivy:cachepath] 	found com.googlecode.javaewah#JavaEWAH;1.1.6 in public
[ivy:cachepath] 	found org.apache.httpcomponents#httpclient;4.3.6 in public
[ivy:cachepath] 	found org.apache.httpcomponents#httpcore;4.3.3 in public
[ivy:cachepath] 	found commons-logging#commons-logging;1.1.3 in public
[ivy:cachepath] 	found commons-codec#commons-codec;1.6 in public
[ivy:cachepath] 	found org.slf4j#slf4j-api;1.7.2 in public
[ivy:cachepath] :: resolution report :: resolve 66ms :: artifacts dl 4ms
	---------------------------------------------------------------------
	|                  |            modules            ||   artifacts   |
	|       conf       | number| search|dwnlded|evicted|| number|dwnlded|
	---------------------------------------------------------------------
	|      default     |   8   |   0   |   0   |   0   ||   8   |   0   |
	---------------------------------------------------------------------
[wc-checker] Initializing working copy...
[wc-checker] SLF4J: Failed to load class "org.slf4j.impl.StaticLoggerBinder".
[wc-checker] SLF4J: Defaulting to no-operation (NOP) logger implementation
[wc-checker] SLF4J: See http://www.slf4j.org/codes.html#StaticLoggerBinder for further details.
[wc-checker] Checking working copy status...

-jenkins-base:

BUILD SUCCESSFUL
Total time: 211 minutes 56 seconds
Archiving artifacts
java.lang.InterruptedException: no matches found within 10000
	at hudson.FilePath$34.hasMatch(FilePath.java:2678)
	at hudson.FilePath$34.invoke(FilePath.java:2557)
	at hudson.FilePath$34.invoke(FilePath.java:2547)
	at hudson.FilePath$FileCallableWrapper.call(FilePath.java:2918)
Also:   hudson.remoting.Channel$CallSiteStackTrace: Remote call to lucene2
		at hudson.remoting.Channel.attachCallSiteStackTrace(Channel.java:1741)
		at hudson.remoting.UserRequest$ExceptionResponse.retrieve(UserRequest.java:357)
		at hudson.remoting.Channel.call(Channel.java:955)
		at hudson.FilePath.act(FilePath.java:1036)
		at hudson.FilePath.act(FilePath.java:1025)
		at hudson.FilePath.validateAntFileMask(FilePath.java:2547)
		at hudson.tasks.ArtifactArchiver.perform(ArtifactArchiver.java:243)
		at hudson.tasks.BuildStepCompatibilityLayer.perform(BuildStepCompatibilityLayer.java:81)
		at hudson.tasks.BuildStepMonitor$1.perform(BuildStepMonitor.java:20)
		at hudson.model.AbstractBuild$AbstractBuildExecution.perform(AbstractBuild.java:744)
		at hudson.model.AbstractBuild$AbstractBuildExecution.performAllBuildSteps(AbstractBuild.java:690)
		at hudson.model.Build$BuildExecution.post2(Build.java:186)
		at hudson.model.AbstractBuild$AbstractBuildExecution.post(AbstractBuild.java:635)
		at hudson.model.Run.execute(Run.java:1819)
		at hudson.model.FreeStyleBuild.run(FreeStyleBuild.java:43)
		at hudson.model.ResourceController.execute(ResourceController.java:97)
		at hudson.model.Executor.run(Executor.java:429)
Caused: hudson.FilePath$TunneledInterruptedException
	at hudson.FilePath$FileCallableWrapper.call(FilePath.java:2920)
	at hudson.remoting.UserRequest.perform(UserRequest.java:212)
	at hudson.remoting.UserRequest.perform(UserRequest.java:54)
	at hudson.remoting.Request$2.run(Request.java:369)
	at hudson.remoting.InterceptingExecutorService$1.call(InterceptingExecutorService.java:72)
	at java.util.concurrent.FutureTask.run(FutureTask.java:266)
	at java.util.concurrent.ThreadPoolExecutor.runWorker(ThreadPoolExecutor.java:1142)
	at java.util.concurrent.ThreadPoolExecutor$Worker.run(ThreadPoolExecutor.java:617)
	at java.lang.Thread.run(Thread.java:748)
Caused: java.lang.InterruptedException: java.lang.InterruptedException: no matches found within 10000
	at hudson.FilePath.act(FilePath.java:1038)
	at hudson.FilePath.act(FilePath.java:1025)
	at hudson.FilePath.validateAntFileMask(FilePath.java:2547)
	at hudson.tasks.ArtifactArchiver.perform(ArtifactArchiver.java:243)
	at hudson.tasks.BuildStepCompatibilityLayer.perform(BuildStepCompatibilityLayer.java:81)
	at hudson.tasks.BuildStepMonitor$1.perform(BuildStepMonitor.java:20)
	at hudson.model.AbstractBuild$AbstractBuildExecution.perform(AbstractBuild.java:744)
	at hudson.model.AbstractBuild$AbstractBuildExecution.performAllBuildSteps(AbstractBuild.java:690)
	at hudson.model.Build$BuildExecution.post2(Build.java:186)
	at hudson.model.AbstractBuild$AbstractBuildExecution.post(AbstractBuild.java:635)
	at hudson.model.Run.execute(Run.java:1819)
	at hudson.model.FreeStyleBuild.run(FreeStyleBuild.java:43)
	at hudson.model.ResourceController.execute(ResourceController.java:97)
	at hudson.model.Executor.run(Executor.java:429)
No artifacts found that match the file pattern "**/*.events,heapdumps/**,**/hs_err_pid*". Configuration error?
Recording test results
Build step 'Publish JUnit test result report' changed build result to UNSTABLE
Email was triggered for: Unstable (Test Failures)
Sending email for trigger: Unstable (Test Failures)

Mime
View raw message