lucene-dev mailing list archives

Site index · List index
Message view « Date » · « Thread »
Top « Date » · « Thread »
From Policeman Jenkins Server <jenk...@thetaphi.de>
Subject [JENKINS] Lucene-Solr-master-Windows (64bit/jdk-9.0.4) - Build # 7546 - Still unstable!
Date Tue, 02 Oct 2018 02:00:51 GMT
Build: https://jenkins.thetaphi.de/job/Lucene-Solr-master-Windows/7546/
Java: 64bit/jdk-9.0.4 -XX:+UseCompressedOops -XX:+UseG1GC

2 tests failed.
FAILED:  org.apache.solr.cloud.autoscaling.sim.TestSimGenericDistributedQueue.testDistributedQueueBlocking

Error Message:


Stack Trace:
java.util.concurrent.TimeoutException
	at __randomizedtesting.SeedInfo.seed([AE0744045404A2D2:EBAD367D10561EA6]:0)
	at java.base/java.util.concurrent.FutureTask.get(FutureTask.java:204)
	at org.apache.solr.cloud.autoscaling.sim.TestSimDistributedQueue.testDistributedQueueBlocking(TestSimDistributedQueue.java:117)
	at java.base/jdk.internal.reflect.NativeMethodAccessorImpl.invoke0(Native Method)
	at java.base/jdk.internal.reflect.NativeMethodAccessorImpl.invoke(NativeMethodAccessorImpl.java:62)
	at java.base/jdk.internal.reflect.DelegatingMethodAccessorImpl.invoke(DelegatingMethodAccessorImpl.java:43)
	at java.base/java.lang.reflect.Method.invoke(Method.java:564)
	at com.carrotsearch.randomizedtesting.RandomizedRunner.invoke(RandomizedRunner.java:1742)
	at com.carrotsearch.randomizedtesting.RandomizedRunner$8.evaluate(RandomizedRunner.java:935)
	at com.carrotsearch.randomizedtesting.RandomizedRunner$9.evaluate(RandomizedRunner.java:971)
	at com.carrotsearch.randomizedtesting.RandomizedRunner$10.evaluate(RandomizedRunner.java:985)
	at com.carrotsearch.randomizedtesting.rules.SystemPropertiesRestoreRule$1.evaluate(SystemPropertiesRestoreRule.java:57)
	at org.apache.lucene.util.TestRuleSetupTeardownChained$1.evaluate(TestRuleSetupTeardownChained.java:49)
	at org.apache.lucene.util.AbstractBeforeAfterRule$1.evaluate(AbstractBeforeAfterRule.java:45)
	at org.apache.lucene.util.TestRuleThreadAndTestName$1.evaluate(TestRuleThreadAndTestName.java:48)
	at org.apache.lucene.util.TestRuleIgnoreAfterMaxFailures$1.evaluate(TestRuleIgnoreAfterMaxFailures.java:64)
	at org.apache.lucene.util.TestRuleMarkFailure$1.evaluate(TestRuleMarkFailure.java:47)
	at com.carrotsearch.randomizedtesting.rules.StatementAdapter.evaluate(StatementAdapter.java:36)
	at com.carrotsearch.randomizedtesting.ThreadLeakControl$StatementRunner.run(ThreadLeakControl.java:368)
	at com.carrotsearch.randomizedtesting.ThreadLeakControl.forkTimeoutingTask(ThreadLeakControl.java:817)
	at com.carrotsearch.randomizedtesting.ThreadLeakControl$3.evaluate(ThreadLeakControl.java:468)
	at com.carrotsearch.randomizedtesting.RandomizedRunner.runSingleTest(RandomizedRunner.java:944)
	at com.carrotsearch.randomizedtesting.RandomizedRunner$5.evaluate(RandomizedRunner.java:830)
	at com.carrotsearch.randomizedtesting.RandomizedRunner$6.evaluate(RandomizedRunner.java:880)
	at com.carrotsearch.randomizedtesting.RandomizedRunner$7.evaluate(RandomizedRunner.java:891)
	at com.carrotsearch.randomizedtesting.rules.StatementAdapter.evaluate(StatementAdapter.java:36)
	at com.carrotsearch.randomizedtesting.rules.SystemPropertiesRestoreRule$1.evaluate(SystemPropertiesRestoreRule.java:57)
	at org.apache.lucene.util.AbstractBeforeAfterRule$1.evaluate(AbstractBeforeAfterRule.java:45)
	at com.carrotsearch.randomizedtesting.rules.StatementAdapter.evaluate(StatementAdapter.java:36)
	at org.apache.lucene.util.TestRuleStoreClassName$1.evaluate(TestRuleStoreClassName.java:41)
	at com.carrotsearch.randomizedtesting.rules.NoShadowingOrOverridesOnMethodsRule$1.evaluate(NoShadowingOrOverridesOnMethodsRule.java:40)
	at com.carrotsearch.randomizedtesting.rules.NoShadowingOrOverridesOnMethodsRule$1.evaluate(NoShadowingOrOverridesOnMethodsRule.java:40)
	at com.carrotsearch.randomizedtesting.rules.StatementAdapter.evaluate(StatementAdapter.java:36)
	at com.carrotsearch.randomizedtesting.rules.StatementAdapter.evaluate(StatementAdapter.java:36)
	at org.apache.lucene.util.TestRuleAssertionsRequired$1.evaluate(TestRuleAssertionsRequired.java:53)
	at org.apache.lucene.util.TestRuleMarkFailure$1.evaluate(TestRuleMarkFailure.java:47)
	at org.apache.lucene.util.TestRuleIgnoreAfterMaxFailures$1.evaluate(TestRuleIgnoreAfterMaxFailures.java:64)
	at org.apache.lucene.util.TestRuleIgnoreTestSuites$1.evaluate(TestRuleIgnoreTestSuites.java:54)
	at com.carrotsearch.randomizedtesting.rules.StatementAdapter.evaluate(StatementAdapter.java:36)
	at com.carrotsearch.randomizedtesting.ThreadLeakControl$StatementRunner.run(ThreadLeakControl.java:368)
	at java.base/java.lang.Thread.run(Thread.java:844)


FAILED:  junit.framework.TestSuite.org.apache.solr.cloud.autoscaling.sim.TestSimGenericDistributedQueue

Error Message:
1 thread leaked from SUITE scope at org.apache.solr.cloud.autoscaling.sim.TestSimGenericDistributedQueue:
    1) Thread[id=39479, name=sdqtest--11882-thread-1, state=TIMED_WAITING, group=TGRP-TestSimGenericDistributedQueue]
        at java.base@9.0.4/jdk.internal.misc.Unsafe.park(Native Method)         at java.base@9.0.4/java.util.concurrent.locks.LockSupport.parkNanos(LockSupport.java:234)
        at java.base@9.0.4/java.util.concurrent.locks.AbstractQueuedSynchronizer$ConditionObject.awaitNanos(AbstractQueuedSynchronizer.java:2104)
        at app//org.apache.solr.cloud.autoscaling.sim.GenericDistributedQueue.peek(GenericDistributedQueue.java:194)
        at app//org.apache.solr.cloud.autoscaling.sim.GenericDistributedQueue.peek(GenericDistributedQueue.java:167)
        at app//org.apache.solr.cloud.autoscaling.sim.TestSimDistributedQueue.lambda$testDistributedQueueBlocking$1(TestSimDistributedQueue.java:108)
        at app//org.apache.solr.cloud.autoscaling.sim.TestSimDistributedQueue$$Lambda$1706/1373593228.call(Unknown
Source)         at java.base@9.0.4/java.util.concurrent.FutureTask.run(FutureTask.java:264)
        at app//org.apache.solr.common.util.ExecutorUtil$MDCAwareThreadPoolExecutor.lambda$execute$0(ExecutorUtil.java:209)
        at app//org.apache.solr.common.util.ExecutorUtil$MDCAwareThreadPoolExecutor$$Lambda$174/2111216833.run(Unknown
Source)         at java.base@9.0.4/java.util.concurrent.ThreadPoolExecutor.runWorker(ThreadPoolExecutor.java:1167)
        at java.base@9.0.4/java.util.concurrent.ThreadPoolExecutor$Worker.run(ThreadPoolExecutor.java:641)
        at java.base@9.0.4/java.lang.Thread.run(Thread.java:844)

Stack Trace:
com.carrotsearch.randomizedtesting.ThreadLeakError: 1 thread leaked from SUITE scope at org.apache.solr.cloud.autoscaling.sim.TestSimGenericDistributedQueue:

   1) Thread[id=39479, name=sdqtest--11882-thread-1, state=TIMED_WAITING, group=TGRP-TestSimGenericDistributedQueue]
        at java.base@9.0.4/jdk.internal.misc.Unsafe.park(Native Method)
        at java.base@9.0.4/java.util.concurrent.locks.LockSupport.parkNanos(LockSupport.java:234)
        at java.base@9.0.4/java.util.concurrent.locks.AbstractQueuedSynchronizer$ConditionObject.awaitNanos(AbstractQueuedSynchronizer.java:2104)
        at app//org.apache.solr.cloud.autoscaling.sim.GenericDistributedQueue.peek(GenericDistributedQueue.java:194)
        at app//org.apache.solr.cloud.autoscaling.sim.GenericDistributedQueue.peek(GenericDistributedQueue.java:167)
        at app//org.apache.solr.cloud.autoscaling.sim.TestSimDistributedQueue.lambda$testDistributedQueueBlocking$1(TestSimDistributedQueue.java:108)
        at app//org.apache.solr.cloud.autoscaling.sim.TestSimDistributedQueue$$Lambda$1706/1373593228.call(Unknown
Source)
        at java.base@9.0.4/java.util.concurrent.FutureTask.run(FutureTask.java:264)
        at app//org.apache.solr.common.util.ExecutorUtil$MDCAwareThreadPoolExecutor.lambda$execute$0(ExecutorUtil.java:209)
        at app//org.apache.solr.common.util.ExecutorUtil$MDCAwareThreadPoolExecutor$$Lambda$174/2111216833.run(Unknown
Source)
        at java.base@9.0.4/java.util.concurrent.ThreadPoolExecutor.runWorker(ThreadPoolExecutor.java:1167)
        at java.base@9.0.4/java.util.concurrent.ThreadPoolExecutor$Worker.run(ThreadPoolExecutor.java:641)
        at java.base@9.0.4/java.lang.Thread.run(Thread.java:844)
	at __randomizedtesting.SeedInfo.seed([AE0744045404A2D2]:0)




Build Log:
[...truncated 14356 lines...]
   [junit4] Suite: org.apache.solr.cloud.autoscaling.sim.TestSimGenericDistributedQueue
   [junit4]   2> 3725712 INFO  (SUITE-TestSimGenericDistributedQueue-seed#[AE0744045404A2D2]-worker)
[    ] o.a.s.SolrTestCaseJ4 SecureRandom sanity checks: test.solr.allowed.securerandom=null
& java.security.egd=file:/dev/./urandom
   [junit4]   2> Creating dataDir: C:\Users\jenkins\workspace\Lucene-Solr-master-Windows\solr\build\solr-core\test\J1\temp\solr.cloud.autoscaling.sim.TestSimGenericDistributedQueue_AE0744045404A2D2-001\init-core-data-001
   [junit4]   2> 3725713 INFO  (SUITE-TestSimGenericDistributedQueue-seed#[AE0744045404A2D2]-worker)
[    ] o.a.s.SolrTestCaseJ4 Using PointFields (NUMERIC_POINTS_SYSPROP=true) w/NUMERIC_DOCVALUES_SYSPROP=false
   [junit4]   2> 3725714 INFO  (SUITE-TestSimGenericDistributedQueue-seed#[AE0744045404A2D2]-worker)
[    ] o.a.s.SolrTestCaseJ4 Randomized ssl (false) and clientAuth (false) via: @org.apache.solr.util.RandomizeSSL(reason="",
value=0.0/0.0, ssl=0.0/0.0, clientAuth=0.0/0.0)
   [junit4]   2> 3725715 INFO  (TEST-TestSimGenericDistributedQueue.testDistributedQueue-seed#[AE0744045404A2D2])
[    ] o.a.s.SolrTestCaseJ4 ###Starting testDistributedQueue
   [junit4]   2> 3727717 INFO  (TEST-TestSimGenericDistributedQueue.testDistributedQueue-seed#[AE0744045404A2D2])
[    ] o.a.s.SolrTestCaseJ4 ###Ending testDistributedQueue
   [junit4]   2> 3727719 INFO  (TEST-TestSimGenericDistributedQueue.testLocallyOffer-seed#[AE0744045404A2D2])
[    ] o.a.s.SolrTestCaseJ4 ###Starting testLocallyOffer
   [junit4]   2> 3727935 INFO  (TEST-TestSimGenericDistributedQueue.testLocallyOffer-seed#[AE0744045404A2D2])
[    ] o.a.s.SolrTestCaseJ4 ###Ending testLocallyOffer
   [junit4]   2> 3727936 INFO  (TEST-TestSimGenericDistributedQueue.testDistributedQueue-seed#[AE0744045404A2D2])
[    ] o.a.s.SolrTestCaseJ4 ###Starting testDistributedQueue {#2}
   [junit4]   2> 3729938 INFO  (TEST-TestSimGenericDistributedQueue.testDistributedQueue-seed#[AE0744045404A2D2])
[    ] o.a.s.SolrTestCaseJ4 ###Ending testDistributedQueue {#2}
   [junit4]   2> 3729939 INFO  (TEST-TestSimGenericDistributedQueue.testDistributedQueueBlocking-seed#[AE0744045404A2D2])
[    ] o.a.s.SolrTestCaseJ4 ###Starting testDistributedQueueBlocking
   [junit4]   2> 3733043 INFO  (TEST-TestSimGenericDistributedQueue.testDistributedQueueBlocking-seed#[AE0744045404A2D2])
[    ] o.a.s.SolrTestCaseJ4 ###Ending testDistributedQueueBlocking
   [junit4]   2> NOTE: reproduce with: ant test  -Dtestcase=TestSimGenericDistributedQueue
-Dtests.method=testDistributedQueueBlocking -Dtests.seed=AE0744045404A2D2 -Dtests.slow=true
-Dtests.locale=bs-Cyrl -Dtests.timezone=Atlantic/South_Georgia -Dtests.asserts=true -Dtests.file.encoding=US-ASCII
   [junit4] ERROR   3.11s J1 | TestSimGenericDistributedQueue.testDistributedQueueBlocking
<<<
   [junit4]    > Throwable #1: java.util.concurrent.TimeoutException
   [junit4]    > 	at __randomizedtesting.SeedInfo.seed([AE0744045404A2D2:EBAD367D10561EA6]:0)
   [junit4]    > 	at java.base/java.util.concurrent.FutureTask.get(FutureTask.java:204)
   [junit4]    > 	at org.apache.solr.cloud.autoscaling.sim.TestSimDistributedQueue.testDistributedQueueBlocking(TestSimDistributedQueue.java:117)
   [junit4]    > 	at java.base/jdk.internal.reflect.NativeMethodAccessorImpl.invoke0(Native
Method)
   [junit4]    > 	at java.base/jdk.internal.reflect.NativeMethodAccessorImpl.invoke(NativeMethodAccessorImpl.java:62)
   [junit4]    > 	at java.base/jdk.internal.reflect.DelegatingMethodAccessorImpl.invoke(DelegatingMethodAccessorImpl.java:43)
   [junit4]    > 	at java.base/java.lang.reflect.Method.invoke(Method.java:564)
   [junit4]    > 	at java.base/java.lang.Thread.run(Thread.java:844)
   [junit4]   2> 3733046 INFO  (TEST-TestSimGenericDistributedQueue.testPeekElements-seed#[AE0744045404A2D2])
[    ] o.a.s.SolrTestCaseJ4 ###Starting testPeekElements
   [junit4]   2> 3734548 INFO  (TEST-TestSimGenericDistributedQueue.testPeekElements-seed#[AE0744045404A2D2])
[    ] o.a.s.SolrTestCaseJ4 ###Ending testPeekElements
   [junit4]   2> NOTE: leaving temporary files on disk at: C:\Users\jenkins\workspace\Lucene-Solr-master-Windows\solr\build\solr-core\test\J1\temp\solr.cloud.autoscaling.sim.TestSimGenericDistributedQueue_AE0744045404A2D2-001
   [junit4]   2> Oct 02, 2018 1:24:23 AM com.carrotsearch.randomizedtesting.ThreadLeakControl
checkThreadLeaks
   [junit4]   2> WARNING: Will linger awaiting termination of 1 leaked thread(s).
   [junit4]   2> Oct 02, 2018 1:25:43 AM com.carrotsearch.randomizedtesting.ThreadLeakControl
checkThreadLeaks
   [junit4]   2> SEVERE: 1 thread leaked from SUITE scope at org.apache.solr.cloud.autoscaling.sim.TestSimGenericDistributedQueue:

   [junit4]   2>    1) Thread[id=39479, name=sdqtest--11882-thread-1, state=TIMED_WAITING,
group=TGRP-TestSimGenericDistributedQueue]
   [junit4]   2>         at java.base@9.0.4/jdk.internal.misc.Unsafe.park(Native Method)
   [junit4]   2>         at java.base@9.0.4/java.util.concurrent.locks.LockSupport.parkNanos(LockSupport.java:234)
   [junit4]   2>         at java.base@9.0.4/java.util.concurrent.locks.AbstractQueuedSynchronizer$ConditionObject.awaitNanos(AbstractQueuedSynchronizer.java:2104)
   [junit4]   2>         at app//org.apache.solr.cloud.autoscaling.sim.GenericDistributedQueue.peek(GenericDistributedQueue.java:194)
   [junit4]   2>         at app//org.apache.solr.cloud.autoscaling.sim.GenericDistributedQueue.peek(GenericDistributedQueue.java:167)
   [junit4]   2>         at app//org.apache.solr.cloud.autoscaling.sim.TestSimDistributedQueue.lambda$testDistributedQueueBlocking$1(TestSimDistributedQueue.java:108)
   [junit4]   2>         at app//org.apache.solr.cloud.autoscaling.sim.TestSimDistributedQueue$$Lambda$1706/1373593228.call(Unknown
Source)
   [junit4]   2>         at java.base@9.0.4/java.util.concurrent.FutureTask.run(FutureTask.java:264)
   [junit4]   2>         at app//org.apache.solr.common.util.ExecutorUtil$MDCAwareThreadPoolExecutor.lambda$execute$0(ExecutorUtil.java:209)
   [junit4]   2>         at app//org.apache.solr.common.util.ExecutorUtil$MDCAwareThreadPoolExecutor$$Lambda$174/2111216833.run(Unknown
Source)
   [junit4]   2>         at java.base@9.0.4/java.util.concurrent.ThreadPoolExecutor.runWorker(ThreadPoolExecutor.java:1167)
   [junit4]   2>         at java.base@9.0.4/java.util.concurrent.ThreadPoolExecutor$Worker.run(ThreadPoolExecutor.java:641)
   [junit4]   2>         at java.base@9.0.4/java.lang.Thread.run(Thread.java:844)
   [junit4]   2> Oct 02, 2018 1:25:43 AM com.carrotsearch.randomizedtesting.ThreadLeakControl
tryToInterruptAll
   [junit4]   2> INFO: Starting to interrupt leaked threads:
   [junit4]   2>    1) Thread[id=39479, name=sdqtest--11882-thread-1, state=TIMED_WAITING,
group=TGRP-TestSimGenericDistributedQueue]
   [junit4]   2> Oct 02, 2018 1:25:43 AM com.carrotsearch.randomizedtesting.ThreadLeakControl
tryToInterruptAll
   [junit4]   2> INFO: All leaked threads terminated.
   [junit4]   2> NOTE: test params are: codec=DummyCompressingStoredFields(storedFieldsFormat=CompressingStoredFieldsFormat(compressionMode=DUMMY,
chunkSize=31668, maxDocsPerChunk=9, blockSize=516), termVectorsFormat=CompressingTermVectorsFormat(compressionMode=DUMMY,
chunkSize=31668, blockSize=516)), sim=Asserting(org.apache.lucene.search.similarities.AssertingSimilarity@615d7509),
locale=bs-Cyrl, timezone=Atlantic/South_Georgia
   [junit4]   2> NOTE: Windows 10 10.0 amd64/Oracle Corporation 9.0.4 (64-bit)/cpus=3,threads=1,free=189442976,total=536870912
   [junit4]   2> NOTE: All tests run in this JVM: [ScriptEngineTest, TestCloudNestedDocsSort,
TestClusterProperties, TestUseDocValuesAsStored2, TestDFRSimilarityFactory, ExplicitHLLTest,
TestHdfsBackupRestoreCore, TestCloudJSONFacetSKG, TestSolr4Spatial, TestFunctionQuery, ConcurrentDeleteAndCreateCollectionTest,
OpenCloseCoreStressTest, PathHierarchyTokenizerFactoryTest, BasicAuthIntegrationTest, TestPostingsSolrHighlighter,
TestDistributedMissingSort, CdcrBootstrapTest, TestCollectionsAPIViaSolrCloudCluster, BlockJoinFacetDistribTest,
TestLazyCores, TestOrdValues, TestPhraseSuggestions, TestDistribDocBasedVersion, CollectionsAPIAsyncDistributedZkTest,
TestLockTree, HealthCheckHandlerTest, TestFieldCacheSort, SystemInfoHandlerTest, SpatialFilterTest,
TestFieldCacheVsDocValues, SchemaVersionSpecificBehaviorTest, SearchRateTriggerIntegrationTest,
TestLeaderElectionZkExpiry, CoreAdminCreateDiscoverTest, TestInitParams, TestExpandComponent,
LeaderElectionIntegrationTest, LargeFieldTest, MetricsConfigTest, PeerSyncWithLeaderAndIndexFingerprintCachingTest,
ScheduledTriggerIntegrationTest, TestSortableTextField, TestCloudRecovery, V2ApiIntegrationTest,
TestMultiValuedNumericRangeQuery, ResponseBuilderTest, RestoreTriggerStateTest, StressHdfsTest,
TestDistribIDF, JsonLoaderTest, TestCSVResponseWriter, UpdateRequestProcessorFactoryTest,
TestDocumentBuilder, SolrCloudExampleTest, ClassificationUpdateProcessorIntegrationTest, SolrPluginUtilsTest,
TestRestoreCore, TestSolrCloudWithKerberosAlt, XmlUpdateRequestHandlerTest, CdcrUpdateLogTest,
TestMaxTokenLenTokenizer, CleanupOldIndexTest, TestCharFilters, DistributedSuggestComponentTest,
HLLSerializationTest, IndexSchemaTest, TestReplicationHandlerBackup, SecurityConfHandlerTest,
AssignBackwardCompatibilityTest, MetricTriggerTest, TestTolerantSearch, TestDownShardTolerantSearch,
BaseCdcrDistributedZkTest, TestCryptoKeys, TestRebalanceLeaders, VMParamsZkACLAndCredentialsProvidersTest,
TestManagedResource, CurrencyRangeFacetCloudTest, RollingRestartTest, TestDynamicFieldResource,
TestHashQParserPlugin, TestConfigSetImmutable, BasicDistributedZk2Test, NodeLostTriggerTest,
ForceLeaderTest, TestZkAclsWithHadoopAuth, NoCacheHeaderTest, TestConfigReload, MinimalSchemaTest,
TestChildDocTransformerHierarchy, TestSolrCLIRunExample, TestMultiWordSynonyms, TestPullReplica,
ExternalFileFieldSortTest, TestDocTermOrds, TestSolrCloudSnapshots, TestSimNodeAddedTrigger,
TestBlobHandler, AtomicUpdatesTest, ZkControllerTest, NumericFieldsTest, TestCollapseQParserPlugin,
TestConfig, CoreAdminOperationTest, MigrateRouteKeyTest, TestNumericRangeQuery64, SolrRequestParserTest,
ConfigSetsAPITest, CoreSorterTest, SimpleFacetsTest, TestWriterPerf, TestSimExecutePlanAction,
TestAnalyzedSuggestions, TestIntervalFaceting, ComputePlanActionTest, SliceStateTest, TestManagedSchemaAPI,
TestRTGBase, TestDocBasedVersionConstraints, TestSchemaManager, SimpleMLTQParserTest, CdcrReplicationHandlerTest,
SpellingQueryConverterTest, SolrCloudReportersTest, DistributedFacetPivotSmallAdvancedTest,
LeaderTragicEventTest, DeleteNodeTest, TestCustomSort, TestEmbeddedSolrServerSchemaAPI, TestBinaryField,
HdfsChaosMonkeySafeLeaderTest, PreAnalyzedUpdateProcessorTest, RequiredFieldsTest, SystemLogListenerTest,
DistributedQueryComponentCustomSortTest, CoreMergeIndexesAdminHandlerTest, TestCloudPivotFacet,
HdfsUnloadDistributedZkTest, TestElisionMultitermQuery, DocValuesTest, TermsComponentTest,
SpatialHeatmapFacetsTest, BlockJoinFacetSimpleTest, WordBreakSolrSpellCheckerTest, SolrJmxReporterTest,
DistribJoinFromCollectionTest, SolrIndexSplitterTest, SOLR749Test, DateFieldTest, TestSolrConfigHandler,
TestNRTOpen, SmileWriterTest, TestLRUCache, TestFieldCache, TestHighlightDedupGrouping, TestCollectionAPIs,
DistributedVersionInfoTest, TestSort, SpellCheckCollatorWithCollapseTest, TestCloudConsistency,
TestTolerantUpdateProcessorCloud, BadComponentTest, TestSimpleQParserPlugin, PrimUtilsTest,
PolyFieldTest, TestSlowCompositeReaderWrapper, SolrIndexConfigTest, DirectUpdateHandlerTest,
FieldMutatingUpdateProcessorTest, TestFastLRUCache, TokenizerChainTest, DistributedIntervalFacetingTest,
SpatialRPTFieldTypeTest, TestJsonFacets, TestZkChroot, TestStressVersions, MetricsHistoryHandlerTest,
LeaderFailoverAfterPartitionTest, TestDynamicLoading, ZkNodePropsTest, CollectionPropsTest,
SaslZkACLProviderTest, HdfsThreadLeakTest, TestCopyFieldCollectionResource, DistributedUpdateProcessorTest,
CreateCollectionCleanupTest, SparseHLLTest, DirectSolrSpellCheckerTest, TestReload, PhrasesIdentificationComponentTest,
TestMacros, DistribCursorPagingTest, PKIAuthenticationIntegrationTest, TestHashPartitioner,
TestSolrConfigHandlerConcurrent, DocumentAnalysisRequestHandlerTest, EmbeddedSolrNoSerializeTest,
AutoAddReplicasPlanActionTest, TemplateUpdateProcessorTest, SolrMetricManagerTest, TestSimDistribStateManager,
MultiThreadedOCPTest, TestLocalFSCloudBackupRestore, CollectionsAPISolrJTest, TestSSLRandomization,
AnalysisAfterCoreReloadTest, BasicFunctionalityTest, CursorPagingTest, DisMaxRequestHandlerTest,
EchoParamsTest, SampleTest, SolrInfoBeanTest, SolrTestCaseJ4Test, TestCrossCoreJoin, TestCursorMarkWithoutUniqueKey,
TestDistributedGrouping, TestGroupingSearch, TestJoin, TestRandomDVFaceting, TestRandomFaceting,
TestSimpleTrackingShardHandler, TestSolrCoreProperties, TestReversedWildcardFilterFactory,
TestEmbeddedSolrServerAdminHandler, TestEmbeddedSolrServerConstructors, ConnectionReuseTest,
AddReplicaTest, AliasIntegrationTest, AsyncCallRequestStatusResponseTest, BasicDistributedZkTest,
BasicZkTest, ChaosMonkeyNothingIsSafeWithPullReplicasTest, ChaosMonkeySafeLeaderWithPullReplicasTest,
ClusterStateTest, ConnectionManagerTest, DeleteInactiveReplicaTest, DeleteLastCustomShardedReplicaTest,
DeleteShardTest, DistributedQueueTest, FullSolrCloudDistribCmdsTest, HttpPartitionOnCommitTest,
HttpPartitionTest, LIRRollingUpdatesTest, LeaderElectionTest, LeaderVoteWaitTimeoutTest, LegacyCloudClusterPropTest,
MoveReplicaHDFSFailoverTest, MoveReplicaTest, MultiSolrCloudTestCaseTest, OutOfBoxZkACLAndCredentialsProvidersTest,
OverriddenZkACLAndCredentialsProvidersTest, OverseerCollectionConfigSetProcessorTest, OverseerRolesTest,
OverseerTaskQueueTest, OverseerTest, PeerSyncReplicationTest, RecoveryZkTest, ReplaceNodeNoTargetTest,
ReplaceNodeTest, ReplicationFactorTest, RestartWhileUpdatingTest, ShardRoutingTest, SyncSliceTest,
TestAuthenticationFramework, TestCloudDeleteByQuery, TestCloudInspectUtil, TestCloudJSONFacetJoinDomain,
TestCloudPseudoReturnFields, TestCloudSearcherWarming, TestConfigSetsAPIExclusivity, TestDistributedMap,
TestExclusionRuleCollectionAccess, TestLeaderElectionWithEmptyReplica, TestMiniSolrCloudClusterSSL,
TestOnReconnectListenerSupport, TestPrepRecovery, TestShortCircuitedRequests, TestSolrCloudWithDelegationTokens,
TestStressInPlaceUpdates, TestStressLiveNodes, TestTlogReplica, CollectionReloadTest, CollectionsAPIDistributedZkTest,
NodeAddedTriggerTest, NodeLostTriggerIntegrationTest, ScheduledMaintenanceTriggerTest, ScheduledTriggerTest,
SearchRateTriggerTest, TriggerCooldownIntegrationTest, TriggerSetPropertiesIntegrationTest,
TestSimClusterStateProvider, TestSimDistributedQueue, TestSimExtremeIndexing, TestSimGenericDistributedQueue]
   [junit4]   2> NOTE: reproduce with: ant test  -Dtestcase=TestSimGenericDistributedQueue
-Dtests.seed=AE0744045404A2D2 -Dtests.slow=true -Dtests.locale=bs-Cyrl -Dtests.timezone=Atlantic/South_Georgia
-Dtests.asserts=true -Dtests.file.encoding=US-ASCII
   [junit4] ERROR   0.00s J1 | TestSimGenericDistributedQueue (suite) <<<
   [junit4]    > Throwable #1: com.carrotsearch.randomizedtesting.ThreadLeakError: 1 thread
leaked from SUITE scope at org.apache.solr.cloud.autoscaling.sim.TestSimGenericDistributedQueue:

   [junit4]    >    1) Thread[id=39479, name=sdqtest--11882-thread-1, state=TIMED_WAITING,
group=TGRP-TestSimGenericDistributedQueue]
   [junit4]    >         at java.base@9.0.4/jdk.internal.misc.Unsafe.park(Native Method)
   [junit4]    >         at java.base@9.0.4/java.util.concurrent.locks.LockSupport.parkNanos(LockSupport.java:234)
   [junit4]    >         at java.base@9.0.4/java.util.concurrent.locks.AbstractQueuedSynchronizer$ConditionObject.awaitNanos(AbstractQueuedSynchronizer.java:2104)
   [junit4]    >         at app//org.apache.solr.cloud.autoscaling.sim.GenericDistributedQueue.peek(GenericDistributedQueue.java:194)
   [junit4]    >         at app//org.apache.solr.cloud.autoscaling.sim.GenericDistributedQueue.peek(GenericDistributedQueue.java:167)
   [junit4]    >         at app//org.apache.solr.cloud.autoscaling.sim.TestSimDistributedQueue.lambda$testDistributedQueueBlocking$1(TestSimDistributedQueue.java:108)
   [junit4]    >         at app//org.apache.solr.cloud.autoscaling.sim.TestSimDistributedQueue$$Lambda$1706/1373593228.call(Unknown
Source)
   [junit4]    >         at java.base@9.0.4/java.util.concurrent.FutureTask.run(FutureTask.java:264)
   [junit4]    >         at app//org.apache.solr.common.util.ExecutorUtil$MDCAwareThreadPoolExecutor.lambda$execute$0(ExecutorUtil.java:209)
   [junit4]    >         at app//org.apache.solr.common.util.ExecutorUtil$MDCAwareThreadPoolExecutor$$Lambda$174/2111216833.run(Unknown
Source)
   [junit4]    >         at java.base@9.0.4/java.util.concurrent.ThreadPoolExecutor.runWorker(ThreadPoolExecutor.java:1167)
   [junit4]    >         at java.base@9.0.4/java.util.concurrent.ThreadPoolExecutor$Worker.run(ThreadPoolExecutor.java:641)
   [junit4]    >         at java.base@9.0.4/java.lang.Thread.run(Thread.java:844)
   [junit4]    > 	at __randomizedtesting.SeedInfo.seed([AE0744045404A2D2]:0)
   [junit4] Completed [533/835 (1!)] on J1 in 88.85s, 5 tests, 2 errors <<< FAILURES!

[...truncated 43311 lines...]
[repro] Jenkins log URL: https://jenkins.thetaphi.de/job/Lucene-Solr-master-Windows/7546/consoleText

[repro] Revision: fe844c739b1bd24090789acad099d3b3e5c12d4e

[repro] Ant options: "-Dargs=-XX:+UseCompressedOops -XX:+UseG1GC"

[repro] ant clean

[...truncated 6 lines...]
[repro] Test suites by module:
[repro]    solr\core
[repro]       TestSimGenericDistributedQueue
[repro] ant compile-test

[...truncated 3451 lines...]
[repro] ant test-nocompile -Dtests.dups=5 -Dtests.maxfailures=5 -Dtests.class="*.TestSimGenericDistributedQueue"
-Dtests.showOutput=onerror "-Dargs=-XX:+UseCompressedOops -XX:+UseG1GC" -Dtests.seed=AE0744045404A2D2
-Dtests.slow=true -Dtests.locale=bs-Cyrl -Dtests.timezone=Atlantic/South_Georgia -Dtests.asserts=true
-Dtests.file.encoding=US-ASCII

[...truncated 94 lines...]
[repro] Failures:
[repro]   0/5 failed: org.apache.solr.cloud.autoscaling.sim.TestSimGenericDistributedQueue
[repro] Exiting with code 0

[...truncated 75 lines...]

Mime
View raw message