lucene-dev mailing list archives

Site index · List index
Message view « Date » · « Thread »
Top « Date » · « Thread »
From Policeman Jenkins Server <jenk...@thetaphi.de>
Subject [JENKINS] Lucene-Solr-master-Solaris (64bit/jdk1.8.0) - Build # 2087 - Still Unstable!
Date Tue, 02 Oct 2018 10:23:36 GMT
Build: https://jenkins.thetaphi.de/job/Lucene-Solr-master-Solaris/2087/
Java: 64bit/jdk1.8.0 -XX:+UseCompressedOops -XX:+UseConcMarkSweepGC

5 tests failed.
FAILED:  org.apache.solr.cloud.autoscaling.sim.TestSimTriggerIntegration.testSearchRate

Error Message:
org.apache.solr.client.solrj.request.CollectionAdminRequest$AddReplica cannot be cast to java.util.Map

Stack Trace:
java.lang.ClassCastException: org.apache.solr.client.solrj.request.CollectionAdminRequest$AddReplica cannot be cast to java.util.Map
	at __randomizedtesting.SeedInfo.seed([FB369E21D7C98B2C:A67E80A8180F2D63]:0)
	at org.apache.solr.cloud.autoscaling.sim.TestSimTriggerIntegration.testSearchRate(TestSimTriggerIntegration.java:1321)
	at sun.reflect.NativeMethodAccessorImpl.invoke0(Native Method)
	at sun.reflect.NativeMethodAccessorImpl.invoke(NativeMethodAccessorImpl.java:62)
	at sun.reflect.DelegatingMethodAccessorImpl.invoke(DelegatingMethodAccessorImpl.java:43)
	at java.lang.reflect.Method.invoke(Method.java:498)
	at com.carrotsearch.randomizedtesting.RandomizedRunner.invoke(RandomizedRunner.java:1742)
	at com.carrotsearch.randomizedtesting.RandomizedRunner$8.evaluate(RandomizedRunner.java:935)
	at com.carrotsearch.randomizedtesting.RandomizedRunner$9.evaluate(RandomizedRunner.java:971)
	at com.carrotsearch.randomizedtesting.RandomizedRunner$10.evaluate(RandomizedRunner.java:985)
	at com.carrotsearch.randomizedtesting.rules.SystemPropertiesRestoreRule$1.evaluate(SystemPropertiesRestoreRule.java:57)
	at org.apache.lucene.util.TestRuleSetupTeardownChained$1.evaluate(TestRuleSetupTeardownChained.java:49)
	at org.apache.lucene.util.AbstractBeforeAfterRule$1.evaluate(AbstractBeforeAfterRule.java:45)
	at org.apache.lucene.util.TestRuleThreadAndTestName$1.evaluate(TestRuleThreadAndTestName.java:48)
	at org.apache.lucene.util.TestRuleIgnoreAfterMaxFailures$1.evaluate(TestRuleIgnoreAfterMaxFailures.java:64)
	at org.apache.lucene.util.TestRuleMarkFailure$1.evaluate(TestRuleMarkFailure.java:47)
	at com.carrotsearch.randomizedtesting.rules.StatementAdapter.evaluate(StatementAdapter.java:36)
	at com.carrotsearch.randomizedtesting.ThreadLeakControl$StatementRunner.run(ThreadLeakControl.java:368)
	at com.carrotsearch.randomizedtesting.ThreadLeakControl.forkTimeoutingTask(ThreadLeakControl.java:817)
	at com.carrotsearch.randomizedtesting.ThreadLeakControl$3.evaluate(ThreadLeakControl.java:468)
	at com.carrotsearch.randomizedtesting.RandomizedRunner.runSingleTest(RandomizedRunner.java:944)
	at com.carrotsearch.randomizedtesting.RandomizedRunner$5.evaluate(RandomizedRunner.java:830)
	at com.carrotsearch.randomizedtesting.RandomizedRunner$6.evaluate(RandomizedRunner.java:880)
	at com.carrotsearch.randomizedtesting.RandomizedRunner$7.evaluate(RandomizedRunner.java:891)
	at com.carrotsearch.randomizedtesting.rules.StatementAdapter.evaluate(StatementAdapter.java:36)
	at com.carrotsearch.randomizedtesting.rules.SystemPropertiesRestoreRule$1.evaluate(SystemPropertiesRestoreRule.java:57)
	at org.apache.lucene.util.AbstractBeforeAfterRule$1.evaluate(AbstractBeforeAfterRule.java:45)
	at com.carrotsearch.randomizedtesting.rules.StatementAdapter.evaluate(StatementAdapter.java:36)
	at org.apache.lucene.util.TestRuleStoreClassName$1.evaluate(TestRuleStoreClassName.java:41)
	at com.carrotsearch.randomizedtesting.rules.NoShadowingOrOverridesOnMethodsRule$1.evaluate(NoShadowingOrOverridesOnMethodsRule.java:40)
	at com.carrotsearch.randomizedtesting.rules.NoShadowingOrOverridesOnMethodsRule$1.evaluate(NoShadowingOrOverridesOnMethodsRule.java:40)
	at com.carrotsearch.randomizedtesting.rules.StatementAdapter.evaluate(StatementAdapter.java:36)
	at com.carrotsearch.randomizedtesting.rules.StatementAdapter.evaluate(StatementAdapter.java:36)
	at com.carrotsearch.randomizedtesting.rules.StatementAdapter.evaluate(StatementAdapter.java:36)
	at org.apache.lucene.util.TestRuleAssertionsRequired$1.evaluate(TestRuleAssertionsRequired.java:53)
	at org.apache.lucene.util.TestRuleMarkFailure$1.evaluate(TestRuleMarkFailure.java:47)
	at org.apache.lucene.util.TestRuleIgnoreAfterMaxFailures$1.evaluate(TestRuleIgnoreAfterMaxFailures.java:64)
	at org.apache.lucene.util.TestRuleIgnoreTestSuites$1.evaluate(TestRuleIgnoreTestSuites.java:54)
	at com.carrotsearch.randomizedtesting.rules.StatementAdapter.evaluate(StatementAdapter.java:36)
	at com.carrotsearch.randomizedtesting.ThreadLeakControl$StatementRunner.run(ThreadLeakControl.java:368)
	at java.lang.Thread.run(Thread.java:748)


FAILED:  org.apache.solr.cloud.autoscaling.sim.TestSimTriggerIntegration.testSearchRate

Error Message:
org.apache.solr.client.solrj.request.CollectionAdminRequest$AddReplica cannot be cast to java.util.Map

Stack Trace:
java.lang.ClassCastException: org.apache.solr.client.solrj.request.CollectionAdminRequest$AddReplica cannot be cast to java.util.Map
	at __randomizedtesting.SeedInfo.seed([FB369E21D7C98B2C:A67E80A8180F2D63]:0)
	at org.apache.solr.cloud.autoscaling.sim.TestSimTriggerIntegration.testSearchRate(TestSimTriggerIntegration.java:1321)
	at sun.reflect.NativeMethodAccessorImpl.invoke0(Native Method)
	at sun.reflect.NativeMethodAccessorImpl.invoke(NativeMethodAccessorImpl.java:62)
	at sun.reflect.DelegatingMethodAccessorImpl.invoke(DelegatingMethodAccessorImpl.java:43)
	at java.lang.reflect.Method.invoke(Method.java:498)
	at com.carrotsearch.randomizedtesting.RandomizedRunner.invoke(RandomizedRunner.java:1742)
	at com.carrotsearch.randomizedtesting.RandomizedRunner$8.evaluate(RandomizedRunner.java:935)
	at com.carrotsearch.randomizedtesting.RandomizedRunner$9.evaluate(RandomizedRunner.java:971)
	at com.carrotsearch.randomizedtesting.RandomizedRunner$10.evaluate(RandomizedRunner.java:985)
	at com.carrotsearch.randomizedtesting.rules.SystemPropertiesRestoreRule$1.evaluate(SystemPropertiesRestoreRule.java:57)
	at org.apache.lucene.util.TestRuleSetupTeardownChained$1.evaluate(TestRuleSetupTeardownChained.java:49)
	at org.apache.lucene.util.AbstractBeforeAfterRule$1.evaluate(AbstractBeforeAfterRule.java:45)
	at org.apache.lucene.util.TestRuleThreadAndTestName$1.evaluate(TestRuleThreadAndTestName.java:48)
	at org.apache.lucene.util.TestRuleIgnoreAfterMaxFailures$1.evaluate(TestRuleIgnoreAfterMaxFailures.java:64)
	at org.apache.lucene.util.TestRuleMarkFailure$1.evaluate(TestRuleMarkFailure.java:47)
	at com.carrotsearch.randomizedtesting.rules.StatementAdapter.evaluate(StatementAdapter.java:36)
	at com.carrotsearch.randomizedtesting.ThreadLeakControl$StatementRunner.run(ThreadLeakControl.java:368)
	at com.carrotsearch.randomizedtesting.ThreadLeakControl.forkTimeoutingTask(ThreadLeakControl.java:817)
	at com.carrotsearch.randomizedtesting.ThreadLeakControl$3.evaluate(ThreadLeakControl.java:468)
	at com.carrotsearch.randomizedtesting.RandomizedRunner.runSingleTest(RandomizedRunner.java:944)
	at com.carrotsearch.randomizedtesting.RandomizedRunner$5.evaluate(RandomizedRunner.java:830)
	at com.carrotsearch.randomizedtesting.RandomizedRunner$6.evaluate(RandomizedRunner.java:880)
	at com.carrotsearch.randomizedtesting.RandomizedRunner$7.evaluate(RandomizedRunner.java:891)
	at com.carrotsearch.randomizedtesting.rules.StatementAdapter.evaluate(StatementAdapter.java:36)
	at com.carrotsearch.randomizedtesting.rules.SystemPropertiesRestoreRule$1.evaluate(SystemPropertiesRestoreRule.java:57)
	at org.apache.lucene.util.AbstractBeforeAfterRule$1.evaluate(AbstractBeforeAfterRule.java:45)
	at com.carrotsearch.randomizedtesting.rules.StatementAdapter.evaluate(StatementAdapter.java:36)
	at org.apache.lucene.util.TestRuleStoreClassName$1.evaluate(TestRuleStoreClassName.java:41)
	at com.carrotsearch.randomizedtesting.rules.NoShadowingOrOverridesOnMethodsRule$1.evaluate(NoShadowingOrOverridesOnMethodsRule.java:40)
	at com.carrotsearch.randomizedtesting.rules.NoShadowingOrOverridesOnMethodsRule$1.evaluate(NoShadowingOrOverridesOnMethodsRule.java:40)
	at com.carrotsearch.randomizedtesting.rules.StatementAdapter.evaluate(StatementAdapter.java:36)
	at com.carrotsearch.randomizedtesting.rules.StatementAdapter.evaluate(StatementAdapter.java:36)
	at com.carrotsearch.randomizedtesting.rules.StatementAdapter.evaluate(StatementAdapter.java:36)
	at org.apache.lucene.util.TestRuleAssertionsRequired$1.evaluate(TestRuleAssertionsRequired.java:53)
	at org.apache.lucene.util.TestRuleMarkFailure$1.evaluate(TestRuleMarkFailure.java:47)
	at org.apache.lucene.util.TestRuleIgnoreAfterMaxFailures$1.evaluate(TestRuleIgnoreAfterMaxFailures.java:64)
	at org.apache.lucene.util.TestRuleIgnoreTestSuites$1.evaluate(TestRuleIgnoreTestSuites.java:54)
	at com.carrotsearch.randomizedtesting.rules.StatementAdapter.evaluate(StatementAdapter.java:36)
	at com.carrotsearch.randomizedtesting.ThreadLeakControl$StatementRunner.run(ThreadLeakControl.java:368)
	at java.lang.Thread.run(Thread.java:748)


FAILED:  org.apache.solr.cloud.autoscaling.sim.TestSimTriggerIntegration.testSearchRate

Error Message:
org.apache.solr.client.solrj.request.CollectionAdminRequest$AddReplica cannot be cast to java.util.Map

Stack Trace:
java.lang.ClassCastException: org.apache.solr.client.solrj.request.CollectionAdminRequest$AddReplica cannot be cast to java.util.Map
	at __randomizedtesting.SeedInfo.seed([FB369E21D7C98B2C:A67E80A8180F2D63]:0)
	at org.apache.solr.cloud.autoscaling.sim.TestSimTriggerIntegration.testSearchRate(TestSimTriggerIntegration.java:1321)
	at sun.reflect.NativeMethodAccessorImpl.invoke0(Native Method)
	at sun.reflect.NativeMethodAccessorImpl.invoke(NativeMethodAccessorImpl.java:62)
	at sun.reflect.DelegatingMethodAccessorImpl.invoke(DelegatingMethodAccessorImpl.java:43)
	at java.lang.reflect.Method.invoke(Method.java:498)
	at com.carrotsearch.randomizedtesting.RandomizedRunner.invoke(RandomizedRunner.java:1742)
	at com.carrotsearch.randomizedtesting.RandomizedRunner$8.evaluate(RandomizedRunner.java:935)
	at com.carrotsearch.randomizedtesting.RandomizedRunner$9.evaluate(RandomizedRunner.java:971)
	at com.carrotsearch.randomizedtesting.RandomizedRunner$10.evaluate(RandomizedRunner.java:985)
	at com.carrotsearch.randomizedtesting.rules.SystemPropertiesRestoreRule$1.evaluate(SystemPropertiesRestoreRule.java:57)
	at org.apache.lucene.util.TestRuleSetupTeardownChained$1.evaluate(TestRuleSetupTeardownChained.java:49)
	at org.apache.lucene.util.AbstractBeforeAfterRule$1.evaluate(AbstractBeforeAfterRule.java:45)
	at org.apache.lucene.util.TestRuleThreadAndTestName$1.evaluate(TestRuleThreadAndTestName.java:48)
	at org.apache.lucene.util.TestRuleIgnoreAfterMaxFailures$1.evaluate(TestRuleIgnoreAfterMaxFailures.java:64)
	at org.apache.lucene.util.TestRuleMarkFailure$1.evaluate(TestRuleMarkFailure.java:47)
	at com.carrotsearch.randomizedtesting.rules.StatementAdapter.evaluate(StatementAdapter.java:36)
	at com.carrotsearch.randomizedtesting.ThreadLeakControl$StatementRunner.run(ThreadLeakControl.java:368)
	at com.carrotsearch.randomizedtesting.ThreadLeakControl.forkTimeoutingTask(ThreadLeakControl.java:817)
	at com.carrotsearch.randomizedtesting.ThreadLeakControl$3.evaluate(ThreadLeakControl.java:468)
	at com.carrotsearch.randomizedtesting.RandomizedRunner.runSingleTest(RandomizedRunner.java:944)
	at com.carrotsearch.randomizedtesting.RandomizedRunner$5.evaluate(RandomizedRunner.java:830)
	at com.carrotsearch.randomizedtesting.RandomizedRunner$6.evaluate(RandomizedRunner.java:880)
	at com.carrotsearch.randomizedtesting.RandomizedRunner$7.evaluate(RandomizedRunner.java:891)
	at com.carrotsearch.randomizedtesting.rules.StatementAdapter.evaluate(StatementAdapter.java:36)
	at com.carrotsearch.randomizedtesting.rules.SystemPropertiesRestoreRule$1.evaluate(SystemPropertiesRestoreRule.java:57)
	at org.apache.lucene.util.AbstractBeforeAfterRule$1.evaluate(AbstractBeforeAfterRule.java:45)
	at com.carrotsearch.randomizedtesting.rules.StatementAdapter.evaluate(StatementAdapter.java:36)
	at org.apache.lucene.util.TestRuleStoreClassName$1.evaluate(TestRuleStoreClassName.java:41)
	at com.carrotsearch.randomizedtesting.rules.NoShadowingOrOverridesOnMethodsRule$1.evaluate(NoShadowingOrOverridesOnMethodsRule.java:40)
	at com.carrotsearch.randomizedtesting.rules.NoShadowingOrOverridesOnMethodsRule$1.evaluate(NoShadowingOrOverridesOnMethodsRule.java:40)
	at com.carrotsearch.randomizedtesting.rules.StatementAdapter.evaluate(StatementAdapter.java:36)
	at com.carrotsearch.randomizedtesting.rules.StatementAdapter.evaluate(StatementAdapter.java:36)
	at com.carrotsearch.randomizedtesting.rules.StatementAdapter.evaluate(StatementAdapter.java:36)
	at org.apache.lucene.util.TestRuleAssertionsRequired$1.evaluate(TestRuleAssertionsRequired.java:53)
	at org.apache.lucene.util.TestRuleMarkFailure$1.evaluate(TestRuleMarkFailure.java:47)
	at org.apache.lucene.util.TestRuleIgnoreAfterMaxFailures$1.evaluate(TestRuleIgnoreAfterMaxFailures.java:64)
	at org.apache.lucene.util.TestRuleIgnoreTestSuites$1.evaluate(TestRuleIgnoreTestSuites.java:54)
	at com.carrotsearch.randomizedtesting.rules.StatementAdapter.evaluate(StatementAdapter.java:36)
	at com.carrotsearch.randomizedtesting.ThreadLeakControl$StatementRunner.run(ThreadLeakControl.java:368)
	at java.lang.Thread.run(Thread.java:748)


FAILED:  org.apache.solr.cloud.autoscaling.sim.TestSimTriggerIntegration.testSearchRate

Error Message:
org.apache.solr.client.solrj.request.CollectionAdminRequest$AddReplica cannot be cast to java.util.Map

Stack Trace:
java.lang.ClassCastException: org.apache.solr.client.solrj.request.CollectionAdminRequest$AddReplica cannot be cast to java.util.Map
	at __randomizedtesting.SeedInfo.seed([FB369E21D7C98B2C:A67E80A8180F2D63]:0)
	at org.apache.solr.cloud.autoscaling.sim.TestSimTriggerIntegration.testSearchRate(TestSimTriggerIntegration.java:1321)
	at sun.reflect.NativeMethodAccessorImpl.invoke0(Native Method)
	at sun.reflect.NativeMethodAccessorImpl.invoke(NativeMethodAccessorImpl.java:62)
	at sun.reflect.DelegatingMethodAccessorImpl.invoke(DelegatingMethodAccessorImpl.java:43)
	at java.lang.reflect.Method.invoke(Method.java:498)
	at com.carrotsearch.randomizedtesting.RandomizedRunner.invoke(RandomizedRunner.java:1742)
	at com.carrotsearch.randomizedtesting.RandomizedRunner$8.evaluate(RandomizedRunner.java:935)
	at com.carrotsearch.randomizedtesting.RandomizedRunner$9.evaluate(RandomizedRunner.java:971)
	at com.carrotsearch.randomizedtesting.RandomizedRunner$10.evaluate(RandomizedRunner.java:985)
	at com.carrotsearch.randomizedtesting.rules.SystemPropertiesRestoreRule$1.evaluate(SystemPropertiesRestoreRule.java:57)
	at org.apache.lucene.util.TestRuleSetupTeardownChained$1.evaluate(TestRuleSetupTeardownChained.java:49)
	at org.apache.lucene.util.AbstractBeforeAfterRule$1.evaluate(AbstractBeforeAfterRule.java:45)
	at org.apache.lucene.util.TestRuleThreadAndTestName$1.evaluate(TestRuleThreadAndTestName.java:48)
	at org.apache.lucene.util.TestRuleIgnoreAfterMaxFailures$1.evaluate(TestRuleIgnoreAfterMaxFailures.java:64)
	at org.apache.lucene.util.TestRuleMarkFailure$1.evaluate(TestRuleMarkFailure.java:47)
	at com.carrotsearch.randomizedtesting.rules.StatementAdapter.evaluate(StatementAdapter.java:36)
	at com.carrotsearch.randomizedtesting.ThreadLeakControl$StatementRunner.run(ThreadLeakControl.java:368)
	at com.carrotsearch.randomizedtesting.ThreadLeakControl.forkTimeoutingTask(ThreadLeakControl.java:817)
	at com.carrotsearch.randomizedtesting.ThreadLeakControl$3.evaluate(ThreadLeakControl.java:468)
	at com.carrotsearch.randomizedtesting.RandomizedRunner.runSingleTest(RandomizedRunner.java:944)
	at com.carrotsearch.randomizedtesting.RandomizedRunner$5.evaluate(RandomizedRunner.java:830)
	at com.carrotsearch.randomizedtesting.RandomizedRunner$6.evaluate(RandomizedRunner.java:880)
	at com.carrotsearch.randomizedtesting.RandomizedRunner$7.evaluate(RandomizedRunner.java:891)
	at com.carrotsearch.randomizedtesting.rules.StatementAdapter.evaluate(StatementAdapter.java:36)
	at com.carrotsearch.randomizedtesting.rules.SystemPropertiesRestoreRule$1.evaluate(SystemPropertiesRestoreRule.java:57)
	at org.apache.lucene.util.AbstractBeforeAfterRule$1.evaluate(AbstractBeforeAfterRule.java:45)
	at com.carrotsearch.randomizedtesting.rules.StatementAdapter.evaluate(StatementAdapter.java:36)
	at org.apache.lucene.util.TestRuleStoreClassName$1.evaluate(TestRuleStoreClassName.java:41)
	at com.carrotsearch.randomizedtesting.rules.NoShadowingOrOverridesOnMethodsRule$1.evaluate(NoShadowingOrOverridesOnMethodsRule.java:40)
	at com.carrotsearch.randomizedtesting.rules.NoShadowingOrOverridesOnMethodsRule$1.evaluate(NoShadowingOrOverridesOnMethodsRule.java:40)
	at com.carrotsearch.randomizedtesting.rules.StatementAdapter.evaluate(StatementAdapter.java:36)
	at com.carrotsearch.randomizedtesting.rules.StatementAdapter.evaluate(StatementAdapter.java:36)
	at com.carrotsearch.randomizedtesting.rules.StatementAdapter.evaluate(StatementAdapter.java:36)
	at org.apache.lucene.util.TestRuleAssertionsRequired$1.evaluate(TestRuleAssertionsRequired.java:53)
	at org.apache.lucene.util.TestRuleMarkFailure$1.evaluate(TestRuleMarkFailure.java:47)
	at org.apache.lucene.util.TestRuleIgnoreAfterMaxFailures$1.evaluate(TestRuleIgnoreAfterMaxFailures.java:64)
	at org.apache.lucene.util.TestRuleIgnoreTestSuites$1.evaluate(TestRuleIgnoreTestSuites.java:54)
	at com.carrotsearch.randomizedtesting.rules.StatementAdapter.evaluate(StatementAdapter.java:36)
	at com.carrotsearch.randomizedtesting.ThreadLeakControl$StatementRunner.run(ThreadLeakControl.java:368)
	at java.lang.Thread.run(Thread.java:748)


FAILED:  org.apache.solr.cloud.autoscaling.sim.TestSimTriggerIntegration.testSearchRate

Error Message:
org.apache.solr.client.solrj.request.CollectionAdminRequest$AddReplica cannot be cast to java.util.Map

Stack Trace:
java.lang.ClassCastException: org.apache.solr.client.solrj.request.CollectionAdminRequest$AddReplica cannot be cast to java.util.Map
	at __randomizedtesting.SeedInfo.seed([FB369E21D7C98B2C:A67E80A8180F2D63]:0)
	at org.apache.solr.cloud.autoscaling.sim.TestSimTriggerIntegration.testSearchRate(TestSimTriggerIntegration.java:1321)
	at sun.reflect.NativeMethodAccessorImpl.invoke0(Native Method)
	at sun.reflect.NativeMethodAccessorImpl.invoke(NativeMethodAccessorImpl.java:62)
	at sun.reflect.DelegatingMethodAccessorImpl.invoke(DelegatingMethodAccessorImpl.java:43)
	at java.lang.reflect.Method.invoke(Method.java:498)
	at com.carrotsearch.randomizedtesting.RandomizedRunner.invoke(RandomizedRunner.java:1742)
	at com.carrotsearch.randomizedtesting.RandomizedRunner$8.evaluate(RandomizedRunner.java:935)
	at com.carrotsearch.randomizedtesting.RandomizedRunner$9.evaluate(RandomizedRunner.java:971)
	at com.carrotsearch.randomizedtesting.RandomizedRunner$10.evaluate(RandomizedRunner.java:985)
	at com.carrotsearch.randomizedtesting.rules.SystemPropertiesRestoreRule$1.evaluate(SystemPropertiesRestoreRule.java:57)
	at org.apache.lucene.util.TestRuleSetupTeardownChained$1.evaluate(TestRuleSetupTeardownChained.java:49)
	at org.apache.lucene.util.AbstractBeforeAfterRule$1.evaluate(AbstractBeforeAfterRule.java:45)
	at org.apache.lucene.util.TestRuleThreadAndTestName$1.evaluate(TestRuleThreadAndTestName.java:48)
	at org.apache.lucene.util.TestRuleIgnoreAfterMaxFailures$1.evaluate(TestRuleIgnoreAfterMaxFailures.java:64)
	at org.apache.lucene.util.TestRuleMarkFailure$1.evaluate(TestRuleMarkFailure.java:47)
	at com.carrotsearch.randomizedtesting.rules.StatementAdapter.evaluate(StatementAdapter.java:36)
	at com.carrotsearch.randomizedtesting.ThreadLeakControl$StatementRunner.run(ThreadLeakControl.java:368)
	at com.carrotsearch.randomizedtesting.ThreadLeakControl.forkTimeoutingTask(ThreadLeakControl.java:817)
	at com.carrotsearch.randomizedtesting.ThreadLeakControl$3.evaluate(ThreadLeakControl.java:468)
	at com.carrotsearch.randomizedtesting.RandomizedRunner.runSingleTest(RandomizedRunner.java:944)
	at com.carrotsearch.randomizedtesting.RandomizedRunner$5.evaluate(RandomizedRunner.java:830)
	at com.carrotsearch.randomizedtesting.RandomizedRunner$6.evaluate(RandomizedRunner.java:880)
	at com.carrotsearch.randomizedtesting.RandomizedRunner$7.evaluate(RandomizedRunner.java:891)
	at com.carrotsearch.randomizedtesting.rules.StatementAdapter.evaluate(StatementAdapter.java:36)
	at com.carrotsearch.randomizedtesting.rules.SystemPropertiesRestoreRule$1.evaluate(SystemPropertiesRestoreRule.java:57)
	at org.apache.lucene.util.AbstractBeforeAfterRule$1.evaluate(AbstractBeforeAfterRule.java:45)
	at com.carrotsearch.randomizedtesting.rules.StatementAdapter.evaluate(StatementAdapter.java:36)
	at org.apache.lucene.util.TestRuleStoreClassName$1.evaluate(TestRuleStoreClassName.java:41)
	at com.carrotsearch.randomizedtesting.rules.NoShadowingOrOverridesOnMethodsRule$1.evaluate(NoShadowingOrOverridesOnMethodsRule.java:40)
	at com.carrotsearch.randomizedtesting.rules.NoShadowingOrOverridesOnMethodsRule$1.evaluate(NoShadowingOrOverridesOnMethodsRule.java:40)
	at com.carrotsearch.randomizedtesting.rules.StatementAdapter.evaluate(StatementAdapter.java:36)
	at com.carrotsearch.randomizedtesting.rules.StatementAdapter.evaluate(StatementAdapter.java:36)
	at com.carrotsearch.randomizedtesting.rules.StatementAdapter.evaluate(StatementAdapter.java:36)
	at org.apache.lucene.util.TestRuleAssertionsRequired$1.evaluate(TestRuleAssertionsRequired.java:53)
	at org.apache.lucene.util.TestRuleMarkFailure$1.evaluate(TestRuleMarkFailure.java:47)
	at org.apache.lucene.util.TestRuleIgnoreAfterMaxFailures$1.evaluate(TestRuleIgnoreAfterMaxFailures.java:64)
	at org.apache.lucene.util.TestRuleIgnoreTestSuites$1.evaluate(TestRuleIgnoreTestSuites.java:54)
	at com.carrotsearch.randomizedtesting.rules.StatementAdapter.evaluate(StatementAdapter.java:36)
	at com.carrotsearch.randomizedtesting.ThreadLeakControl$StatementRunner.run(ThreadLeakControl.java:368)
	at java.lang.Thread.run(Thread.java:748)




Build Log:
[...truncated 14248 lines...]
   [junit4] Suite: org.apache.solr.cloud.autoscaling.sim.TestSimTriggerIntegration
   [junit4]   2> Creating dataDir: /export/home/jenkins/workspace/Lucene-Solr-master-Solaris/solr/build/solr-core/test/J0/temp/solr.cloud.autoscaling.sim.TestSimTriggerIntegration_FB369E21D7C98B2C-001/init-core-data-001
   [junit4]   2> 3416118 INFO  (SUITE-TestSimTriggerIntegration-seed#[FB369E21D7C98B2C]-worker) [    ] o.a.s.SolrTestCaseJ4 Using PointFields (NUMERIC_POINTS_SYSPROP=true) w/NUMERIC_DOCVALUES_SYSPROP=true
   [junit4]   2> 3416119 INFO  (SUITE-TestSimTriggerIntegration-seed#[FB369E21D7C98B2C]-worker) [    ] o.a.s.SolrTestCaseJ4 Randomized ssl (false) and clientAuth (false) via: @org.apache.solr.util.RandomizeSSL(reason=, value=NaN, ssl=NaN, clientAuth=NaN)
   [junit4]   2> 3416119 INFO  (SUITE-TestSimTriggerIntegration-seed#[FB369E21D7C98B2C]-worker) [    ] o.a.s.SolrTestCaseJ4 SecureRandom sanity checks: test.solr.allowed.securerandom=null & java.security.egd=file:/dev/./urandom
   [junit4]   2> 3416122 DEBUG (SUITE-TestSimTriggerIntegration-seed#[FB369E21D7C98B2C]-worker) [    ] o.a.s.c.a.s.SimClusterStateProvider --- new Overseer leader: 127.0.0.1:10322_solr
   [junit4]   2> 3416122 DEBUG (Simulated OverseerAutoScalingTriggerThread) [    ] o.a.s.c.a.OverseerTriggerThread Adding .auto_add_replicas and .scheduled_maintenance triggers
   [junit4]   2> 3416122 DEBUG (Simulated OverseerAutoScalingTriggerThread) [    ] o.a.s.c.a.OverseerTriggerThread Refreshing /autoscaling.json with znode version 0
   [junit4]   2> 3416122 DEBUG (SUITE-TestSimTriggerIntegration-seed#[FB369E21D7C98B2C]-worker) [    ] o.a.s.c.a.s.SimClusterStateProvider ** creating new collection states
   [junit4]   2> 3416122 DEBUG (SUITE-TestSimTriggerIntegration-seed#[FB369E21D7C98B2C]-worker) [    ] o.a.s.c.a.s.SimClusterStateProvider ** saved cluster state version -1
   [junit4]   2> 3416122 INFO  (SUITE-TestSimTriggerIntegration-seed#[FB369E21D7C98B2C]-worker) [    ] o.a.s.h.a.MetricsHistoryHandler No .system collection, keeping metrics history in memory.
   [junit4]   2> 3416123 DEBUG (Simulated OverseerAutoScalingTriggerThread) [    ] o.a.s.c.a.OverseerTriggerThread Current znodeVersion 0, lastZnodeVersion -1
   [junit4]   2> 3416123 DEBUG (Simulated OverseerAutoScalingTriggerThread) [    ] o.a.s.c.a.OverseerTriggerThread Processed trigger updates upto znodeVersion 0
   [junit4]   2> 3416123 DEBUG (Simulated OverseerAutoScalingTriggerThread) [    ] o.a.s.c.a.NodeLostTrigger NodeLostTrigger .auto_add_replicas - Initial livenodes: [127.0.0.1:10322_solr, 127.0.0.1:10323_solr]
   [junit4] IGNOR/A 0.00s J0 | TestSimTriggerIntegration.testListeners
   [junit4]    > Assumption #1: 'badapple' test group is disabled (@BadApple(bugUrl=https://issues.apache.org/jira/browse/SOLR-12028))
   [junit4]   2> 3416123 DEBUG (Simulated OverseerAutoScalingTriggerThread) [    ] o.a.s.c.a.OverseerTriggerThread -- clean old nodeAdded markers
   [junit4]   2> 3416123 DEBUG (Simulated OverseerAutoScalingTriggerThread) [    ] o.a.s.c.a.OverseerTriggerThread Current znodeVersion 0, lastZnodeVersion 0
   [junit4]   2> 3416123 DEBUG (ScheduledTrigger-11694-thread-1) [    ] o.a.s.c.a.NodeLostTrigger Running NodeLostTrigger: .auto_add_replicas with currently live nodes: 2
   [junit4] IGNOR/A 0.00s J0 | TestSimTriggerIntegration.testNodeAddedTrigger
   [junit4]    > Assumption #1: 'badapple' test group is disabled (@BadApple(bugUrl=https://issues.apache.org/jira/browse/SOLR-12028))
   [junit4]   2> 3416145 DEBUG (ScheduledTrigger-11694-thread-1) [    ] o.a.s.c.a.NodeLostTrigger Running NodeLostTrigger: .auto_add_replicas with currently live nodes: 2
   [junit4]   2> 3416145 INFO  (TEST-TestSimTriggerIntegration.testNodeLostTrigger-seed#[FB369E21D7C98B2C]) [    ] o.a.s.SolrTestCaseJ4 ###Starting testNodeLostTrigger
   [junit4]   2> 3416145 DEBUG (TEST-TestSimTriggerIntegration.testNodeLostTrigger-seed#[FB369E21D7C98B2C]) [    ] o.a.s.c.a.OverseerTriggerThread Refreshing /autoscaling.json with znode version 1
   [junit4]   2> 3416145 DEBUG (Simulated OverseerAutoScalingTriggerThread) [    ] o.a.s.c.a.OverseerTriggerThread Processed trigger updates upto znodeVersion 1
   [junit4]   2> 3416145 INFO  (TEST-TestSimTriggerIntegration.testNodeLostTrigger-seed#[FB369E21D7C98B2C]) [    ] o.a.s.c.a.s.SimCloudManager === Restarting OverseerTriggerThread and clearing object cache...
   [junit4]   2> 3416151 DEBUG (Simulated OverseerAutoScalingTriggerThread) [    ] o.a.s.c.a.OverseerTriggerThread -- clean old nodeLost markers
   [junit4]   2> 3416151 DEBUG (Simulated OverseerAutoScalingTriggerThread) [    ] o.a.s.c.a.OverseerTriggerThread -- clean old nodeAdded markers
   [junit4]   2> 3416151 WARN  (Simulated OverseerAutoScalingTriggerThread) [    ] o.a.s.c.a.OverseerTriggerThread Interrupted
   [junit4]   2> java.lang.InterruptedException: null
   [junit4]   2> 	at java.util.concurrent.locks.AbstractQueuedSynchronizer.acquireInterruptibly(AbstractQueuedSynchronizer.java:1220) ~[?:1.8.0_172]
   [junit4]   2> 	at java.util.concurrent.locks.ReentrantLock.lockInterruptibly(ReentrantLock.java:335) ~[?:1.8.0_172]
   [junit4]   2> 	at org.apache.solr.cloud.autoscaling.OverseerTriggerThread.run(OverseerTriggerThread.java:177) [java/:?]
   [junit4]   2> 	at java.lang.Thread.run(Thread.java:748) [?:1.8.0_172]
   [junit4]   2> 3416151 DEBUG (TEST-TestSimTriggerIntegration.testNodeLostTrigger-seed#[FB369E21D7C98B2C]) [    ] o.a.s.c.a.OverseerTriggerThread OverseerTriggerThread has been closed explicitly
   [junit4]   2> 3416151 DEBUG (Simulated OverseerAutoScalingTriggerThread) [    ] o.a.s.c.a.OverseerTriggerThread Adding .auto_add_replicas and .scheduled_maintenance triggers
   [junit4]   2> 3416152 DEBUG (Simulated OverseerAutoScalingTriggerThread) [    ] o.a.s.c.a.OverseerTriggerThread Refreshing /autoscaling.json with znode version 2
   [junit4]   2> 3416152 DEBUG (Simulated OverseerAutoScalingTriggerThread) [    ] o.a.s.c.a.OverseerTriggerThread Current znodeVersion 2, lastZnodeVersion -1
   [junit4]   2> 3416152 DEBUG (Simulated OverseerAutoScalingTriggerThread) [    ] o.a.s.c.a.OverseerTriggerThread Processed trigger updates upto znodeVersion 2
   [junit4]   2> 3416152 DEBUG (Simulated OverseerAutoScalingTriggerThread) [    ] o.a.s.c.a.NodeLostTrigger NodeLostTrigger .auto_add_replicas - Initial livenodes: [127.0.0.1:10322_solr, 127.0.0.1:10323_solr]
   [junit4]   2> 3416152 DEBUG (Simulated OverseerAutoScalingTriggerThread) [    ] o.a.s.c.a.OverseerTriggerThread -- clean old nodeAdded markers
   [junit4]   2> 3416152 DEBUG (Simulated OverseerAutoScalingTriggerThread) [    ] o.a.s.c.a.OverseerTriggerThread Current znodeVersion 2, lastZnodeVersion 2
   [junit4]   2> 3416152 DEBUG (ScheduledTrigger-11699-thread-2) [    ] o.a.s.c.a.NodeLostTrigger Running NodeLostTrigger: .auto_add_replicas with currently live nodes: 2
   [junit4]   2> 3416176 DEBUG (ScheduledTrigger-11699-thread-1) [    ] o.a.s.c.a.NodeLostTrigger Running NodeLostTrigger: .auto_add_replicas with currently live nodes: 2
   [junit4]   2> 3416196 DEBUG (ScheduledTrigger-11699-thread-3) [    ] o.a.s.c.a.NodeLostTrigger Running NodeLostTrigger: .auto_add_replicas with currently live nodes: 2
   [junit4]   2> 3416217 DEBUG (ScheduledTrigger-11699-thread-4) [    ] o.a.s.c.a.NodeLostTrigger Running NodeLostTrigger: .auto_add_replicas with currently live nodes: 2
   [junit4]   2> 3416237 DEBUG (ScheduledTrigger-11699-thread-3) [    ] o.a.s.c.a.NodeLostTrigger Running NodeLostTrigger: .auto_add_replicas with currently live nodes: 2
   [junit4]   2> 3416253 DEBUG (simCloudManagerPool-11698-thread-1) [    ] o.a.s.c.a.s.SimClusterStateProvider ** creating new collection states
   [junit4]   2> 3416255 DEBUG (simCloudManagerPool-11698-thread-1) [    ] o.a.s.c.a.s.SimClusterStateProvider ** saved cluster state version 0
   [junit4]   2> 3416255 DEBUG (simCloudManagerPool-11698-thread-1) [    ] o.a.s.c.a.AutoScalingHandler Verified autoscaling configuration
   [junit4]   2> 3416255 DEBUG (simCloudManagerPool-11698-thread-1) [    ] o.a.s.c.a.OverseerTriggerThread Refreshing /autoscaling.json with znode version 3
   [junit4]   2> 3416257 DEBUG (Simulated OverseerAutoScalingTriggerThread) [    ] o.a.s.c.a.OverseerTriggerThread Processed trigger updates upto znodeVersion 3
   [junit4]   2> 3416257 DEBUG (Simulated OverseerAutoScalingTriggerThread) [    ] o.a.s.c.a.OverseerTriggerThread -- clean old nodeAdded markers
   [junit4]   2> 3416257 DEBUG (Simulated OverseerAutoScalingTriggerThread) [    ] o.a.s.c.a.OverseerTriggerThread Current znodeVersion 3, lastZnodeVersion 3
   [junit4]   2> 3416257 DEBUG (TEST-TestSimTriggerIntegration.testNodeLostTrigger-seed#[FB369E21D7C98B2C]) [    ] o.a.s.c.a.s.SimClusterStateProvider ** creating new collection states
   [junit4]   2> 3416257 DEBUG (TEST-TestSimTriggerIntegration.testNodeLostTrigger-seed#[FB369E21D7C98B2C]) [    ] o.a.s.c.a.s.SimClusterStateProvider ** saved cluster state version 1
   [junit4]   2> 3416258 DEBUG (ScheduledTrigger-11699-thread-1) [    ] o.a.s.c.a.NodeLostTrigger Running NodeLostTrigger: .auto_add_replicas with currently live nodes: 2
   [junit4]   2> 3416278 DEBUG (ScheduledTrigger-11699-thread-1) [    ] o.a.s.c.a.NodeLostTrigger Running NodeLostTrigger: .auto_add_replicas with currently live nodes: 2
   [junit4]   2> 3416278 DEBUG (simCloudManagerPool-11698-thread-2) [    ] o.a.s.c.a.s.SimClusterStateProvider ** creating new collection states
   [junit4]   2> 3416278 DEBUG (simCloudManagerPool-11698-thread-2) [    ] o.a.s.c.a.s.SimClusterStateProvider ** saved cluster state version 2
   [junit4]   2> 3416279 DEBUG (simCloudManagerPool-11698-thread-3) [    ] o.a.s.c.a.s.SimClusterStateProvider -- elected new leader for .system / shard1: {"core_node1":{
   [junit4]   2>     "core":".system_shard1_replica_n1",
   [junit4]   2>     "shard":"shard1",
   [junit4]   2>     "collection":".system",
   [junit4]   2>     "node_name":"127.0.0.1:10322_solr",
   [junit4]   2>     "type":"NRT",
   [junit4]   2>     "leader":"true",
   [junit4]   2>     "SEARCHER.searcher.maxDoc":0,
   [junit4]   2>     "SEARCHER.searcher.deletedDocs":0,
   [junit4]   2>     "INDEX.sizeInBytes":10240,
   [junit4]   2>     "state":"active",
   [junit4]   2>     "INDEX.sizeInGB":9.5367431640625E-6,
   [junit4]   2>     "SEARCHER.searcher.numDocs":0}}
   [junit4]   2> 3416280 DEBUG (TEST-TestSimTriggerIntegration.testNodeLostTrigger-seed#[FB369E21D7C98B2C]) [    ] o.a.s.c.a.s.SimClusterStateProvider ** creating new collection states
   [junit4]   2> 3416280 DEBUG (TEST-TestSimTriggerIntegration.testNodeLostTrigger-seed#[FB369E21D7C98B2C]) [    ] o.a.s.c.a.s.SimClusterStateProvider ** saved cluster state version 3
   [junit4]   2> 3416281 DEBUG (simCloudManagerPool-11698-thread-4) [    ] o.a.s.c.a.AutoScalingHandler Verified autoscaling configuration
   [junit4]   2> 3416282 DEBUG (simCloudManagerPool-11698-thread-4) [    ] o.a.s.c.a.OverseerTriggerThread Refreshing /autoscaling.json with znode version 4
   [junit4]   2> 3416282 DEBUG (Simulated OverseerAutoScalingTriggerThread) [    ] o.a.s.c.a.OverseerTriggerThread Processed trigger updates upto znodeVersion 4
   [junit4]   2> 3416282 INFO  (Simulated OverseerAutoScalingTriggerThread) [    ] o.a.s.c.a.s.TestSimTriggerIntegration TestTriggerAction init
   [junit4]   2> 3416282 DEBUG (Simulated OverseerAutoScalingTriggerThread) [    ] o.a.s.c.a.NodeLostTrigger NodeLostTrigger node_lost_trigger - Initial livenodes: [127.0.0.1:10322_solr, 127.0.0.1:10323_solr]
   [junit4]   2> 3416282 DEBUG (Simulated OverseerAutoScalingTriggerThread) [    ] o.a.s.c.a.OverseerTriggerThread -- clean old nodeAdded markers
   [junit4]   2> 3416282 DEBUG (Simulated OverseerAutoScalingTriggerThread) [    ] o.a.s.c.a.OverseerTriggerThread Current znodeVersion 4, lastZnodeVersion 4
   [junit4]   2> 3416282 DEBUG (ScheduledTrigger-11699-thread-3) [    ] o.a.s.c.a.NodeLostTrigger Running NodeLostTrigger: node_lost_trigger with currently live nodes: 1
   [junit4]   2> 3416282 DEBUG (ScheduledTrigger-11699-thread-3) [    ] o.a.s.c.a.NodeLostTrigger Tracking lost node: 127.0.0.1:10323_solr
   [junit4]   2> 3416298 DEBUG (ScheduledTrigger-11699-thread-4) [    ] o.a.s.c.a.NodeLostTrigger Running NodeLostTrigger: .auto_add_replicas with currently live nodes: 1
   [junit4]   2> 3416298 DEBUG (ScheduledTrigger-11699-thread-4) [    ] o.a.s.c.a.NodeLostTrigger Tracking lost node: 127.0.0.1:10323_solr
   [junit4]   2> 3416306 DEBUG (ScheduledTrigger-11699-thread-4) [    ] o.a.s.c.a.NodeLostTrigger Running NodeLostTrigger: node_lost_trigger with currently live nodes: 1
   [junit4]   2> 3416306 DEBUG (ScheduledTrigger-11699-thread-4) [    ] o.a.s.c.a.NodeLostTrigger NodeLostTrigger firing registered processor for lost nodes: [127.0.0.1:10323_solr]
   [junit4]   2> 3416314 DEBUG (simCloudManagerPool-11698-thread-7) [    ] o.a.s.c.a.AutoScalingHandler Verified autoscaling configuration
   [junit4]   2> 3416314 DEBUG (simCloudManagerPool-11698-thread-7) [    ] o.a.s.c.a.OverseerTriggerThread Refreshing /autoscaling.json with znode version 5
   [junit4]   2> 3416314 DEBUG (Simulated OverseerAutoScalingTriggerThread) [    ] o.a.s.c.a.OverseerTriggerThread Processed trigger updates upto znodeVersion 5
   [junit4]   2> 3416314 DEBUG (Simulated OverseerAutoScalingTriggerThread) [    ] o.a.s.c.a.OverseerTriggerThread -- clean old nodeAdded markers
   [junit4]   2> 3416314 DEBUG (Simulated OverseerAutoScalingTriggerThread) [    ] o.a.s.c.a.OverseerTriggerThread Current znodeVersion 5, lastZnodeVersion 5
   [junit4]   2> 3416354 INFO  (TEST-TestSimTriggerIntegration.testNodeLostTrigger-seed#[FB369E21D7C98B2C]) [    ] o.a.s.SolrTestCaseJ4 ###Ending testNodeLostTrigger
   [junit4]   2> 3416355 DEBUG (TEST-TestSimTriggerIntegration.testNodeLostTrigger-seed#[FB369E21D7C98B2C]) [    ] o.a.s.c.a.s.SimClusterStateProvider ** creating new collection states
   [junit4]   2> 3416355 DEBUG (TEST-TestSimTriggerIntegration.testNodeLostTrigger-seed#[FB369E21D7C98B2C]) [    ] o.a.s.c.a.s.SimClusterStateProvider ** saved cluster state version 4
   [junit4]   2> 3416355 INFO  (TEST-TestSimTriggerIntegration.testNodeLostTrigger-seed#[FB369E21D7C98B2C]) [    ] o.a.s.c.a.s.SimSolrCloudTestCase #######################################
   [junit4]   2> ############ CLUSTER STATE ############
   [junit4]   2> #######################################
   [junit4]   2> ## Live nodes:		1
   [junit4]   2> ## Empty nodes:	0
   [junit4]   2> ## Dead nodes:		1
   [junit4]   2> ##		127.0.0.1:10323_solr
   [junit4]   2> ## Collections:
   [junit4]   2> ##  * .system
   [junit4]   2> ##    shardsTotal	1
   [junit4]   2> ##    shardsState	{active=1}
   [junit4]   2> ##      shardsWithoutLeader	0
   [junit4]   2> ##    totalReplicas	1
   [junit4]   2> ##      activeReplicas	1
   [junit4]   2> ##      inactiveReplicas	0
   [junit4]   2> ##    totalActiveDocs	2
   [junit4]   2> ##      bufferedDocs	0
   [junit4]   2> ##      maxActiveSliceDocs	2
   [junit4]   2> ##      minActiveSliceDocs	2
   [junit4]   2> ##      avgActiveSliceDocs	2
   [junit4]   2> ##    totalInactiveDocs	0
   [junit4]   2> ##      maxInactiveSliceDocs	0
   [junit4]   2> ##      minInactiveSliceDocs	0
   [junit4]   2> ##      avgInactiveSliceDocs	NaN
   [junit4]   2> ##    totalActiveBytes	11,240
   [junit4]   2> ##      maxActiveSliceBytes	11,240
   [junit4]   2> ##      minActiveSliceBytes	11,240
   [junit4]   2> ##      avgActiveSliceBytes	11,240
   [junit4]   2> ##    totalInactiveBytes	0
   [junit4]   2> ##      maxInactiveSliceBytes	0
   [junit4]   2> ##      minInactiveSliceBytes	0
   [junit4]   2> ##      avgInactiveSliceBytes	NaN
   [junit4]   2> ##    totalActiveDeletedDocs	0
   [junit4]   2> ## Max replicas per node:	1
   [junit4]   2> ## Min replicas per node:	1
   [junit4]   2> ## Total replicas:		1
   [junit4]   2> ## * .system		1
   [junit4]   2> ##		- active           1
   [junit4]   2> ######### Solr op counts ##########
   [junit4]   2> ##		- autoscaling        3
   [junit4]   2> ##		- update             2
   [junit4]   2> ######### Autoscaling event counts ###########
   [junit4]   2> ## * Trigger: node_lost_trigger
   [junit4]   2> ##		- STARTED         1
   [junit4]   2> ##		- SUCCEEDED       1
   [junit4]   2> 
   [junit4]   2> 3416395 INFO  (TEST-TestSimTriggerIntegration.testSearchRate-seed#[FB369E21D7C98B2C]) [    ] o.a.s.SolrTestCaseJ4 ###Starting testSearchRate
   [junit4]   2> 3416395 DEBUG (TEST-TestSimTriggerIntegration.testSearchRate-seed#[FB369E21D7C98B2C]) [    ] o.a.s.c.a.OverseerTriggerThread Refreshing /autoscaling.json with znode version 6
   [junit4]   2> 3416395 DEBUG (TEST-TestSimTriggerIntegration.testSearchRate-seed#[FB369E21D7C98B2C]) [    ] o.a.s.c.a.s.SimNodeStateProvider - removing dead node values: 127.0.0.1:10323_solr
   [junit4]   2> 3416395 DEBUG (Simulated OverseerAutoScalingTriggerThread) [    ] o.a.s.c.a.OverseerTriggerThread Processed trigger updates upto znodeVersion 6
   [junit4]   2> 3416395 DEBUG (Simulated OverseerAutoScalingTriggerThread) [    ] o.a.s.c.a.OverseerTriggerThread -- clean old nodeLost markers
   [junit4]   2> 3416395 DEBUG (Simulated OverseerAutoScalingTriggerThread) [    ] o.a.s.c.a.OverseerTriggerThread -- clean old nodeAdded markers
   [junit4]   2> 3416395 DEBUG (Simulated OverseerAutoScalingTriggerThread) [    ] o.a.s.c.a.OverseerTriggerThread Current znodeVersion 6, lastZnodeVersion 6
   [junit4]   2> 3416395 INFO  (TEST-TestSimTriggerIntegration.testSearchRate-seed#[FB369E21D7C98B2C]) [    ] o.a.s.c.a.s.SimCloudManager === Restarting OverseerTriggerThread and clearing object cache...
   [junit4]   2> 3416395 WARN  (Simulated OverseerAutoScalingTriggerThread) [    ] o.a.s.c.a.OverseerTriggerThread OverseerTriggerThread woken up but we are closed, exiting.
   [junit4]   2> 3416396 DEBUG (TEST-TestSimTriggerIntegration.testSearchRate-seed#[FB369E21D7C98B2C]) [    ] o.a.s.c.a.OverseerTriggerThread OverseerTriggerThread has been closed explicitly
   [junit4]   2> 3416396 DEBUG (Simulated OverseerAutoScalingTriggerThread) [    ] o.a.s.c.a.OverseerTriggerThread Adding .auto_add_replicas and .scheduled_maintenance triggers
   [junit4]   2> 3416397 DEBUG (Simulated OverseerAutoScalingTriggerThread) [    ] o.a.s.c.a.OverseerTriggerThread Refreshing /autoscaling.json with znode version 7
   [junit4]   2> 3416397 DEBUG (Simulated OverseerAutoScalingTriggerThread) [    ] o.a.s.c.a.OverseerTriggerThread Current znodeVersion 7, lastZnodeVersion -1
   [junit4]   2> 3416397 DEBUG (Simulated OverseerAutoScalingTriggerThread) [    ] o.a.s.c.a.OverseerTriggerThread Processed trigger updates upto znodeVersion 7
   [junit4]   2> 3416397 DEBUG (Simulated OverseerAutoScalingTriggerThread) [    ] o.a.s.c.a.NodeLostTrigger NodeLostTrigger .auto_add_replicas - Initial livenodes: [127.0.0.1:10324_solr, 127.0.0.1:10322_solr]
   [junit4]   2> 3416397 DEBUG (Simulated OverseerAutoScalingTriggerThread) [    ] o.a.s.c.a.OverseerTriggerThread -- clean old nodeAdded markers
   [junit4]   2> 3416397 DEBUG (Simulated OverseerAutoScalingTriggerThread) [    ] o.a.s.c.a.OverseerTriggerThread Current znodeVersion 7, lastZnodeVersion 7
   [junit4]   2> 3416397 DEBUG (ScheduledTrigger-11702-thread-2) [    ] o.a.s.c.a.NodeLostTrigger Running NodeLostTrigger: .auto_add_replicas with currently live nodes: 2
   [junit4]   2> 3416422 DEBUG (ScheduledTrigger-11702-thread-1) [    ] o.a.s.c.a.NodeLostTrigger Running NodeLostTrigger: .auto_add_replicas with currently live nodes: 2
   [junit4]   2> 3416443 DEBUG (ScheduledTrigger-11702-thread-4) [    ] o.a.s.c.a.NodeLostTrigger Running NodeLostTrigger: .auto_add_replicas with currently live nodes: 2
   [junit4]   2> 3416464 DEBUG (ScheduledTrigger-11702-thread-1) [    ] o.a.s.c.a.NodeLostTrigger Running NodeLostTrigger: .auto_add_replicas with currently live nodes: 2
   [junit4]   2> 3416484 DEBUG (ScheduledTrigger-11702-thread-1) [    ] o.a.s.c.a.NodeLostTrigger Running NodeLostTrigger: .auto_add_replicas with currently live nodes: 2
   [junit4]   2> 3416497 DEBUG (simCloudManagerPool-11701-thread-1) [    ] o.a.s.c.a.s.SimClusterStateProvider ** creating new collection states
   [junit4]   2> 3416497 DEBUG (simCloudManagerPool-11701-thread-1) [    ] o.a.s.c.a.s.SimClusterStateProvider ** saved cluster state version 5
   [junit4]   2> 3416497 DEBUG (simCloudManagerPool-11701-thread-1) [    ] o.a.s.c.a.AutoScalingHandler Verified autoscaling configuration
   [junit4]   2> 3416497 DEBUG (simCloudManagerPool-11701-thread-1) [    ] o.a.s.c.a.OverseerTriggerThread Refreshing /autoscaling.json with znode version 8
   [junit4]   2> 3416500 DEBUG (Simulated OverseerAutoScalingTriggerThread) [    ] o.a.s.c.a.OverseerTriggerThread Processed trigger updates upto znodeVersion 8
   [junit4]   2> 3416500 DEBUG (Simulated OverseerAutoScalingTriggerThread) [    ] o.a.s.c.a.OverseerTriggerThread -- clean old nodeAdded markers
   [junit4]   2> 3416500 DEBUG (Simulated OverseerAutoScalingTriggerThread) [    ] o.a.s.c.a.OverseerTriggerThread Current znodeVersion 8, lastZnodeVersion 8
   [junit4]   2> 3416500 DEBUG (TEST-TestSimTriggerIntegration.testSearchRate-seed#[FB369E21D7C98B2C]) [    ] o.a.s.c.a.s.SimClusterStateProvider ** creating new collection states
   [junit4]   2> 3416500 DEBUG (TEST-TestSimTriggerIntegration.testSearchRate-seed#[FB369E21D7C98B2C]) [    ] o.a.s.c.a.s.SimClusterStateProvider ** saved cluster state version 6
   [junit4]   2> 3416504 DEBUG (ScheduledTrigger-11702-thread-2) [    ] o.a.s.c.a.NodeLostTrigger Running NodeLostTrigger: .auto_add_replicas with currently live nodes: 2
   [junit4]   2> 3416521 DEBUG (simCloudManagerPool-11701-thread-2) [    ] o.a.s.c.a.s.SimClusterStateProvider ** creating new collection states
   [junit4]   2> 3416521 DEBUG (simCloudManagerPool-11701-thread-2) [    ] o.a.s.c.a.s.SimClusterStateProvider ** saved cluster state version 7
   [junit4]   2> 3416521 DEBUG (simCloudManagerPool-11701-thread-3) [    ] o.a.s.c.a.s.SimClusterStateProvider -- elected new leader for .system / shard1: {"core_node2":{
   [junit4]   2>     "core":".system_shard1_replica_n1",
   [junit4]   2>     "shard":"shard1",
   [junit4]   2>     "collection":".system",
   [junit4]   2>     "node_name":"127.0.0.1:10322_solr",
   [junit4]   2>     "type":"NRT",
   [junit4]   2>     "leader":"true",
   [junit4]   2>     "SEARCHER.searcher.maxDoc":0,
   [junit4]   2>     "SEARCHER.searcher.deletedDocs":0,
   [junit4]   2>     "INDEX.sizeInBytes":10240,
   [junit4]   2>     "state":"active",
   [junit4]   2>     "INDEX.sizeInGB":9.5367431640625E-6,
   [junit4]   2>     "SEARCHER.searcher.numDocs":0}}
   [junit4]   2> 3416522 DEBUG (TEST-TestSimTriggerIntegration.testSearchRate-seed#[FB369E21D7C98B2C]) [    ] o.a.s.c.a.s.SimClusterStateProvider ** creating new collection states
   [junit4]   2> 3416522 DEBUG (TEST-TestSimTriggerIntegration.testSearchRate-seed#[FB369E21D7C98B2C]) [    ] o.a.s.c.a.s.SimClusterStateProvider ** saved cluster state version 8
   [junit4]   2> 3416523 DEBUG (simCloudManagerPool-11701-thread-4) [    ] o.a.s.c.a.s.SimClusterStateProvider ** creating new collection states
   [junit4]   2> 3416523 DEBUG (simCloudManagerPool-11701-thread-4) [    ] o.a.s.c.a.s.SimClusterStateProvider ** saved cluster state version 9
   [junit4]   2> 3416524 DEBUG (ScheduledTrigger-11702-thread-2) [    ] o.a.s.c.a.NodeLostTrigger Running NodeLostTrigger: .auto_add_replicas with currently live nodes: 2
   [junit4]   2> 3416545 DEBUG (ScheduledTrigger-11702-thread-2) [    ] o.a.s.c.a.NodeLostTrigger Running NodeLostTrigger: .auto_add_replicas with currently live nodes: 2
   [junit4]   2> 3416547 DEBUG (simCloudManagerPool-11701-thread-5) [    ] o.a.s.c.a.s.SimClusterStateProvider ** creating new collection states
   [junit4]   2> 3416547 DEBUG (simCloudManagerPool-11701-thread-5) [    ] o.a.s.c.a.s.SimClusterStateProvider ** saved cluster state version 10
   [junit4]   2> 3416547 DEBUG (TEST-TestSimTriggerIntegration.testSearchRate-seed#[FB369E21D7C98B2C]) [    ] o.a.s.c.a.s.SimClusterStateProvider ** creating new collection states
   [junit4]   2> 3416547 DEBUG (TEST-TestSimTriggerIntegration.testSearchRate-seed#[FB369E21D7C98B2C]) [    ] o.a.s.c.a.s.SimClusterStateProvider ** saved cluster state version 11
   [junit4]   2> 3416548 DEBUG (simCloudManagerPool-11701-thread-7) [    ] o.a.s.c.a.s.SimClusterStateProvider -- elected new leader for collection1 / shard1: {"core_node1":{
   [junit4]   2>     "core":"collection1_shard1_replica_n1",
   [junit4]   2>     "shard":"shard1",
   [junit4]   2>     "collection":"collection1",
   [junit4]   2>     "node_name":"127.0.0.1:10324_solr",
   [junit4]   2>     "type":"NRT",
   [junit4]   2>     "leader":"true",
   [junit4]   2>     "SEARCHER.searcher.maxDoc":0,
   [junit4]   2>     "SEARCHER.searcher.deletedDocs":0,
   [junit4]   2>     "INDEX.sizeInBytes":10240,
   [junit4]   2>     "state":"active",
   [junit4]   2>     "INDEX.sizeInGB":9.5367431640625E-6,
   [junit4]   2>     "SEARCHER.searcher.numDocs":0}}
   [junit4]   2> 3416558 DEBUG (simCloudManagerPool-11701-thread-6) [    ] o.a.s.c.a.s.SimClusterStateProvider ** creating new collection states
   [junit4]   2> 3416558 DEBUG (simCloudManagerPool-11701-thread-6) [    ] o.a.s.c.a.s.SimClusterStateProvider ** saved cluster state version 12
   [junit4]   2> 3416558 DEBUG (TEST-TestSimTriggerIntegration.testSearchRate-seed#[FB369E21D7C98B2C]) [    ] o.a.s.c.a.s.SimClusterStateProvider ** creating new collection states
   [junit4]   2> 3416558 DEBUG (TEST-TestSimTriggerIntegration.testSearchRate-seed#[FB369E21D7C98B2C]) [    ] o.a.s.c.a.s.SimClusterStateProvider ** saved cluster state version 13
   [junit4]   2> 3416561 DEBUG (simCloudManagerPool-11701-thread-8) [    ] o.a.s.c.a.AutoScalingHandler Verified autoscaling configuration
   [junit4]   2> 3416561 DEBUG (simCloudManagerPool-11701-thread-8) [    ] o.a.s.c.a.OverseerTriggerThread Refreshing /autoscaling.json with znode version 9
   [junit4]   2> 3416561 DEBUG (Simulated OverseerAutoScalingTriggerThread) [    ] o.a.s.c.a.OverseerTriggerThread Processed trigger updates upto znodeVersion 9
   [junit4]   2> 3416561 DEBUG (Simulated OverseerAutoScalingTriggerThread) [    ] o.a.s.c.a.OverseerTriggerThread -- clean old nodeAdded markers
   [junit4]   2> 3416561 DEBUG (Simulated OverseerAutoScalingTriggerThread) [    ] o.a.s.c.a.OverseerTriggerThread Current znodeVersion 9, lastZnodeVersion 9
   [junit4]   2> 3416561 DEBUG (ScheduledTrigger-11702-thread-3) [    ] o.a.s.c.a.SearchRateTrigger ### rates for node 127.0.0.1:10324_solr
   [junit4]   2> 3416561 DEBUG (ScheduledTrigger-11702-thread-3) [    ] o.a.s.c.a.SearchRateTrigger ### rates for node 127.0.0.1:10322_solr
   [junit4]   2> 3416563 DEBUG (simCloudManagerPool-11701-thread-9) [    ] o.a.s.c.a.AutoScalingHandler Verified autoscaling configuration
   [junit4]   2> 3416563 DEBUG (simCloudManagerPool-11701-thread-9) [    ] o.a.s.c.a.OverseerTriggerThread Refreshing /autoscaling.json with znode version 10
   [junit4]   2> 3416564 DEBUG (Simulated OverseerAutoScalingTriggerThread) [    ] o.a.s.c.a.OverseerTriggerThread Processed trigger updates upto znodeVersion 10
   [junit4]   2> 3416564 DEBUG (Simulated OverseerAutoScalingTriggerThread) [    ] o.a.s.c.a.OverseerTriggerThread -- clean old nodeAdded markers
   [junit4]   2> 3416564 DEBUG (Simulated OverseerAutoScalingTriggerThread) [    ] o.a.s.c.a.OverseerTriggerThread Current znodeVersion 10, lastZnodeVersion 10
   [junit4]   2> 3416565 DEBUG (ScheduledTrigger-11702-thread-2) [    ] o.a.s.c.a.NodeLostTrigger Running NodeLostTrigger: .auto_add_replicas with currently live nodes: 2
   [junit4]   2> 3416582 DEBUG (ScheduledTrigger-11702-thread-4) [    ] o.a.s.c.a.SearchRateTrigger ### rates for node 127.0.0.1:10324_solr
   [junit4]   2> 3416582 DEBUG (ScheduledTrigger-11702-thread-4) [    ] o.a.s.c.a.SearchRateTrigger ###  metrics:solr.core.collection1.shard1.replica_n1:QUERY./select.requestTimes:1minRate	250
   [junit4]   2> 3416582 DEBUG (ScheduledTrigger-11702-thread-4) [    ] o.a.s.c.a.SearchRateTrigger ### rates for node 127.0.0.1:10322_solr
   [junit4]   2> 3416582 DEBUG (ScheduledTrigger-11702-thread-4) [    ] o.a.s.c.a.SearchRateTrigger ###  metrics:solr.core.collection1.shard1.replica_n2:QUERY./select.requestTimes:1minRate	250
   [junit4]   2> 3416582 DEBUG (ScheduledTrigger-11702-thread-4) [    ] o.a.s.c.a.SearchRateTrigger ## Collection: collection1
   [junit4]   2> 3416582 DEBUG (ScheduledTrigger-11702-thread-4) [    ] o.a.s.c.a.SearchRateTrigger ##  - shard1
   [junit4]   2> 3416582 DEBUG (ScheduledTrigger-11702-thread-4) [    ] o.a.s.c.a.SearchRateTrigger ##     collection1_shard1_replica_n1  250.0
   [junit4]   2> 3416582 DEBUG (ScheduledTrigger-11702-thread-4) [    ] o.a.s.c.a.SearchRateTrigger ##     collection1_shard1_replica_n2  250.0
   [junit4]   2> 3416582 DEBUG (ScheduledTrigger-11702-thread-4) [    ] o.a.s.c.a.SearchRateTrigger -- collection1.shard1: totalShardRate=500.0, shardRate=250.0
   [junit4]   2> 3416585 DEBUG (ScheduledTrigger-11702-thread-1) [    ] o.a.s.c.a.NodeLostTrigger Running NodeLostTrigger: .auto_add_replicas with currently live nodes: 2
   [junit4]   2> 3416602 DEBUG (ScheduledTrigger-11702-thread-1) [    ] o.a.s.c.a.SearchRateTrigger ### rates for node 127.0.0.1:10324_solr
   [junit4]   2> 3416602 DEBUG (ScheduledTrigger-11702-thread-1) [    ] o.a.s.c.a.SearchRateTrigger ###  metrics:solr.core.collection1.shard1.replica_n1:QUERY./select.requestTimes:1minRate	250
   [junit4]   2> 3416602 DEBUG (ScheduledTrigger-11702-thread-1) [    ] o.a.s.c.a.SearchRateTrigger ### rates for node 127.0.0.1:10322_solr
   [junit4]   2> 3416602 DEBUG (ScheduledTrigger-11702-thread-1) [    ] o.a.s.c.a.SearchRateTrigger ###  metrics:solr.core.collection1.shard1.replica_n2:QUERY./select.requestTimes:1minRate	250
   [junit4]   2> 3416602 DEBUG (ScheduledTrigger-11702-thread-1) [    ] o.a.s.c.a.SearchRateTrigger ## Collection: collection1
   [junit4]   2> 3416602 DEBUG (ScheduledTrigger-11702-thread-1) [    ] o.a.s.c.a.SearchRateTrigger ##  - shard1
   [junit4]   2> 3416602 DEBUG (ScheduledTrigger-11702-thread-1) [    ] o.a.s.c.a.SearchRateTrigger ##     collection1_shard1_replica_n1  250.0
   [junit4]   2> 3416602 DEBUG (ScheduledTrigger-11702-thread-1) [    ] o.a.s.c.a.SearchRateTrigger ##     collection1_shard1_replica_n2  250.0
   [junit4]   2> 3416602 DEBUG (ScheduledTrigger-11702-thread-1) [    ] o.a.s.c.a.SearchRateTrigger -- collection1.shard1: totalShardRate=500.0, shardRate=250.0
   [junit4]   2> 3416607 DEBUG (AutoscalingActionExecutor-11703-thread-1) [    ] o.a.s.c.a.ComputePlanAction -- processing event: {
   [junit4]   2>   "id":"2dc3b0f0d3504T72g82hu4b0sigms6k6a49pdnu",
   [junit4]   2>   "source":"search_rate_trigger",
   [junit4]   2>   "eventTime":805096167126276,
   [junit4]   2>   "eventType":"SEARCHRATE",
   [junit4]   2>   "properties":{
   [junit4]   2>     "hotReplicas":[
   [junit4]   2>       {"core_node1":{
   [junit4]   2>           "core":"collection1_shard1_replica_n1",
   [junit4]   2>           "shard":"shard1",
   [junit4]   2>           "collection":"collection1",
   [junit4]   2>           "node_name":"127.0.0.1:10324_solr",
   [junit4]   2>           "type":"NRT",
   [junit4]   2>           "leader":"true",
   [junit4]   2>           "SEARCHER.searcher.maxDoc":0,
   [junit4]   2>           "SEARCHER.searcher.deletedDocs":0,
   [junit4]   2>           "INDEX.sizeInBytes":10240,
   [junit4]   2>           "rate":250.0,
   [junit4]   2>           "state":"active",
   [junit4]   2>           "QUERY./select.requestTimes:1minRate":250,
   [junit4]   2>           "INDEX.sizeInGB":9.5367431640625E-6,
   [junit4]   2>           "SEARCHER.searcher.numDocs":0}},
   [junit4]   2>       {"core_node2":{
   [junit4]   2>           "core":"collection1_shard1_replica_n2",
   [junit4]   2>           "shard":"shard1",
   [junit4]   2>           "collection":"collection1",
   [junit4]   2>           "node_name":"127.0.0.1:10322_solr",
   [junit4]   2>           "type":"NRT",
   [junit4]   2>           "SEARCHER.searcher.maxDoc":0,
   [junit4]   2>           "SEARCHER.searcher.deletedDocs":0,
   [junit4]   2>           "INDEX.sizeInBytes":10240,
   [junit4]   2>           "rate":250.0,
   [junit4]   2>           "state":"active",
   [junit4]   2>           "QUERY./select.requestTimes:1minRate":250,
   [junit4]   2>           "INDEX.sizeInGB":9.5367431640625E-6,
   [junit4]   2>           "SEARCHER.searcher.numDocs":0}}],
   [junit4]   2>     "coldNodes":{},
   [junit4]   2>     "coldShards":{},
   [junit4]   2>     "coldReplicas":[],
   [junit4]   2>     "violationType":["hotShards"],
   [junit4]   2>     "coldCollections":{},
   [junit4]   2>     "hotShards":{"collection1":{"shard1":250.0}},
   [junit4]   2>     "hotCollections":{"collection1":500.0},
   [junit4]   2>     "hotNodes":{
   [junit4]   2>       "127.0.0.1:10324_solr":250.0,
   [junit4]   2>       "127.0.0.1:10322_solr":250.0},
   [junit4]   2>     "_enqueue_time_":805097333780126,
   [junit4]   2>     "requestedOps":[
   [junit4]   2>       {
   [junit4]   2>         "action":"ADDREPLICA",
   [junit4]   2>         "hints":{"COLL_SHARD":[{
   [junit4]   2>               "first":"collection1",
   [junit4]   2>               "second":"shard1"}]}},
   [junit4]   2>       {
   [junit4]   2>         "action":"ADDREPLICA",
   [junit4]   2>         "hints":{"COLL_SHARD":[{
   [junit4]   2>               "first":"collection1",
   [junit4]   2>               "second":"shard1"}]}},
   [junit4]   2>       {
   [junit4]   2>         "action":"ADDREPLICA",
   [junit4]   2>         "hints":{"COLL_SHARD":[{
   [junit4]   2>               "first":"collection1",
   [junit4]   2>               "second":"shard1"}]}}]}} with context properties: {AFTER_ACTION=[start], BEFORE_ACTION=[start, compute]}
   [junit4]   2> 3416607 DEBUG (AutoscalingActionExecutor-11703-thread-1) [    ] o.a.s.c.a.ComputePlanAction Computed Plan: action=ADDREPLICA&collection=collection1&shard=shard1&node=127.0.0.1:10324_solr&type=NRT
   [junit4]   2> 3416607 DEBUG (AutoscalingActionExecutor-11703-thread-1) [    ] o.a.s.c.a.ComputePlanAction Computed Plan: action=ADDREPLICA&collection=collection1&shard=shard1&node=127.0.0.1:10324_solr&type=NRT
   [junit4]   2> 3416607 DEBUG (AutoscalingActionExecutor-11703-thread-1) [    ] o.a.s.c.a.ComputePlanAction Computed Plan: action=ADDREPLICA&collection=collection1&shard=shard1&node=127.0.0.1:10322_solr&type=NRT
   [junit4]   2> 3416608 DEBUG (AutoscalingActionExecutor-11703-thread-1) [    ] o.a.s.c.a.ExecutePlanAction -- processing event: {
   [junit4]   2>   "id":"2dc3b0f0d3504T72g82hu4b0sigms6k6a49pdnu",
   [junit4]   2>   "source":"search_rate_trigger",
   [junit4]   2>   "eventTime":805096167126276,
   [junit4]   2>   "eventType":"SEARCHRATE",
   [junit4]   2>   "properties":{
   [junit4]   2>     "hotReplicas":[
   [junit4]   2>       {"core_node1":{
   [junit4]   2>           "core":"collection1_shard1_replica_n1",
   [junit4]   2>           "shard":"shard1",
   [junit4]   2>           "collection":"collection1",
   [junit4]   2>           "node_name":"127.0.0.1:10324_solr",
   [junit4]   2>           "type":"NRT",
   [junit4]   2>           "leader":"true",
   [junit4]   2>           "SEARCHER.searcher.maxDoc":0,
   [junit4]   2>           "SEARCHER.searcher.deletedDocs":0,
   [junit4]   2>           "INDEX.sizeInBytes":10240,
   [junit4]   2>           "rate":250.0,
   [junit4]   2>           "state":"active",
   [junit4]   2>           "QUERY./select.requestTimes:1minRate":250,
   [junit4]   2>           "INDEX.sizeInGB":9.5367431640625E-6,
   [junit4]   2>           "SEARCHER.searcher.numDocs":0}},
   [junit4]   2>       {"core_node2":{
   [junit4]   2>           "core":"collection1_shard1_replica_n2",
   [junit4]   2>           "shard":"shard1",
   [junit4]   2>           "collection":"collection1",
   [junit4]   2>           "node_name":"127.0.0.1:10322_solr",
   [junit4]   2>           "type":"NRT",
   [junit4]   2>           "SEARCHER.searcher.maxDoc":0,
   [junit4]   2>           "SEARCHER.searcher.deletedDocs":0,
   [junit4]   2>           "INDEX.sizeInBytes":10240,
   [junit4]   2>           "rate":250.0,
   [junit4]   2>           "state":"active",
   [junit4]   2>           "QUERY./select.requestTimes:1minRate":250,
   [junit4]   2>           "INDEX.sizeInGB":9.5367431640625E-6,
   [junit4]   2>           "SEARCHER.searcher.numDocs":0}}],
   [junit4]   2>     "__start__":3,
   [junit4]   2>     "coldNodes":{},
   [junit4]   2>     "coldShards":{},
   [junit4]   2>     "coldReplicas":[],
   [junit4]   2>     "violationType":["hotShards"],
   [junit4]   2>     "coldCollections":{},
   [junit4]   2>     "hotShards":{"collection1":{"shard1":250.0}},
   [junit4]   2>     "hotCollections":{"collection1":500.0},
   [junit4]   2>     "hotNodes":{
   [junit4]   2>       "127.0.0.1:10324_solr":250.0,
   [junit4]   2>       "127.0.0.1:10322_solr":250.0},
   [junit4]   2>     "_enqueue_time_":805097333780126,
   [junit4]   2>     "requestedOps":[
   [junit4]   2>       {
   [junit4]   2>         "action":"ADDREPLICA",
   [junit4]   2>         "hints":{"COLL_SHARD":[{
   [junit4]   2>               "first":"collection1",
   [junit4]   2>               "second":"shard1"}]}},
   [junit4]   2>       {
   [junit4]   2>         "action":"ADDREPLICA",
   [junit4]   2>         "hints":{"COLL_SHARD":[{
   [junit4]   2>               "first":"collection1",
   [junit4]   2>               "second":"shard1"}]}},
   [junit4]   2>       {
   [junit4]   2>         "action":"ADDREPLICA",
   [junit4]   2>         "hints":{"COLL_SHARD":[{
   [junit4]   2>               "first":"collection1",
   [junit4]   2>               "second":"shard1"}]}}]}} with context properties: {operations=[{
   [junit4]   2>   "class":"org.apache.solr.client.solrj.request.CollectionAdminRequest$AddReplica",
   [junit4]   2>   "method":"GET",
   [junit4]   2>   "params.action":"ADDREPLICA",
   [junit4]   2>   "params.collection":"collection1",
   [junit4]   2>   "params.shard":"shard1",
   [junit4]   2>   "params.node":"127.0.0.1:10324_solr",
   [junit4]   2>   "params.type":"NRT"}, {
   [junit4]   2>   "class":"org.apache.solr.client.solrj.request.CollectionAdminRequest$AddReplica",
   [junit4]   2>   "method":"GET",
   [junit4]   2>   "params.action":"ADDREPLICA",
   [junit4]   2>   "params.collection":"collection1",
   [junit4]   2>   "params.shard":"shard1",
   [junit4]   2>   "params.node":"127.0.0.1:10324_solr",
   [junit4]   2>   "params.type":"NRT"}, {
   [junit4]   2>   "class":"org.apache.solr.client.solrj.request.CollectionAdminRequest$AddReplica",
   [junit4]   2>   "method":"GET",
   [junit4]   2>   "params.action":"ADDREPLICA",
   [junit4]   2>   "params.collection":"collection1",
   [junit4]   2>   "params.shard":"shard1",
   [junit4]   2>   "params.node":"127.0.0.1:10322_solr",
   [junit4]   2>   "params.type":"NRT"}], AFTER_ACTION=[start, compute], BEFORE_ACTION=[start, compute, execute]}
   [junit4]   2> 3416608 DEBUG (AutoscalingActionExecutor-11703-thread-1) [    ] o.a.s.c.a.ExecutePlanAction Executing operation: action=ADDREPLICA&collection=collection1&shard=shard1&node=127.0.0.1:10324_solr&type=NRT
   [junit4]   2> 3416609 INFO  (simCloudManagerPool-11701-thread-11) [    ] o.a.s.c.a.c.AddReplicaCmd Node Identified 127.0.0.1:10324_solr for creating new replica of shard shard1 for collection collection1
   [junit4]   2> 3416619 DEBUG (simCloudManagerPool-11701-thread-11) [    ] o.a.s.c.a.s.SimClusterStateProvider ** creating new collection states
   [junit4]   2> 3416619 DEBUG (simCloudManagerPool-11701-thread-11) [    ] o.a.s.c.a.s.SimClusterStateProvider ** saved cluster state version 14
   [junit4]   2> 3416620 DEBUG (AutoscalingActionExecutor-11703-thread-1) [    ] o.a.s.c.a.ExecutePlanAction Executing operation: action=ADDREPLICA&collection=collection1&shard=shard1&node=127.0.0.1:10324_solr&type=NRT
   [junit4]   2> 3416621 INFO  (simCloudManagerPool-11701-thread-14) [    ] o.a.s.c.a.c.AddReplicaCmd Node Identified 127.0.0.1:10324_solr for creating new replica of shard shard1 for collection collection1
   [junit4]   2> 3416631 DEBUG (simCloudManagerPool-11701-thread-14) [    ] o.a.s.c.a.s.SimClusterStateProvider ** creating new collection states
   [junit4]   2> 3416631 DEBUG (simCloudManagerPool-11701-thread-14) [    ] o.a.s.c.a.s.SimClusterStateProvider ** saved cluster state version 15
   [junit4]   2> 3416632 DEBUG (AutoscalingActionExecutor-11703-thread-1) [    ] o.a.s.c.a.ExecutePlanAction Executing operation: action=ADDREPLICA&collection=collection1&shard=shard1&node=127.0.0.1:10322_solr&type=NRT
   [junit4]   2> 3416633 INFO  (simCloudManagerPool-11701-thread-17) [    ] o.a.s.c.a.c.AddReplicaCmd Node Identified 127.0.0.1:10322_solr for creating new replica of shard shard1 for collection collection1
   [junit4]   2> 3416648 DEBUG (simCloudManagerPool-11701-thread-17) [    ] o.a.s.c.a.s.SimClusterStateProvider ** creating new collection states
   [junit4]   2> 3416648 DEBUG (simCloudManagerPool-11701-thread-17) [    ] o.a.s.c.a.s.SimClusterStateProvider ** saved cluster state version 16
   [junit4]   2> 3416755 DEBUG (ScheduledTrigger-11702-thread-4) [    ] o.a.s.c.a.NodeLostTrigger Running NodeLostTrigger: .auto_add_replicas with currently live nodes: 2
   [junit4]   2> 3416755 DEBUG (ScheduledTrigger-11702-thread-3) [    ] o.a.s.c.a.SearchRateTrigger ### rates for node 127.0.0.1:10324_solr
   [junit4]   2> 3416755 DEBUG (ScheduledTrigger-11702-thread-3) [    ] o.a.s.c.a.SearchRateTrigger ###  metrics:solr.core.collection1.shard1.replica_n1:QUERY./select.requestTimes:1minRate	250
   [junit4]   2> 3416755 DEBUG (ScheduledTrigger-11702-thread-3) [    ] o.a.s.c.a.SearchRateTrigger ### rates for node 127.0.0.1:10322_solr
   [junit4]   2> 3416755 DEBUG (ScheduledTrigger-11702-thread-3) [    ] o.a.s.c.a.SearchRateTrigger ###  metrics:solr.core.collection1.shard1.replica_n2:QUERY./select.requestTimes:1minRate	250
   [junit4]   2> 3416755 DEBUG (ScheduledTrigger-11702-thread-3) [    ] o.a.s.c.a.SearchRateTrigger ## Collection: collection1
   [junit4]   2> 3416755 DEBUG (ScheduledTrigger-11702-thread-3) [    ] o.a.s.c.a.SearchRateTrigger ##  - shard1
   [junit4]   2> 3416755 DEBUG (ScheduledTrigger-11702-thread-3) [    ] o.a.s.c.a.SearchRateTrigger ##     collection1_shard1_replica_n1  250.0
   [junit4]   2> 3416755 DEBUG (ScheduledTrigger-11702-thread-3) [    ] o.a.s.c.a.SearchRateTrigger ##     collection1_shard1_replica_n2  250.0
   [junit4]   2> 3416755 DEBUG (ScheduledTrigger-11702-thread-3) [    ] o.a.s.c.a.SearchRateTrigger -- collection1.shard1: totalShardRate=500.0, shardRate=100.0
   [junit4]   2> 3416759 INFO  (TEST-TestSimTriggerIntegration.testSearchRate-seed#[FB369E21D7C98B2C]) [    ] o.a.s.SolrTestCaseJ4 ###Ending testSearchRate
   [junit4]   2> 3416759 DEBUG (TEST-TestSimTriggerIntegration.testSearchRate-seed#[FB369E21D7C98B2C]) [    ] o.a.s.c.a.s.SimClusterStateProvider ** creating new collection states
   [junit4]   2> 3416759 DEBUG (TEST-TestSimTriggerIntegration.testSearchRate-seed#[FB369E21D7C98B2C]) [    ] o.a.s.c.a.s.SimClusterStateProvider ** saved cluster state version 17
   [junit4]   2> 3416760 INFO  (TEST-TestSimTriggerIntegration.testSearchRate-seed#[FB369E21D7C98B2C]) [    ] o.a.s.c.a.s.SimSolrCloudTestCase #######################################
   [junit4]   2> ############ CLUSTER STATE ############
   [junit4]   2> #######################################
   [junit4]   2> ## Live nodes:		2
   [junit4]   2> ## Empty nodes:	0
   [junit4]   2> ## Dead nodes:		0
   [junit4]   2> ## Collections:
   [junit4]   2> ##  * .system
   [junit4]   2> ##    shardsTotal	1
   [junit4]   2> ##    shardsState	{active=1}
   [junit4]   2> ##      shardsWithoutLeader	0
   [junit4]   2> ##    totalReplicas	1
   [junit4]   2> ##      activeReplicas	1
   [junit4]   2> ##      inactiveReplicas	0
   [junit4]   2> ##    totalActiveDocs	2
   [junit4]   2> ##      bufferedDocs	0
   [junit4]   2> ##      maxActiveSliceDocs	2
   [junit4]   2> ##      minActiveSliceDocs	2
   [junit4]   2> ##      avgActiveSliceDocs	2
   [junit4]   2> ##    totalInactiveDocs	0
   [junit4]   2> ##      maxInactiveSliceDocs	0
   [junit4]   2> ##      minInactiveSliceDocs	0
   [junit4]   2> ##      avgInactiveSliceDocs	NaN
   [junit4]   2> ##    totalActiveBytes	11,240
   [junit4]   2> ##      maxActiveSliceBytes	11,240
   [junit4]   2> ##      minActiveSliceBytes	11,240
   [junit4]   2> ##      avgActiveSliceBytes	11,240
   [junit4]   2> ##    totalInactiveBytes	0
   [junit4]   2> ##      maxInactiveSliceBytes	0
   [junit4]   2> ##      minInactiveSliceBytes	0
   [junit4]   2> ##      avgInactiveSliceBytes	NaN
   [junit4]   2> ##    totalActiveDeletedDocs	0
   [junit4]   2> ##  * collection1
   [junit4]   2> ##    shardsTotal	1
   [junit4]   2> ##    shardsState	{active=1}
   [junit4]   2> ##      shardsWithoutLeader	0
   [junit4]   2> ##    totalReplicas	5
   [junit4]   2> ##      activeReplicas	5
   [junit4]   2> ##      inactiveReplicas	0
   [junit4]   2> ##    totalActiveDocs	0
   [junit4]   2> ##      bufferedDocs	0
   [junit4]   2> ##      maxActiveSliceDocs	0
   [junit4]   2> ##      minActiveSliceDocs	0
   [junit4]   2> ##      avgActiveSliceDocs	0
   [junit4]   2> ##    totalInactiveDocs	0
   [junit4]   2> ##      maxInactiveSliceDocs	0
   [junit4]   2> ##      minInactiveSliceDocs	0
   [junit4]   2> ##      avgInactiveSliceDocs	NaN
   [junit4]   2> ##    totalActiveBytes	10,240
   [junit4]   2> ##      maxActiveSliceBytes	10,240
   [junit4]   2> ##      minActiveSliceBytes	10,240
   [junit4]   2> ##      avgActiveSliceBytes	10,240
   [junit4]   2> ##    totalInactiveBytes	0
   [junit4]   2> ##      maxInactiveSliceBytes	0
   [junit4]   2> ##      minInactiveSliceBytes	0
   [junit4]   2> ##      avgInactiveSliceBytes	NaN
   [junit4]   2> ##    totalActiveDeletedDocs	0
   [junit4]   2> ## Max replicas per node:	3
   [junit4]   2> ## Min replicas per node:	3
   [junit4]   2> ## Total replicas:		6
   [junit4]   2> ## * .system		1
   [junit4]   2> ##		- active           1
   [junit4]   2> ## * collection1		5
   [junit4]   2> ##		- active           5
   [junit4]   2> ######### Solr op counts ##########
   [junit4]   2> ##		- ADDREPLICA         3
   [junit4]   2> ##		- CREATE             1
   [junit4]   2> ##		- DELETESTATUS       3
   [junit4]   2> ##		- REQUESTSTATUS      3
   [junit4]   2> ##		- autoscaling        3
   [junit4]   2> ##		- update             3
   [junit4]   2> ######### Autoscaling event counts ###########
   [junit4]   2> ## * Trigger: node_lost_trigger
   [junit4]   2> ##		- STARTED         1
   [junit4]   2> ##		- SUCCEEDED       1
   [junit4]   2> ## * Trigger: search_rate_trigger
   [junit4]   2> ##		- STARTED         1
   [junit4]   2> ##		- SUCCEEDED       1
   [junit4]   2> 
   [junit4]   2> NOTE: reproduce with: ant test  -Dtestcase=TestSimTriggerIntegration -Dtests.method=testSearchRate -Dtests.seed=FB369E21D7C98B2C -Dtests.slow=true -Dtests.locale=ms -Dtests.timezone=Australia/Lord_Howe -Dtests.asserts=true -Dtests.file.encoding=ISO-8859-1
   [junit4] ERROR   0.41s J0 | TestSimTriggerIntegration.testSearchRate <<<
   [junit4]    > Throwable #1: java.lang.ClassCastException: org.apache.solr.client.solrj.request.CollectionAdminRequest$AddReplica cannot be cast to java.util.Map
   [junit4]    > 	at __randomizedtesting.SeedInfo.seed([FB369E21D7C98B2C:A67E80A8180F2D63]:0)
   [junit4]    > 	at org.apache.solr.cloud.autoscaling.sim.TestSimTriggerIntegration.testSearchRate(TestSimTriggerIntegration.java:1321)
   [junit4]    > 	at java.lang.Thread.run(Thread.java:748)
   [junit4]   2> 3416768 DEBUG (AutoscalingActionExecutor-11703-thread-1) [    ] o.a.s.c.a.ComputePlanAction -- processing event: {
   [junit4]   2>   "id":"2dc3b4c381ea8T72g82hu4b0sigms6k6a49pdnx",
   [junit4]   2>   "source":"search_rate_trigger",
   [junit4]   2>   "eventTime":805097193348776,
   [junit4]   2>   "eventType":"SEARCHRATE",
   [junit4]   2>   "properties":{
   [junit4]   2>     "hotReplicas":[
   [junit4]   2>       {"core_node1":{
   [junit4]   2>           "core":"collection1_shard1_replica_n1",
   [junit4]   2>           "shard":"shard1",
   [junit4]   2>           "collection":"collection1",
   [junit4]   2>           "node_name":"127.0.0.1:10324_solr",
   [junit4]   2>           "type":"NRT",
   [junit4]   2>           "leader":"true",
   [junit4]   2>           "SEARCHER.searcher.maxDoc":0,
   [junit4]   2>           "SEARCHER.searcher.deletedDocs":0,
   [junit4]   2>           "INDEX.sizeInBytes":10240,
   [junit4]   2>           "rate":250.0,
   [junit4]   2>           "state":"active",
   [junit4]   2>           "QUERY./select.requestTimes:1minRate":250,
   [junit4]   2>           "INDEX.sizeInGB":9.5367431640625E-6,
   [junit4]   2>           "SEARCHER.searcher.numDocs":0}},
   [junit4]   2>       {"core_node2":{
   [junit4]   2>           "core":"collection1_shard1_replica_n2",
   [junit4]   2>           "shard":"shard1",
   [junit4]   2>           "collection":"collection1",
   [junit4]   2>           "node_name":"127.0.0.1:10322_solr",
   [junit4]   2>           "type":"NRT",
   [junit4]   2>           "SEARCHER.searcher.maxDoc":0,
   [junit4]   2>           "SEARCHER.searcher.deletedDocs":0,
   [junit4]   2>           "INDEX.sizeInBytes":10240,
   [junit4]   2>           "rate":250.0,
   [junit4]   2>           "state":"active",
   [junit4]   2>           "QUERY./select.requestTimes:1minRate":250,
   [junit4]   2>           "INDEX.sizeInGB":9.5367431640625E-6,
   [junit4]   2>           "SEARCHER.searcher.numDocs":0}}],
   [junit4]   2>     "coldNodes":{},
   [junit4]   2>     "coldShards":{},
   [junit4]   2>     "coldReplicas":[],
   [junit4]   2>     "violationType":["hotShards"],
   [junit4]   2>     "coldCollections":{},
   [junit4]   2>     "hotShards":{"collection1":{"shard1":100.0}},
   [junit4]   2>     "hotCollections":{"collection1":500.0},
   [junit4]   2>     "hotNodes":{
   [junit4]   2>       "127.0.0.1:10324_solr":250.0,
   [junit4]   2>       "127.0.0.1:10322_solr":250.0},
   [junit4]   2>     "_enqueue_time_":805105027263076,
   [junit4]   2>     "requestedOps":[
   [junit4]   2>       {
   [junit4]   2>         "action":"ADDREPLICA",
   [junit4]   2>         "hints":{"COLL_SHARD":[{
   [junit4]   2>               "first":"collection1",
   [junit4]   2>               "second":"shard1"}]}},
   [junit4]   2>       {
   [junit4]   2>         "action":"ADDREPLICA",
   [junit4]   2>         "hints":{"COLL_SHARD":[{
   [junit4]   2>               "first":"collection1",
   [junit4]   2>               "second":"shard1"}]}},
   [junit4]   2>       {
   [junit4]   2>         "action":"ADDREPLICA",
   [junit4]   2>         "hints":{"COLL_SHARD":[{
   [junit4]   2>               "first":"collection1",
   [junit4]   2>               "second":"shard1"}]}}]}} with context properties: {AFTER_ACTION=[start], BEFORE_ACTION=[start, compute]}
   [junit4]   2> 3416784 DEBUG (AutoscalingActionExecutor-11703-thread-1) [    ] o.a.s.c.a.ComputePlanAction Computed Plan: action=ADDREPLICA&collection=collection1&shard=shard1&node=127.0.0.1:10324_solr&type=NRT
   [junit4]   2> 3416787 DEBUG (AutoscalingActionExecutor-11703-thread-1) [    ] o.a.s.c.a.ComputePlanAction Computed Plan: action=ADDREPLICA&collection=collection1&shard=shard1&node=127.0.0.1:10322_solr&type=NRT
   [junit4]   2> 3416787 DEBUG (AutoscalingActionExecutor-11703-thread-1) [    ] o.a.s.c.a.ComputePlanAction Computed Plan: action=ADDREPLICA&collection=collection1&shard=shard1&node=127.0.0.1:10324_solr&type=NRT
   [junit4]   2> 3416789 DEBUG (AutoscalingActionExecutor-11703-thread-1) [    ] o.a.s.c.a.ExecutePlanAction -- processing event: {
   [junit4]   2>   "id":"2dc3b4c381ea8T72g82hu4b0sigms6k6a49pdnx",
   [junit4]   2>   "source":"search_rate_trigger",
   [junit4]   2>   "eventTime":805097193348776,
   [junit4]   2>   "eventType":"SEARCHRATE",
   [junit4]   2>   "properties":{
   [junit4]   2>     "hotReplicas":[
   [junit4]   2>       {"core_node1":{
   [junit4]   2>           "core":"collection1_shard1_replica_n1",
   [junit4]   2>           "shard":"shard1",
   [junit4]   2>           "collection":"collection1",
   [junit4]   2>           "node_name":"127.0.0.1:10324_solr",
   [junit4]   2>           "type":"NRT",
   [junit4]   2>           "leader":"true",
   [junit4]   2>           "SEARCHER.searcher.maxDoc":0,
   [junit4]   2>           "SEARCHER.searcher.deletedDocs":0,
   [junit4]   2>           "INDEX.sizeInBytes":10240,
   [junit4]   2>           "rate":250.0,
   [junit4]   2>           "state":"active",
   [junit4]   2>           "QUERY./select.requestTimes:1minRate":250,
   [junit4]   2>           "INDEX.sizeInGB":9.5367431640625E-6,
   [junit4]   2>           "SEARCHER.searcher.numDocs":0}},
   [junit4]   2>       {"core_node2":{
   [junit4]   2>           "core":"collection1_shard1_replica_n2",
   [junit4]   2>           "shard":"shard1",
   [junit4]   2>           "collection":"collection1",
   [junit4]   2>           "node_name":"127.0.0.1:10322_solr",
   [junit4]   2>           "type":"NRT",
   [junit4]   2>           "SEARCHER.searcher.maxDoc":0,
   [junit4]   2>           "SEARCHER.searcher.deletedDocs":0,
   [junit4]   2>           "INDEX.sizeInBytes":10240,
   [junit4]   2>           "rate":250.0,
   [junit4]   2>           "state":"active",
   [junit4]   2>           "QUERY./select.requestTimes:1minRate":250,
   [junit4]   2>           "INDEX.sizeInGB":9.5367431640625E-6,
   [junit4]   2>           "SEARCHER.searcher.numDocs":0}}],
   [junit4]   2>     "__start__":3,
   [junit4]   2>     "coldNodes":{},
   [junit4]   2>     "coldShards":{},
   [junit4]   2>     "coldReplicas":[],
   [junit4]   2>     "violationType":["hotShards"],
   [junit4]   2>     "coldCollections":{},
   [junit4]   2>     "hotShards":{"collection1":{"shard1":100.0}},
   [junit4]   2>     "hotCollections":{"collection1":500.0},
   [junit4]   2>     "hotNodes":{
   [junit4]   2>       "127.0.0.1:10324_solr":250.0,
   [junit4]   2>       "127.0.0.1:10322_solr":250.0},
   [junit4]   2>     "_enqueue_time_":805105027263076,
   [junit4]   2>     "requestedOps":[
   [junit4]   2>       {
   [junit4]   2>         "action":"ADDREPLICA",
   [junit4]   2>         "hints":{"COLL_SHARD":[{
   [junit4]   2>               "first":"collection1",
   [junit4]   2>               "second":"shard1"}]}},
   [junit4]   2>       {
   [junit4]   2>         "action":"ADDREPLICA",
   [junit4]   2>         "hints":{"COLL_SHARD":[{
   [junit4]   2>               "first":"collection1",
   [junit4]   2>               "second":"shard1"}]}},
   [junit4]   2>       {
   [junit4]   2>         "action":"ADDREPLICA",
   [junit4]   2>         "hints":{"COLL_SHARD":[{
   [junit4]   2>               "first":"collection1",
   [junit4]   2>               "second":"shard1"}]}}]}} with context properties: {operations=[{
   [junit4]   2>   "class":"org.apache.solr.client.solrj.request.CollectionAdminRequest$AddReplica",
   [junit4]   2>   "method":"GET",
   [junit4]   2>   "params.action":"ADDREPLICA",
   [junit4]   2>   "params.collection":"collection1",
   [junit4]   2>   "params.shard":"shard1",
   [junit4]   2>   "params.node":"127.0.0.1:10324_solr",
   [junit4]   2>   "params.type":"NRT"}, {
   [junit4]   2>   "class":"org.apache.solr.client.solrj.request.CollectionAdminRequest$AddReplica",
   [junit4]   2>   "method":"GET",
   [junit4]   2>   "params.action":"ADDREPLICA",
   [junit4]   2>   "params.collection":"collection1",
   [junit4]   2>   "params.shard":"shard1",
   [junit4]   2>   "params.node":"127.0.0.1:10322_solr",
   [junit4]   2>   "params.type":"NRT"}, {
   [junit4]   2>   "class":"org.apache.solr.client.solrj.request.CollectionAdminRequest$AddReplica",
   [junit4]   2>   "method":"GET",
   [junit4]   2>   "params.action":"ADDREPLICA",
   [junit4]   2>   "params.collection":"collection1",
   [junit4]   2>   "params.shard":"shard1",
   [junit4]   2>   "params.node":"127.0.0.1:10324_solr",
   [junit4]   2>   "params.type":"NRT"}], AFTER_ACTION=[start, compute], BEFORE_ACTION=[start, compute, execute]}
   [junit4]   2> 3416792 DEBUG (AutoscalingActionExecutor-11703-thread-1) [    ] o.a.s.c.a.ExecutePlanAction Executing operation: action=ADDREPLICA&collection=collection1&shard=shard1&node=127.0.0.1:10324_solr&type=NRT
   [junit4]   2> 3416801 INFO  (simCloudManagerPool-11701-thread-22) [    ] o.a.s.c.a.c.AddReplicaCmd Node Identified 127.0.0.1:10324_solr for creating new replica of shard shard1 for collection collection1
   [junit4]   2> 3416823 DEBUG (simCloudManagerPool-11701-thread-22) [    ] o.a.s.c.a.s.SimClusterStateProvider ** creating new collection states
   [junit4]   2> 3416836 DEBUG (simCloudManagerPool-11701-thread-22) [    ] o.a.s.c.a.s.SimClusterStateProvider ** saved cluster state version 18
   [junit4]   2> 3416852 INFO  (TEST-TestSimTriggerIntegration.testNodeLostTriggerRestoreState-seed#[FB369E21D7C98B2C]) [    ] o.a.s.SolrTestCaseJ4 ###Starting testNodeLostTriggerRestoreState
   [junit4]   2> 3416852 DEBUG (TEST-TestSimTriggerIntegration.testNodeLostTriggerRestoreState-seed#[FB369E21D7C98B2C]) [    ] o.a.s.c.a.OverseerTriggerThread Refreshing /autoscaling.json with znode version 11
   [junit4]   2> 3416852 DEBUG (Simulated OverseerAutoScalingTriggerThread) [    ] o.a.s.c.a.OverseerTriggerThread Processed trigger updates upto znodeVersion 11
   [junit4]   2> 3416853 DEBUG (Simulated OverseerAutoScalingTriggerThread) [    ] o.a.s.c.a.OverseerTriggerThread -- clean old nodeLost markers
   [junit4]   2> 3416853 DEBUG (Simulated OverseerAutoScalingTriggerThread) [    ] o.a.s.c.a.OverseerTriggerThread -- clean old nodeAdded markers
   [junit4]   2> 3416853 DEBUG (Simulated OverseerAutoScalingTriggerThread) [    ] o.a.s.c.a.OverseerTriggerThread Current znodeVersion 11, lastZnodeVersion 11
   [junit4]   2> 3416853 INFO  (TEST-TestSimTriggerIntegration.testNodeLostTriggerRestoreState-seed#[FB369E21D7C98B2C]) [    ] o.a.s.c.a.s.SimCloudManager === Restarting OverseerTriggerThread and clearing object cache...
   [junit4]   2> 3416853 WARN  (Simulated OverseerAutoScalingTriggerThread) [    ] o.a.s.c.a.OverseerTriggerThread Interrupted
   [junit4]   2> java.lang.InterruptedException: null
   [junit4]   2> 	at java.util.concurrent.locks.AbstractQueuedSynchronizer$ConditionObject.reportInterruptAfterWait(AbstractQueuedSynchronizer.java:2014) ~[?:1.8.0_172]
   [junit4]   2> 	at java.util.concurrent.locks.AbstractQueuedSynchronizer$ConditionObject.await(AbstractQueuedSynchronizer.java:2048) ~[?:1.8.0_172]
   [junit4]   2> 	at org.apache.solr.cloud.autoscaling.OverseerTriggerThread.run(OverseerTriggerThread.java:189) [java/:?]
   [junit4]   2> 	at java.lang.Thread.run(Thread.java:748) [?:1.8.0_172]
   [junit4]   2> 3416853 WARN  (AutoscalingActionExecutor-11703-thread-1) [    ] o.a.s.c.a.ExecutePlanAction Unexpected exception while trying to delete znode: /autoscaling/triggerState/search_rate_trigger/execute/op-0000000003
   [junit4]   2> java.util.NoSuchElementException: /autoscaling/triggerState/search_rate_trigger/execute/op-0000000003
   [junit4]   2> 	at org.apache.solr.cloud.autoscaling.sim.SimDistribStateManager.removeData(SimDistribStateManager.java:482) ~[test/:?]
   [junit4]   2> 	at org.apache.solr.cloud.autoscaling.ExecutePlanAction.process(ExecutePlanAction.java:91) ~[java/:?]
   [junit4]   2> 	at org.apache.solr.cloud.autoscaling.ScheduledTriggers.lambda$null$3(ScheduledTriggers.java:308) ~[java/:?]
   [junit4]   2> 	at java.util.concurrent.Executors$RunnableAdapter.call(Executors.java:511) ~[?:1.8.0_172]
   [junit4]   2> 	at java.util.concurrent.FutureTask.run(FutureTask.java:266) ~[?:1.8.0_172]
   [junit4]   2> 	at org.apache.solr.common.util.ExecutorUtil$MDCAwareThreadPoolExecutor.lambda$execute$0(ExecutorUtil.java:209) ~[java/:?]
   [junit4]   2> 	at java.util.concurrent.ThreadPoolExecutor.runWorker(ThreadPoolExecutor.java:1149) [?:1.8.0_172]
   [junit4]   2> 	at java.util.concurrent.ThreadPoolExecutor$Worker.run(ThreadPoolExecutor.java:624) [?:1.8.0_172]
   [junit4]   2> 	at java.lang.Thread.run(Thread.java:748) [?:1.8.0_172]
   [junit4]   2> 3416853 DEBUG (AutoscalingActionExecutor-11703-thread-1) [    ] o.a.s.c.a.ExecutePlanAction Executing operation: action=ADDREPLICA&collection=collection1&shard=shard1&node=127.0.0.1:10322_solr&type=NRT
   [junit4]   2> 3416853 DEBUG (simCloudManagerPool-11701-thread-25) [    ] o.a.s.c.a.s.SimClusterStateProvider ** creating new collection states
   [junit4]   2> 3416854 DEBUG (simCloudManagerPool-11701-thread-25) [    ] o.a.s.c.a.s.SimClusterStateProvider ** saved cluster state version 19
   [junit4]   2> 3416855 DEBUG (simCloudManagerPool-11701-thread-26) [    ] o.a.s.c.a.s.SimClusterStateProvider ** creating new collection states
   [junit4]   2> 3416855 DEBUG (simCloudManagerPool-11701-thread-26) [    ] o.a.s.c.a.s.SimClusterStateProvider ** saved cluster state version 20
   [junit4]   2> 3416876 DEBUG (simCloudManagerPool-11701-thread-27) [    ] o.a.s.c.a.s.SimClusterStateProvider ** creating new collection states
   [junit4]   2> 3416877 DEBUG (simCloudManagerPool-11701-thread-27) [    ] o.a.s.c.a.s.SimClusterStateProvider ** saved cluster state version 21
   [junit4]   2> 3416877 DEBUG (simCloudManagerPool-11701-thread-28) [    ] o.a.s.c.a.s.SimClusterStateProvider -- elected new leader for .system / shard1: {"core_node3":{
   [junit4]   2>     "core":".system_shard1_replica_n1",
   [junit4]   2>     "shard":"shard1",
   [junit4]   2>     "collection":".system",
   [junit4]   2>     "node_name":"127.0.0.1:10322_solr",
   [junit4]   2>     "type":"NRT",
   [junit4]   2>     "leader":"true",
   [junit4]   2>     "SEARCHER.searcher.maxDoc":0,
   [junit4]   2>     "SEARCHER.searcher.deletedDocs":0,
   [junit4]   2>     "INDEX.sizeInBytes":10240,
   [junit4]   2>     "state":"active",
   [junit4]   2>     "INDEX.sizeInGB":9.5367431640625E-6,
   [junit4]   2>     "SEARCHER.searcher.numDocs":0}}
   [junit4]   2> 3416878 DEBUG (simCloudManagerPool-11701-thread-26) [    ] o.a.s.c.a.s.SimClusterStateProvider ** creating new collection states
   [junit4]   2> 3416878 DEBUG (simCloudManagerPool-11701-thread-26) [    ] o.a.s.c.a.s.SimClusterStateProvider ** saved cluster state version 22
   [junit4]   2> 3416878 WARN  (AutoscalingActionExecutor-11703-thread-1) [    ] o.a.s.c.a.ScheduledTriggers Exception executing actions
   [junit4]   2> org.apache.solr.cloud.autoscaling.TriggerActionException: Error processing action for trigger event: {
   [junit4]   2>   "id":"2dc3b4c381ea8T72g82hu4b0sigms6k6a49pdnx",
   [junit4]   2>   "source":"search_rate_trigger",
   [junit4]   2>   "eventTime":805097193348776,
   [junit4]   2>   "eventType":"SEARCHRATE",
   [junit4]   2>   "properties":{
   [junit4]   2>     "hotReplicas":[
   [junit4]   2>       {"core_node1":{
   [junit4]   2>           "core":"collection1_shard1_replica_n1",
   [junit4]   2>           "shard":"shard1",
   [junit4]   2>           "collection":"collection1",
   [junit4]   2>           "node_name":"127.0.0.1:10324_solr",
   [junit4]   2>           "type":"NRT",
   [junit4]   2>           "leader":"true",
   [junit4]   2>           "SEARCHER.searcher.maxDoc":0,
   [junit4]   2>           "SEARCHER.searcher.deletedDocs":0,
   [junit4]   2>           "INDEX.sizeInBytes":10240,
   [junit4]   2>           "rate":250.0,
   [junit4]   2>           "state":"active",
   [junit4]   2>           "QUERY./select.requestTimes:1minRate":250,
   [junit4]   2>           "INDEX.sizeInGB":9.5367431640625E-6,
   [junit4]   2>           "SEARCHER.searcher.numDocs":0}},
   [junit4]   2>       {"core_node2":{
   [junit4]   2>           "core":"collection1_shard1_replica_n2",
   [junit4]   2>           "shard":"shard1",
   [junit4]   2>           "collection":"collection1",
   [junit4]   2>           "node_name":"127.0.0.1:10322_solr",
   [junit4]   2>           "type":"NRT",
   [junit4]   2>           "SEARCHER.searcher.maxDoc":0,
   [junit4]   2>           "SEARCHER.searcher.deletedDocs":0,
   [junit4]   2>           "INDEX.sizeInBytes":10240,
   [junit4]   2>           "rate":250.0,
   [junit4]   2>           "state":"active",
   [junit4]   2>           "QUERY./select.requestTimes:1minRate":250,
   [junit4]   2>           "INDEX.sizeInGB":9.5367431640625E-6,
   [junit4]   2>           "SEARCHER.searcher.numDocs":0}}],
   [junit4]   2>     "__start__":3,
   [junit4]   2>     "coldNodes":{},
   [junit4]   2>     "coldShards":{},
   [junit4]   2>     "coldReplicas":[],
   [junit4]   2>     "violationType":["hotShards"],
   [junit4]   2>     "coldCollections":{},
   [junit4]   2>     "hotShards":{"collection1":{"shard1":100.0}},
   [junit4]   2>     "hotCollections":{"collection1":500.0},
   [junit4]   2>     "hotNodes":{
   [junit4]   2>       "127.0.0.1:10324_solr":250.0,
   [junit4]   2>       "127.0.0.1:10322_solr":250.0},
   [junit4]   2>     "_enqueue_time_":805105027263076,
   [junit4]   2>     "requestedOps":[
   [junit4]   2>       {
   [junit4]   2>         "action":"ADDREPLICA",
   [junit4]   2>         "hints":{"COLL_SHARD":[{
   [junit4]   2>               "first":"collection1",
   [junit4]   2>               "second":"shard1"}]}},
   [junit4]   2>       {
   [junit4]   2>         "action":"ADDREPLICA",
   [junit4]   2>         "hints":{"COLL_SHARD":[{
   [junit4]   2>               "first":"collection1",
   [junit4]   2>               "second":"shard1"}]}},
   [junit4]   2>       {
   [junit4]   2>         "action":"ADDREPLICA",
   [junit4]   2>         "hints":{"COLL_SHARD":[{
   [junit4]   2>               "first":"collection1",
   [junit4]   2>               "second":"shard1"}]}}]}}
   [junit4]   2> 	at org.apache.solr.cloud.autoscaling.ScheduledTriggers.lambda$null$3(ScheduledTriggers.java:311) ~[java/:?]
   [junit4]   2> 	at java.util.concurrent.Executors$RunnableAdapter.call(Executors.java:511) ~[?:1.8.0_172]
   [junit4]   2> 	at java.util.concurrent.FutureTask.run(FutureTask.java:266) ~[?:1.8.0_172]
   [junit4]   2> 	at org.apache.solr.common.util.ExecutorUtil$MDCAwareThreadPoolExecutor.lambda$execute$0(ExecutorUtil.java:209) ~[java/:?]
   [junit4]   2> 	at java.util.concurrent.ThreadPoolExecutor.runWorker(ThreadPoolExecutor.java:1149) [?:1.8.0_172]
   [junit4]   2> 	at java.util.concurrent.ThreadPoolExecutor$Worker.run(ThreadPoolExecutor.java:624) [?:1.8.0_172]
   [junit4]   2> 	at java.lang.Thread.run(Thread.java:748) [?:1.8.0_172]
   [junit4]   2> Caused by: org.apache.solr.common.SolrException: Unexpected exception while processing event: {
   [junit4]   2>   "id":"2dc3b4c381ea8T72g82hu4b0sigms6k6a49pdnx",
   [junit4]   2>   "source":"search_rate_trigger",
   [junit4]   2>   "eventTime":805097193348776,
   [junit4]   2>   "eventType":"SEARCHRATE",
   [junit4]   2>   "properties":{
   [junit4]   2>     "hotReplicas":[
   [junit4]   2>       {"core_node1":{
   [junit4]   2>           "core":"collection1_shard1_replica_n1",
   [junit4]   2>           "shard":"shard1",
   [junit4]   2>           "collection":"collection1",
   [junit4]   2>           "node_name":"127.0.0.1:10324_solr",
   [junit4]   2>           "type":"NRT",
   [junit4]   2>           "leader":"true",
   [junit4]   2>           "SEARCHER.searcher.maxDoc":0,
   [junit4]   2>           "SEARCHER.searcher.deletedDocs":0,
   [junit4]   2>           "INDEX.sizeInBytes":10240,
   [junit4]   2>           "rate":250.0,
   [junit4]   2>           "state":"active",
   [junit4]   2>           "QUERY./select.requestTimes:1minRate":250,
   [junit4]   2>           "INDEX.sizeInGB":9.5367431640625E-6,
   [junit4]   2>           "SEARCHER.searcher.numDocs":0}},
   [junit4]   2>       {"core_node2":{
   [junit4]   2>           "core":"collection1_shard1_replica_n2",
   [junit4]   2>           "shard":"shard1",
   [junit4]   2>           "collection":"collection1",
   [junit4]   2>           "node_name":"127.0.0.1:10322_solr",
   [junit4]   2>           "type":"NRT",
   [junit4]   2>           "SEARCHER.searcher.maxDoc":0,
   [junit4]   2>           "SEARCHER.sear

[...truncated too long message...]

ddedTrigger node_added_cooldown_trigger - removing marker path: /autoscaling/nodeAdded/127.0.0.1:10047_solr
   [junit4]   2> 16448 DEBUG (AutoscalingActionExecutor-153-thread-1) [    ] o.a.s.c.a.ScheduledTriggers -- processing actions for {
   [junit4]   2>   "id":"271f4a66eb984T72g82hu4b0sigms6k6a49p8ib",
   [junit4]   2>   "source":"node_added_cooldown_trigger",
   [junit4]   2>   "eventTime":688245531654532,
   [junit4]   2>   "eventType":"NODEADDED",
   [junit4]   2>   "properties":{
   [junit4]   2>     "eventTimes":[688245531654532],
   [junit4]   2>     "preferredOperation":"movereplica",
   [junit4]   2>     "_enqueue_time_":688246555092982,
   [junit4]   2>     "nodeNames":["127.0.0.1:10047_solr"]}}
   [junit4]   2> 16449 DEBUG (AutoscalingActionExecutor-153-thread-1) [    ] o.a.s.c.a.ScheduledTriggers Resuming trigger: .auto_add_replicas after 100ms
   [junit4]   2> 16449 DEBUG (AutoscalingActionExecutor-153-thread-1) [    ] o.a.s.c.a.ScheduledTriggers Resuming trigger: node_added_cooldown_trigger after 100ms
   [junit4]   2> 16449 DEBUG (AutoscalingActionExecutor-153-thread-1) [    ] o.a.s.c.a.ScheduledTriggers -- processing took 48 ms for event id=271f4a66eb984T72g82hu4b0sigms6k6a49p8ib
   [junit4]   2> 16489 INFO  (TEST-TestSimTriggerIntegration.testCooldown-seed#[FB369E21D7C98B2C]) [    ] o.a.s.SolrTestCaseJ4 ###Ending testCooldown
   [junit4]   2> 16489 DEBUG (TEST-TestSimTriggerIntegration.testCooldown-seed#[FB369E21D7C98B2C]) [    ] o.a.s.c.a.s.SimClusterStateProvider ** creating new collection states
   [junit4]   2> 16489 DEBUG (TEST-TestSimTriggerIntegration.testCooldown-seed#[FB369E21D7C98B2C]) [    ] o.a.s.c.a.s.SimClusterStateProvider ** saved cluster state version 65
   [junit4]   2> 16490 INFO  (TEST-TestSimTriggerIntegration.testCooldown-seed#[FB369E21D7C98B2C]) [    ] o.a.s.c.a.s.SimSolrCloudTestCase #######################################
   [junit4]   2> ############ CLUSTER STATE ############
   [junit4]   2> #######################################
   [junit4]   2> ## Live nodes:		4
   [junit4]   2> ## Empty nodes:	3
   [junit4]   2> ## Dead nodes:		0
   [junit4]   2> ## Collections:
   [junit4]   2> ##  * .system
   [junit4]   2> ##    shardsTotal	1
   [junit4]   2> ##    shardsState	{active=1}
   [junit4]   2> ##      shardsWithoutLeader	0
   [junit4]   2> ##    totalReplicas	1
   [junit4]   2> ##      activeReplicas	1
   [junit4]   2> ##      inactiveReplicas	0
   [junit4]   2> ##    totalActiveDocs	4
   [junit4]   2> ##      bufferedDocs	0
   [junit4]   2> ##      maxActiveSliceDocs	4
   [junit4]   2> ##      minActiveSliceDocs	4
   [junit4]   2> ##      avgActiveSliceDocs	4
   [junit4]   2> ##    totalInactiveDocs	0
   [junit4]   2> ##      maxInactiveSliceDocs	0
   [junit4]   2> ##      minInactiveSliceDocs	0
   [junit4]   2> ##      avgInactiveSliceDocs	NaN
   [junit4]   2> ##    totalActiveBytes	12,240
   [junit4]   2> ##      maxActiveSliceBytes	12,240
   [junit4]   2> ##      minActiveSliceBytes	12,240
   [junit4]   2> ##      avgActiveSliceBytes	12,240
   [junit4]   2> ##    totalInactiveBytes	0
   [junit4]   2> ##      maxInactiveSliceBytes	0
   [junit4]   2> ##      minInactiveSliceBytes	0
   [junit4]   2> ##      avgInactiveSliceBytes	NaN
   [junit4]   2> ##    totalActiveDeletedDocs	0
   [junit4]   2> ## Max replicas per node:	1
   [junit4]   2> ## Min replicas per node:	0
   [junit4]   2> ## Total replicas:		1
   [junit4]   2> ## * .system		1
   [junit4]   2> ##		- active           1
   [junit4]   2> ######### Solr op counts ##########
   [junit4]   2> ##		- autoscaling        3
   [junit4]   2> ##		- update             4
   [junit4]   2> ######### Autoscaling event counts ###########
   [junit4]   2> ## * Trigger: node_added_cooldown_trigger
   [junit4]   2> ##		- STARTED         2
   [junit4]   2> ##		- SUCCEEDED       2
   [junit4]   2> ## * Trigger: node_added_restore_trigger
   [junit4]   2> ##		- STARTED         1
   [junit4]   2> ##		- SUCCEEDED       1
   [junit4]   2> ## * Trigger: node_added_trigger
   [junit4]   2> ##		- FAILED          1
   [junit4]   2> ##		- STARTED         6
   [junit4]   2> ##		- SUCCEEDED       5
   [junit4]   2> ## * Trigger: node_added_trigger1
   [junit4]   2> ##		- FAILED          1
   [junit4]   2> ##		- STARTED         3
   [junit4]   2> ##		- SUCCEEDED       2
   [junit4]   2> ## * Trigger: node_added_trigger2
   [junit4]   2> ##		- STARTED         1
   [junit4]   2> ##		- SUCCEEDED       1
   [junit4]   2> ## * Trigger: node_lost_restore_trigger
   [junit4]   2> ##		- STARTED         1
   [junit4]   2> ##		- SUCCEEDED       1
   [junit4]   2> ## * Trigger: node_lost_trigger
   [junit4]   2> ##		- STARTED         2
   [junit4]   2> ##		- SUCCEEDED       2
   [junit4]   2> ## * Trigger: node_lost_trigger1
   [junit4]   2> ##		- STARTED         1
   [junit4]   2> ##		- SUCCEEDED       1
   [junit4]   2> ## * Trigger: node_lost_trigger2
   [junit4]   2> ##		- STARTED         1
   [junit4]   2> ##		- SUCCEEDED       1
   [junit4]   2> ## * Trigger: search_rate_trigger
   [junit4]   2> ##		- FAILED          1
   [junit4]   2> ##		- STARTED         2
   [junit4]   2> ##		- SUCCEEDED       1
   [junit4]   2> 
   [junit4] OK      0.36s J0 | TestSimTriggerIntegration.testCooldown
   [junit4]   2> 16490 DEBUG (SUITE-TestSimTriggerIntegration-seed#[FB369E21D7C98B2C]-worker) [    ] o.a.s.c.a.ScheduledTriggers Shutting down scheduled thread pool executor now
   [junit4]   2> 16490 DEBUG (SUITE-TestSimTriggerIntegration-seed#[FB369E21D7C98B2C]-worker) [    ] o.a.s.c.a.ScheduledTriggers Shutting down action executor now
   [junit4]   2> 16491 WARN  (Simulated OverseerAutoScalingTriggerThread) [    ] o.a.s.c.a.OverseerTriggerThread OverseerTriggerThread woken up but we are closed, exiting.
   [junit4]   2> 16491 DEBUG (SUITE-TestSimTriggerIntegration-seed#[FB369E21D7C98B2C]-worker) [    ] o.a.s.c.a.ScheduledTriggers Awaiting termination for action executor
   [junit4]   2> 16491 DEBUG (SUITE-TestSimTriggerIntegration-seed#[FB369E21D7C98B2C]-worker) [    ] o.a.s.c.a.ScheduledTriggers Awaiting termination for scheduled thread pool executor
   [junit4]   2> 16491 DEBUG (SUITE-TestSimTriggerIntegration-seed#[FB369E21D7C98B2C]-worker) [    ] o.a.s.c.a.ScheduledTriggers ScheduledTriggers closed completely
   [junit4]   2> 16491 DEBUG (SUITE-TestSimTriggerIntegration-seed#[FB369E21D7C98B2C]-worker) [    ] o.a.s.c.a.OverseerTriggerThread OverseerTriggerThread has been closed explicitly
   [junit4]   2> NOTE: leaving temporary files on disk at: /export/home/jenkins/workspace/Lucene-Solr-master-Solaris/solr/build/solr-core/test/J0/temp/solr.cloud.autoscaling.sim.TestSimTriggerIntegration_FB369E21D7C98B2C-003
   [junit4]   2> NOTE: test params are: codec=Lucene80, sim=Asserting(org.apache.lucene.search.similarities.AssertingSimilarity@3567e5b6), locale=ms, timezone=Australia/Lord_Howe
   [junit4]   2> NOTE: SunOS 5.11 amd64/Oracle Corporation 1.8.0_172 (64-bit)/cpus=3,threads=1,free=83667184,total=97320960
   [junit4]   2> NOTE: All tests run in this JVM: [TestSimTriggerIntegration, TestSimTriggerIntegration, TestSimTriggerIntegration]
   [junit4] Completed [5/5 (5!)] on J0 in 3.66s, 11 tests, 1 error <<< FAILURES!
   [junit4] 
   [junit4] 
   [junit4] Tests with failures [seed: FB369E21D7C98B2C]:
   [junit4]   - org.apache.solr.cloud.autoscaling.sim.TestSimTriggerIntegration.testSearchRate
   [junit4]   - org.apache.solr.cloud.autoscaling.sim.TestSimTriggerIntegration.testSearchRate
   [junit4]   - org.apache.solr.cloud.autoscaling.sim.TestSimTriggerIntegration.testSearchRate
   [junit4]   - org.apache.solr.cloud.autoscaling.sim.TestSimTriggerIntegration.testSearchRate
   [junit4]   - org.apache.solr.cloud.autoscaling.sim.TestSimTriggerIntegration.testSearchRate
   [junit4] 
   [junit4] 
   [junit4] JVM J0:     0.75 ..    17.10 =    16.35s
   [junit4] JVM J1:     0.83 ..    13.59 =    12.76s
   [junit4] Execution time total: 17 seconds
   [junit4] Tests summary: 5 suites, 55 tests, 5 errors

BUILD FAILED
/export/home/jenkins/workspace/Lucene-Solr-master-Solaris/lucene/common-build.xml:1567: The following error occurred while executing this line:
/export/home/jenkins/workspace/Lucene-Solr-master-Solaris/lucene/common-build.xml:1092: There were test failures: 5 suites, 55 tests, 5 errors [seed: FB369E21D7C98B2C]

Total time: 19 seconds

[repro] Setting last failure code to 256

[repro] Failures:
[repro]   5/5 failed: org.apache.solr.cloud.autoscaling.sim.TestSimTriggerIntegration
[repro] Exiting with code 256
+ mv lucene/build lucene/build.repro
+ mv solr/build solr/build.repro
+ mv lucene/build.orig lucene/build
+ mv solr/build.orig solr/build
Archiving artifacts
Setting ANT_1_8_2_HOME=/export/home/jenkins/tools/hudson.tasks.Ant_AntInstallation/ANT_1.8.2
[WARNINGS] Parsing warnings in console log with parser Java Compiler (javac)
Setting ANT_1_8_2_HOME=/export/home/jenkins/tools/hudson.tasks.Ant_AntInstallation/ANT_1.8.2
Setting ANT_1_8_2_HOME=/export/home/jenkins/tools/hudson.tasks.Ant_AntInstallation/ANT_1.8.2
<Git Blamer> Using GitBlamer to create author and commit information for all warnings.
<Git Blamer> GIT_COMMIT=961d565955ed9b2acd8f44319c16b627d6192714, workspace=/export/home/jenkins/workspace/Lucene-Solr-master-Solaris
[WARNINGS] Computing warning deltas based on reference build #2086
Recording test results
Setting ANT_1_8_2_HOME=/export/home/jenkins/tools/hudson.tasks.Ant_AntInstallation/ANT_1.8.2
Build step 'Publish JUnit test result report' changed build result to UNSTABLE
Email was triggered for: Unstable (Test Failures)
Sending email for trigger: Unstable (Test Failures)
Setting ANT_1_8_2_HOME=/export/home/jenkins/tools/hudson.tasks.Ant_AntInstallation/ANT_1.8.2
Setting ANT_1_8_2_HOME=/export/home/jenkins/tools/hudson.tasks.Ant_AntInstallation/ANT_1.8.2
Setting ANT_1_8_2_HOME=/export/home/jenkins/tools/hudson.tasks.Ant_AntInstallation/ANT_1.8.2
Setting ANT_1_8_2_HOME=/export/home/jenkins/tools/hudson.tasks.Ant_AntInstallation/ANT_1.8.2

Mime
View raw message