lucene-dev mailing list archives

Site index · List index
Message view « Date » · « Thread »
Top « Date » · « Thread »
From Apache Jenkins Server <jenk...@builds.apache.org>
Subject [JENKINS] Lucene-Solr-NightlyTests-7.x - Build # 363 - Still Unstable
Date Wed, 31 Oct 2018 10:06:19 GMT
Build: https://builds.apache.org/job/Lucene-Solr-NightlyTests-7.x/363/

1 tests failed.
FAILED:  org.apache.solr.cloud.TestCloudPivotFacet.test

Error Message:
{main(facet=true&facet.pivot={!stats%3Dst0}bogus_not_in_any_doc_s&facet.pivot={!stats%3Dst2}pivot_z_s1,pivot_x_s,pivot_tdt&facet.limit=15&facet.missing=true&facet.sort=index&facet.overrequest.count=0),extra(rows=0&q=*:*&stats=true&stats.field={!key%3Dsk1+tag%3Dst1,st2}pivot_d&stats.field={!key%3Dsk2+tag%3Dst2,st3}pivot_dt1&stats.field={!key%3Dsk3+tag%3Dst3,st4}pivot_z_s&_test_miss=true&_test_sort=index)} ==> Stddev of sk2 => pivot_z_s1,pivot_x_s,pivot_tdt: {params(rows=0),defaults({main({main(rows=0&q=*:*&stats=true&stats.field={!key%3Dsk1+tag%3Dst1,st2}pivot_d&stats.field={!key%3Dsk2+tag%3Dst2,st3}pivot_dt1&stats.field={!key%3Dsk3+tag%3Dst3,st4}pivot_z_s&_test_miss=true&_test_sort=index),extra(fq={!term+f%3Dpivot_z_s1}a)}),extra(fq={!term+f%3Dpivot_x_s}b)})} expected:<0.0> but was:<20724.30287367949>

Stack Trace:
java.lang.AssertionError: {main(facet=true&facet.pivot={!stats%3Dst0}bogus_not_in_any_doc_s&facet.pivot={!stats%3Dst2}pivot_z_s1,pivot_x_s,pivot_tdt&facet.limit=15&facet.missing=true&facet.sort=index&facet.overrequest.count=0),extra(rows=0&q=*:*&stats=true&stats.field={!key%3Dsk1+tag%3Dst1,st2}pivot_d&stats.field={!key%3Dsk2+tag%3Dst2,st3}pivot_dt1&stats.field={!key%3Dsk3+tag%3Dst3,st4}pivot_z_s&_test_miss=true&_test_sort=index)} ==> Stddev of sk2 => pivot_z_s1,pivot_x_s,pivot_tdt: {params(rows=0),defaults({main({main(rows=0&q=*:*&stats=true&stats.field={!key%3Dsk1+tag%3Dst1,st2}pivot_d&stats.field={!key%3Dsk2+tag%3Dst2,st3}pivot_dt1&stats.field={!key%3Dsk3+tag%3Dst3,st4}pivot_z_s&_test_miss=true&_test_sort=index),extra(fq={!term+f%3Dpivot_z_s1}a)}),extra(fq={!term+f%3Dpivot_x_s}b)})} expected:<0.0> but was:<20724.30287367949>
	at __randomizedtesting.SeedInfo.seed([E8745FA6D96CE260:6020607C77908F98]:0)
	at org.apache.solr.cloud.TestCloudPivotFacet.assertPivotCountsAreCorrect(TestCloudPivotFacet.java:292)
	at org.apache.solr.cloud.TestCloudPivotFacet.test(TestCloudPivotFacet.java:239)
	at sun.reflect.NativeMethodAccessorImpl.invoke0(Native Method)
	at sun.reflect.NativeMethodAccessorImpl.invoke(NativeMethodAccessorImpl.java:62)
	at sun.reflect.DelegatingMethodAccessorImpl.invoke(DelegatingMethodAccessorImpl.java:43)
	at java.lang.reflect.Method.invoke(Method.java:498)
	at com.carrotsearch.randomizedtesting.RandomizedRunner.invoke(RandomizedRunner.java:1742)
	at com.carrotsearch.randomizedtesting.RandomizedRunner$8.evaluate(RandomizedRunner.java:935)
	at com.carrotsearch.randomizedtesting.RandomizedRunner$9.evaluate(RandomizedRunner.java:971)
	at com.carrotsearch.randomizedtesting.RandomizedRunner$10.evaluate(RandomizedRunner.java:985)
	at org.apache.solr.BaseDistributedSearchTestCase$ShardsRepeatRule$ShardsFixedStatement.callStatement(BaseDistributedSearchTestCase.java:1010)
	at org.apache.solr.BaseDistributedSearchTestCase$ShardsRepeatRule$ShardsStatement.evaluate(BaseDistributedSearchTestCase.java:985)
	at com.carrotsearch.randomizedtesting.rules.SystemPropertiesRestoreRule$1.evaluate(SystemPropertiesRestoreRule.java:57)
	at org.apache.lucene.util.TestRuleSetupTeardownChained$1.evaluate(TestRuleSetupTeardownChained.java:49)
	at org.apache.lucene.util.AbstractBeforeAfterRule$1.evaluate(AbstractBeforeAfterRule.java:45)
	at org.apache.lucene.util.TestRuleThreadAndTestName$1.evaluate(TestRuleThreadAndTestName.java:48)
	at org.apache.lucene.util.TestRuleIgnoreAfterMaxFailures$1.evaluate(TestRuleIgnoreAfterMaxFailures.java:64)
	at org.apache.lucene.util.TestRuleMarkFailure$1.evaluate(TestRuleMarkFailure.java:47)
	at com.carrotsearch.randomizedtesting.rules.StatementAdapter.evaluate(StatementAdapter.java:36)
	at com.carrotsearch.randomizedtesting.ThreadLeakControl$StatementRunner.run(ThreadLeakControl.java:368)
	at com.carrotsearch.randomizedtesting.ThreadLeakControl.forkTimeoutingTask(ThreadLeakControl.java:817)
	at com.carrotsearch.randomizedtesting.ThreadLeakControl$3.evaluate(ThreadLeakControl.java:468)
	at com.carrotsearch.randomizedtesting.RandomizedRunner.runSingleTest(RandomizedRunner.java:944)
	at com.carrotsearch.randomizedtesting.RandomizedRunner$5.evaluate(RandomizedRunner.java:830)
	at com.carrotsearch.randomizedtesting.RandomizedRunner$6.evaluate(RandomizedRunner.java:880)
	at com.carrotsearch.randomizedtesting.RandomizedRunner$7.evaluate(RandomizedRunner.java:891)
	at com.carrotsearch.randomizedtesting.rules.StatementAdapter.evaluate(StatementAdapter.java:36)
	at com.carrotsearch.randomizedtesting.rules.SystemPropertiesRestoreRule$1.evaluate(SystemPropertiesRestoreRule.java:57)
	at org.apache.lucene.util.AbstractBeforeAfterRule$1.evaluate(AbstractBeforeAfterRule.java:45)
	at com.carrotsearch.randomizedtesting.rules.StatementAdapter.evaluate(StatementAdapter.java:36)
	at org.apache.lucene.util.TestRuleStoreClassName$1.evaluate(TestRuleStoreClassName.java:41)
	at com.carrotsearch.randomizedtesting.rules.NoShadowingOrOverridesOnMethodsRule$1.evaluate(NoShadowingOrOverridesOnMethodsRule.java:40)
	at com.carrotsearch.randomizedtesting.rules.NoShadowingOrOverridesOnMethodsRule$1.evaluate(NoShadowingOrOverridesOnMethodsRule.java:40)
	at com.carrotsearch.randomizedtesting.rules.StatementAdapter.evaluate(StatementAdapter.java:36)
	at com.carrotsearch.randomizedtesting.rules.StatementAdapter.evaluate(StatementAdapter.java:36)
	at com.carrotsearch.randomizedtesting.rules.StatementAdapter.evaluate(StatementAdapter.java:36)
	at org.apache.lucene.util.TestRuleAssertionsRequired$1.evaluate(TestRuleAssertionsRequired.java:53)
	at org.apache.lucene.util.TestRuleMarkFailure$1.evaluate(TestRuleMarkFailure.java:47)
	at org.apache.lucene.util.TestRuleIgnoreAfterMaxFailures$1.evaluate(TestRuleIgnoreAfterMaxFailures.java:64)
	at org.apache.lucene.util.TestRuleIgnoreTestSuites$1.evaluate(TestRuleIgnoreTestSuites.java:54)
	at com.carrotsearch.randomizedtesting.rules.StatementAdapter.evaluate(StatementAdapter.java:36)
	at com.carrotsearch.randomizedtesting.ThreadLeakControl$StatementRunner.run(ThreadLeakControl.java:368)
	at java.lang.Thread.run(Thread.java:748)
Caused by: java.lang.AssertionError: Stddev of sk2 => pivot_z_s1,pivot_x_s,pivot_tdt: {params(rows=0),defaults({main({main(rows=0&q=*:*&stats=true&stats.field={!key%3Dsk1+tag%3Dst1,st2}pivot_d&stats.field={!key%3Dsk2+tag%3Dst2,st3}pivot_dt1&stats.field={!key%3Dsk3+tag%3Dst3,st4}pivot_z_s&_test_miss=true&_test_sort=index),extra(fq={!term+f%3Dpivot_z_s1}a)}),extra(fq={!term+f%3Dpivot_x_s}b)})} expected:<0.0> but was:<20724.30287367949>
	at org.junit.Assert.fail(Assert.java:93)
	at org.junit.Assert.failNotEquals(Assert.java:647)
	at org.junit.Assert.assertEquals(Assert.java:443)
	at org.apache.solr.cloud.TestCloudPivotFacet.assertNumerics(TestCloudPivotFacet.java:743)
	at org.apache.solr.cloud.TestCloudPivotFacet.assertPivotStats(TestCloudPivotFacet.java:402)
	at org.apache.solr.cloud.TestCloudPivotFacet.assertPivotData(TestCloudPivotFacet.java:350)
	at org.apache.solr.cloud.TestCloudPivotFacet.assertPivotCountsAreCorrect(TestCloudPivotFacet.java:313)
	at org.apache.solr.cloud.TestCloudPivotFacet.assertPivotCountsAreCorrect(TestCloudPivotFacet.java:324)
	at org.apache.solr.cloud.TestCloudPivotFacet.assertPivotCountsAreCorrect(TestCloudPivotFacet.java:282)
	... 42 more




Build Log:
[...truncated 14318 lines...]
   [junit4] Suite: org.apache.solr.cloud.TestCloudPivotFacet
   [junit4]   2> 1969745 INFO  (SUITE-TestCloudPivotFacet-seed#[E8745FA6D96CE260]-worker) [    ] o.a.s.SolrTestCaseJ4 SecureRandom sanity checks: test.solr.allowed.securerandom=null & java.security.egd=file:/dev/./urandom
   [junit4]   2> Creating dataDir: /x1/jenkins/jenkins-slave/workspace/Lucene-Solr-NightlyTests-7.x/checkout/solr/build/solr-core/test/J1/temp/solr.cloud.TestCloudPivotFacet_E8745FA6D96CE260-001/init-core-data-001
   [junit4]   2> 1969746 WARN  (SUITE-TestCloudPivotFacet-seed#[E8745FA6D96CE260]-worker) [    ] o.a.s.SolrTestCaseJ4 startTrackingSearchers: numOpens=5 numCloses=5
   [junit4]   2> 1969746 INFO  (SUITE-TestCloudPivotFacet-seed#[E8745FA6D96CE260]-worker) [    ] o.a.s.SolrTestCaseJ4 Using PointFields (NUMERIC_POINTS_SYSPROP=true) w/NUMERIC_DOCVALUES_SYSPROP=true
   [junit4]   2> 1969748 INFO  (SUITE-TestCloudPivotFacet-seed#[E8745FA6D96CE260]-worker) [    ] o.a.s.SolrTestCaseJ4 Randomized ssl (false) and clientAuth (false) via: @org.apache.solr.SolrTestCaseJ4$SuppressSSL(bugUrl=None)
   [junit4]   2> 1969748 INFO  (SUITE-TestCloudPivotFacet-seed#[E8745FA6D96CE260]-worker) [    ] o.a.s.BaseDistributedSearchTestCase Setting hostContext system property: /
   [junit4]   2> 1969749 INFO  (SUITE-TestCloudPivotFacet-seed#[E8745FA6D96CE260]-worker) [    ] o.a.s.c.TestCloudPivotFacet init'ing useFieldRandomizedFactor = 4
   [junit4]   2> 1969755 INFO  (TEST-TestCloudPivotFacet.test-seed#[E8745FA6D96CE260]) [    ] o.a.s.c.ZkTestServer STARTING ZK TEST SERVER
   [junit4]   2> 1969755 INFO  (Thread-3174) [    ] o.a.s.c.ZkTestServer client port:0.0.0.0/0.0.0.0:0
   [junit4]   2> 1969755 INFO  (Thread-3174) [    ] o.a.s.c.ZkTestServer Starting server
   [junit4]   2> 1969757 ERROR (Thread-3174) [    ] o.a.z.s.ZooKeeperServer ZKShutdownHandler is not registered, so ZooKeeper server won't take any action on ERROR or SHUTDOWN server state changes
   [junit4]   2> 1969855 INFO  (TEST-TestCloudPivotFacet.test-seed#[E8745FA6D96CE260]) [    ] o.a.s.c.ZkTestServer start zk server on port:43751
   [junit4]   2> 1969859 INFO  (zkConnectionManagerCallback-3792-thread-1) [    ] o.a.s.c.c.ConnectionManager zkClient has connected
   [junit4]   2> 1969864 INFO  (zkConnectionManagerCallback-3794-thread-1) [    ] o.a.s.c.c.ConnectionManager zkClient has connected
   [junit4]   2> 1969872 INFO  (TEST-TestCloudPivotFacet.test-seed#[E8745FA6D96CE260]) [    ] o.a.s.c.AbstractZkTestCase put /x1/jenkins/jenkins-slave/workspace/Lucene-Solr-NightlyTests-7.x/checkout/solr/core/src/test-files/solr/collection1/conf/solrconfig-tlog.xml to /configs/conf1/solrconfig.xml
   [junit4]   2> 1969874 INFO  (TEST-TestCloudPivotFacet.test-seed#[E8745FA6D96CE260]) [    ] o.a.s.c.AbstractZkTestCase put /x1/jenkins/jenkins-slave/workspace/Lucene-Solr-NightlyTests-7.x/checkout/solr/core/src/test-files/solr/collection1/conf/schema.xml to /configs/conf1/schema.xml
   [junit4]   2> 1969876 INFO  (TEST-TestCloudPivotFacet.test-seed#[E8745FA6D96CE260]) [    ] o.a.s.c.AbstractZkTestCase put /x1/jenkins/jenkins-slave/workspace/Lucene-Solr-NightlyTests-7.x/checkout/solr/core/src/test-files/solr/collection1/conf/solrconfig.snippet.randomindexconfig.xml to /configs/conf1/solrconfig.snippet.randomindexconfig.xml
   [junit4]   2> 1969878 INFO  (TEST-TestCloudPivotFacet.test-seed#[E8745FA6D96CE260]) [    ] o.a.s.c.AbstractZkTestCase put /x1/jenkins/jenkins-slave/workspace/Lucene-Solr-NightlyTests-7.x/checkout/solr/core/src/test-files/solr/collection1/conf/stopwords.txt to /configs/conf1/stopwords.txt
   [junit4]   2> 1969879 INFO  (TEST-TestCloudPivotFacet.test-seed#[E8745FA6D96CE260]) [    ] o.a.s.c.AbstractZkTestCase put /x1/jenkins/jenkins-slave/workspace/Lucene-Solr-NightlyTests-7.x/checkout/solr/core/src/test-files/solr/collection1/conf/protwords.txt to /configs/conf1/protwords.txt
   [junit4]   2> 1969881 INFO  (TEST-TestCloudPivotFacet.test-seed#[E8745FA6D96CE260]) [    ] o.a.s.c.AbstractZkTestCase put /x1/jenkins/jenkins-slave/workspace/Lucene-Solr-NightlyTests-7.x/checkout/solr/core/src/test-files/solr/collection1/conf/currency.xml to /configs/conf1/currency.xml
   [junit4]   2> 1969882 INFO  (TEST-TestCloudPivotFacet.test-seed#[E8745FA6D96CE260]) [    ] o.a.s.c.AbstractZkTestCase put /x1/jenkins/jenkins-slave/workspace/Lucene-Solr-NightlyTests-7.x/checkout/solr/core/src/test-files/solr/collection1/conf/enumsConfig.xml to /configs/conf1/enumsConfig.xml
   [junit4]   2> 1969884 INFO  (TEST-TestCloudPivotFacet.test-seed#[E8745FA6D96CE260]) [    ] o.a.s.c.AbstractZkTestCase put /x1/jenkins/jenkins-slave/workspace/Lucene-Solr-NightlyTests-7.x/checkout/solr/core/src/test-files/solr/collection1/conf/open-exchange-rates.json to /configs/conf1/open-exchange-rates.json
   [junit4]   2> 1969885 INFO  (TEST-TestCloudPivotFacet.test-seed#[E8745FA6D96CE260]) [    ] o.a.s.c.AbstractZkTestCase put /x1/jenkins/jenkins-slave/workspace/Lucene-Solr-NightlyTests-7.x/checkout/solr/core/src/test-files/solr/collection1/conf/mapping-ISOLatin1Accent.txt to /configs/conf1/mapping-ISOLatin1Accent.txt
   [junit4]   2> 1969887 INFO  (TEST-TestCloudPivotFacet.test-seed#[E8745FA6D96CE260]) [    ] o.a.s.c.AbstractZkTestCase put /x1/jenkins/jenkins-slave/workspace/Lucene-Solr-NightlyTests-7.x/checkout/solr/core/src/test-files/solr/collection1/conf/old_synonyms.txt to /configs/conf1/old_synonyms.txt
   [junit4]   2> 1969888 INFO  (TEST-TestCloudPivotFacet.test-seed#[E8745FA6D96CE260]) [    ] o.a.s.c.AbstractZkTestCase put /x1/jenkins/jenkins-slave/workspace/Lucene-Solr-NightlyTests-7.x/checkout/solr/core/src/test-files/solr/collection1/conf/synonyms.txt to /configs/conf1/synonyms.txt
   [junit4]   2> 1969890 INFO  (TEST-TestCloudPivotFacet.test-seed#[E8745FA6D96CE260]) [    ] o.a.s.c.AbstractFullDistribZkTestBase Will use NRT replicas unless explicitly asked otherwise
   [junit4]   2> 1970067 INFO  (TEST-TestCloudPivotFacet.test-seed#[E8745FA6D96CE260]) [    ] o.e.j.s.Server jetty-9.4.11.v20180605; built: 2018-06-05T18:24:03.829Z; git: d5fc0523cfa96bfebfbda19606cad384d772f04c; jvm 1.8.0_172-b11
   [junit4]   2> 1970069 INFO  (TEST-TestCloudPivotFacet.test-seed#[E8745FA6D96CE260]) [    ] o.e.j.s.session DefaultSessionIdManager workerName=node0
   [junit4]   2> 1970069 INFO  (TEST-TestCloudPivotFacet.test-seed#[E8745FA6D96CE260]) [    ] o.e.j.s.session No SessionScavenger set, using defaults
   [junit4]   2> 1970069 INFO  (TEST-TestCloudPivotFacet.test-seed#[E8745FA6D96CE260]) [    ] o.e.j.s.session node0 Scavenging every 660000ms
   [junit4]   2> 1970069 INFO  (TEST-TestCloudPivotFacet.test-seed#[E8745FA6D96CE260]) [    ] o.e.j.s.h.ContextHandler Started o.e.j.s.ServletContextHandler@69a7986a{/,null,AVAILABLE}
   [junit4]   2> 1970071 INFO  (TEST-TestCloudPivotFacet.test-seed#[E8745FA6D96CE260]) [    ] o.e.j.s.AbstractConnector Started ServerConnector@5c0d69{HTTP/1.1,[http/1.1]}{127.0.0.1:46634}
   [junit4]   2> 1970071 INFO  (TEST-TestCloudPivotFacet.test-seed#[E8745FA6D96CE260]) [    ] o.e.j.s.Server Started @1970163ms
   [junit4]   2> 1970071 INFO  (TEST-TestCloudPivotFacet.test-seed#[E8745FA6D96CE260]) [    ] o.a.s.c.s.e.JettySolrRunner Jetty properties: {solr.data.dir=/x1/jenkins/jenkins-slave/workspace/Lucene-Solr-NightlyTests-7.x/checkout/solr/build/solr-core/test/J1/temp/solr.cloud.TestCloudPivotFacet_E8745FA6D96CE260-001/tempDir-001/control/data, hostContext=/, hostPort=46634, coreRootDirectory=/x1/jenkins/jenkins-slave/workspace/Lucene-Solr-NightlyTests-7.x/checkout/solr/build/solr-core/test/J1/../../../../../../../../../../../x1/jenkins/jenkins-slave/workspace/Lucene-Solr-NightlyTests-7.x/checkout/solr/build/solr-core/test/J1/temp/solr.cloud.TestCloudPivotFacet_E8745FA6D96CE260-001/control-001/cores}
   [junit4]   2> 1970071 ERROR (TEST-TestCloudPivotFacet.test-seed#[E8745FA6D96CE260]) [    ] o.a.s.u.StartupLoggingUtils Missing Java Option solr.log.dir. Logging may be missing or incomplete.
   [junit4]   2> 1970071 INFO  (TEST-TestCloudPivotFacet.test-seed#[E8745FA6D96CE260]) [    ] o.a.s.s.SolrDispatchFilter Using logger factory org.apache.logging.slf4j.Log4jLoggerFactory
   [junit4]   2> 1970071 INFO  (TEST-TestCloudPivotFacet.test-seed#[E8745FA6D96CE260]) [    ] o.a.s.s.SolrDispatchFilter  ___      _       Welcome to Apache Solr? version 7.6.0
   [junit4]   2> 1970072 INFO  (TEST-TestCloudPivotFacet.test-seed#[E8745FA6D96CE260]) [    ] o.a.s.s.SolrDispatchFilter / __| ___| |_ _   Starting in cloud mode on port null
   [junit4]   2> 1970072 INFO  (TEST-TestCloudPivotFacet.test-seed#[E8745FA6D96CE260]) [    ] o.a.s.s.SolrDispatchFilter \__ \/ _ \ | '_|  Install dir: null
   [junit4]   2> 1970072 INFO  (TEST-TestCloudPivotFacet.test-seed#[E8745FA6D96CE260]) [    ] o.a.s.s.SolrDispatchFilter |___/\___/_|_|    Start time: 2018-10-31T09:03:58.705Z
   [junit4]   2> 1970074 INFO  (zkConnectionManagerCallback-3796-thread-1) [    ] o.a.s.c.c.ConnectionManager zkClient has connected
   [junit4]   2> 1970075 INFO  (TEST-TestCloudPivotFacet.test-seed#[E8745FA6D96CE260]) [    ] o.a.s.s.SolrDispatchFilter Loading solr.xml from SolrHome (not found in ZooKeeper)
   [junit4]   2> 1970075 INFO  (TEST-TestCloudPivotFacet.test-seed#[E8745FA6D96CE260]) [    ] o.a.s.c.SolrXmlConfig Loading container configuration from /x1/jenkins/jenkins-slave/workspace/Lucene-Solr-NightlyTests-7.x/checkout/solr/build/solr-core/test/J1/temp/solr.cloud.TestCloudPivotFacet_E8745FA6D96CE260-001/control-001/solr.xml
   [junit4]   2> 1970080 INFO  (TEST-TestCloudPivotFacet.test-seed#[E8745FA6D96CE260]) [    ] o.a.s.c.SolrXmlConfig Configuration parameter autoReplicaFailoverWorkLoopDelay is ignored
   [junit4]   2> 1970080 INFO  (TEST-TestCloudPivotFacet.test-seed#[E8745FA6D96CE260]) [    ] o.a.s.c.SolrXmlConfig Configuration parameter autoReplicaFailoverBadNodeExpiration is ignored
   [junit4]   2> 1970082 INFO  (TEST-TestCloudPivotFacet.test-seed#[E8745FA6D96CE260]) [    ] o.a.s.c.SolrXmlConfig MBean server found: com.sun.jmx.mbeanserver.JmxMBeanServer@18fe091f, but no JMX reporters were configured - adding default JMX reporter.
   [junit4]   2> 1970202 INFO  (TEST-TestCloudPivotFacet.test-seed#[E8745FA6D96CE260]) [    ] o.a.s.c.ZkContainer Zookeeper client=127.0.0.1:43751/solr
   [junit4]   2> 1970203 INFO  (zkConnectionManagerCallback-3800-thread-1) [    ] o.a.s.c.c.ConnectionManager zkClient has connected
   [junit4]   2> 1970207 INFO  (zkConnectionManagerCallback-3802-thread-1) [    ] o.a.s.c.c.ConnectionManager zkClient has connected
   [junit4]   2> 1970304 INFO  (TEST-TestCloudPivotFacet.test-seed#[E8745FA6D96CE260]) [n:127.0.0.1:46634_    ] o.a.s.c.OverseerElectionContext I am going to be the leader 127.0.0.1:46634_
   [junit4]   2> 1970305 INFO  (TEST-TestCloudPivotFacet.test-seed#[E8745FA6D96CE260]) [n:127.0.0.1:46634_    ] o.a.s.c.Overseer Overseer (id=72195968331743236-127.0.0.1:46634_-n_0000000000) starting
   [junit4]   2> 1970313 INFO  (zkConnectionManagerCallback-3809-thread-1) [    ] o.a.s.c.c.ConnectionManager zkClient has connected
   [junit4]   2> 1970317 INFO  (TEST-TestCloudPivotFacet.test-seed#[E8745FA6D96CE260]) [n:127.0.0.1:46634_    ] o.a.s.c.s.i.ZkClientClusterStateProvider Cluster at 127.0.0.1:43751/solr ready
   [junit4]   2> 1970319 INFO  (TEST-TestCloudPivotFacet.test-seed#[E8745FA6D96CE260]) [n:127.0.0.1:46634_    ] o.a.s.c.ZkController Register node as live in ZooKeeper:/live_nodes/127.0.0.1:46634_
   [junit4]   2> 1970319 INFO  (OverseerStateUpdate-72195968331743236-127.0.0.1:46634_-n_0000000000) [n:127.0.0.1:46634_    ] o.a.s.c.Overseer Starting to work on the main queue : 127.0.0.1:46634_
   [junit4]   2> 1970336 INFO  (OverseerStateUpdate-72195968331743236-127.0.0.1:46634_-n_0000000000) [n:127.0.0.1:46634_    ] o.a.s.c.c.ZkStateReader Updated live nodes from ZooKeeper... (0) -> (1)
   [junit4]   2> 1970341 INFO  (zkCallback-3808-thread-1) [    ] o.a.s.c.c.ZkStateReader Updated live nodes from ZooKeeper... (0) -> (1)
   [junit4]   2> 1970358 INFO  (TEST-TestCloudPivotFacet.test-seed#[E8745FA6D96CE260]) [n:127.0.0.1:46634_    ] o.a.s.h.a.MetricsHistoryHandler No .system collection, keeping metrics history in memory.
   [junit4]   2> 1970386 INFO  (TEST-TestCloudPivotFacet.test-seed#[E8745FA6D96CE260]) [n:127.0.0.1:46634_    ] o.a.s.m.r.SolrJmxReporter JMX monitoring for 'solr.node' (registry 'solr.node') enabled at server: com.sun.jmx.mbeanserver.JmxMBeanServer@18fe091f
   [junit4]   2> 1970403 INFO  (TEST-TestCloudPivotFacet.test-seed#[E8745FA6D96CE260]) [n:127.0.0.1:46634_    ] o.a.s.m.r.SolrJmxReporter JMX monitoring for 'solr.jvm' (registry 'solr.jvm') enabled at server: com.sun.jmx.mbeanserver.JmxMBeanServer@18fe091f
   [junit4]   2> 1970403 INFO  (TEST-TestCloudPivotFacet.test-seed#[E8745FA6D96CE260]) [n:127.0.0.1:46634_    ] o.a.s.m.r.SolrJmxReporter JMX monitoring for 'solr.jetty' (registry 'solr.jetty') enabled at server: com.sun.jmx.mbeanserver.JmxMBeanServer@18fe091f
   [junit4]   2> 1970405 INFO  (TEST-TestCloudPivotFacet.test-seed#[E8745FA6D96CE260]) [n:127.0.0.1:46634_    ] o.a.s.c.CorePropertiesLocator Found 0 core definitions underneath /x1/jenkins/jenkins-slave/workspace/Lucene-Solr-NightlyTests-7.x/checkout/solr/build/solr-core/test/J1/../../../../../../../../../../../x1/jenkins/jenkins-slave/workspace/Lucene-Solr-NightlyTests-7.x/checkout/solr/build/solr-core/test/J1/temp/solr.cloud.TestCloudPivotFacet_E8745FA6D96CE260-001/control-001/cores
   [junit4]   2> 1970438 INFO  (zkConnectionManagerCallback-3815-thread-1) [    ] o.a.s.c.c.ConnectionManager zkClient has connected
   [junit4]   2> 1970439 INFO  (TEST-TestCloudPivotFacet.test-seed#[E8745FA6D96CE260]) [    ] o.a.s.c.c.ZkStateReader Updated live nodes from ZooKeeper... (0) -> (1)
   [junit4]   2> 1970440 INFO  (TEST-TestCloudPivotFacet.test-seed#[E8745FA6D96CE260]) [    ] o.a.s.c.s.i.ZkClientClusterStateProvider Cluster at 127.0.0.1:43751/solr ready
   [junit4]   2> 1970442 INFO  (qtp2043184068-14033) [n:127.0.0.1:46634_    ] o.a.s.h.a.CollectionsHandler Invoked Collection Action :create with params collection.configName=conf1&name=control_collection&nrtReplicas=1&action=CREATE&numShards=1&createNodeSet=127.0.0.1:46634_&wt=javabin&version=2 and sendToOCPQueue=true
   [junit4]   2> 1970446 INFO  (OverseerThreadFactory-5492-thread-1-processing-n:127.0.0.1:46634_) [n:127.0.0.1:46634_    ] o.a.s.c.a.c.CreateCollectionCmd Create collection control_collection
   [junit4]   2> 1970556 INFO  (qtp2043184068-14028) [n:127.0.0.1:46634_    ] o.a.s.s.HttpSolrCall [admin] webapp=null path=/admin/metrics params={prefix=CONTAINER.fs.usableSpace,CONTAINER.fs.totalSpace,CORE.coreName&wt=javabin&version=2&group=solr.node,solr.core} status=0 QTime=0
   [junit4]   2> 1970564 INFO  (qtp2043184068-14029) [n:127.0.0.1:46634_    x:control_collection_shard1_replica_n1] o.a.s.h.a.CoreAdminOperation core create command qt=/admin/cores&collection.configName=conf1&newCollection=true&name=control_collection_shard1_replica_n1&action=CREATE&numShards=1&collection=control_collection&shard=shard1&wt=javabin&version=2&replicaType=NRT
   [junit4]   2> 1970564 INFO  (qtp2043184068-14029) [n:127.0.0.1:46634_    x:control_collection_shard1_replica_n1] o.a.s.c.TransientSolrCoreCacheDefault Allocating transient cache for 4 transient cores
   [junit4]   2> 1971608 INFO  (qtp2043184068-14029) [n:127.0.0.1:46634_ c:control_collection s:shard1  x:control_collection_shard1_replica_n1] o.a.s.c.SolrConfig Using Lucene MatchVersion: 7.6.0
   [junit4]   2> 1971635 INFO  (qtp2043184068-14029) [n:127.0.0.1:46634_ c:control_collection s:shard1  x:control_collection_shard1_replica_n1] o.a.s.s.IndexSchema [control_collection_shard1_replica_n1] Schema name=test
   [junit4]   2> 1971828 INFO  (qtp2043184068-14029) [n:127.0.0.1:46634_ c:control_collection s:shard1  x:control_collection_shard1_replica_n1] o.a.s.s.IndexSchema Loaded schema test/1.0 with uniqueid field id
   [junit4]   2> 1971853 INFO  (qtp2043184068-14029) [n:127.0.0.1:46634_ c:control_collection s:shard1  x:control_collection_shard1_replica_n1] o.a.s.c.CoreContainer Creating SolrCore 'control_collection_shard1_replica_n1' using configuration from collection control_collection, trusted=true
   [junit4]   2> 1971854 INFO  (qtp2043184068-14029) [n:127.0.0.1:46634_ c:control_collection s:shard1  x:control_collection_shard1_replica_n1] o.a.s.m.r.SolrJmxReporter JMX monitoring for 'solr.core.control_collection.shard1.replica_n1' (registry 'solr.core.control_collection.shard1.replica_n1') enabled at server: com.sun.jmx.mbeanserver.JmxMBeanServer@18fe091f
   [junit4]   2> 1971854 INFO  (qtp2043184068-14029) [n:127.0.0.1:46634_ c:control_collection s:shard1  x:control_collection_shard1_replica_n1] o.a.s.c.SolrCore [[control_collection_shard1_replica_n1] ] Opening new SolrCore at [/x1/jenkins/jenkins-slave/workspace/Lucene-Solr-NightlyTests-7.x/checkout/solr/build/solr-core/test/J1/temp/solr.cloud.TestCloudPivotFacet_E8745FA6D96CE260-001/control-001/cores/control_collection_shard1_replica_n1], dataDir=[/x1/jenkins/jenkins-slave/workspace/Lucene-Solr-NightlyTests-7.x/checkout/solr/build/solr-core/test/J1/../../../../../../../../../../../x1/jenkins/jenkins-slave/workspace/Lucene-Solr-NightlyTests-7.x/checkout/solr/build/solr-core/test/J1/temp/solr.cloud.TestCloudPivotFacet_E8745FA6D96CE260-001/control-001/cores/control_collection_shard1_replica_n1/data/]
   [junit4]   2> 1971859 INFO  (qtp2043184068-14029) [n:127.0.0.1:46634_ c:control_collection s:shard1  x:control_collection_shard1_replica_n1] o.a.s.u.RandomMergePolicy RandomMergePolicy wrapping class org.apache.lucene.index.TieredMergePolicy: [TieredMergePolicy: maxMergeAtOnce=44, maxMergeAtOnceExplicit=25, maxMergedSegmentMB=35.2265625, floorSegmentMB=0.6015625, forceMergeDeletesPctAllowed=14.107885589266665, segmentsPerTier=18.0, maxCFSSegmentSizeMB=8.796093022207999E12, noCFSRatio=1.0, deletesPctAllowed=27.694887829024218
   [junit4]   2> 1971865 WARN  (qtp2043184068-14029) [n:127.0.0.1:46634_ c:control_collection s:shard1  x:control_collection_shard1_replica_n1] o.a.s.c.RequestHandlers INVALID paramSet a in requestHandler {type = requestHandler,name = /dump,class = DumpRequestHandler,attributes = {initParams=a, name=/dump, class=DumpRequestHandler},args = {defaults={a=A,b=B}}}
   [junit4]   2> 1971950 INFO  (qtp2043184068-14029) [n:127.0.0.1:46634_ c:control_collection s:shard1  x:control_collection_shard1_replica_n1] o.a.s.u.UpdateHandler Using UpdateLog implementation: org.apache.solr.update.UpdateLog
   [junit4]   2> 1971950 INFO  (qtp2043184068-14029) [n:127.0.0.1:46634_ c:control_collection s:shard1  x:control_collection_shard1_replica_n1] o.a.s.u.UpdateLog Initializing UpdateLog: dataDir= defaultSyncLevel=FLUSH numRecordsToKeep=100 maxNumLogsToKeep=10 numVersionBuckets=65536
   [junit4]   2> 1971952 INFO  (qtp2043184068-14029) [n:127.0.0.1:46634_ c:control_collection s:shard1  x:control_collection_shard1_replica_n1] o.a.s.u.CommitTracker Hard AutoCommit: disabled
   [junit4]   2> 1971952 INFO  (qtp2043184068-14029) [n:127.0.0.1:46634_ c:control_collection s:shard1  x:control_collection_shard1_replica_n1] o.a.s.u.CommitTracker Soft AutoCommit: disabled
   [junit4]   2> 1971955 INFO  (qtp2043184068-14029) [n:127.0.0.1:46634_ c:control_collection s:shard1  x:control_collection_shard1_replica_n1] o.a.s.u.RandomMergePolicy RandomMergePolicy wrapping class org.apache.lucene.index.TieredMergePolicy: [TieredMergePolicy: maxMergeAtOnce=6, maxMergeAtOnceExplicit=9, maxMergedSegmentMB=0.7294921875, floorSegmentMB=0.921875, forceMergeDeletesPctAllowed=7.396377397787985, segmentsPerTier=38.0, maxCFSSegmentSizeMB=8.796093022207999E12, noCFSRatio=0.7317311934972269, deletesPctAllowed=48.98606555317808
   [junit4]   2> 1971957 INFO  (qtp2043184068-14029) [n:127.0.0.1:46634_ c:control_collection s:shard1  x:control_collection_shard1_replica_n1] o.a.s.s.SolrIndexSearcher Opening [Searcher@352f4d3d[control_collection_shard1_replica_n1] main]
   [junit4]   2> 1971959 INFO  (qtp2043184068-14029) [n:127.0.0.1:46634_ c:control_collection s:shard1  x:control_collection_shard1_replica_n1] o.a.s.r.ManagedResourceStorage Configured ZooKeeperStorageIO with znodeBase: /configs/conf1
   [junit4]   2> 1971959 INFO  (qtp2043184068-14029) [n:127.0.0.1:46634_ c:control_collection s:shard1  x:control_collection_shard1_replica_n1] o.a.s.r.ManagedResourceStorage Loaded null at path _rest_managed.json using ZooKeeperStorageIO:path=/configs/conf1
   [junit4]   2> 1971960 INFO  (qtp2043184068-14029) [n:127.0.0.1:46634_ c:control_collection s:shard1  x:control_collection_shard1_replica_n1] o.a.s.h.ReplicationHandler Commits will be reserved for 10000ms.
   [junit4]   2> 1971962 INFO  (searcherExecutor-5497-thread-1-processing-n:127.0.0.1:46634_ x:control_collection_shard1_replica_n1 c:control_collection s:shard1) [n:127.0.0.1:46634_ c:control_collection s:shard1  x:control_collection_shard1_replica_n1] o.a.s.c.SolrCore [control_collection_shard1_replica_n1] Registered new searcher Searcher@352f4d3d[control_collection_shard1_replica_n1] main{ExitableDirectoryReader(UninvertingDirectoryReader())}
   [junit4]   2> 1971968 INFO  (qtp2043184068-14029) [n:127.0.0.1:46634_ c:control_collection s:shard1  x:control_collection_shard1_replica_n1] o.a.s.u.UpdateLog Could not find max version in index or recent updates, using new clock 1615831121894834176
   [junit4]   2> 1971976 INFO  (qtp2043184068-14029) [n:127.0.0.1:46634_ c:control_collection s:shard1  x:control_collection_shard1_replica_n1] o.a.s.c.ZkShardTerms Successful update of terms at /collections/control_collection/terms/shard1 to Terms{values={core_node2=0}, version=0}
   [junit4]   2> 1971979 INFO  (qtp2043184068-14029) [n:127.0.0.1:46634_ c:control_collection s:shard1  x:control_collection_shard1_replica_n1] o.a.s.c.ShardLeaderElectionContext Enough replicas found to continue.
   [junit4]   2> 1971979 INFO  (qtp2043184068-14029) [n:127.0.0.1:46634_ c:control_collection s:shard1  x:control_collection_shard1_replica_n1] o.a.s.c.ShardLeaderElectionContext I may be the new leader - try and sync
   [junit4]   2> 1971980 INFO  (qtp2043184068-14029) [n:127.0.0.1:46634_ c:control_collection s:shard1  x:control_collection_shard1_replica_n1] o.a.s.c.SyncStrategy Sync replicas to http://127.0.0.1:46634/control_collection_shard1_replica_n1/
   [junit4]   2> 1971980 INFO  (qtp2043184068-14029) [n:127.0.0.1:46634_ c:control_collection s:shard1  x:control_collection_shard1_replica_n1] o.a.s.c.SyncStrategy Sync Success - now sync replicas to me
   [junit4]   2> 1971980 INFO  (qtp2043184068-14029) [n:127.0.0.1:46634_ c:control_collection s:shard1  x:control_collection_shard1_replica_n1] o.a.s.c.SyncStrategy http://127.0.0.1:46634/control_collection_shard1_replica_n1/ has no replicas
   [junit4]   2> 1971980 INFO  (qtp2043184068-14029) [n:127.0.0.1:46634_ c:control_collection s:shard1  x:control_collection_shard1_replica_n1] o.a.s.c.ShardLeaderElectionContext Found all replicas participating in election, clear LIR
   [junit4]   2> 1971984 INFO  (qtp2043184068-14029) [n:127.0.0.1:46634_ c:control_collection s:shard1  x:control_collection_shard1_replica_n1] o.a.s.c.ShardLeaderElectionContext I am the new leader: http://127.0.0.1:46634/control_collection_shard1_replica_n1/ shard1
   [junit4]   2> 1972139 INFO  (qtp2043184068-14029) [n:127.0.0.1:46634_ c:control_collection s:shard1  x:control_collection_shard1_replica_n1] o.a.s.c.ZkController I am the leader, no recovery necessary
   [junit4]   2> 1972142 INFO  (qtp2043184068-14029) [n:127.0.0.1:46634_ c:control_collection s:shard1  x:control_collection_shard1_replica_n1] o.a.s.s.HttpSolrCall [admin] webapp=null path=/admin/cores params={qt=/admin/cores&collection.configName=conf1&newCollection=true&name=control_collection_shard1_replica_n1&action=CREATE&numShards=1&collection=control_collection&shard=shard1&wt=javabin&version=2&replicaType=NRT} status=0 QTime=1578
   [junit4]   2> 1972145 INFO  (qtp2043184068-14033) [n:127.0.0.1:46634_    ] o.a.s.h.a.CollectionsHandler Wait for new collection to be active for at most 30 seconds. Check all shard replicas
   [junit4]   2> 1972242 INFO  (zkCallback-3801-thread-1) [    ] o.a.s.c.c.ZkStateReader A cluster state change: [WatchedEvent state:SyncConnected type:NodeDataChanged path:/collections/control_collection/state.json] for collection [control_collection] has occurred - updating... (live nodes size: [1])
   [junit4]   2> 1972449 INFO  (OverseerCollectionConfigSetProcessor-72195968331743236-127.0.0.1:46634_-n_0000000000) [n:127.0.0.1:46634_    ] o.a.s.c.OverseerTaskQueue Response ZK path: /overseer/collection-queue-work/qnr-0000000000 doesn't exist.  Requestor may have disconnected from ZooKeeper
   [junit4]   2> 1973145 INFO  (qtp2043184068-14033) [n:127.0.0.1:46634_    ] o.a.s.s.HttpSolrCall [admin] webapp=null path=/admin/collections params={collection.configName=conf1&name=control_collection&nrtReplicas=1&action=CREATE&numShards=1&createNodeSet=127.0.0.1:46634_&wt=javabin&version=2} status=0 QTime=2703
   [junit4]   2> 1973152 INFO  (zkConnectionManagerCallback-3820-thread-1) [    ] o.a.s.c.c.ConnectionManager zkClient has connected
   [junit4]   2> 1973153 INFO  (TEST-TestCloudPivotFacet.test-seed#[E8745FA6D96CE260]) [    ] o.a.s.c.c.ZkStateReader Updated live nodes from ZooKeeper... (0) -> (1)
   [junit4]   2> 1973154 INFO  (TEST-TestCloudPivotFacet.test-seed#[E8745FA6D96CE260]) [    ] o.a.s.c.s.i.ZkClientClusterStateProvider Cluster at 127.0.0.1:43751/solr ready
   [junit4]   2> 1973154 INFO  (TEST-TestCloudPivotFacet.test-seed#[E8745FA6D96CE260]) [    ] o.a.s.c.ChaosMonkey monkey: init - expire sessions:false cause connection loss:false
   [junit4]   2> 1973155 INFO  (qtp2043184068-14032) [n:127.0.0.1:46634_    ] o.a.s.h.a.CollectionsHandler Invoked Collection Action :create with params collection.configName=conf1&name=collection1&nrtReplicas=1&action=CREATE&numShards=2&createNodeSet=&stateFormat=1&wt=javabin&version=2 and sendToOCPQueue=true
   [junit4]   2> 1973158 INFO  (OverseerThreadFactory-5492-thread-2-processing-n:127.0.0.1:46634_) [n:127.0.0.1:46634_    ] o.a.s.c.a.c.CreateCollectionCmd Create collection collection1
   [junit4]   2> 1973364 WARN  (OverseerThreadFactory-5492-thread-2-processing-n:127.0.0.1:46634_) [n:127.0.0.1:46634_    ] o.a.s.c.a.c.CreateCollectionCmd It is unusual to create a collection (collection1) without cores.
   [junit4]   2> 1973367 INFO  (qtp2043184068-14032) [n:127.0.0.1:46634_    ] o.a.s.h.a.CollectionsHandler Wait for new collection to be active for at most 30 seconds. Check all shard replicas
   [junit4]   2> 1973367 INFO  (qtp2043184068-14032) [n:127.0.0.1:46634_    ] o.a.s.s.HttpSolrCall [admin] webapp=null path=/admin/collections params={collection.configName=conf1&name=collection1&nrtReplicas=1&action=CREATE&numShards=2&createNodeSet=&stateFormat=1&wt=javabin&version=2} status=0 QTime=211
   [junit4]   2> 1973549 INFO  (TEST-TestCloudPivotFacet.test-seed#[E8745FA6D96CE260]) [    ] o.a.s.c.AbstractFullDistribZkTestBase create jetty 1 in directory /x1/jenkins/jenkins-slave/workspace/Lucene-Solr-NightlyTests-7.x/checkout/solr/build/solr-core/test/J1/temp/solr.cloud.TestCloudPivotFacet_E8745FA6D96CE260-001/shard-1-001 of type NRT
   [junit4]   2> 1973550 INFO  (TEST-TestCloudPivotFacet.test-seed#[E8745FA6D96CE260]) [    ] o.e.j.s.Server jetty-9.4.11.v20180605; built: 2018-06-05T18:24:03.829Z; git: d5fc0523cfa96bfebfbda19606cad384d772f04c; jvm 1.8.0_172-b11
   [junit4]   2> 1973551 INFO  (TEST-TestCloudPivotFacet.test-seed#[E8745FA6D96CE260]) [    ] o.e.j.s.session DefaultSessionIdManager workerName=node0
   [junit4]   2> 1973551 INFO  (TEST-TestCloudPivotFacet.test-seed#[E8745FA6D96CE260]) [    ] o.e.j.s.session No SessionScavenger set, using defaults
   [junit4]   2> 1973551 INFO  (TEST-TestCloudPivotFacet.test-seed#[E8745FA6D96CE260]) [    ] o.e.j.s.session node0 Scavenging every 660000ms
   [junit4]   2> 1973552 INFO  (TEST-TestCloudPivotFacet.test-seed#[E8745FA6D96CE260]) [    ] o.e.j.s.h.ContextHandler Started o.e.j.s.ServletContextHandler@4e05206a{/,null,AVAILABLE}
   [junit4]   2> 1973553 INFO  (TEST-TestCloudPivotFacet.test-seed#[E8745FA6D96CE260]) [    ] o.e.j.s.AbstractConnector Started ServerConnector@6fc5b35c{HTTP/1.1,[http/1.1]}{127.0.0.1:33700}
   [junit4]   2> 1973553 INFO  (TEST-TestCloudPivotFacet.test-seed#[E8745FA6D96CE260]) [    ] o.e.j.s.Server Started @1973646ms
   [junit4]   2> 1973553 INFO  (TEST-TestCloudPivotFacet.test-seed#[E8745FA6D96CE260]) [    ] o.a.s.c.s.e.JettySolrRunner Jetty properties: {solr.data.dir=/x1/jenkins/jenkins-slave/workspace/Lucene-Solr-NightlyTests-7.x/checkout/solr/build/solr-core/test/J1/temp/solr.cloud.TestCloudPivotFacet_E8745FA6D96CE260-001/tempDir-001/jetty1, replicaType=NRT, solrconfig=solrconfig.xml, hostContext=/, hostPort=33700, coreRootDirectory=/x1/jenkins/jenkins-slave/workspace/Lucene-Solr-NightlyTests-7.x/checkout/solr/build/solr-core/test/J1/temp/solr.cloud.TestCloudPivotFacet_E8745FA6D96CE260-001/shard-1-001/cores}
   [junit4]   2> 1973554 ERROR (TEST-TestCloudPivotFacet.test-seed#[E8745FA6D96CE260]) [    ] o.a.s.u.StartupLoggingUtils Missing Java Option solr.log.dir. Logging may be missing or incomplete.
   [junit4]   2> 1973554 INFO  (TEST-TestCloudPivotFacet.test-seed#[E8745FA6D96CE260]) [    ] o.a.s.s.SolrDispatchFilter Using logger factory org.apache.logging.slf4j.Log4jLoggerFactory
   [junit4]   2> 1973554 INFO  (TEST-TestCloudPivotFacet.test-seed#[E8745FA6D96CE260]) [    ] o.a.s.s.SolrDispatchFilter  ___      _       Welcome to Apache Solr? version 7.6.0
   [junit4]   2> 1973554 INFO  (TEST-TestCloudPivotFacet.test-seed#[E8745FA6D96CE260]) [    ] o.a.s.s.SolrDispatchFilter / __| ___| |_ _   Starting in cloud mode on port null
   [junit4]   2> 1973554 INFO  (TEST-TestCloudPivotFacet.test-seed#[E8745FA6D96CE260]) [    ] o.a.s.s.SolrDispatchFilter \__ \/ _ \ | '_|  Install dir: null
   [junit4]   2> 1973554 INFO  (TEST-TestCloudPivotFacet.test-seed#[E8745FA6D96CE260]) [    ] o.a.s.s.SolrDispatchFilter |___/\___/_|_|    Start time: 2018-10-31T09:04:02.187Z
   [junit4]   2> 1973556 INFO  (zkConnectionManagerCallback-3822-thread-1) [    ] o.a.s.c.c.ConnectionManager zkClient has connected
   [junit4]   2> 1973557 INFO  (TEST-TestCloudPivotFacet.test-seed#[E8745FA6D96CE260]) [    ] o.a.s.s.SolrDispatchFilter Loading solr.xml from SolrHome (not found in ZooKeeper)
   [junit4]   2> 1973557 INFO  (TEST-TestCloudPivotFacet.test-seed#[E8745FA6D96CE260]) [    ] o.a.s.c.SolrXmlConfig Loading container configuration from /x1/jenkins/jenkins-slave/workspace/Lucene-Solr-NightlyTests-7.x/checkout/solr/build/solr-core/test/J1/temp/solr.cloud.TestCloudPivotFacet_E8745FA6D96CE260-001/shard-1-001/solr.xml
   [junit4]   2> 1973562 INFO  (TEST-TestCloudPivotFacet.test-seed#[E8745FA6D96CE260]) [    ] o.a.s.c.SolrXmlConfig Configuration parameter autoReplicaFailoverWorkLoopDelay is ignored
   [junit4]   2> 1973562 INFO  (TEST-TestCloudPivotFacet.test-seed#[E8745FA6D96CE260]) [    ] o.a.s.c.SolrXmlConfig Configuration parameter autoReplicaFailoverBadNodeExpiration is ignored
   [junit4]   2> 1973564 INFO  (TEST-TestCloudPivotFacet.test-seed#[E8745FA6D96CE260]) [    ] o.a.s.c.SolrXmlConfig MBean server found: com.sun.jmx.mbeanserver.JmxMBeanServer@18fe091f, but no JMX reporters were configured - adding default JMX reporter.
   [junit4]   2> 1973928 INFO  (TEST-TestCloudPivotFacet.test-seed#[E8745FA6D96CE260]) [    ] o.a.s.c.ZkContainer Zookeeper client=127.0.0.1:43751/solr
   [junit4]   2> 1973930 INFO  (zkConnectionManagerCallback-3826-thread-1) [    ] o.a.s.c.c.ConnectionManager zkClient has connected
   [junit4]   2> 1973932 INFO  (zkConnectionManagerCallback-3828-thread-1) [    ] o.a.s.c.c.ConnectionManager zkClient has connected
   [junit4]   2> 1973941 INFO  (TEST-TestCloudPivotFacet.test-seed#[E8745FA6D96CE260]) [    ] o.a.s.c.c.ZkStateReader Updated live nodes from ZooKeeper... (0) -> (1)
   [junit4]   2> 1973946 INFO  (TEST-TestCloudPivotFacet.test-seed#[E8745FA6D96CE260]) [    ] o.a.s.c.TransientSolrCoreCacheDefault Allocating transient cache for 4 transient cores
   [junit4]   2> 1973946 INFO  (TEST-TestCloudPivotFacet.test-seed#[E8745FA6D96CE260]) [    ] o.a.s.c.ZkController Register node as live in ZooKeeper:/live_nodes/127.0.0.1:33700_
   [junit4]   2> 1973947 INFO  (zkCallback-3808-thread-1) [    ] o.a.s.c.c.ZkStateReader Updated live nodes from ZooKeeper... (1) -> (2)
   [junit4]   2> 1973947 INFO  (zkCallback-3801-thread-2) [    ] o.a.s.c.c.ZkStateReader Updated live nodes from ZooKeeper... (1) -> (2)
   [junit4]   2> 1973947 INFO  (zkCallback-3819-thread-1) [    ] o.a.s.c.c.ZkStateReader Updated live nodes from ZooKeeper... (1) -> (2)
   [junit4]   2> 1973948 INFO  (zkCallback-3827-thread-1) [    ] o.a.s.c.c.ZkStateReader Updated live nodes from ZooKeeper... (1) -> (2)
   [junit4]   2> 1973977 INFO  (zkConnectionManagerCallback-3835-thread-1) [    ] o.a.s.c.c.ConnectionManager zkClient has connected
   [junit4]   2> 1973978 INFO  (TEST-TestCloudPivotFacet.test-seed#[E8745FA6D96CE260]) [    ] o.a.s.c.c.ZkStateReader Updated live nodes from ZooKeeper... (0) -> (2)
   [junit4]   2> 1973979 INFO  (TEST-TestCloudPivotFacet.test-seed#[E8745FA6D96CE260]) [    ] o.a.s.c.s.i.ZkClientClusterStateProvider Cluster at 127.0.0.1:43751/solr ready
   [junit4]   2> 1973980 INFO  (TEST-TestCloudPivotFacet.test-seed#[E8745FA6D96CE260]) [    ] o.a.s.h.a.MetricsHistoryHandler No .system collection, keeping metrics history in memory.
   [junit4]   2> 1974009 INFO  (TEST-TestCloudPivotFacet.test-seed#[E8745FA6D96CE260]) [    ] o.a.s.m.r.SolrJmxReporter JMX monitoring for 'solr.node' (registry 'solr.node') enabled at server: com.sun.jmx.mbeanserver.JmxMBeanServer@18fe091f
   [junit4]   2> 1974027 INFO  (TEST-TestCloudPivotFacet.test-seed#[E8745FA6D96CE260]) [    ] o.a.s.m.r.SolrJmxReporter JMX monitoring for 'solr.jvm' (registry 'solr.jvm') enabled at server: com.sun.jmx.mbeanserver.JmxMBeanServer@18fe091f
   [junit4]   2> 1974027 INFO  (TEST-TestCloudPivotFacet.test-seed#[E8745FA6D96CE260]) [    ] o.a.s.m.r.SolrJmxReporter JMX monitoring for 'solr.jetty' (registry 'solr.jetty') enabled at server: com.sun.jmx.mbeanserver.JmxMBeanServer@18fe091f
   [junit4]   2> 1974030 INFO  (TEST-TestCloudPivotFacet.test-seed#[E8745FA6D96CE260]) [    ] o.a.s.c.CorePropertiesLocator Found 0 core definitions underneath /x1/jenkins/jenkins-slave/workspace/Lucene-Solr-NightlyTests-7.x/checkout/solr/build/solr-core/test/J1/temp/solr.cloud.TestCloudPivotFacet_E8745FA6D96CE260-001/shard-1-001/cores
   [junit4]   2> 1974073 INFO  (qtp502179821-14088) [n:127.0.0.1:33700_    ] o.a.s.h.a.CollectionsHandler Invoked Collection Action :addreplica with params node=127.0.0.1:33700_&action=ADDREPLICA&collection=collection1&shard=shard2&type=NRT&wt=javabin&version=2 and sendToOCPQueue=true
   [junit4]   2> 1974076 INFO  (OverseerCollectionConfigSetProcessor-72195968331743236-127.0.0.1:46634_-n_0000000000) [n:127.0.0.1:46634_    ] o.a.s.c.OverseerTaskQueue Response ZK path: /overseer/collection-queue-work/qnr-0000000002 doesn't exist.  Requestor may have disconnected from ZooKeeper
   [junit4]   2> 1974081 INFO  (qtp502179821-14083) [n:127.0.0.1:33700_    ] o.a.s.s.HttpSolrCall [admin] webapp=null path=/admin/metrics params={prefix=CONTAINER.fs.usableSpace,CONTAINER.fs.totalSpace,CORE.coreName&wt=javabin&version=2&group=solr.node,solr.core} status=0 QTime=2
   [junit4]   2> 1974085 INFO  (qtp2043184068-14028) [n:127.0.0.1:46634_    ] o.a.s.s.HttpSolrCall [admin] webapp=null path=/admin/metrics params={wt=javabin&version=2&key=solr.core.control_collection.shard1.replica_n1:INDEX.sizeInBytes} status=0 QTime=2
   [junit4]   2> 1974086 INFO  (qtp2043184068-14032) [n:127.0.0.1:46634_    ] o.a.s.s.HttpSolrCall [admin] webapp=null path=/admin/metrics params={prefix=CONTAINER.fs.usableSpace,CONTAINER.fs.totalSpace,CORE.coreName&wt=javabin&version=2&group=solr.node,solr.core} status=0 QTime=1
   [junit4]   2> 1974087 INFO  (OverseerThreadFactory-5492-thread-3-processing-n:127.0.0.1:46634_) [n:127.0.0.1:46634_ c:collection1 s:shard2  ] o.a.s.c.a.c.AddReplicaCmd Node Identified 127.0.0.1:33700_ for creating new replica of shard shard2 for collection collection1
   [junit4]   2> 1974092 INFO  (qtp502179821-14084) [n:127.0.0.1:33700_    x:collection1_shard2_replica_n41] o.a.s.h.a.CoreAdminOperation core create command qt=/admin/cores&collection.configName=conf1&name=collection1_shard2_replica_n41&action=CREATE&collection=collection1&shard=shard2&wt=javabin&version=2&replicaType=NRT
   [junit4]   2> 1975112 INFO  (qtp502179821-14084) [n:127.0.0.1:33700_ c:collection1 s:shard2  x:collection1_shard2_replica_n41] o.a.s.c.SolrConfig Using Lucene MatchVersion: 7.6.0
   [junit4]   2> 1975129 INFO  (qtp502179821-14084) [n:127.0.0.1:33700_ c:collection1 s:shard2  x:collection1_shard2_replica_n41] o.a.s.s.IndexSchema [collection1_shard2_replica_n41] Schema name=test
   [junit4]   2> 1975280 INFO  (qtp502179821-14084) [n:127.0.0.1:33700_ c:collection1 s:shard2  x:collection1_shard2_replica_n41] o.a.s.s.IndexSchema Loaded schema test/1.0 with uniqueid field id
   [junit4]   2> 1975298 INFO  (qtp502179821-14084) [n:127.0.0.1:33700_ c:collection1 s:shard2  x:collection1_shard2_replica_n41] o.a.s.c.CoreContainer Creating SolrCore 'collection1_shard2_replica_n41' using configuration from collection collection1, trusted=true
   [junit4]   2> 1975299 INFO  (qtp502179821-14084) [n:127.0.0.1:33700_ c:collection1 s:shard2  x:collection1_shard2_replica_n41] o.a.s.m.r.SolrJmxReporter JMX monitoring for 'solr.core.collection1.shard2.replica_n41' (registry 'solr.core.collection1.shard2.replica_n41') enabled at server: com.sun.jmx.mbeanserver.JmxMBeanServer@18fe091f
   [junit4]   2> 1975299 INFO  (qtp502179821-14084) [n:127.0.0.1:33700_ c:collection1 s:shard2  x:collection1_shard2_replica_n41] o.a.s.c.SolrCore [[collection1_shard2_replica_n41] ] Opening new SolrCore at [/x1/jenkins/jenkins-slave/workspace/Lucene-Solr-NightlyTests-7.x/checkout/solr/build/solr-core/test/J1/temp/solr.cloud.TestCloudPivotFacet_E8745FA6D96CE260-001/shard-1-001/cores/collection1_shard2_replica_n41], dataDir=[/x1/jenkins/jenkins-slave/workspace/Lucene-Solr-NightlyTests-7.x/checkout/solr/build/solr-core/test/J1/temp/solr.cloud.TestCloudPivotFacet_E8745FA6D96CE260-001/shard-1-001/cores/collection1_shard2_replica_n41/data/]
   [junit4]   2> 1975306 INFO  (qtp502179821-14084) [n:127.0.0.1:33700_ c:collection1 s:shard2  x:collection1_shard2_replica_n41] o.a.s.u.RandomMergePolicy RandomMergePolicy wrapping class org.apache.lucene.index.TieredMergePolicy: [TieredMergePolicy: maxMergeAtOnce=44, maxMergeAtOnceExplicit=25, maxMergedSegmentMB=35.2265625, floorSegmentMB=0.6015625, forceMergeDeletesPctAllowed=14.107885589266665, segmentsPerTier=18.0, maxCFSSegmentSizeMB=8.796093022207999E12, noCFSRatio=1.0, deletesPctAllowed=27.694887829024218
   [junit4]   2> 1975310 WARN  (qtp502179821-14084) [n:127.0.0.1:33700_ c:collection1 s:shard2  x:collection1_shard2_replica_n41] o.a.s.c.RequestHandlers INVALID paramSet a in requestHandler {type = requestHandler,name = /dump,class = DumpRequestHandler,attributes = {initParams=a, name=/dump, class=DumpRequestHandler},args = {defaults={a=A,b=B}}}
   [junit4]   2> 1975383 INFO  (qtp502179821-14084) [n:127.0.0.1:33700_ c:collection1 s:shard2  x:collection1_shard2_replica_n41] o.a.s.u.UpdateHandler Using UpdateLog implementation: org.apache.solr.update.UpdateLog
   [junit4]   2> 1975383 INFO  (qtp502179821-14084) [n:127.0.0.1:33700_ c:collection1 s:shard2  x:collection1_shard2_replica_n41] o.a.s.u.UpdateLog Initializing UpdateLog: dataDir= defaultSyncLevel=FLUSH numRecordsToKeep=100 maxNumLogsToKeep=10 numVersionBuckets=65536
   [junit4]   2> 1975385 INFO  (qtp502179821-14084) [n:127.0.0.1:33700_ c:collection1 s:shard2  x:collection1_shard2_replica_n41] o.a.s.u.CommitTracker Hard AutoCommit: disabled
   [junit4]   2> 1975385 INFO  (qtp502179821-14084) [n:127.0.0.1:33700_ c:collection1 s:shard2  x:collection1_shard2_replica_n41] o.a.s.u.CommitTracker Soft AutoCommit: disabled
   [junit4]   2> 1975387 INFO  (qtp502179821-14084) [n:127.0.0.1:33700_ c:collection1 s:shard2  x:collection1_shard2_replica_n41] o.a.s.u.RandomMergePolicy RandomMergePolicy wrapping class org.apache.lucene.index.TieredMergePolicy: [TieredMergePolicy: maxMergeAtOnce=6, maxMergeAtOnceExplicit=9, maxMergedSegmentMB=0.7294921875, floorSegmentMB=0.921875, forceMergeDeletesPctAllowed=7.396377397787985, segmentsPerTier=38.0, maxCFSSegmentSizeMB=8.796093022207999E12, noCFSRatio=0.7317311934972269, deletesPctAllowed=48.98606555317808
   [junit4]   2> 1975388 INFO  (qtp502179821-14084) [n:127.0.0.1:33700_ c:collection1 s:shard2  x:collection1_shard2_replica_n41] o.a.s.s.SolrIndexSearcher Opening [Searcher@3f1ba90e[collection1_shard2_replica_n41] main]
   [junit4]   2> 1975389 INFO  (qtp502179821-14084) [n:127.0.0.1:33700_ c:collection1 s:shard2  x:collection1_shard2_replica_n41] o.a.s.r.ManagedResourceStorage Configured ZooKeeperStorageIO with znodeBase: /configs/conf1
   [junit4]   2> 1975390 INFO  (qtp502179821-14084) [n:127.0.0.1:33700_ c:collection1 s:shard2  x:collection1_shard2_replica_n41] o.a.s.r.ManagedResourceStorage Loaded null at path _rest_managed.json using ZooKeeperStorageIO:path=/configs/conf1
   [junit4]   2> 1975391 INFO  (qtp502179821-14084) [n:127.0.0.1:33700_ c:collection1 s:shard2  x:collection1_shard2_replica_n41] o.a.s.h.ReplicationHandler Commits will be reserved for 10000ms.
   [junit4]   2> 1975392 INFO  (searcherExecutor-5511-thread-1-processing-n:127.0.0.1:33700_ x:collection1_shard2_replica_n41 c:collection1 s:shard2) [n:127.0.0.1:33700_ c:collection1 s:shard2  x:collection1_shard2_replica_n41] o.a.s.c.SolrCore [collection1_shard2_replica_n41] Registered new searcher Searcher@3f1ba90e[collection1_shard2_replica_n41] main{ExitableDirectoryReader(UninvertingDirectoryReader())}
   [junit4]   2> 1975392 INFO  (qtp502179821-14084) [n:127.0.0.1:33700_ c:collection1 s:shard2  x:collection1_shard2_replica_n41] o.a.s.u.UpdateLog Could not find max version in index or recent updates, using new clock 1615831125485158400
   [junit4]   2> 1975399 INFO  (qtp502179821-14084) [n:127.0.0.1:33700_ c:collection1 s:shard2  x:collection1_shard2_replica_n41] o.a.s.c.ZkShardTerms Successful update of terms at /collections/collection1/terms/shard2 to Terms{values={core_node42=0}, version=0}
   [junit4]   2> 1975402 INFO  (qtp502179821-14084) [n:127.0.0.1:33700_ c:collection1 s:shard2  x:collection1_shard2_replica_n41] o.a.s.c.ShardLeaderElectionContext Enough replicas found to continue.
   [junit4]   2> 1975402 INFO  (qtp502179821-14084) [n:127.0.0.1:33700_ c:collection1 s:shard2  x:collection1_shard2_replica_n41] o.a.s.c.ShardLeaderElectionContext I may be the new leader - try and sync
   [junit4]   2> 1975402 INFO  (qtp502179821-14084) [n:127.0.0.1:33700_ c:collection1 s:shard2  x:collection1_shard2_replica_n41] o.a.s.c.SyncStrategy Sync replicas to http://127.0.0.1:33700/collection1_shard2_replica_n41/
   [junit4]   2> 1975402 INFO  (qtp502179821-14084) [n:127.0.0.1:33700_ c:collection1 s:shard2  x:collection1_shard2_replica_n41] o.a.s.c.SyncStrategy Sync Success - now sync replicas to me
   [junit4]   2> 1975403 INFO  (qtp502179821-14084) [n:127.0.0.1:33700_ c:collection1 s:shard2  x:collection1_shard2_replica_n41] o.a.s.c.SyncStrategy http://127.0.0.1:33700/collection1_shard2_replica_n41/ has no replicas
   [junit4]   2> 1975403 INFO  (qtp502179821-14084) [n:127.0.0.1:33700_ c:collection1 s:shard2  x:collection1_shard2_replica_n41] o.a.s.c.ShardLeaderElectionContext Found all replicas participating in election, clear LIR
   [junit4]   2> 1975407 INFO  (qtp502179821-14084) [n:127.0.0.1:33700_ c:collection1 s:shard2  x:collection1_shard2_replica_n41] o.a.s.c.ShardLeaderElectionContext I am the new leader: http://127.0.0.1:33700/collection1_shard2_replica_n41/ shard2
   [junit4]   2> 1975559 INFO  (qtp502179821-14084) [n:127.0.0.1:33700_ c:collection1 s:shard2  x:collection1_shard2_replica_n41] o.a.s.c.ZkController I am the leader, no recovery necessary
   [junit4]   2> 1975562 INFO  (qtp502179821-14084) [n:127.0.0.1:33700_ c:collection1 s:shard2  x:collection1_shard2_replica_n41] o.a.s.s.HttpSolrCall [admin] webapp=null path=/admin/cores params={qt=/admin/cores&collection.configName=conf1&name=collection1_shard2_replica_n41&action=CREATE&collection=collection1&shard=shard2&wt=javabin&version=2&replicaType=NRT} status=0 QTime=1471
   [junit4]   2> 1975566 INFO  (qtp502179821-14088) [n:127.0.0.1:33700_ c:collection1   ] o.a.s.s.HttpSolrCall [admin] webapp=null path=/admin/collections params={node=127.0.0.1:33700_&action=ADDREPLICA&collection=collection1&shard=shard2&type=NRT&wt=javabin&version=2} status=0 QTime=1492
   [junit4]   2> 1975753 INFO  (TEST-TestCloudPivotFacet.test-seed#[E8745FA6D96CE260]) [    ] o.a.s.c.AbstractFullDistribZkTestBase create jetty 2 in directory /x1/jenkins/jenkins-slave/workspace/Lucene-Solr-NightlyTests-7.x/checkout/solr/build/solr-core/test/J1/temp/solr.cloud.TestCloudPivotFacet_E8745FA6D96CE260-001/shard-2-001 of type NRT
   [junit4]   2> 1975755 INFO  (TEST-TestCloudPivotFacet.test-seed#[E8745FA6D96CE260]) [    ] o.e.j.s.Server jetty-9.4.11.v20180605; built: 2018-06-05T18:24:03.829Z; git: d5fc0523cfa96bfebfbda19606cad384d772f04c; jvm 1.8.0_172-b11
   [junit4]   2> 1975757 INFO  (TEST-TestCloudPivotFacet.test-seed#[E8745FA6D96CE260]) [    ] o.e.j.s.session DefaultSessionIdManager workerName=node0
   [junit4]   2> 1975757 INFO  (TEST-TestCloudPivotFacet.test-seed#[E8745FA6D96CE260]) [    ] o.e.j.s.session No SessionScavenger set, using defaults
   [junit4]   2> 1975757 INFO  (TEST-TestCloudPivotFacet.test-seed#[E8745FA6D96CE260]) [    ] o.e.j.s.session node0 Scavenging every 660000ms
   [junit4]   2> 1975758 INFO  (TEST-TestCloudPivotFacet.test-seed#[E8745FA6D96CE260]) [    ] o.e.j.s.h.ContextHandler Started o.e.j.s.ServletContextHandler@7bfd2e5c{/,null,AVAILABLE}
   [junit4]   2> 1975760 INFO  (TEST-TestCloudPivotFacet.test-seed#[E8745FA6D96CE260]) [    ] o.e.j.s.AbstractConnector Started ServerConnector@4947e03d{HTTP/1.1,[http/1.1]}{127.0.0.1:37293}
   [junit4]   2> 1975760 INFO  (TEST-TestCloudPivotFacet.test-seed#[E8745FA6D96CE260]) [    ] o.e.j.s.Server Started @1975853ms
   [junit4]   2> 1975760 INFO  (TEST-TestCloudPivotFacet.test-seed#[E8745FA6D96CE260]) [    ] o.a.s.c.s.e.JettySolrRunner Jetty properties: {solr.data.dir=/x1/jenkins/jenkins-slave/workspace/Lucene-Solr-NightlyTests-7.x/checkout/solr/build/solr-core/test/J1/temp/solr.cloud.TestCloudPivotFacet_E8745FA6D96CE260-001/tempDir-001/jetty2, replicaType=NRT, solrconfig=solrconfig.xml, hostContext=/, hostPort=37293, coreRootDirectory=/x1/jenkins/jenkins-slave/workspace/Lucene-Solr-NightlyTests-7.x/checkout/solr/build/solr-core/test/J1/temp/solr.cloud.TestCloudPivotFacet_E8745FA6D96CE260-001/shard-2-001/cores}
   [junit4]   2> 1975760 ERROR (TEST-TestCloudPivotFacet.test-seed#[E8745FA6D96CE260]) [    ] o.a.s.u.StartupLoggingUtils Missing Java Option solr.log.dir. Logging may be missing or incomplete.
   [junit4]   2> 1975761 INFO  (TEST-TestCloudPivotFacet.test-seed#[E8745FA6D96CE260]) [    ] o.a.s.s.SolrDispatchFilter Using logger factory org.apache.logging.slf4j.Log4jLoggerFactory
   [junit4]   2> 1975761 INFO  (TEST-TestCloudPivotFacet.test-seed#[E8745FA6D96CE260]) [    ] o.a.s.s.SolrDispatchFilter  ___      _       Welcome to Apache Solr? version 7.6.0
   [junit4]   2> 1975761 INFO  (TEST-TestCloudPivotFacet.test-seed#[E8745FA6D96CE260]) [    ] o.a.s.s.SolrDispatchFilter / __| ___| |_ _   Starting in cloud mode on port null
   [junit4]   2> 1975761 INFO  (TEST-TestCloudPivotFacet.test-seed#[E8745FA6D96CE260]) [    ] o.a.s.s.SolrDispatchFilter \__ \/ _ \ | '_|  Install dir: null
   [junit4]   2> 1975761 INFO  (TEST-TestCloudPivotFacet.test-seed#[E8745FA6D96CE260]) [    ] o.a.s.s.SolrDispatchFilter |___/\___/_|_|    Start time: 2018-10-31T09:04:04.394Z
   [junit4]   2> 1975763 INFO  (zkConnectionManagerCallback-3838-thread-1) [    ] o.a.s.c.c.ConnectionManager zkClient has connected
   [junit4]   2> 1975764 INFO  (TEST-TestCloudPivotFacet.test-seed#[E8745FA6D96CE260]) [    ] o.a.s.s.SolrDispatchFilter Loading solr.xml from SolrHome (not found in ZooKeeper)
   [junit4]   2> 1975764 INFO  (TEST-TestCloudPivotFacet.test-seed#[E8745FA6D96CE260]) [    ] o.a.s.c.SolrXmlConfig Loading container configuration from /x1/jenkins/jenkins-slave/workspace/Lucene-Solr-NightlyTests-7.x/checkout/solr/build/solr-core/test/J1/temp/solr.cloud.TestCloudPivotFacet_E8745FA6D96CE260-001/shard-2-001/solr.xml
   [junit4]   2> 1975769 INFO  (TEST-TestCloudPivotFacet.test-seed#[E8745FA6D96CE260]) [    ] o.a.s.c.SolrXmlConfig Configuration parameter autoReplicaFailoverWorkLoopDelay is ignored
   [junit4]   2> 1975769 INFO  (TEST-TestCloudPivotFacet.test-seed#[E8745FA6D96CE260]) [    ] o.a.s.c.SolrXmlConfig Configuration parameter autoReplicaFailoverBadNodeExpiration is ignored
   [junit4]   2> 1975771 INFO  (TEST-TestCloudPivotFacet.test-seed#[E8745FA6D96CE260]) [    ] o.a.s.c.SolrXmlConfig MBean server found: com.sun.jmx.mbeanserver.JmxMBeanServer@18fe091f, but no JMX reporters were configured - adding default JMX reporter.
   [junit4]   2> 1975977 INFO  (TEST-TestCloudPivotFacet.test-seed#[E8745FA6D96CE260]) [    ] o.a.s.c.ZkContainer Zookeeper client=127.0.0.1:43751/solr
   [junit4]   2> 1975979 INFO  (zkConnectionManagerCallback-3842-thread-1) [    ] o.a.s.c.c.ConnectionManager zkClient has connected
   [junit4]   2> 1975982 INFO  (zkConnectionManagerCallback-3844-thread-1) [    ] o.a.s.c.c.ConnectionManager zkClient has connected
   [junit4]   2> 1975989 INFO  (TEST-TestCloudPivotFacet.test-seed#[E8745FA6D96CE260]) [    ] o.a.s.c.c.ZkStateReader Updated live nodes from ZooKeeper... (0) -> (2)
   [junit4]   2> 1975994 INFO  (TEST-TestCloudPivotFacet.test-seed#[E8745FA6D96CE260]) [    ] o.a.s.c.TransientSolrCoreCacheDefault Allocating transient cache for 4 transient cores
   [junit4]   2> 1975994 INFO  (TEST-TestCloudPivotFacet.test-seed#[E8745FA6D96CE260]) [    ] o.a.s.c.ZkController Register node as live in ZooKeeper:/live_nodes/127.0.0.1:37293_
   [junit4]   2> 1975996 INFO  (zkCallback-3834-thread-1) [    ] o.a.s.c.c.ZkStateReader Updated live nodes from ZooKeeper... (2) -> (3)
   [junit4]   2> 1975996 INFO  (zkCallback-3808-thread-1) [    ] o.a.s.c.c.ZkStateReader Updated live nodes from ZooKeeper... (2) -> (3)
   [junit4]   2> 1975996 INFO  (zkCallback-3819-thread-1) [    ] o.a.s.c.c.ZkStateReader Updated live nodes from ZooKeeper... (2) -> (3)
   [junit4]   2> 1975996 INFO  (zkCallback-3801-thread-2) [    ] o.a.s.c.c.ZkStateReader Updated live nodes from ZooKeeper... (2) -> (3)
   [junit4]   2> 1975996 INFO  (zkCallback-3827-thread-1) [    ] o.a.s.c.c.ZkStateReader Updated live nodes from ZooKeeper... (2) -> (3)
   [junit4]   2> 1975997 INFO  (zkCallback-3843-thread-1) [    ] o.a.s.c.c.ZkStateReader Updated live nodes from ZooKeeper... (2) -> (3)
   [junit4]   2> 1976025 INFO  (zkConnectionManagerCallback-3851-thread-1) [    ] o.a.s.c.c.ConnectionManager zkClient has connected
   [junit4]   2> 1976026 INFO  (TEST-TestCloudPivotFacet.test-seed#[E8745FA6D96CE260]) [    ] o.a.s.c.c.ZkStateReader Updated live nodes from ZooKeeper... (0) -> (3)
   [junit4]   2> 1976027 INFO  (TEST-TestCloudPivotFacet.test-seed#[E8745FA6D96CE260]) [    ] o.a.s.c.s.i.ZkClientClusterStateProvider Cluster at 127.0.0.1:43751/solr ready
   [junit4]   2> 1976028 INFO  (TEST-TestCloudPivotFacet.test-seed#[E8745FA6D96CE260]) [    ] o.a.s.h.a.MetricsHistoryHandler No .system collection, keeping metrics history in memory.
   [junit4]   2> 1976057 INFO  (TEST-TestCloudPivotFacet.test-seed#[E8745FA6D96CE260]) [    ] o.a.s.m.r.SolrJmxReporter JMX monitoring for 'solr.node' (registry 'solr.node') enabled at server: com.sun.jmx.mbeanserver.JmxMBeanServer@18fe091f
   [junit4]   2> 1976075 INFO  (TEST-TestCloudPivotFacet.test-seed#[E8745FA6D96CE260]) [    ] o.a.s.m.r.SolrJmxReporter JMX monitoring for 'solr.jvm' (registry 'solr.jvm') enabled at server: com.sun.jmx.mbeanserver.JmxMBeanServer@18fe091f
   [junit4]   2> 1976075 INFO  (TEST-TestCloudPivotFacet.test-seed#[E8745FA6D96CE260]) [    ] o.a.s.m.r.SolrJmxReporter JMX monitoring for 'solr.jetty' (registry 'solr.jetty') enabled at server: com.sun.jmx.mbeanserver.JmxMBeanServer@18fe091f
   [junit4]   2> 1976078 INFO  (TEST-TestCloudPivotFacet.test-seed#[E8745FA6D96CE260]) [    ] o.a.s.c.CorePropertiesLocator Found 0 core definitions underneath /x1/jenkins/jenkins-slave/workspace/Lucene-Solr-NightlyTests-7.x/checkout/solr/build/solr-core/test/J1/temp/solr.cloud.TestCloudPivotFacet_E8745FA6D96CE260-001/shard-2-001/cores
   [junit4]   2> 1976079 INFO  (OverseerCollectionConfigSetProcessor-72195968331743236-127.0.0.1:46634_-n_0000000000) [n:127.0.0.1:46634_    ] o.a.s.c.OverseerTaskQueue Response ZK path: /overseer/collection-queue-work/qnr-0000000004 doesn't exist.  Requestor may have disconnected from ZooKeeper
   [junit4]   2> 1976134 INFO  (qtp502179821-14090) [n:127.0.0.1:33700_    ] o.a.s.h.a.CollectionsHandler Invoked Collection Action :addreplica with params node=127.0.0.1:37293_&action=ADDREPLICA&collection=collection1&shard=shard1&type=NRT&wt=javabin&version=2 and sendToOCPQueue=true
   [junit4]   2> 1976140 INFO  (qtp502179821-14087) [n:127.0.0.1:33700_    ] o.a.s.s.HttpSolrCall [admin] webapp=null path=/admin/metrics params={wt=javabin&version=2&key=solr.core.collection1.shard2.replica_n41:INDEX.sizeInBytes} status=0 QTime=1
   [junit4]   2> 1976142 INFO  (qtp502179821-14083) [n:127.0.0.1:33700_    ] o.a.s.s.HttpSolrCall [admin] webapp=null path=/admin/metrics params={prefix=CONTAINER.fs.usableSpace,CONTAINER.fs.totalSpace,CORE.coreName&wt=javabin&version=2&group=solr.node,solr.core} status=0 QTime=0
   [junit4]   2> 1976144 INFO  (qtp490614089-14125) [n:127.0.0.1:37293_    ] o.a.s.s.HttpSolrCall [admin] webapp=null path=/admin/metrics params={prefix=CONTAINER.fs.usableSpace,CONTAINER.fs.totalSpace,CORE.coreName&wt=javabin&version=2&group=solr.node,solr.core} status=0 QTime=0
   [junit4]   2> 1976145 INFO  (qtp2043184068-14028) [n:127.0.0.1:46634_    ] o.a.s.s.HttpSolrCall [admin] webapp=null path=/admin/metrics params={wt=javabin&version=2&key=solr.core.control_collection.shard1.replica_n1:INDEX.sizeInBytes} status=0 QTime=0
   [junit4]   2> 1976146 INFO  (qtp2043184068-14032) [n:127.0.0.1:46634_    ] o.a.s.s.HttpSolrCall [admin] webapp=null path=/admin/metrics params={prefix=CONTAINER.fs.usableSpace,CONTAINER.fs.totalSpace,CORE.coreName&wt=javabin&version=2&group=solr.node,solr.core} status=0 QTime=0
   [junit4]   2> 1976146 INFO  (OverseerThreadFactory-5492-thread-4-processing-n:127.0.0.1:46634_) [n:127.0.0.1:46634_ c:collection1 s:shard1  ] o.a.s.c.a.c.AddReplicaCmd Node Identified 127.0.0.1:37293_ for creating new replica of shard shard1 for collection collection1
   [junit4]   2> 1976149 INFO  (qtp490614089-14120) [n:127.0.0.1:37293_    x:collection1_shard1_replica_n43] o.a.s.h.a.CoreAdminOperation core create command qt=/admin/cores&collection.configName=conf1&name=collection1_shard1_replica_n43&action=CREATE&collection=collection1&shard=shard1&wt=javabin&version=2&replicaType=NRT
   [junit4]   2> 1977168 INFO  (qtp490614089-14120) [n:127.0.0.1:37293_ c:collection1 s:shard1  x:collection1_shard1_replica_n43] o.a.s.c.SolrConfig Using Lucene MatchVersion: 7.6.0
   [junit4]   2> 1977186 INFO  (qtp490614089-14120) [n:127.0.0.1:37293_ c:collection1 s:shard1  x:collection1_shard1_replica_n43] o.a.s.s.IndexSchema [collection1_shard1_replica_n43] Schema name=test
   [junit4]   2> 1977328 INFO  (qtp490614089-14120) [n:127.0.0.1:37293_ c:collection1 s:shard1  x:collection1_shard1_replica_n43] o.a.s.s.IndexSchema Loaded schema test/1.0 with uniqueid field id
   [junit4]   2> 1977351 INFO  (qtp490614089-14120) [n:127.0.0.1:37293_ c:collection1 s:shard1  x:collection1_shard1_replica_n43] o.a.s.c.CoreContainer Creating SolrCore 'collection1_shard1_replica_n43' using configuration from collection collection1, trusted=true
   [junit4]   2> 1977352 INFO  (qtp490614089-14120) [n:127.0.0.1:37293_ c:collection1 s:shard1  x:collection1_shard1_replica_n43] o.a.s.m.r.SolrJmxReporter JMX monitoring for 'solr.core.collection1.shard1.replica_n43' (registry 'solr.core.collection1.shard1.replica_n43') enabled at server: com.sun.jmx.mbeanserver.JmxMBeanServer@18fe091f
   [junit4]   2> 1977353 INFO  (qtp490614089-14120) [n:127.0.0.1:37293_ c:collection1 s:shard1  x:collection1_shard1_replica_n43] o.a.s.c.SolrCore [[collection1_shard1_replica_n43] ] Opening new SolrCore at [/x1/jenkins/jenkins-slave/workspace/Lucene-Solr-NightlyTests-7.x/checkout/solr/build/solr-core/test/J1/temp/solr.cloud.TestCloudPivotFacet_E8745FA6D96CE260-001/shard-2-001/cores/collection1_shard1_replica_n43], dataDir=[/x1/jenkins/jenkins-slave/workspace/Lucene-Solr-NightlyTests-7.x/checkout/solr/build/solr-core/test/J1/temp/solr.cloud.TestCloudPivotFacet_E8745FA6D96CE260-001/shard-2-001/cores/collection1_shard1_replica_n43/data/]
   [junit4]   2> 1977358 INFO  (qtp490614089-14120) [n:127.0.0.1:37293_ c:collection1 s:shard1  x:collection1_shard1_replica_n43] o.a.s.u.RandomMergePolicy RandomMergePolicy wrapping class org.apache.lucene.index.TieredMergePolicy: [TieredMergePolicy: maxMergeAtOnce=44, maxMergeAtOnceExplicit=25, maxMergedSegmentMB=35.2265625, floorSegmentMB=0.6015625, forceMergeDeletesPctAllowed=14.107885589266665, segmentsPerTier=18.0, maxCFSSegmentSizeMB=8.796093022207999E12, noCFSRatio=1.0, deletesPctAllowed=27.694887829024218
   [junit4]   2> 1977362 WARN  (qtp490614089-14120) [n:127.0.0.1:37293_ c:collection1 s:shard1  x:collection1_shard1_replica_n43] o.a.s.c.RequestHandlers INVALID paramSet a in requestHandler {type = requestHandler,name = /dump,class = DumpRequestHandler,attributes = {initParams=a, name=/dump, class=DumpRequestHandler},args = {defaults={a=A,b=B}}}
   [junit4]   2> 1977434 INFO  (qtp490614089-14120) [n:127.0.0.1:37293_ c:collection1 s:shard1  x:collection1_shard1_replica_n43] o.a.s.u.UpdateHandler Using UpdateLog implementation: org.apache.solr.update.UpdateLog
   [junit4]   2> 1977434 INFO  (qtp490614089-14120) [n:127.0.0.1:37293_ c:collection1 s:shard1  x:collection1_shard1_replica_n43] o.a.s.u.UpdateLog Initializing UpdateLog: dataDir= defaultSyncLevel=FLUSH numRecordsToKeep=100 maxNumLogsToKeep=10 numVersionBuckets=65536
   [junit4]   2> 1977436 INFO  (qtp490614089-14120) [n:127.0.0.1:37293_ c:collection1 s:shard1  x:collection1_shard1_replica_n43] o.a.s.u.CommitTracker Hard AutoCommit: disabled
   [junit4]   2> 1977436 INFO  (qtp490614089-14120) [n:127.0.0.1:37293_ c:collection1 s:shard1  x:collection1_shard1_replica_n43] o.a.s.u.CommitTracker Soft AutoCommit: disabled
   [junit4]   2> 1977438 INFO  (qtp490614089-14120) [n:127.0.0.1:37293_ c:collection1 s:shard1  x:collection1_shard1_replica_n43] o.a.s.u.RandomMergePolicy RandomMergePolicy wrapping class org.apache.lucene.index.TieredMergePolicy: [TieredMergePolicy: maxMergeAtOnce=6, maxMergeAtOnceExplicit=9, maxMergedSegmentMB=0.7294921875, floorSegmentMB=0.921875, forceMergeDeletesPctAllowed=7.396377397787985, segmentsPerTier=38.0, maxCFSSegmentSizeMB=8.796093022207999E12, noCFSRatio=0.7317311934972269, deletesPctAllowed=48.98606555317808
   [junit4]   2> 1977439 INFO  (qtp490614089-14120) [n:127.0.0.1:37293_ c:collection1 s:shard1  x:collection1_shard1_replica_n43] o.a.s.s.SolrIndexSearcher Opening [Searcher@35041ba[collection1_shard1_replica_n43] main]
   [junit4]   2> 1977440 INFO  (qtp490614089-14120) [n:127.0.0.1:37293_ c:collection1 s:shard1  x:collection1_shard1_replica_n43] o.a.s.r.ManagedResourceStorage Configured ZooKeeperStorageIO with znodeBase: /configs/conf1
   [junit4]   2> 1977441 INFO  (qtp490614089-14120) [n:127.0.0.1:37293_ c:collection1 s:shard1  x:collection1_shard1_replica_n43] o.a.s.r.ManagedResourceStorage Loaded null at path _rest_managed.json using ZooKeeperStorageIO:path=/configs/conf1
   [junit4]   2> 1977442 INFO  (qtp490614089-14120) [n:127.0.0.1:37293_ c:collection1 s:shard1  x:collection1_shard1_replica_n43] o.a.s.h.ReplicationHandler Commits will be reserved for 10000ms.
   [junit4]   2> 1977442 INFO  (qtp490614089-14120) [n:127.0.0.1:37293_ c:collection1 s:shard1  x:collection1_shard1_replica_n43] o.a.s.u.UpdateLog Could not find max version in index or recent updates, using new clock 1615831127634739200
   [junit4]   2> 1977443 INFO  (searcherExecutor-5525-thread-1-processing-n:127.0.0.1:37293_ x:collection1_shard1_replica_n43 c:collection1 s:shard1) [n:127.0.0.1:37293_ c:collection1 s:shard1  x:collection1_shard1_replica_n43] o.a.s.c.SolrCore [collection1_shard1_replica_n43] Registered new searcher Searcher@35041ba[collection1_shard1_replica_n43] main{ExitableDirectoryReader(UninvertingDirectoryReader())}
   [junit4]   2> 1977447 INFO  (qtp490614089-14120) [n:127.0.0.1:37293_ c:collection1 s:shard1  x:collection1_shard1_replica_n43] o.a.s.c.ZkShardTerms Successful update of terms at /collections/collection1/terms/shard1 to Terms{values={core_node44=0}, version=0}
   [junit4]   2> 1977450 INFO  (qtp490614089-14120) [n:127.0.0.1:37293_ c:collection1 s:shard1  x:collection1_shard1_replica_n43] o.a.s.c.ShardLeaderElectionContext Enough replicas found to continue.
   [junit4]   2> 1977450 INFO  (qtp490614089-14120) [n:127.0.0.1:37293_ c:collection1 s:shard1  x:collection1_shard1_replica_n43] o.a.s.c.ShardLeaderElectionContext I may be the new leader - try and sync
   [junit4]   2> 1977450 INFO  (qtp490614089-14120) [n:127.0.0.1:37293_ c:collection1 s:shard1  x:collection1_shard1_replica_n43] o.a.s.c.SyncStrategy Sync replicas to http://127.0.0.1:37293/collection1_shard1_replica_n43/
   [junit4]   2> 1977450 INFO  (qtp490614089-14120) [n:127.0.0.1:37293_ c:collection1 s:shard1  x:collection1_shard1_replica_n43] o.a.s.c.SyncStrategy Sync Success - now sync replicas to me
   [junit4]   2> 1977450 INFO  (qtp490614089-14120) [n:127.0.0.1:37293_ c:collection1 s:shard1  x:collection1_shard1_replica_n43] o.a.s.c.SyncStrategy http://127.0.0.1:37293/collection1_shard1_replica_n43/ has no replicas
   [junit4]   2> 1977450 INFO  (qtp490614089-14120) [n:127.0.0.1:37293_ c:collection1 s:shard1  x:collection1_shard1_replica_n43] o.a.s.c.ShardLeaderElectionContext Found all replicas participating in election, clear LIR
   [junit4]   2> 1977454 INFO  (qtp490614089-14120) [n:127.0.0.1:37293_ c:collection1 s:shard1  x:collection1_shard1_replica_n43] o.a.s.c.ShardLeaderElectionContext I am the new leader: http://127.0.0.1:37293/collection1_shard1_replica_n43/ shard1
   [junit4]   2> 1977557 INFO  (qtp490614089-14120) [n:127.0.0.1:37293_ c:collection1 s:shard1  x:collection1_shard1_replica_n43] o.a.s.c.ZkController I am the leader, no recovery necessary
   [junit4]   2> 1977562 INFO  (qtp490614089-14120) [n:127.0.0.1:37293_ c:collection1 s:shard1  x:collection1_shard1_replica_n43] o.a.s.s.HttpSolrCall [admin] webapp=null path=/admin/cores params={qt=/admin/cores&collection.configName=conf1&name=collection1_shard1_replica_n43&action=CREATE&collection=collection1&shard=shard1&wt=javabin&version=2&replicaType=NRT} status=0 QTime=1412
   [junit4]   2> 1977564 INFO  (qtp502179821-14090) [n:127.0.0.1:33700_ c:collection1   ] o.a.s.s.HttpSolrCall [admin] webapp=null path=/admin/collections params={node=127.0.0.1:37293_&action=ADDREPLICA&collection=collection1&shard=shard1&type=NRT&wt=javabin&version=2} status=0 QTime=1430
   [junit4]   2> 1977745 INFO  (TEST-TestCloudPivotFacet.test-seed#[E8745FA6D96CE260]) [    ] o.a.s.c.AbstractFullDistribZkTestBase create jetty 3 in directory /x1/jenkins/jenkins-slave/workspace/Lucene-Solr-NightlyTests-7.x/checkout/solr/build/solr-core/test/J1/temp/solr.cloud.TestCloudPivotFacet_E8745FA6D96CE260-001/shard-3-001 of type NRT
   [junit4]   2> 1977746 INFO  (TEST-TestCloudPivotFacet.test-seed#[E8745FA6D96CE260]) [    ] o.e.j.s.Server jetty-9.4.11.v20180605; built: 2018-06-05T18:24:03.829Z; git: d5fc0523cfa96bfebfbda19606cad384d772f04c; jvm 1.8.0_172-b11
   [junit4]   2> 1977748 INFO  (TEST-TestCloudPivotFacet.test-seed#[E8745FA6D96CE260]) [    ] o.e.j.s.session DefaultSessionIdManager workerName=node0
   [junit4]   2> 1977748 INFO  (TEST-TestCloudPivotFacet.test-seed#[E8745FA6D96CE260]) [    ] o.e.j.s.session No SessionScavenger set, using defaults
   [junit4]   2> 1977748 INFO  (TEST-TestCloudPivotFacet.test-seed#[E8745FA6D96CE260]) [    ] o.e.j.s.session node0 Scavenging every 600000ms
   [junit4]   2> 1977748 INFO  (TEST-TestCloudPivotFacet.test-seed#[E8745FA6D96CE260]) [    ] o.e.j.s.h.ContextHandler Started o.e.j.s.ServletContextHandler@6489f990{/,null,AVAILABLE}
   [junit4]   2> 1977749 INFO  (TEST-TestCloudPivotFacet.test-seed#[E8745FA6D96CE260]) [    ] o.e.j.s.AbstractConnector Started ServerConnector@6b364fcb{HTTP/1.1,[http/1.1]}{127.0.0.1:38180}
   [junit4]   2> 1977749 INFO  (TEST-TestCloudPivotFacet.test-seed#[E8745FA6D96CE260]) [    ] o.e.j.s.Server Started @1977841ms
   [junit4]   2> 1977749 INFO  (TEST-TestCloudPivotFacet.test-seed#[E8745FA6D96CE260]) [    ] o.a.s.c.s.e.JettySolrRunner Jetty properties: {solr.data.dir=/x1/jenkins/jenkins-slave/workspace/Lucene-Solr-NightlyTests-7.x/checkout/solr/build/solr-core/test/J1/temp/solr.cloud.TestCloudPivotFacet_E8745FA6D96CE260-001/tempDir-001/jetty3, replicaType=NRT, solrconfig=solrconfig.xml, hostContext=/, hostPort=38180, coreRootDirectory=/x1/jenkins/jenkins-slave/workspace/Lucene-Solr-NightlyTests-7.x/checkout/solr/build/solr-core/test/J1/../../../../../../../../../../../x1/jenkins/jenkins-slave/workspace/Lucene-Solr-NightlyTests-7.x/checkout/solr/build/solr-core/test/J1/temp/solr.cloud.TestCloudPivotFacet_E8745FA6D96CE260-001/shard-3-001/cores}
   [junit4]   2> 1977749 ERROR (TEST-TestCloudPivotFacet.test-seed#[E8745FA6D96CE260]) [    ] o.a.s.u.StartupLoggingUtils Missing Java Option solr.log.dir. Logging may be missing or incomplete.
   [junit4]   2> 1977749 INFO  (TEST-TestCloudPivotFacet.test-seed#[E8745FA6D96CE260]) [    ] o.a.s.s.SolrDispatchFilter Using logger factory org.apache.logging.slf4j.Log4jLoggerFactory
   [junit4]   2> 1977749 INFO  (TEST-TestCloudPivotFacet.test-seed#[E8745FA6D96CE260]) [    ] o.a.s.s.SolrDispatchFilter  ___      _       Welcome to Apache Solr? version 7.6.0
   [junit4]   2> 1977749 INFO  (TEST-TestCloudPivotFacet.test-seed#[E8745FA6D96CE260]) [    ] o.a.s.s.SolrDispatchFilter / __| ___| |_ _   Starting in cloud mode on port null
   [junit4]   2> 1977749 INFO  (TEST-TestCloudPivotFacet.test-seed#[E8745FA6D96CE260]) [    ] o.a.s.s.SolrDispatchFilter \__ \/ _ \ | '_|  Install dir: null
   [junit4]   2> 1977749 INFO  (TEST-TestCloudPivotFacet.test-seed#[E8745FA6D96CE260]) [    ] o.a.s.s.SolrDispatchFilter |___/\___/_|_|    Start time: 2018-10-31T09:04:06.382Z
   [junit4]   2> 1977754 INFO  (zkConnectionManagerCallback-3854-thread-1) [    ] o.a.s.c.c.ConnectionManager zkClient has connected
   [junit4]   2> 1977755 INFO  (TEST-TestCloudPivotFacet.test-seed#[E8745FA6D96CE260]) [    ] o.a.s.s.SolrDispatchFilter Loading solr.xml from SolrHome (not found in ZooKeeper)
   [junit4]   2> 1977755 INFO  (TEST-TestCloudPivotFacet.test-seed#[E8745FA6D96CE260]) [    ] o.a.s.c.SolrXmlConfig Loading container configuration from /x1/jenkins/jenkins-slave/workspace/Lucene-Solr-NightlyTests-7.x/checkout/solr/build/solr-core/test/J1/temp/solr.cloud.TestCloudPivotFacet_E8745FA6D96CE260-001/shard-3-001/solr.xml
   [junit4]   2> 1977760 INFO  (TEST-TestCloudPivotFacet.test-seed#[E8745FA6D96CE260]) [    ] o.a.s.c.SolrXmlConfig Configuration parameter autoReplicaFailoverWorkLoopDelay is ignored
   [junit4]   2> 1977760 INFO  (TEST-TestCloudPivotFacet.test-seed#[E8745FA6D96CE260]) [    ] o.a.s.c.SolrXmlConfig Configuration parameter autoReplicaFailoverBadNodeExpiration is ignored
   [junit4]   2> 1977762 INFO  (TEST-TestCloudPivotFacet.test-seed#[E8745FA6D96CE260]) [    ] o.a.s.c.SolrXmlConfig MBean server found: com.sun.jmx.mbeanserver.JmxMBeanServer@18fe091f, but no JMX reporters were configured - adding default JMX reporter.
   [junit4]   2> 1977878 INFO  (TEST-TestCloudPivotFacet.test-seed#[E8745FA6D96CE260]) [    ] o.a.s.c.ZkContainer Zookeeper client=127.0.0.1:43751/solr
   [junit4]   2> 1977880 INFO  (zkConnectionManagerCallback-3858-thread-1) [    ] o.a.s.c.c.ConnectionManager zkClient has connected
   [junit4]   2> 1977883 INFO  (zkConnectionManagerCallback-3860-thread-1) [    ] o.a.s.c.c.ConnectionManager zkClient has connected
   [junit4]   2> 1977890 INFO  (TEST-TestCloudPivotFacet.test-seed#[E8745FA6D96CE260]) [    ] o.a.s.c.c.ZkStateReader Updated live nodes from ZooKeeper... (0) -> (3)
   [junit4]   2> 1977900 INFO  (TEST-TestCloudPivotFacet.test-seed#[E8745FA6D96CE260]) [    ] o.a.s.c.TransientSolrCoreCacheDefault Allocating transient cache for 4 transient cores
   [junit4]   2> 1977900 INFO  (TEST-TestCloudPivotFacet.test-seed#[E8745FA6D96CE260]) [    ] o.a.s.c.ZkController Register node as live in ZooKeeper:/live_nodes/127.0.0.1:38180_
   [junit4]   2> 1977901 INFO  (zkCallback-3819-thread-1) [    ] o.a.s.c.c.ZkStateReader Updated live nodes from ZooKeeper... (3) -> (4)
   [junit4]   2> 1977902 INFO  (zkCallback-3843-thread-1) [    ] o.a.s.c.c.ZkStateReader Updated live nodes from ZooKeeper... (3) -> (4)
   [junit4]   2> 1977902 INFO  (zkCallback-3808-thread-1) [    ] o.a.s.c.c.ZkStateReader Updated live nodes from ZooKeeper... (3) -> (4)
   [junit4]   2> 1977902 INFO  (zkCallback-3834-thread-1) [    ] o.a.s.c.c.ZkStateReader Updated live nodes from ZooKeeper... (3) -> (4)
   [junit4]   2> 1977902 INFO  (zkCallback-3801-thread-2) [    ] o.a.s.c.c.ZkStateReader Updated live nodes from ZooKeeper... (3) -> (4)
   [junit4]   2> 1977902 INFO  (zkCallback-3850-thread-1) [    ] o.a.s.c.c.ZkStateReader Updated live nodes from ZooKeeper... (3) -> (4)
   [junit4]   2> 1977903 INFO  (zkCallback-3859-thread-1) [    ] o.a.s.c.c.ZkStateReader Updated live nodes from ZooKeeper... (3) -> (4)
   [junit4]   2> 1977903 INFO  (zkCallback-3827-thread-1) [    ] o.a.s.c.c.ZkStateReader Updated live nodes from ZooKeeper... (3) -> (4)
   [junit4]   2> 1977934 INFO  (zkConnectionManagerCallback-3867-thread-1) [    ] o.a.s.c.c.ConnectionManager zkClient has connected
   [junit4]   2> 1977935 INFO  (TEST-TestCloudPivotFacet.test-seed#[E8745FA6D96CE260]) [    ] o.a.s.c.c.ZkStateReader Updated live nodes from ZooKeeper... (0) -> (4)
   [junit4]   2> 1977937 INFO  (TEST-TestCloudPivotFacet.test-seed#[E8745FA6D96CE260]) [    ] o.a.s.c.s.i.ZkClientClusterStateProvider Cluster at 127.0.0.1:43751/solr ready
   [junit4]   2> 1977937 INFO  (TEST-TestCloudPivotFacet.test-seed#[E8745FA6D96CE260]) [    ] o.a.s.h.a.MetricsHistoryHandler No .system collection, keeping metrics history in memory.
   [junit4]   2> 1977967 INFO  (TEST-TestCloudPivotFacet.test-seed#[E8745FA6D96CE260]) [    ] o.a.s.m.r.SolrJmxReporter JMX monitoring for 'solr.node' (registry 'solr.node') enabled at server: com.sun.jmx.mbeanserver.JmxMBeanServer@18fe091f
   [junit4]   2> 1977985 INFO  (TEST-TestCloudPivotFacet.test-seed#[E8745FA6D96CE260]) [    ] o.a.s.m.r.SolrJmxReporter JMX monitoring for 'solr.jvm' (registry 'solr.jvm') enabled at server: com.sun.jmx.mbeanserver.JmxMBeanServer@18fe091f
   [junit4]   2> 1977986 INFO  (TEST-TestCloudPivotFacet.test-seed#[E8745FA6D96CE260]) [    ] o.a.s.m.r.SolrJmxReporter JMX monitoring for 'solr.jetty' (registry 'solr.jetty') enabled at server: com.sun.jmx.mbeanserver.JmxMBeanServer@18fe091f
   [junit4]   2> 1977988 INFO  (TEST-TestCloudPivotFacet.test-seed#[E8745FA6D96CE260]) [    ] o.a.s.c.CorePropertiesLocator Found 0 core definitions underneath /x1/jenkins/jenkins-slave/workspace/Lucene-Solr-NightlyTests-7.x/checkout/solr/build/solr-core/test/J1/../../../../../../../../../../../x1/jenkins/jenkins-slave/workspace/Lucene-Solr-NightlyTests-7.x/checkout/solr/build/solr-core/test/J1/temp/solr.cloud.TestCloudPivotFacet_E8745FA6D96CE260-001/shard-3-001/cores
   [junit4]   2> 1978078 INFO  (qtp502179821-14089) [n:127.0.0.1:33700_    ] o.a.s.h.a.CollectionsHandler Invoked Collection Action :addreplica with params node=127.0.0.1:38180_&action=ADDREPLICA&collection=collection1&shard=shard2&type=NRT&wt=javabin&version=2 and sendToOCPQueue=true
   [junit4]   2> 1978081 INFO  (OverseerCollectionConfigSetProcessor-72195968331743236-127.0.0.1:46634_-n_0000000000) [n:127.0.0.1:46634_    ] o.a.s.c.OverseerTaskQueue Response ZK path: /overseer/collection-queue-work/qnr-0000000006 doesn't exist.  Requestor may have disconnected from ZooKeeper
   [junit4]   2> 1978084 INFO  (qtp502179821-14087) [n:127.0.0.1:33700_    ] o.a.s.s.HttpSolrCall [admin] webapp=null path=/admin/metrics params={wt=javabin&version=2&key=solr.core.collection1.shard2.replica_n41:INDEX.sizeInBytes} status=0 QTime=0
   [junit4]   2> 1978085 INFO  (qtp502179821-14083) [n:127.0.0.1:33700_    ] o.a.s.s.HttpSolrCall [admin] webapp=null path=/admin/metrics params={prefix=CONTAINER.fs.usableSpace,CONTAINER.fs.totalSpace,CORE.coreName&wt=javabin&version=2&group=solr.node,solr.core} status=0 QTime=0
   [junit4]   2> 1978088 INFO  (qtp490614089-14121) [n:127.0.0.1:37293_    ] o.a.s.s.HttpSolrCall [admin] webapp=null path=/admin/metrics params={wt=javabin&version=2&key=solr.core.collection1.shard1.replica_n43:INDEX.sizeInBytes} status=0 QTime=1
   [junit4]   2> 1978089 INFO  (qtp490614089-14127) [n:127.0.0.1:37293_    ] o.a.s.s.HttpSolrCall [admin] webapp=null path=/admin/metrics params={prefix=CONTAINER.fs.usableSpace,CONTAINER.fs.totalSpace,CORE.coreName&wt=javabin&version=2&group=solr.node,solr.core} status=0 QTime=0
   [junit4]   2> 1978091 INFO  (qtp643415226-14162) [n:127.0.0.1:38180_    ] o.a.s.s.HttpSolrCall [admin] webapp=null path=/admin/metrics params={prefix=CONTAINER.fs.usableSpace,CONTAINER.fs.totalSpace,CORE.coreName&wt=javabin&version=2&group=solr.node,solr.core} status=0 QTime=0
   [junit4]   2> 1978092 INFO  (qtp2043184068-14028) [n:127.0.0.1:46634_    ] o.a.s.s.HttpSolrCall [admin] webapp=null path=/admin/metrics params={wt=javabin&version=2&key=solr.core.control_collection.shard1.replica_n1:INDEX.sizeInBytes} status=0 QTime=0
   [junit4]   2> 1978093 INFO  (qtp2043184068-14032) [n:127.0.0.1:46634_    ] o.a.s.s.HttpSolrCall [admin] webapp=null path=/admin/metrics params={prefix=CONTAINER.fs.usableSpace,CONTAINER.fs.totalSpace,CORE.coreName&wt=javabin&version=2&group=solr.node,solr.core} status=0 QTime=0
   [junit4]   2> 1978095 INFO  (qtp502179821-14087) [n:127.0.0.1:33700_    ] o.a.s.s.HttpSolrCall [admin] webapp=null path=/admin/metrics params={wt=javabin&version=2&key=solr.core.collection1.shard2.replica_n41:INDEX.sizeInBytes} status=0 QTime=0
   [junit4]   2> 1978096 INFO  (OverseerThreadFactory-5492-thread-5-processing-n:127.0.0.1:46634_) [n:127.0.0.1:46634_ c:collection1 s:shard2  ] o.a.s.c.a.c.AddReplicaCmd Node Identified 127.0.0.1:38180_ for creating new replica of shard shard2 for collection collection1
   [junit4]   2> 1978099 INFO  (qtp643415226-14157) [n:127.0.0.1:38180_    x:collection1_shard2_replica_n45] o.a.s.h.a.CoreAdminOperation core create command qt=/admin/cores&collection.configName=conf1&name=collection1_shard2_replica_n45&action=CREATE&collection=collection1&shard=shard2&wt=javabin&version=2&replicaType=NRT
   [junit4]   2> 1979125 INFO  (qtp643415226-14157) [n:127.0.0.1:38180_ c:collection1 s:shard2  x:collection1_shard2_replica_n45] o.a.s.c.SolrConfig Using Lucene MatchVersion: 7.6.0
   [junit4]   2> 1979141 INFO  (qtp643415226-14157) [n:127.0.0.1:38180_ c:collection1 s:shard2  x:collection1_shard2_replica_n45] o.a.s.s.IndexSchema [collection1_shard2_replica_n45] Schema name=test
   [junit4]   2> 1979293 INFO  (qtp643415226-14157) [n:127.0.0.1:38180_ c:collection1 s:shard2  x:collection1_shard2_replica_n45] o.a.s.s.IndexSchema Loaded schema test/1.0 with uniqueid field id
   [junit4]   2> 1979314 INFO  (qtp643415226-14157) [n:127.0.0.1:38180_ c:collection1 s:shard2  x:collection1_shard2_replica_n45] o.a.s.c.CoreContainer Creating SolrCore 'collection1_shard2_replica_n45' using configuration from collection collection1, trusted=true
   [junit4]   2> 1979323 INFO  (qtp643415226-14157) [n:127.0.0.1:38180_ c:collection1 s:shard2  x:collection1_shard2_replica_n45] o.a.s.m.r.SolrJmxReporter JMX monitoring for 'solr.core.collection1.shard2.replica_n45' (registry 'solr.core.collection1.shard2.replica_n45') enabled at server: com.sun.jmx.mbeanserver.JmxMBeanServer@18fe091f
   [junit4]   2> 1979324 INFO  (qtp643415226-14157) [n:127.0.0.1:38180_ c:collection1 s:shard2  x:collection1_shard2_replica_n45] o.a.s.c.SolrCore [[collection1_shard2_replica_n45] ] Opening new SolrCore at [/x1/jenkins/jenkins-slave/workspace/Lucene-Solr-NightlyTests-7.x/checkout/solr/build/solr-core/test/J1/temp/solr.cloud.TestCloudPivotFacet_E8745FA6D96CE260-001/shard-3-001/cores/collection1_shard2_replica_n45], dataDir=[/x1/jenkins/jenkins-slave/workspace/Lucene-Solr-NightlyTests-7.x/checkout/solr/build/solr-core/test/J1/../../../../../../../../../../../x1/jenkins/jenkins-slave/workspace/Lucene-Solr-NightlyTests-7.x/checkout/solr/build/solr-core/test/J1/temp/solr.cloud.TestCloudPivotFacet_E8745FA6D96CE260-001/shard-3-001/cores/collection1_shard2_replica_n45/data/]
   [junit4]   2> 1979329 INFO  (qtp643415226-14157) [n:127.0.0.1:38180_ c:collection1 s:shard2  x:collection1_shard2_replica_n45] o.a.s.u.RandomMergePolicy RandomMergePolicy wrapping class org.apache.lucene.index.TieredMergePolicy: [TieredMergePolicy: maxMergeAtOnce=44, maxMergeAtOnceExplicit=25, maxMergedSegmentMB=35.2265625, floorSegmentMB=0.6015625, forceMergeDeletesPctAllowed=14.107885589266665, segmentsPerTier=18.0, maxCFSSegmentSizeMB=8.796093022207999E12, noCFSRatio=1.0, deletesPctAllowed=27.694887829024218
   [junit4]   2> 1979333 WARN  (qtp643415226-14157) [n:127.0.0.1:38180_ c:collection1 s:shard2  x:collection1_shard2_replica_n45] o.a.s.c.RequestHandlers INVALID paramSet a in requestHandler {type = requestHandler,name = /dump,class = DumpRequestHandler,attributes = {initParams=a, name=/dump, class=DumpRequestHandler},args = {defaults={a=A,b=B}}}
   [junit4]   2> 1979405 INFO  (qtp643415226-14157) [n:127.0.0.1:38180_ c:collection1 s:shard2  x:collection1_shard2_replica_n45] o.a.s.u.UpdateHandler Using UpdateLog implementation: org.apache.solr.update.UpdateLog
   [junit4]   2> 1979405 INFO  (qtp643415226-14157) [n:127.0.0.1:38180_ c:collection1 s:shard2  x:collection1_shard2_replica_n45] o.a.s.u.UpdateLog Initializing UpdateLog: dataDir= defaultSyncLevel=FLUSH numRecordsToKeep=100 maxNumLogsToKeep=10 numVersionBuckets=65536
   [junit4]   2> 1979407 INFO  (qtp643415226-14157) [n:127.0.0.1:38180_ c:collection1 s:shard2  x:collection1_shard2_replica_n45] o.a.s.u.CommitTracker Hard AutoCommit: disabled
   [junit4]   2> 1979407 INFO  (qtp643415226-14157) [n:127.0.0.1:38180_ c:collection1 s:shard2  x:collection1_shard2_replica_n45] o.a.s.u.CommitTracker Soft AutoCommit: disabled
   [junit4]   2> 1979409 INFO  (qtp643415226-14157) [n:127.0.0.1:38180_ c:collection1 s:shard2  x:collection1_shard2_replica_n45] o.a.s.u.RandomMergePolicy RandomMergePolicy wrapping class org.apache.lucene.index.TieredMergePolicy: [TieredMergePolicy: maxMergeAtOnce=6, maxMergeAtOnceExplicit=9, maxMergedSegmentMB=0.7294921875, floorSegmentMB=0.921875, forceMergeDeletesPctAllowed=7.396377397787985, segmentsPerTier=38.0, maxCFSSegmentSizeMB=8.796093022207999E12, noCFSRatio=0.7317311934972269, deletesPctAllowed=48.98606555317808
   [junit4]   2> 1979410 INFO  (qtp643415226-14157) [n:127.0.0.1:38180_ c:collection1 s:shard2  x:collection1_shard2_replica_n45] o.a.s.s.SolrIndexSearcher Opening [Searcher@711642ac[collection1_shard2_replica_n45] main]
   [junit4]   2> 1979412 INFO  (qtp643415226-14157) [n:127.0.0.1:38180_ c:collection1 s:shard2  x:collection1_shard2_replica_n45] o.a.s.r.ManagedResourceStorage Configured ZooKeeperStorageIO with znodeBase: /configs/conf1
   [junit4]   2> 1979412 INFO  (qtp643415226-14157) [n:127.0.0.1:38180_ c:collection1 s:shard2  x:collection1_shard2_replica_n45] o.a.s.r.ManagedResourceStorage Loaded null at path _rest_managed.json using ZooKeeperStorageIO:path=/configs/conf1
   [junit4]   2> 1979413 INFO  (qtp643415226-14157) [n:127.0.0.1:38180_ c:collection1 s:shard2  x:collection1_shard2_replica_n45] o.a.s.h.ReplicationHandler Commits will be reserved for 10000ms.
   [junit4]   2> 1979413 INFO  (qtp643415226-14157) [n:127.0.0.1:38180_ c:collection1 s:shard2  x:collection1_shard2_replica_n45] o.a.s.u.UpdateLog Could not find max version in index or recent updates, using new clock 1615831129701482496
   [junit4]   2> 1979415 INFO  (searcherExecutor-5539-thread-1-processing-n:127.0.0.1:38180_ x:collection1_shard2_replica_n45 c:collection1 s:shard2) [n:127.0.0.1:38180_ c:collection1 s:shard2  x:collection1_shard2_replica_n45] o.a.s.c.SolrCore [collection1_shard2_replica_n45] Registered new searcher Searcher@711642ac[collection1_shard2_replica_n45] main{ExitableDirectoryReader(UninvertingDirectoryReader())}
   [junit4]   2> 1979422 INFO  (qtp643415226-14157) [n:127.0.0.1:38180_ c:collection1 s:shard2  x:collection1_shard2_replica_n45] o.a.s.c.ZkShardTerms Successful update of terms at /collections/collection1/terms/shard2 to Terms{values={core_node42=0, core_node46=0}, version=1}
   [junit4]   2> 1979424 INFO  (qtp643415226-14157) [n:127.0.0.1:38180_ c:collection1 s:shard2  x:collection1_shard2_replica_n45] o.a.s.c.ZkController Core needs to recover:collection1_shard2_replica_n45
   [junit4]   2> 1979424 INFO  (updateExecutor-3855-thread-1-processing-n:127.0.0.1:38180_ x:collection1_shard2_replica_n45 c:collection1 s:shard2) [n:127.0.0.1:38180_ c:collection1 s:shard2 r:core_node46 x:collection1_shard2_replica_n45] o.a.s.u.DefaultSolrCoreState Running recovery
   [junit4]   2> 1979425 INFO  (recoveryExecutor-3856-thread-1-processing-n:127.0.0.1:38180_ x:collection1_shard2_replica_n45 c:collection1 s:shard2 r:core_node46) [n:127.0.0.1:38180_ c:collection1 s:shard2 r:core_node46 x:collection1_shard2_replica_n45] o.a.s.c.RecoveryStrategy Starting recovery process. recoveringAfterStartup=true
   [junit4]   2> 1979426 INFO  (recoveryExecutor-3856-thread-1-processing-n:127.0.0.1:38180_ x:collection1_shard2_replica_n45 c:collection1 s:shard2 r:core_node46) [n:127.0.0.1:38180_ c:collection1 s:shard2 r:core_node46 x:collection1_shard2_replica_n45] o.a.s.c.RecoveryStrategy startupVersions is empty
   [junit4]   2> 1979427 INFO  (qtp643415226-14157) [n:127.0.0.1:38180_ c:collection1 s:shard2  x:collection1_shard2_replica_n45] o.a.s.s.HttpSolrCall [admin] webapp=null path=/admin/cores params={qt=/admin/co

[...truncated too long message...]

kout/lucene/top-level-ivy-settings.xml

resolve:

ivy-availability-check:
[loadresource] Do not set property disallowed.ivy.jars.list as its length is 0.

-ivy-fail-disallowed-ivy-version:

ivy-fail:

ivy-configure:
[ivy:configure] :: loading settings :: file = /x1/jenkins/jenkins-slave/workspace/Lucene-Solr-NightlyTests-7.x/checkout/lucene/top-level-ivy-settings.xml

resolve:

ivy-availability-check:
[loadresource] Do not set property disallowed.ivy.jars.list as its length is 0.

-ivy-fail-disallowed-ivy-version:

ivy-fail:

ivy-fail:

ivy-configure:
[ivy:configure] :: loading settings :: file = /x1/jenkins/jenkins-slave/workspace/Lucene-Solr-NightlyTests-7.x/checkout/lucene/top-level-ivy-settings.xml

resolve:

ivy-availability-check:
[loadresource] Do not set property disallowed.ivy.jars.list as its length is 0.

-ivy-fail-disallowed-ivy-version:

ivy-fail:

ivy-configure:
[ivy:configure] :: loading settings :: file = /x1/jenkins/jenkins-slave/workspace/Lucene-Solr-NightlyTests-7.x/checkout/lucene/top-level-ivy-settings.xml

resolve:

ivy-availability-check:
[loadresource] Do not set property disallowed.ivy.jars.list as its length is 0.

-ivy-fail-disallowed-ivy-version:

ivy-fail:

ivy-fail:

ivy-configure:
[ivy:configure] :: loading settings :: file = /x1/jenkins/jenkins-slave/workspace/Lucene-Solr-NightlyTests-7.x/checkout/lucene/top-level-ivy-settings.xml

resolve:

ivy-availability-check:
[loadresource] Do not set property disallowed.ivy.jars.list as its length is 0.

-ivy-fail-disallowed-ivy-version:

ivy-fail:

ivy-fail:

ivy-configure:
[ivy:configure] :: loading settings :: file = /x1/jenkins/jenkins-slave/workspace/Lucene-Solr-NightlyTests-7.x/checkout/lucene/top-level-ivy-settings.xml

resolve:

ivy-availability-check:
[loadresource] Do not set property disallowed.ivy.jars.list as its length is 0.

-ivy-fail-disallowed-ivy-version:

ivy-fail:

ivy-fail:

ivy-configure:
[ivy:configure] :: loading settings :: file = /x1/jenkins/jenkins-slave/workspace/Lucene-Solr-NightlyTests-7.x/checkout/lucene/top-level-ivy-settings.xml

resolve:

ivy-availability-check:
[loadresource] Do not set property disallowed.ivy.jars.list as its length is 0.

-ivy-fail-disallowed-ivy-version:

ivy-fail:

ivy-fail:

ivy-configure:
[ivy:configure] :: loading settings :: file = /x1/jenkins/jenkins-slave/workspace/Lucene-Solr-NightlyTests-7.x/checkout/lucene/top-level-ivy-settings.xml

resolve:

ivy-availability-check:
[loadresource] Do not set property disallowed.ivy.jars.list as its length is 0.

-ivy-fail-disallowed-ivy-version:

ivy-fail:

ivy-fail:

ivy-configure:
[ivy:configure] :: loading settings :: file = /x1/jenkins/jenkins-slave/workspace/Lucene-Solr-NightlyTests-7.x/checkout/lucene/top-level-ivy-settings.xml

resolve:

ivy-availability-check:
[loadresource] Do not set property disallowed.ivy.jars.list as its length is 0.

-ivy-fail-disallowed-ivy-version:

ivy-fail:

ivy-fail:

ivy-configure:
[ivy:configure] :: loading settings :: file = /x1/jenkins/jenkins-slave/workspace/Lucene-Solr-NightlyTests-7.x/checkout/lucene/top-level-ivy-settings.xml

resolve:

ivy-availability-check:
[loadresource] Do not set property disallowed.ivy.jars.list as its length is 0.

-ivy-fail-disallowed-ivy-version:

ivy-fail:

ivy-fail:

ivy-configure:
[ivy:configure] :: loading settings :: file = /x1/jenkins/jenkins-slave/workspace/Lucene-Solr-NightlyTests-7.x/checkout/lucene/top-level-ivy-settings.xml

resolve:

ivy-availability-check:
[loadresource] Do not set property disallowed.ivy.jars.list as its length is 0.

-ivy-fail-disallowed-ivy-version:

ivy-fail:

ivy-fail:

ivy-configure:
[ivy:configure] :: loading settings :: file = /x1/jenkins/jenkins-slave/workspace/Lucene-Solr-NightlyTests-7.x/checkout/lucene/top-level-ivy-settings.xml

resolve:

ivy-availability-check:
[loadresource] Do not set property disallowed.ivy.jars.list as its length is 0.

-ivy-fail-disallowed-ivy-version:

ivy-fail:

ivy-fail:

ivy-configure:
[ivy:configure] :: loading settings :: file = /x1/jenkins/jenkins-slave/workspace/Lucene-Solr-NightlyTests-7.x/checkout/lucene/top-level-ivy-settings.xml

resolve:

ivy-availability-check:
[loadresource] Do not set property disallowed.ivy.jars.list as its length is 0.

-ivy-fail-disallowed-ivy-version:

ivy-fail:

ivy-fail:

ivy-configure:
[ivy:configure] :: loading settings :: file = /x1/jenkins/jenkins-slave/workspace/Lucene-Solr-NightlyTests-7.x/checkout/lucene/top-level-ivy-settings.xml

resolve:

jar-checksums:
    [mkdir] Created dir: /x1/jenkins/jenkins-slave/workspace/Lucene-Solr-NightlyTests-7.x/checkout/solr/null1821347088
     [copy] Copying 241 files to /x1/jenkins/jenkins-slave/workspace/Lucene-Solr-NightlyTests-7.x/checkout/solr/null1821347088
   [delete] Deleting directory /x1/jenkins/jenkins-slave/workspace/Lucene-Solr-NightlyTests-7.x/checkout/solr/null1821347088

check-working-copy:
[ivy:cachepath] :: resolving dependencies :: org.eclipse.jgit#org.eclipse.jgit-caller;working
[ivy:cachepath] 	confs: [default]
[ivy:cachepath] 	found org.eclipse.jgit#org.eclipse.jgit;4.6.0.201612231935-r in public
[ivy:cachepath] 	found com.jcraft#jsch;0.1.53 in public
[ivy:cachepath] 	found com.googlecode.javaewah#JavaEWAH;1.1.6 in public
[ivy:cachepath] 	found org.apache.httpcomponents#httpclient;4.3.6 in public
[ivy:cachepath] 	found org.apache.httpcomponents#httpcore;4.3.3 in public
[ivy:cachepath] 	found commons-logging#commons-logging;1.1.3 in public
[ivy:cachepath] 	found commons-codec#commons-codec;1.6 in public
[ivy:cachepath] 	found org.slf4j#slf4j-api;1.7.2 in public
[ivy:cachepath] :: resolution report :: resolve 49ms :: artifacts dl 4ms
	---------------------------------------------------------------------
	|                  |            modules            ||   artifacts   |
	|       conf       | number| search|dwnlded|evicted|| number|dwnlded|
	---------------------------------------------------------------------
	|      default     |   8   |   0   |   0   |   0   ||   8   |   0   |
	---------------------------------------------------------------------
[wc-checker] Initializing working copy...
[wc-checker] SLF4J: Failed to load class "org.slf4j.impl.StaticLoggerBinder".
[wc-checker] SLF4J: Defaulting to no-operation (NOP) logger implementation
[wc-checker] SLF4J: See http://www.slf4j.org/codes.html#StaticLoggerBinder for further details.
[wc-checker] Checking working copy status...

-jenkins-base:

BUILD SUCCESSFUL
Total time: 282 minutes 36 seconds
Archiving artifacts
java.lang.InterruptedException: no matches found within 10000
	at hudson.FilePath$34.hasMatch(FilePath.java:2678)
	at hudson.FilePath$34.invoke(FilePath.java:2557)
	at hudson.FilePath$34.invoke(FilePath.java:2547)
	at hudson.FilePath$FileCallableWrapper.call(FilePath.java:2918)
Also:   hudson.remoting.Channel$CallSiteStackTrace: Remote call to lucene
		at hudson.remoting.Channel.attachCallSiteStackTrace(Channel.java:1741)
		at hudson.remoting.UserRequest$ExceptionResponse.retrieve(UserRequest.java:357)
		at hudson.remoting.Channel.call(Channel.java:955)
		at hudson.FilePath.act(FilePath.java:1036)
		at hudson.FilePath.act(FilePath.java:1025)
		at hudson.FilePath.validateAntFileMask(FilePath.java:2547)
		at hudson.tasks.ArtifactArchiver.perform(ArtifactArchiver.java:243)
		at hudson.tasks.BuildStepCompatibilityLayer.perform(BuildStepCompatibilityLayer.java:81)
		at hudson.tasks.BuildStepMonitor$1.perform(BuildStepMonitor.java:20)
		at hudson.model.AbstractBuild$AbstractBuildExecution.perform(AbstractBuild.java:744)
		at hudson.model.AbstractBuild$AbstractBuildExecution.performAllBuildSteps(AbstractBuild.java:690)
		at hudson.model.Build$BuildExecution.post2(Build.java:186)
		at hudson.model.AbstractBuild$AbstractBuildExecution.post(AbstractBuild.java:635)
		at hudson.model.Run.execute(Run.java:1819)
		at hudson.model.FreeStyleBuild.run(FreeStyleBuild.java:43)
		at hudson.model.ResourceController.execute(ResourceController.java:97)
		at hudson.model.Executor.run(Executor.java:429)
Caused: hudson.FilePath$TunneledInterruptedException
	at hudson.FilePath$FileCallableWrapper.call(FilePath.java:2920)
	at hudson.remoting.UserRequest.perform(UserRequest.java:212)
	at hudson.remoting.UserRequest.perform(UserRequest.java:54)
	at hudson.remoting.Request$2.run(Request.java:369)
	at hudson.remoting.InterceptingExecutorService$1.call(InterceptingExecutorService.java:72)
	at java.util.concurrent.FutureTask.run(FutureTask.java:266)
	at java.util.concurrent.ThreadPoolExecutor.runWorker(ThreadPoolExecutor.java:1142)
	at java.util.concurrent.ThreadPoolExecutor$Worker.run(ThreadPoolExecutor.java:617)
	at java.lang.Thread.run(Thread.java:748)
Caused: java.lang.InterruptedException: java.lang.InterruptedException: no matches found within 10000
	at hudson.FilePath.act(FilePath.java:1038)
	at hudson.FilePath.act(FilePath.java:1025)
	at hudson.FilePath.validateAntFileMask(FilePath.java:2547)
	at hudson.tasks.ArtifactArchiver.perform(ArtifactArchiver.java:243)
	at hudson.tasks.BuildStepCompatibilityLayer.perform(BuildStepCompatibilityLayer.java:81)
	at hudson.tasks.BuildStepMonitor$1.perform(BuildStepMonitor.java:20)
	at hudson.model.AbstractBuild$AbstractBuildExecution.perform(AbstractBuild.java:744)
	at hudson.model.AbstractBuild$AbstractBuildExecution.performAllBuildSteps(AbstractBuild.java:690)
	at hudson.model.Build$BuildExecution.post2(Build.java:186)
	at hudson.model.AbstractBuild$AbstractBuildExecution.post(AbstractBuild.java:635)
	at hudson.model.Run.execute(Run.java:1819)
	at hudson.model.FreeStyleBuild.run(FreeStyleBuild.java:43)
	at hudson.model.ResourceController.execute(ResourceController.java:97)
	at hudson.model.Executor.run(Executor.java:429)
No artifacts found that match the file pattern "**/*.events,heapdumps/**,**/hs_err_pid*". Configuration error?
Recording test results
Build step 'Publish JUnit test result report' changed build result to UNSTABLE
Email was triggered for: Unstable (Test Failures)
Sending email for trigger: Unstable (Test Failures)

Mime
View raw message