lucene-dev mailing list archives

Site index · List index
Message view « Date » · « Thread »
Top « Date » · « Thread »
From Apache Jenkins Server <jenk...@builds.apache.org>
Subject [JENKINS] Lucene-Solr-NightlyTests-7.x - Build # 334 - Failure
Date Tue, 02 Oct 2018 05:11:07 GMT
Build: https://builds.apache.org/job/Lucene-Solr-NightlyTests-7.x/334/

1 tests failed.
FAILED:  org.apache.solr.uninverting.TestDocTermOrdsUninvertLimit.testTriggerUnInvertLimit

Error Message:
refusing to delete any files: this IndexWriter hit an unrecoverable exception

Stack Trace:
org.apache.lucene.store.AlreadyClosedException: refusing to delete any files: this IndexWriter
hit an unrecoverable exception
	at org.apache.lucene.index.IndexFileDeleter.ensureOpen(IndexFileDeleter.java:349)
	at org.apache.lucene.index.IndexFileDeleter.deleteFiles(IndexFileDeleter.java:669)
	at org.apache.lucene.index.IndexFileDeleter.decRef(IndexFileDeleter.java:589)
	at org.apache.lucene.index.IndexFileDeleter.checkpoint(IndexFileDeleter.java:531)
	at org.apache.lucene.index.IndexWriter.checkpoint(IndexWriter.java:2578)
	at org.apache.lucene.index.IndexWriter.publishFlushedSegment(IndexWriter.java:2654)
	at org.apache.lucene.index.IndexWriter.lambda$publishFlushedSegments$10(IndexWriter.java:5066)
	at org.apache.lucene.index.DocumentsWriterFlushQueue.innerPurge(DocumentsWriterFlushQueue.java:115)
	at org.apache.lucene.index.DocumentsWriterFlushQueue.tryPurge(DocumentsWriterFlushQueue.java:146)
	at org.apache.lucene.index.DocumentsWriter.purgeFlushTickets(DocumentsWriter.java:201)
	at org.apache.lucene.index.IndexWriter.publishFlushedSegments(IndexWriter.java:5046)
	at org.apache.lucene.index.IndexWriter$1.afterSegmentsFlushed(IndexWriter.java:367)
	at org.apache.lucene.index.DocumentsWriter.doFlush(DocumentsWriter.java:599)
	at org.apache.lucene.index.DocumentsWriter.postUpdate(DocumentsWriter.java:413)
	at org.apache.lucene.index.DocumentsWriter.updateDocuments(DocumentsWriter.java:470)
	at org.apache.lucene.index.IndexWriter.updateDocuments(IndexWriter.java:1299)
	at org.apache.lucene.index.IndexWriter.addDocuments(IndexWriter.java:1272)
	at org.apache.lucene.index.RandomIndexWriter.addDocument(RandomIndexWriter.java:159)
	at org.apache.solr.uninverting.TestDocTermOrdsUninvertLimit.testTriggerUnInvertLimit(TestDocTermOrdsUninvertLimit.java:65)
	at sun.reflect.NativeMethodAccessorImpl.invoke0(Native Method)
	at sun.reflect.NativeMethodAccessorImpl.invoke(NativeMethodAccessorImpl.java:62)
	at sun.reflect.DelegatingMethodAccessorImpl.invoke(DelegatingMethodAccessorImpl.java:43)
	at java.lang.reflect.Method.invoke(Method.java:498)
	at com.carrotsearch.randomizedtesting.RandomizedRunner.invoke(RandomizedRunner.java:1742)
	at com.carrotsearch.randomizedtesting.RandomizedRunner$8.evaluate(RandomizedRunner.java:935)
	at com.carrotsearch.randomizedtesting.RandomizedRunner$9.evaluate(RandomizedRunner.java:971)
	at com.carrotsearch.randomizedtesting.RandomizedRunner$10.evaluate(RandomizedRunner.java:985)
	at org.apache.lucene.util.TestRuleSetupTeardownChained$1.evaluate(TestRuleSetupTeardownChained.java:49)
	at org.apache.lucene.util.AbstractBeforeAfterRule$1.evaluate(AbstractBeforeAfterRule.java:45)
	at org.apache.lucene.util.TestRuleThreadAndTestName$1.evaluate(TestRuleThreadAndTestName.java:48)
	at org.apache.lucene.util.TestRuleIgnoreAfterMaxFailures$1.evaluate(TestRuleIgnoreAfterMaxFailures.java:64)
	at org.apache.lucene.util.TestRuleMarkFailure$1.evaluate(TestRuleMarkFailure.java:47)
	at com.carrotsearch.randomizedtesting.rules.StatementAdapter.evaluate(StatementAdapter.java:36)
	at com.carrotsearch.randomizedtesting.ThreadLeakControl$StatementRunner.run(ThreadLeakControl.java:368)
	at com.carrotsearch.randomizedtesting.ThreadLeakControl.forkTimeoutingTask(ThreadLeakControl.java:817)
	at com.carrotsearch.randomizedtesting.ThreadLeakControl$3.evaluate(ThreadLeakControl.java:468)
	at com.carrotsearch.randomizedtesting.RandomizedRunner.runSingleTest(RandomizedRunner.java:944)
	at com.carrotsearch.randomizedtesting.RandomizedRunner$5.evaluate(RandomizedRunner.java:830)
	at com.carrotsearch.randomizedtesting.RandomizedRunner$6.evaluate(RandomizedRunner.java:880)
	at com.carrotsearch.randomizedtesting.RandomizedRunner$7.evaluate(RandomizedRunner.java:891)
	at org.apache.lucene.util.AbstractBeforeAfterRule$1.evaluate(AbstractBeforeAfterRule.java:45)
	at com.carrotsearch.randomizedtesting.rules.StatementAdapter.evaluate(StatementAdapter.java:36)
	at org.apache.lucene.util.TestRuleStoreClassName$1.evaluate(TestRuleStoreClassName.java:41)
	at com.carrotsearch.randomizedtesting.rules.NoShadowingOrOverridesOnMethodsRule$1.evaluate(NoShadowingOrOverridesOnMethodsRule.java:40)
	at com.carrotsearch.randomizedtesting.rules.NoShadowingOrOverridesOnMethodsRule$1.evaluate(NoShadowingOrOverridesOnMethodsRule.java:40)
	at com.carrotsearch.randomizedtesting.rules.StatementAdapter.evaluate(StatementAdapter.java:36)
	at com.carrotsearch.randomizedtesting.rules.StatementAdapter.evaluate(StatementAdapter.java:36)
	at com.carrotsearch.randomizedtesting.rules.StatementAdapter.evaluate(StatementAdapter.java:36)
	at org.apache.lucene.util.TestRuleAssertionsRequired$1.evaluate(TestRuleAssertionsRequired.java:53)
	at org.apache.lucene.util.TestRuleMarkFailure$1.evaluate(TestRuleMarkFailure.java:47)
	at org.apache.lucene.util.TestRuleIgnoreAfterMaxFailures$1.evaluate(TestRuleIgnoreAfterMaxFailures.java:64)
	at org.apache.lucene.util.TestRuleIgnoreTestSuites$1.evaluate(TestRuleIgnoreTestSuites.java:54)
	at com.carrotsearch.randomizedtesting.rules.StatementAdapter.evaluate(StatementAdapter.java:36)
	at com.carrotsearch.randomizedtesting.ThreadLeakControl$StatementRunner.run(ThreadLeakControl.java:368)
	at java.lang.Thread.run(Thread.java:748)
Caused by: java.lang.OutOfMemoryError: Java heap space
	at org.apache.lucene.store.RAMFile.newBuffer(RAMFile.java:84)
	at org.apache.lucene.store.RAMFile.addBuffer(RAMFile.java:57)
	at org.apache.lucene.store.RAMOutputStream.switchCurrentBuffer(RAMOutputStream.java:168)
	at org.apache.lucene.store.RAMOutputStream.writeBytes(RAMOutputStream.java:154)
	at org.apache.lucene.store.MockIndexOutputWrapper.writeBytes(MockIndexOutputWrapper.java:141)
	at org.apache.lucene.store.RateLimitedIndexOutput.writeBytes(RateLimitedIndexOutput.java:73)
	at org.apache.lucene.store.DataOutput.copyBytes(DataOutput.java:278)
	at org.apache.lucene.codecs.lucene50.Lucene50CompoundFormat.write(Lucene50CompoundFormat.java:96)
	at org.apache.lucene.index.IndexWriter.createCompoundFile(IndexWriter.java:4997)
	at org.apache.lucene.index.IndexWriter.mergeMiddle(IndexWriter.java:4510)
	at org.apache.lucene.index.IndexWriter.merge(IndexWriter.java:4068)
	at org.apache.lucene.index.ConcurrentMergeScheduler.doMerge(ConcurrentMergeScheduler.java:625)
	at org.apache.lucene.index.ConcurrentMergeScheduler$MergeThread.run(ConcurrentMergeScheduler.java:662)




Build Log:
[...truncated 12882 lines...]
   [junit4] Suite: org.apache.solr.uninverting.TestDocTermOrdsUninvertLimit
   [junit4]   2> out 01, 2018 9:18:52 PM com.carrotsearch.randomizedtesting.RandomizedRunner$QueueUncaughtExceptionsHandler
uncaughtException
   [junit4]   2> ADVERTÊNCIA: Uncaught exception in thread: Thread[Lucene Merge Thread
#55,5,TGRP-TestDocTermOrdsUninvertLimit]
   [junit4]   2> org.apache.lucene.index.MergePolicy$MergeException: java.lang.OutOfMemoryError:
Java heap space
   [junit4]   2> 	at __randomizedtesting.SeedInfo.seed([72E11A484EB2B1D4]:0)
   [junit4]   2> 	at org.apache.lucene.index.ConcurrentMergeScheduler.handleMergeException(ConcurrentMergeScheduler.java:704)
   [junit4]   2> 	at org.apache.lucene.index.ConcurrentMergeScheduler$MergeThread.run(ConcurrentMergeScheduler.java:684)
   [junit4]   2> Caused by: java.lang.OutOfMemoryError: Java heap space
   [junit4]   2> 	at org.apache.lucene.store.RAMFile.newBuffer(RAMFile.java:84)
   [junit4]   2> 	at org.apache.lucene.store.RAMFile.addBuffer(RAMFile.java:57)
   [junit4]   2> 	at org.apache.lucene.store.RAMOutputStream.switchCurrentBuffer(RAMOutputStream.java:168)
   [junit4]   2> 	at org.apache.lucene.store.RAMOutputStream.writeBytes(RAMOutputStream.java:154)
   [junit4]   2> 	at org.apache.lucene.store.MockIndexOutputWrapper.writeBytes(MockIndexOutputWrapper.java:141)
   [junit4]   2> 	at org.apache.lucene.store.RateLimitedIndexOutput.writeBytes(RateLimitedIndexOutput.java:73)
   [junit4]   2> 	at org.apache.lucene.store.DataOutput.writeBytes(DataOutput.java:52)
   [junit4]   2> 	at org.apache.lucene.codecs.lucene50.ForUtil.writeBlock(ForUtil.java:175)
   [junit4]   2> 	at org.apache.lucene.codecs.lucene50.Lucene50PostingsWriter.addPosition(Lucene50PostingsWriter.java:289)
   [junit4]   2> 	at org.apache.lucene.codecs.PushPostingsWriterBase.writeTerm(PushPostingsWriterBase.java:156)
   [junit4]   2> 	at org.apache.lucene.codecs.blockterms.BlockTermsWriter$TermsWriter.write(BlockTermsWriter.java:235)
   [junit4]   2> 	at org.apache.lucene.codecs.blockterms.BlockTermsWriter.write(BlockTermsWriter.java:147)
   [junit4]   2> 	at org.apache.lucene.codecs.FieldsConsumer.merge(FieldsConsumer.java:105)
   [junit4]   2> 	at org.apache.lucene.codecs.perfield.PerFieldPostingsFormat$FieldsWriter.merge(PerFieldPostingsFormat.java:164)
   [junit4]   2> 	at org.apache.lucene.index.SegmentMerger.mergeTerms(SegmentMerger.java:231)
   [junit4]   2> 	at org.apache.lucene.index.SegmentMerger.merge(SegmentMerger.java:116)
   [junit4]   2> 	at org.apache.lucene.index.IndexWriter.mergeMiddle(IndexWriter.java:4446)
   [junit4]   2> 	at org.apache.lucene.index.IndexWriter.merge(IndexWriter.java:4068)
   [junit4]   2> 	at org.apache.lucene.index.ConcurrentMergeScheduler.doMerge(ConcurrentMergeScheduler.java:625)
   [junit4]   2> 	at org.apache.lucene.index.ConcurrentMergeScheduler$MergeThread.run(ConcurrentMergeScheduler.java:662)
   [junit4]   2> 
   [junit4]   2> out 01, 2018 9:18:52 PM com.carrotsearch.randomizedtesting.RandomizedRunner$QueueUncaughtExceptionsHandler
uncaughtException
   [junit4]   2> ADVERTÊNCIA: Uncaught exception in thread: Thread[Lucene Merge Thread
#61,5,TGRP-TestDocTermOrdsUninvertLimit]
   [junit4]   2> org.apache.lucene.index.MergePolicy$MergeException: java.lang.OutOfMemoryError:
Java heap space
   [junit4]   2> 	at __randomizedtesting.SeedInfo.seed([72E11A484EB2B1D4]:0)
   [junit4]   2> 	at org.apache.lucene.index.ConcurrentMergeScheduler.handleMergeException(ConcurrentMergeScheduler.java:704)
   [junit4]   2> 	at org.apache.lucene.index.ConcurrentMergeScheduler$MergeThread.run(ConcurrentMergeScheduler.java:684)
   [junit4]   2> Caused by: java.lang.OutOfMemoryError: Java heap space
   [junit4]   2> 	at org.apache.lucene.store.RAMFile.newBuffer(RAMFile.java:84)
   [junit4]   2> 	at org.apache.lucene.store.RAMFile.addBuffer(RAMFile.java:57)
   [junit4]   2> 	at org.apache.lucene.store.RAMOutputStream.switchCurrentBuffer(RAMOutputStream.java:168)
   [junit4]   2> 	at org.apache.lucene.store.RAMOutputStream.writeBytes(RAMOutputStream.java:154)
   [junit4]   2> 	at org.apache.lucene.store.MockIndexOutputWrapper.writeBytes(MockIndexOutputWrapper.java:141)
   [junit4]   2> 	at org.apache.lucene.store.RateLimitedIndexOutput.writeBytes(RateLimitedIndexOutput.java:73)
   [junit4]   2> 	at org.apache.lucene.store.DataOutput.copyBytes(DataOutput.java:278)
   [junit4]   2> 	at org.apache.lucene.codecs.lucene50.Lucene50CompoundFormat.write(Lucene50CompoundFormat.java:96)
   [junit4]   2> 	at org.apache.lucene.index.IndexWriter.createCompoundFile(IndexWriter.java:4997)
   [junit4]   2> 	at org.apache.lucene.index.IndexWriter.mergeMiddle(IndexWriter.java:4510)
   [junit4]   2> 	at org.apache.lucene.index.IndexWriter.merge(IndexWriter.java:4068)
   [junit4]   2> 	at org.apache.lucene.index.ConcurrentMergeScheduler.doMerge(ConcurrentMergeScheduler.java:625)
   [junit4]   2> 	at org.apache.lucene.index.ConcurrentMergeScheduler$MergeThread.run(ConcurrentMergeScheduler.java:662)
   [junit4]   2> 
   [junit4]   2> NOTE: download the large Jenkins line-docs file by running 'ant get-jenkins-line-docs'
in the lucene directory.
   [junit4]   2> NOTE: reproduce with: ant test  -Dtestcase=TestDocTermOrdsUninvertLimit
-Dtests.method=testTriggerUnInvertLimit -Dtests.seed=72E11A484EB2B1D4 -Dtests.multiplier=2
-Dtests.nightly=true -Dtests.slow=true -Dtests.linedocsfile=/home/jenkins/jenkins-slave/workspace/Lucene-Solr-NightlyTests-7.x/test-data/enwiki.random.lines.txt
-Dtests.locale=pt-BR -Dtests.timezone=US/Mountain -Dtests.asserts=true -Dtests.file.encoding=UTF-8
   [junit4] ERROR   18.5s J0 | TestDocTermOrdsUninvertLimit.testTriggerUnInvertLimit <<<
   [junit4]    > Throwable #1: org.apache.lucene.store.AlreadyClosedException: refusing
to delete any files: this IndexWriter hit an unrecoverable exception
   [junit4]    > 	at org.apache.lucene.index.IndexFileDeleter.ensureOpen(IndexFileDeleter.java:349)
   [junit4]    > 	at org.apache.lucene.index.IndexFileDeleter.deleteFiles(IndexFileDeleter.java:669)
   [junit4]    > 	at org.apache.lucene.index.IndexFileDeleter.decRef(IndexFileDeleter.java:589)
   [junit4]    > 	at org.apache.lucene.index.IndexFileDeleter.checkpoint(IndexFileDeleter.java:531)
   [junit4]    > 	at org.apache.lucene.index.IndexWriter.checkpoint(IndexWriter.java:2578)
   [junit4]    > 	at org.apache.lucene.index.IndexWriter.publishFlushedSegment(IndexWriter.java:2654)
   [junit4]    > 	at org.apache.lucene.index.IndexWriter.lambda$publishFlushedSegments$10(IndexWriter.java:5066)
   [junit4]    > 	at org.apache.lucene.index.DocumentsWriterFlushQueue.innerPurge(DocumentsWriterFlushQueue.java:115)
   [junit4]    > 	at org.apache.lucene.index.DocumentsWriterFlushQueue.tryPurge(DocumentsWriterFlushQueue.java:146)
   [junit4]    > 	at org.apache.lucene.index.DocumentsWriter.purgeFlushTickets(DocumentsWriter.java:201)
   [junit4]    > 	at org.apache.lucene.index.IndexWriter.publishFlushedSegments(IndexWriter.java:5046)
   [junit4]    > 	at org.apache.lucene.index.IndexWriter$1.afterSegmentsFlushed(IndexWriter.java:367)
   [junit4]    > 	at org.apache.lucene.index.DocumentsWriter.doFlush(DocumentsWriter.java:599)
   [junit4]    > 	at org.apache.lucene.index.DocumentsWriter.postUpdate(DocumentsWriter.java:413)
   [junit4]    > 	at org.apache.lucene.index.DocumentsWriter.updateDocuments(DocumentsWriter.java:470)
   [junit4]    > 	at org.apache.lucene.index.IndexWriter.updateDocuments(IndexWriter.java:1299)
   [junit4]    > 	at org.apache.lucene.index.IndexWriter.addDocuments(IndexWriter.java:1272)
   [junit4]    > 	at org.apache.lucene.index.RandomIndexWriter.addDocument(RandomIndexWriter.java:159)
   [junit4]    > 	at org.apache.solr.uninverting.TestDocTermOrdsUninvertLimit.testTriggerUnInvertLimit(TestDocTermOrdsUninvertLimit.java:65)
   [junit4]    > 	at java.lang.Thread.run(Thread.java:748)
   [junit4]    > Caused by: java.lang.OutOfMemoryError: Java heap space
   [junit4]    > 	at org.apache.lucene.store.RAMFile.newBuffer(RAMFile.java:84)
   [junit4]    > 	at org.apache.lucene.store.RAMFile.addBuffer(RAMFile.java:57)
   [junit4]    > 	at org.apache.lucene.store.RAMOutputStream.switchCurrentBuffer(RAMOutputStream.java:168)
   [junit4]    > 	at org.apache.lucene.store.RAMOutputStream.writeBytes(RAMOutputStream.java:154)
   [junit4]    > 	at org.apache.lucene.store.MockIndexOutputWrapper.writeBytes(MockIndexOutputWrapper.java:141)
   [junit4]    > 	at org.apache.lucene.store.RateLimitedIndexOutput.writeBytes(RateLimitedIndexOutput.java:73)
   [junit4]    > 	at org.apache.lucene.store.DataOutput.copyBytes(DataOutput.java:278)
   [junit4]    > 	at org.apache.lucene.codecs.lucene50.Lucene50CompoundFormat.write(Lucene50CompoundFormat.java:96)
   [junit4]    > 	at org.apache.lucene.index.IndexWriter.createCompoundFile(IndexWriter.java:4997)
   [junit4]    > 	at org.apache.lucene.index.IndexWriter.mergeMiddle(IndexWriter.java:4510)
   [junit4]    > 	at org.apache.lucene.index.IndexWriter.merge(IndexWriter.java:4068)
   [junit4]    > 	at org.apache.lucene.index.ConcurrentMergeScheduler.doMerge(ConcurrentMergeScheduler.java:625)
   [junit4]    > 	at org.apache.lucene.index.ConcurrentMergeScheduler$MergeThread.run(ConcurrentMergeScheduler.java:662)Throwable
#2: com.carrotsearch.randomizedtesting.UncaughtExceptionError: Captured an uncaught exception
in thread: Thread[id=183, name=Lucene Merge Thread #55, state=RUNNABLE, group=TGRP-TestDocTermOrdsUninvertLimit]
   [junit4]    > Caused by: org.apache.lucene.index.MergePolicy$MergeException: java.lang.OutOfMemoryError:
Java heap space
   [junit4]    > 	at __randomizedtesting.SeedInfo.seed([72E11A484EB2B1D4]:0)
   [junit4]    > 	at org.apache.lucene.index.ConcurrentMergeScheduler.handleMergeException(ConcurrentMergeScheduler.java:704)
   [junit4]    > 	at org.apache.lucene.index.ConcurrentMergeScheduler$MergeThread.run(ConcurrentMergeScheduler.java:684)
   [junit4]    > Caused by: java.lang.OutOfMemoryError: Java heap space
   [junit4]    > 	at org.apache.lucene.store.RAMFile.newBuffer(RAMFile.java:84)
   [junit4]    > 	at org.apache.lucene.store.RAMFile.addBuffer(RAMFile.java:57)
   [junit4]    > 	at org.apache.lucene.store.RAMOutputStream.switchCurrentBuffer(RAMOutputStream.java:168)
   [junit4]    > 	at org.apache.lucene.store.RAMOutputStream.writeBytes(RAMOutputStream.java:154)
   [junit4]    > 	at org.apache.lucene.store.MockIndexOutputWrapper.writeBytes(MockIndexOutputWrapper.java:141)
   [junit4]    > 	at org.apache.lucene.store.RateLimitedIndexOutput.writeBytes(RateLimitedIndexOutput.java:73)
   [junit4]    > 	at org.apache.lucene.store.DataOutput.writeBytes(DataOutput.java:52)
   [junit4]    > 	at org.apache.lucene.codecs.lucene50.ForUtil.writeBlock(ForUtil.java:175)
   [junit4]    > 	at org.apache.lucene.codecs.lucene50.Lucene50PostingsWriter.addPosition(Lucene50PostingsWriter.java:289)
   [junit4]    > 	at org.apache.lucene.codecs.PushPostingsWriterBase.writeTerm(PushPostingsWriterBase.java:156)
   [junit4]    > 	at org.apache.lucene.codecs.blockterms.BlockTermsWriter$TermsWriter.write(BlockTermsWriter.java:235)
   [junit4]    > 	at org.apache.lucene.codecs.blockterms.BlockTermsWriter.write(BlockTermsWriter.java:147)
   [junit4]    > 	at org.apache.lucene.codecs.FieldsConsumer.merge(FieldsConsumer.java:105)
   [junit4]    > 	at org.apache.lucene.codecs.perfield.PerFieldPostingsFormat$FieldsWriter.merge(PerFieldPostingsFormat.java:164)
   [junit4]    > 	at org.apache.lucene.index.SegmentMerger.mergeTerms(SegmentMerger.java:231)
   [junit4]    > 	at org.apache.lucene.index.SegmentMerger.merge(SegmentMerger.java:116)
   [junit4]    > 	at org.apache.lucene.index.IndexWriter.mergeMiddle(IndexWriter.java:4446)
   [junit4]    > 	at org.apache.lucene.index.IndexWriter.merge(IndexWriter.java:4068)
   [junit4]    > 	at org.apache.lucene.index.ConcurrentMergeScheduler.doMerge(ConcurrentMergeScheduler.java:625)
   [junit4]    > 	at org.apache.lucene.index.ConcurrentMergeScheduler$MergeThread.run(ConcurrentMergeScheduler.java:662)Throwable
#3: com.carrotsearch.randomizedtesting.UncaughtExceptionError: Captured an uncaught exception
in thread: Thread[id=189, name=Lucene Merge Thread #61, state=RUNNABLE, group=TGRP-TestDocTermOrdsUninvertLimit]
   [junit4]    > Caused by: org.apache.lucene.index.MergePolicy$MergeException: java.lang.OutOfMemoryError:
Java heap space
   [junit4]    > 	at __randomizedtesting.SeedInfo.seed([72E11A484EB2B1D4]:0)
   [junit4]    > 	at org.apache.lucene.index.ConcurrentMergeScheduler.handleMergeException(ConcurrentMergeScheduler.java:704)
   [junit4]    > 	at org.apache.lucene.index.ConcurrentMergeScheduler$MergeThread.run(ConcurrentMergeScheduler.java:684)
   [junit4]    > Caused by: java.lang.OutOfMemoryError: Java heap space
   [junit4]    > 	at org.apache.lucene.store.RAMFile.newBuffer(RAMFile.java:84)
   [junit4]    > 	at org.apache.lucene.store.RAMFile.addBuffer(RAMFile.java:57)
   [junit4]    > 	at org.apache.lucene.store.RAMOutputStream.switchCurrentBuffer(RAMOutputStream.java:168)
   [junit4]    > 	at org.apache.lucene.store.RAMOutputStream.writeBytes(RAMOutputStream.java:154)
   [junit4]    > 	at org.apache.lucene.store.MockIndexOutputWrapper.writeBytes(MockIndexOutputWrapper.java:141)
   [junit4]    > 	at org.apache.lucene.store.RateLimitedIndexOutput.writeBytes(RateLimitedIndexOutput.java:73)
   [junit4]    > 	at org.apache.lucene.store.DataOutput.copyBytes(DataOutput.java:278)
   [junit4]    > 	at org.apache.lucene.codecs.lucene50.Lucene50CompoundFormat.write(Lucene50CompoundFormat.java:96)
   [junit4]    > 	at org.apache.lucene.index.IndexWriter.createCompoundFile(IndexWriter.java:4997)
   [junit4]    > 	at org.apache.lucene.index.IndexWriter.mergeMiddle(IndexWriter.java:4510)
   [junit4]    > 	at org.apache.lucene.index.IndexWriter.merge(IndexWriter.java:4068)
   [junit4]    > 	at org.apache.lucene.index.ConcurrentMergeScheduler.doMerge(ConcurrentMergeScheduler.java:625)
   [junit4]    > 	at org.apache.lucene.index.ConcurrentMergeScheduler$MergeThread.run(ConcurrentMergeScheduler.java:662)
   [junit4]   2> NOTE: test params are: codec=Asserting(Lucene70): {field=PostingsFormat(name=MockRandom)},
docValues:{}, maxPointsInLeafNode=1171, maxMBSortInHeap=6.684070216850869, sim=RandomSimilarity(queryNorm=false):
{field=IB LL-L2}, locale=pt-BR, timezone=US/Mountain
   [junit4]   2> NOTE: Linux 4.4.0-130-generic amd64/Oracle Corporation 1.8.0_172 (64-bit)/cpus=4,threads=1,free=69897792,total=477626368
   [junit4]   2> NOTE: All tests run in this JVM: [AutoScalingHandlerTest, TestDocTermOrdsUninvertLimit]
   [junit4] Completed [2/834 (1!)] on J0 in 18.67s, 1 test, 1 error <<< FAILURES!

[...truncated 1017 lines...]
   [junit4] JVM J0: stdout was not empty, see: /x1/jenkins/jenkins-slave/workspace/Lucene-Solr-NightlyTests-7.x/checkout/solr/build/solr-core/test/temp/junit4-J0-20181002_031809_7052061044411162715813.sysout
   [junit4] >>> JVM J0 emitted unexpected output (verbatim) ----
   [junit4] java.lang.OutOfMemoryError: Java heap space
   [junit4] Dumping heap to /x1/jenkins/jenkins-slave/workspace/Lucene-Solr-NightlyTests-7.x/checkout/heapdumps/java_pid479.hprof
...
   [junit4] Heap dump file created [431734106 bytes in 0.749 secs]
   [junit4] <<< JVM J0: EOF ----

   [junit4] JVM J0: stderr was not empty, see: /x1/jenkins/jenkins-slave/workspace/Lucene-Solr-NightlyTests-7.x/checkout/solr/build/solr-core/test/temp/junit4-J0-20181002_031809_7053991538386726918590.syserr
   [junit4] >>> JVM J0 emitted unexpected output (verbatim) ----
   [junit4] WARN: Unhandled exception in event serialization. -> java.lang.OutOfMemoryError:
GC overhead limit exceeded
   [junit4] <<< JVM J0: EOF ----

[...truncated 1726 lines...]
   [junit4] ERROR: JVM J0 ended with an exception, command line: /usr/local/asfpackages/java/jdk1.8.0_172/jre/bin/java
-XX:+HeapDumpOnOutOfMemoryError -XX:HeapDumpPath=/x1/jenkins/jenkins-slave/workspace/Lucene-Solr-NightlyTests-7.x/checkout/heapdumps
-ea -esa -Dtests.prefix=tests -Dtests.seed=72E11A484EB2B1D4 -Xmx512M -Dtests.iters= -Dtests.verbose=false
-Dtests.infostream=false -Dtests.codec=random -Dtests.postingsformat=random -Dtests.docvaluesformat=random
-Dtests.locale=random -Dtests.timezone=random -Dtests.directory=random -Dtests.linedocsfile=/home/jenkins/jenkins-slave/workspace/Lucene-Solr-NightlyTests-7.x/test-data/enwiki.random.lines.txt
-Dtests.luceneMatchVersion=7.6.0 -Dtests.cleanthreads=perClass -Djava.util.logging.config.file=/x1/jenkins/jenkins-slave/workspace/Lucene-Solr-NightlyTests-7.x/checkout/lucene/tools/junit4/logging.properties
-Dtests.nightly=true -Dtests.weekly=false -Dtests.monster=false -Dtests.slow=true -Dtests.asserts=true
-Dtests.multiplier=2 -DtempDir=./temp -Djava.io.tmpdir=./temp -Dcommon.dir=/x1/jenkins/jenkins-slave/workspace/Lucene-Solr-NightlyTests-7.x/checkout/lucene
-Dclover.db.dir=/x1/jenkins/jenkins-slave/workspace/Lucene-Solr-NightlyTests-7.x/checkout/lucene/build/clover/db
-Djava.security.policy=/x1/jenkins/jenkins-slave/workspace/Lucene-Solr-NightlyTests-7.x/checkout/lucene/tools/junit4/solr-tests.policy
-Dtests.LUCENE_VERSION=7.6.0 -Djetty.testMode=1 -Djetty.insecurerandom=1 -Dsolr.directoryFactory=org.apache.solr.core.MockDirectoryFactory
-Djava.awt.headless=true -Djdk.map.althashing.threshold=0 -Dtests.src.home=/x1/jenkins/jenkins-slave/workspace/Lucene-Solr-NightlyTests-7.x/checkout
-Djava.security.egd=file:/dev/./urandom -Djunit4.childvm.cwd=/x1/jenkins/jenkins-slave/workspace/Lucene-Solr-NightlyTests-7.x/checkout/solr/build/solr-core/test/J0
-Djunit4.tempDir=/x1/jenkins/jenkins-slave/workspace/Lucene-Solr-NightlyTests-7.x/checkout/solr/build/solr-core/test/temp
-Djunit4.childvm.id=0 -Djunit4.childvm.count=3 -Dtests.leaveTemporary=false -Dtests.filterstacks=true
-Dtests.badapples=false -Djava.security.manager=org.apache.lucene.util.TestSecurityManager
-Dfile.encoding=UTF-8 -classpath /x1/jenkins/jenkins-slave/workspace/Lucene-Solr-NightlyTests-7.x/checkout/solr/build/solr-core/classes/test:/x1/jenkins/jenkins-slave/workspace/Lucene-Solr-NightlyTests-7.x/checkout/solr/build/solr-test-framework/classes/java:/x1/jenkins/jenkins-slave/workspace/Lucene-Solr-NightlyTests-7.x/checkout/solr/test-framework/lib/junit4-ant-2.6.4.jar:/x1/jenkins/jenkins-slave/workspace/Lucene-Solr-NightlyTests-7.x/checkout/solr/core/src/test-files:/x1/jenkins/jenkins-slave/workspace/Lucene-Solr-NightlyTests-7.x/checkout/lucene/build/test-framework/classes/java:/x1/jenkins/jenkins-slave/workspace/Lucene-Solr-NightlyTests-7.x/checkout/lucene/build/codecs/classes/java:/x1/jenkins/jenkins-slave/workspace/Lucene-Solr-NightlyTests-7.x/checkout/solr/build/solr-solrj/classes/java:/x1/jenkins/jenkins-slave/workspace/Lucene-Solr-NightlyTests-7.x/checkout/solr/build/solr-core/classes/java:/x1/jenkins/jenkins-slave/workspace/Lucene-Solr-NightlyTests-7.x/checkout/lucene/build/analysis/common/lucene-analyzers-common-7.6.0-SNAPSHOT.jar:/x1/jenkins/jenkins-slave/workspace/Lucene-Solr-NightlyTests-7.x/checkout/lucene/build/analysis/kuromoji/lucene-analyzers-kuromoji-7.6.0-SNAPSHOT.jar:/x1/jenkins/jenkins-slave/workspace/Lucene-Solr-NightlyTests-7.x/checkout/lucene/build/analysis/nori/lucene-analyzers-nori-7.6.0-SNAPSHOT.jar:/x1/jenkins/jenkins-slave/workspace/Lucene-Solr-NightlyTests-7.x/checkout/lucene/build/analysis/phonetic/lucene-analyzers-phonetic-7.6.0-SNAPSHOT.jar:/x1/jenkins/jenkins-slave/workspace/Lucene-Solr-NightlyTests-7.x/checkout/lucene/build/codecs/lucene-codecs-7.6.0-SNAPSHOT.jar:/x1/jenkins/jenkins-slave/workspace/Lucene-Solr-NightlyTests-7.x/checkout/lucene/build/backward-codecs/lucene-backward-codecs-7.6.0-SNAPSHOT.jar:/x1/jenkins/jenkins-slave/workspace/Lucene-Solr-NightlyTests-7.x/checkout/lucene/build/highlighter/lucene-highlighter-7.6.0-SNAPSHOT.jar:/x1/jenkins/jenkins-slave/workspace/Lucene-Solr-NightlyTests-7.x/checkout/lucene/build/memory/lucene-memory-7.6.0-SNAPSHOT.jar:/x1/jenkins/jenkins-slave/workspace/Lucene-Solr-NightlyTests-7.x/checkout/lucene/build/misc/lucene-misc-7.6.0-SNAPSHOT.jar:/x1/jenkins/jenkins-slave/workspace/Lucene-Solr-NightlyTests-7.x/checkout/lucene/build/spatial-extras/lucene-spatial-extras-7.6.0-SNAPSHOT.jar:/x1/jenkins/jenkins-slave/workspace/Lucene-Solr-NightlyTests-7.x/checkout/lucene/build/spatial3d/lucene-spatial3d-7.6.0-SNAPSHOT.jar:/x1/jenkins/jenkins-slave/workspace/Lucene-Solr-NightlyTests-7.x/checkout/lucene/build/expressions/lucene-expressions-7.6.0-SNAPSHOT.jar:/x1/jenkins/jenkins-slave/workspace/Lucene-Solr-NightlyTests-7.x/checkout/lucene/build/suggest/lucene-suggest-7.6.0-SNAPSHOT.jar:/x1/jenkins/jenkins-slave/workspace/Lucene-Solr-NightlyTests-7.x/checkout/lucene/build/grouping/lucene-grouping-7.6.0-SNAPSHOT.jar:/x1/jenkins/jenkins-slave/workspace/Lucene-Solr-NightlyTests-7.x/checkout/lucene/build/queries/lucene-queries-7.6.0-SNAPSHOT.jar:/x1/jenkins/jenkins-slave/workspace/Lucene-Solr-NightlyTests-7.x/checkout/lucene/build/queryparser/lucene-queryparser-7.6.0-SNAPSHOT.jar:/x1/jenkins/jenkins-slave/workspace/Lucene-Solr-NightlyTests-7.x/checkout/lucene/build/join/lucene-join-7.6.0-SNAPSHOT.jar:/x1/jenkins/jenkins-slave/workspace/Lucene-Solr-NightlyTests-7.x/checkout/lucene/build/sandbox/lucene-sandbox-7.6.0-SNAPSHOT.jar:/x1/jenkins/jenkins-slave/workspace/Lucene-Solr-NightlyTests-7.x/checkout/lucene/build/classification/lucene-classification-7.6.0-SNAPSHOT.jar:/x1/jenkins/jenkins-slave/workspace/Lucene-Solr-NightlyTests-7.x/checkout/solr/core/lib/antlr4-runtime-4.5.1-1.jar:/x1/jenkins/jenkins-slave/workspace/Lucene-Solr-NightlyTests-7.x/checkout/solr/core/lib/asm-5.1.jar:/x1/jenkins/jenkins-slave/workspace/Lucene-Solr-NightlyTests-7.x/checkout/solr/core/lib/asm-commons-5.1.jar:/x1/jenkins/jenkins-slave/workspace/Lucene-Solr-NightlyTests-7.x/checkout/solr/core/lib/avatica-core-1.10.0.jar:/x1/jenkins/jenkins-slave/workspace/Lucene-Solr-NightlyTests-7.x/checkout/solr/core/lib/caffeine-2.4.0.jar:/x1/jenkins/jenkins-slave/workspace/Lucene-Solr-NightlyTests-7.x/checkout/solr/core/lib/calcite-core-1.13.0.jar:/x1/jenkins/jenkins-slave/workspace/Lucene-Solr-NightlyTests-7.x/checkout/solr/core/lib/calcite-linq4j-1.13.0.jar:/x1/jenkins/jenkins-slave/workspace/Lucene-Solr-NightlyTests-7.x/checkout/solr/core/lib/commons-cli-1.2.jar:/x1/jenkins/jenkins-slave/workspace/Lucene-Solr-NightlyTests-7.x/checkout/solr/core/lib/commons-codec-1.10.jar:/x1/jenkins/jenkins-slave/workspace/Lucene-Solr-NightlyTests-7.x/checkout/solr/core/lib/commons-collections-3.2.2.jar:/x1/jenkins/jenkins-slave/workspace/Lucene-Solr-NightlyTests-7.x/checkout/solr/core/lib/commons-compiler-2.7.6.jar:/x1/jenkins/jenkins-slave/workspace/Lucene-Solr-NightlyTests-7.x/checkout/solr/core/lib/commons-configuration-1.6.jar:/x1/jenkins/jenkins-slave/workspace/Lucene-Solr-NightlyTests-7.x/checkout/solr/core/lib/commons-exec-1.3.jar:/x1/jenkins/jenkins-slave/workspace/Lucene-Solr-NightlyTests-7.x/checkout/solr/core/lib/commons-fileupload-1.3.3.jar:/x1/jenkins/jenkins-slave/workspace/Lucene-Solr-NightlyTests-7.x/checkout/solr/core/lib/commons-io-2.5.jar:/x1/jenkins/jenkins-slave/workspace/Lucene-Solr-NightlyTests-7.x/checkout/solr/core/lib/commons-lang-2.6.jar:/x1/jenkins/jenkins-slave/workspace/Lucene-Solr-NightlyTests-7.x/checkout/solr/core/lib/commons-lang3-3.6.jar:/x1/jenkins/jenkins-slave/workspace/Lucene-Solr-NightlyTests-7.x/checkout/solr/core/lib/commons-math3-3.6.1.jar:/x1/jenkins/jenkins-slave/workspace/Lucene-Solr-NightlyTests-7.x/checkout/solr/core/lib/curator-client-2.8.0.jar:/x1/jenkins/jenkins-slave/workspace/Lucene-Solr-NightlyTests-7.x/checkout/solr/core/lib/curator-framework-2.8.0.jar:/x1/jenkins/jenkins-slave/workspace/Lucene-Solr-NightlyTests-7.x/checkout/solr/core/lib/curator-recipes-2.8.0.jar:/x1/jenkins/jenkins-slave/workspace/Lucene-Solr-NightlyTests-7.x/checkout/solr/core/lib/disruptor-3.4.0.jar:/x1/jenkins/jenkins-slave/workspace/Lucene-Solr-NightlyTests-7.x/checkout/solr/core/lib/dom4j-1.6.1.jar:/x1/jenkins/jenkins-slave/workspace/Lucene-Solr-NightlyTests-7.x/checkout/solr/core/lib/eigenbase-properties-1.1.5.jar:/x1/jenkins/jenkins-slave/workspace/Lucene-Solr-NightlyTests-7.x/checkout/solr/core/lib/guava-14.0.1.jar:/x1/jenkins/jenkins-slave/workspace/Lucene-Solr-NightlyTests-7.x/checkout/solr/core/lib/hadoop-annotations-2.7.4.jar:/x1/jenkins/jenkins-slave/workspace/Lucene-Solr-NightlyTests-7.x/checkout/solr/core/lib/hadoop-auth-2.7.4.jar:/x1/jenkins/jenkins-slave/workspace/Lucene-Solr-NightlyTests-7.x/checkout/solr/core/lib/hadoop-common-2.7.4.jar:/x1/jenkins/jenkins-slave/workspace/Lucene-Solr-NightlyTests-7.x/checkout/solr/core/lib/hadoop-hdfs-2.7.4.jar:/x1/jenkins/jenkins-slave/workspace/Lucene-Solr-NightlyTests-7.x/checkout/solr/core/lib/hppc-0.8.1.jar:/x1/jenkins/jenkins-slave/workspace/Lucene-Solr-NightlyTests-7.x/checkout/solr/core/lib/htrace-core-3.2.0-incubating.jar:/x1/jenkins/jenkins-slave/workspace/Lucene-Solr-NightlyTests-7.x/checkout/solr/core/lib/jackson-annotations-2.9.5.jar:/x1/jenkins/jenkins-slave/workspace/Lucene-Solr-NightlyTests-7.x/checkout/solr/core/lib/jackson-core-2.9.5.jar:/x1/jenkins/jenkins-slave/workspace/Lucene-Solr-NightlyTests-7.x/checkout/solr/core/lib/jackson-core-asl-1.9.13.jar:/x1/jenkins/jenkins-slave/workspace/Lucene-Solr-NightlyTests-7.x/checkout/solr/core/lib/jackson-databind-2.9.5.jar:/x1/jenkins/jenkins-slave/workspace/Lucene-Solr-NightlyTests-7.x/checkout/solr/core/lib/jackson-dataformat-smile-2.9.5.jar:/x1/jenkins/jenkins-slave/workspace/Lucene-Solr-NightlyTests-7.x/checkout/solr/core/lib/jackson-mapper-asl-1.9.13.jar:/x1/jenkins/jenkins-slave/workspace/Lucene-Solr-NightlyTests-7.x/checkout/solr/core/lib/janino-2.7.6.jar:/x1/jenkins/jenkins-slave/workspace/Lucene-Solr-NightlyTests-7.x/checkout/solr/core/lib/jcl-over-slf4j-1.7.24.jar:/x1/jenkins/jenkins-slave/workspace/Lucene-Solr-NightlyTests-7.x/checkout/solr/core/lib/joda-time-2.2.jar:/x1/jenkins/jenkins-slave/workspace/Lucene-Solr-NightlyTests-7.x/checkout/solr/core/lib/log4j-1.2-api-2.11.0.jar:/x1/jenkins/jenkins-slave/workspace/Lucene-Solr-NightlyTests-7.x/checkout/solr/core/lib/log4j-api-2.11.0.jar:/x1/jenkins/jenkins-slave/workspace/Lucene-Solr-NightlyTests-7.x/checkout/solr/core/lib/log4j-core-2.11.0.jar:/x1/jenkins/jenkins-slave/workspace/Lucene-Solr-NightlyTests-7.x/checkout/solr/core/lib/log4j-slf4j-impl-2.11.0.jar:/x1/jenkins/jenkins-slave/workspace/Lucene-Solr-NightlyTests-7.x/checkout/solr/core/lib/org.restlet-2.3.0.jar:/x1/jenkins/jenkins-slave/workspace/Lucene-Solr-NightlyTests-7.x/checkout/solr/core/lib/org.restlet.ext.servlet-2.3.0.jar:/x1/jenkins/jenkins-slave/workspace/Lucene-Solr-NightlyTests-7.x/checkout/solr/core/lib/protobuf-java-3.1.0.jar:/x1/jenkins/jenkins-slave/workspace/Lucene-Solr-NightlyTests-7.x/checkout/solr/core/lib/rrd4j-3.2.jar:/x1/jenkins/jenkins-slave/workspace/Lucene-Solr-NightlyTests-7.x/checkout/solr/core/lib/spatial4j-0.7.jar:/x1/jenkins/jenkins-slave/workspace/Lucene-Solr-NightlyTests-7.x/checkout/solr/core/lib/t-digest-3.1.jar:/x1/jenkins/jenkins-slave/workspace/Lucene-Solr-NightlyTests-7.x/checkout/solr/solrj/lib/commons-io-2.5.jar:/x1/jenkins/jenkins-slave/workspace/Lucene-Solr-NightlyTests-7.x/checkout/solr/solrj/lib/commons-math3-3.6.1.jar:/x1/jenkins/jenkins-slave/workspace/Lucene-Solr-NightlyTests-7.x/checkout/solr/solrj/lib/httpclient-4.5.3.jar:/x1/jenkins/jenkins-slave/workspace/Lucene-Solr-NightlyTests-7.x/checkout/solr/solrj/lib/httpcore-4.4.6.jar:/x1/jenkins/jenkins-slave/workspace/Lucene-Solr-NightlyTests-7.x/checkout/solr/solrj/lib/httpmime-4.5.3.jar:/x1/jenkins/jenkins-slave/workspace/Lucene-Solr-NightlyTests-7.x/checkout/solr/solrj/lib/jcl-over-slf4j-1.7.24.jar:/x1/jenkins/jenkins-slave/workspace/Lucene-Solr-NightlyTests-7.x/checkout/solr/solrj/lib/noggit-0.8.jar:/x1/jenkins/jenkins-slave/workspace/Lucene-Solr-NightlyTests-7.x/checkout/solr/solrj/lib/slf4j-api-1.7.24.jar:/x1/jenkins/jenkins-slave/workspace/Lucene-Solr-NightlyTests-7.x/checkout/solr/solrj/lib/stax2-api-3.1.4.jar:/x1/jenkins/jenkins-slave/workspace/Lucene-Solr-NightlyTests-7.x/checkout/solr/solrj/lib/woodstox-core-asl-4.4.1.jar:/x1/jenkins/jenkins-slave/workspace/Lucene-Solr-NightlyTests-7.x/checkout/solr/solrj/lib/zookeeper-3.4.11.jar:/x1/jenkins/jenkins-slave/workspace/Lucene-Solr-NightlyTests-7.x/checkout/solr/server/lib/gmetric4j-1.0.7.jar:/x1/jenkins/jenkins-slave/workspace/Lucene-Solr-NightlyTests-7.x/checkout/solr/server/lib/javax.servlet-api-3.1.0.jar:/x1/jenkins/jenkins-slave/workspace/Lucene-Solr-NightlyTests-7.x/checkout/solr/server/lib/jetty-continuation-9.4.11.v20180605.jar:/x1/jenkins/jenkins-slave/workspace/Lucene-Solr-NightlyTests-7.x/checkout/solr/server/lib/jetty-deploy-9.4.11.v20180605.jar:/x1/jenkins/jenkins-slave/workspace/Lucene-Solr-NightlyTests-7.x/checkout/solr/server/lib/jetty-http-9.4.11.v20180605.jar:/x1/jenkins/jenkins-slave/workspace/Lucene-Solr-NightlyTests-7.x/checkout/solr/server/lib/jetty-io-9.4.11.v20180605.jar:/x1/jenkins/jenkins-slave/workspace/Lucene-Solr-NightlyTests-7.x/checkout/solr/server/lib/jetty-jmx-9.4.11.v20180605.jar:/x1/jenkins/jenkins-slave/workspace/Lucene-Solr-NightlyTests-7.x/checkout/solr/server/lib/jetty-rewrite-9.4.11.v20180605.jar:/x1/jenkins/jenkins-slave/workspace/Lucene-Solr-NightlyTests-7.x/checkout/solr/server/lib/jetty-security-9.4.11.v20180605.jar:/x1/jenkins/jenkins-slave/workspace/Lucene-Solr-NightlyTests-7.x/checkout/solr/server/lib/jetty-server-9.4.11.v20180605.jar:/x1/jenkins/jenkins-slave/workspace/Lucene-Solr-NightlyTests-7.x/checkout/solr/server/lib/jetty-servlet-9.4.11.v20180605.jar:/x1/jenkins/jenkins-slave/workspace/Lucene-Solr-NightlyTests-7.x/checkout/solr/server/lib/jetty-servlets-9.4.11.v20180605.jar:/x1/jenkins/jenkins-slave/workspace/Lucene-Solr-NightlyTests-7.x/checkout/solr/server/lib/jetty-util-9.4.11.v20180605.jar:/x1/jenkins/jenkins-slave/workspace/Lucene-Solr-NightlyTests-7.x/checkout/solr/server/lib/jetty-webapp-9.4.11.v20180605.jar:/x1/jenkins/jenkins-slave/workspace/Lucene-Solr-NightlyTests-7.x/checkout/solr/server/lib/jetty-xml-9.4.11.v20180605.jar:/x1/jenkins/jenkins-slave/workspace/Lucene-Solr-NightlyTests-7.x/checkout/solr/server/lib/metrics-core-3.2.6.jar:/x1/jenkins/jenkins-slave/workspace/Lucene-Solr-NightlyTests-7.x/checkout/solr/server/lib/metrics-ganglia-3.2.6.jar:/x1/jenkins/jenkins-slave/workspace/Lucene-Solr-NightlyTests-7.x/checkout/solr/server/lib/metrics-graphite-3.2.6.jar:/x1/jenkins/jenkins-slave/workspace/Lucene-Solr-NightlyTests-7.x/checkout/solr/server/lib/metrics-jetty9-3.2.6.jar:/x1/jenkins/jenkins-slave/workspace/Lucene-Solr-NightlyTests-7.x/checkout/solr/server/lib/metrics-jvm-3.2.6.jar:/x1/jenkins/jenkins-slave/workspace/Lucene-Solr-NightlyTests-7.x/checkout/solr/example/example-DIH/solr/db/lib/derby-10.9.1.0.jar:/x1/jenkins/jenkins-slave/workspace/Lucene-Solr-NightlyTests-7.x/checkout/solr/example/example-DIH/solr/db/lib/hsqldb-2.4.0.jar:/x1/jenkins/jenkins-slave/workspace/Lucene-Solr-NightlyTests-7.x/checkout/lucene/build/core/classes/java:/x1/jenkins/jenkins-slave/workspace/Lucene-Solr-NightlyTests-7.x/checkout/lucene/test-framework/lib/junit-4.10.jar:/x1/jenkins/jenkins-slave/workspace/Lucene-Solr-NightlyTests-7.x/checkout/lucene/test-framework/lib/randomizedtesting-runner-2.6.4.jar:/x1/jenkins/jenkins-slave/workspace/Lucene-Solr-NightlyTests-7.x/checkout/solr/core/test-lib/antlr-2.7.7.jar:/x1/jenkins/jenkins-slave/workspace/Lucene-Solr-NightlyTests-7.x/checkout/solr/core/test-lib/antlr4-runtime-4.5.1-1.jar:/x1/jenkins/jenkins-slave/workspace/Lucene-Solr-NightlyTests-7.x/checkout/solr/core/test-lib/apacheds-core-2.0.0-M15.jar:/x1/jenkins/jenkins-slave/workspace/Lucene-Solr-NightlyTests-7.x/checkout/solr/core/test-lib/apacheds-core-api-2.0.0-M15.jar:/x1/jenkins/jenkins-slave/workspace/Lucene-Solr-NightlyTests-7.x/checkout/solr/core/test-lib/apacheds-core-avl-2.0.0-M15.jar:/x1/jenkins/jenkins-slave/workspace/Lucene-Solr-NightlyTests-7.x/checkout/solr/core/test-lib/apacheds-core-shared-2.0.0-M15.jar:/x1/jenkins/jenkins-slave/workspace/Lucene-Solr-NightlyTests-7.x/checkout/solr/core/test-lib/apacheds-i18n-2.0.0-M15.jar:/x1/jenkins/jenkins-slave/workspace/Lucene-Solr-NightlyTests-7.x/checkout/solr/core/test-lib/apacheds-interceptor-kerberos-2.0.0-M15.jar:/x1/jenkins/jenkins-slave/workspace/Lucene-Solr-NightlyTests-7.x/checkout/solr/core/test-lib/apacheds-interceptors-admin-2.0.0-M15.jar:/x1/jenkins/jenkins-slave/workspace/Lucene-Solr-NightlyTests-7.x/checkout/solr/core/test-lib/apacheds-interceptors-authn-2.0.0-M15.jar:/x1/jenkins/jenkins-slave/workspace/Lucene-Solr-NightlyTests-7.x/checkout/solr/core/test-lib/apacheds-interceptors-authz-2.0.0-M15.jar:/x1/jenkins/jenkins-slave/workspace/Lucene-Solr-NightlyTests-7.x/checkout/solr/core/test-lib/apacheds-interceptors-changelog-2.0.0-M15.jar:/x1/jenkins/jenkins-slave/workspace/Lucene-Solr-NightlyTests-7.x/checkout/solr/core/test-lib/apacheds-interceptors-collective-2.0.0-M15.jar:/x1/jenkins/jenkins-slave/workspace/Lucene-Solr-NightlyTests-7.x/checkout/solr/core/test-lib/apacheds-interceptors-event-2.0.0-M15.jar:/x1/jenkins/jenkins-slave/workspace/Lucene-Solr-NightlyTests-7.x/checkout/solr/core/test-lib/apacheds-interceptors-exception-2.0.0-M15.jar:/x1/jenkins/jenkins-slave/workspace/Lucene-Solr-NightlyTests-7.x/checkout/solr/core/test-lib/apacheds-interceptors-journal-2.0.0-M15.jar:/x1/jenkins/jenkins-slave/workspace/Lucene-Solr-NightlyTests-7.x/checkout/solr/core/test-lib/apacheds-interceptors-normalization-2.0.0-M15.jar:/x1/jenkins/jenkins-slave/workspace/Lucene-Solr-NightlyTests-7.x/checkout/solr/core/test-lib/apacheds-interceptors-operational-2.0.0-M15.jar:/x1/jenkins/jenkins-slave/workspace/Lucene-Solr-NightlyTests-7.x/checkout/solr/core/test-lib/apacheds-interceptors-referral-2.0.0-M15.jar:/x1/jenkins/jenkins-slave/workspace/Lucene-Solr-NightlyTests-7.x/checkout/solr/core/test-lib/apacheds-interceptors-schema-2.0.0-M15.jar:/x1/jenkins/jenkins-slave/workspace/Lucene-Solr-NightlyTests-7.x/checkout/solr/core/test-lib/apacheds-interceptors-subtree-2.0.0-M15.jar:/x1/jenkins/jenkins-slave/workspace/Lucene-Solr-NightlyTests-7.x/checkout/solr/core/test-lib/apacheds-interceptors-trigger-2.0.0-M15.jar:/x1/jenkins/jenkins-slave/workspace/Lucene-Solr-NightlyTests-7.x/checkout/solr/core/test-lib/apacheds-jdbm-partition-2.0.0-M15.jar:/x1/jenkins/jenkins-slave/workspace/Lucene-Solr-NightlyTests-7.x/checkout/solr/core/test-lib/apacheds-jdbm1-2.0.0-M2.jar:/x1/jenkins/jenkins-slave/workspace/Lucene-Solr-NightlyTests-7.x/checkout/solr/core/test-lib/apacheds-kerberos-codec-2.0.0-M15.jar:/x1/jenkins/jenkins-slave/workspace/Lucene-Solr-NightlyTests-7.x/checkout/solr/core/test-lib/apacheds-ldif-partition-2.0.0-M15.jar:/x1/jenkins/jenkins-slave/workspace/Lucene-Solr-NightlyTests-7.x/checkout/solr/core/test-lib/apacheds-mavibot-partition-2.0.0-M15.jar:/x1/jenkins/jenkins-slave/workspace/Lucene-Solr-NightlyTests-7.x/checkout/solr/core/test-lib/apacheds-protocol-kerberos-2.0.0-M15.jar:/x1/jenkins/jenkins-slave/workspace/Lucene-Solr-NightlyTests-7.x/checkout/solr/core/test-lib/apacheds-protocol-ldap-2.0.0-M15.jar:/x1/jenkins/jenkins-slave/workspace/Lucene-Solr-NightlyTests-7.x/checkout/solr/core/test-lib/apacheds-protocol-shared-2.0.0-M15.jar:/x1/jenkins/jenkins-slave/workspace/Lucene-Solr-NightlyTests-7.x/checkout/solr/core/test-lib/apacheds-xdbm-partition-2.0.0-M15.jar:/x1/jenkins/jenkins-slave/workspace/Lucene-Solr-NightlyTests-7.x/checkout/solr/core/test-lib/api-all-1.0.0-M20.jar:/x1/jenkins/jenkins-slave/workspace/Lucene-Solr-NightlyTests-7.x/checkout/solr/core/test-lib/bcprov-jdk15on-1.54.jar:/x1/jenkins/jenkins-slave/workspace/Lucene-Solr-NightlyTests-7.x/checkout/solr/core/test-lib/byte-buddy-1.6.2.jar:/x1/jenkins/jenkins-slave/workspace/Lucene-Solr-NightlyTests-7.x/checkout/solr/core/test-lib/commons-collections-3.2.2.jar:/x1/jenkins/jenkins-slave/workspace/Lucene-Solr-NightlyTests-7.x/checkout/solr/core/test-lib/ehcache-core-2.4.4.jar:/x1/jenkins/jenkins-slave/workspace/Lucene-Solr-NightlyTests-7.x/checkout/solr/core/test-lib/hadoop-common-2.7.4-tests.jar:/x1/jenkins/jenkins-slave/workspace/Lucene-Solr-NightlyTests-7.x/checkout/solr/core/test-lib/hadoop-hdfs-2.7.4-tests.jar:/x1/jenkins/jenkins-slave/workspace/Lucene-Solr-NightlyTests-7.x/checkout/solr/core/test-lib/hadoop-minikdc-2.7.4.jar:/x1/jenkins/jenkins-slave/workspace/Lucene-Solr-NightlyTests-7.x/checkout/solr/core/test-lib/htrace-core-3.2.0-incubating.jar:/x1/jenkins/jenkins-slave/workspace/Lucene-Solr-NightlyTests-7.x/checkout/solr/core/test-lib/jersey-core-1.9.jar:/x1/jenkins/jenkins-slave/workspace/Lucene-Solr-NightlyTests-7.x/checkout/solr/core/test-lib/jersey-server-1.9.jar:/x1/jenkins/jenkins-slave/workspace/Lucene-Solr-NightlyTests-7.x/checkout/solr/core/test-lib/jetty-6.1.26.jar:/x1/jenkins/jenkins-slave/workspace/Lucene-Solr-NightlyTests-7.x/checkout/solr/core/test-lib/jetty-sslengine-6.1.26.jar:/x1/jenkins/jenkins-slave/workspace/Lucene-Solr-NightlyTests-7.x/checkout/solr/core/test-lib/jetty-util-6.1.26.jar:/x1/jenkins/jenkins-slave/workspace/Lucene-Solr-NightlyTests-7.x/checkout/solr/core/test-lib/mina-core-2.0.0-M5.jar:/x1/jenkins/jenkins-slave/workspace/Lucene-Solr-NightlyTests-7.x/checkout/solr/core/test-lib/mockito-core-2.6.2.jar:/x1/jenkins/jenkins-slave/workspace/Lucene-Solr-NightlyTests-7.x/checkout/solr/core/test-lib/netty-all-4.0.36.Final.jar:/x1/jenkins/jenkins-slave/workspace/Lucene-Solr-NightlyTests-7.x/checkout/solr/core/test-lib/objenesis-2.5.jar:/x1/jenkins/jenkins-slave/workspace/Lucene-Solr-NightlyTests-7.x/checkout/lucene/build/analysis/icu/lucene-analyzers-icu-7.6.0-SNAPSHOT.jar:/x1/jenkins/jenkins-slave/workspace/Lucene-Solr-NightlyTests-7.x/checkout/solr/build/contrib/solr-analysis-extras/classes/java:/x1/jenkins/jenkins-slave/workspace/Lucene-Solr-NightlyTests-7.x/checkout/lucene/build/queryparser/classes/test:/x1/jenkins/jenkins-slave/workspace/Lucene-Solr-NightlyTests-7.x/checkout/lucene/build/backward-codecs/classes/test:/x1/jenkins/jenkins-slave/workspace/Lucene-Solr-NightlyTests-7.x/checkout/solr/contrib/analysis-extras/lib/icu4j-62.1.jar:/home/jenkins/tools/ant/apache-ant-1.8.4/lib/ant-launcher.jar:/x1/jenkins/.ant/lib/ivy-2.4.0.jar:/home/jenkins/tools/ant/apache-ant-1.8.4/lib/ant-junit.jar:/home/jenkins/tools/ant/apache-ant-1.8.4/lib/ant-apache-log4j.jar:/home/jenkins/tools/ant/apache-ant-1.8.4/lib/ant-junit4.jar:/home/jenkins/tools/ant/apache-ant-1.8.4/lib/ant-jai.jar:/home/jenkins/tools/ant/apache-ant-1.8.4/lib/ant-javamail.jar:/home/jenkins/tools/ant/apache-ant-1.8.4/lib/ant-apache-bsf.jar:/home/jenkins/tools/ant/apache-ant-1.8.4/lib/ant-commons-net.jar:/home/jenkins/tools/ant/apache-ant-1.8.4/lib/ant-antlr.jar:/home/jenkins/tools/ant/apache-ant-1.8.4/lib/ant-jsch.jar:/home/jenkins/tools/ant/apache-ant-1.8.4/lib/ant-apache-oro.jar:/home/jenkins/tools/ant/apache-ant-1.8.4/lib/ant-commons-logging.jar:/home/jenkins/tools/ant/apache-ant-1.8.4/lib/ant.jar:/home/jenkins/tools/ant/apache-ant-1.8.4/lib/ant-netrexx.jar:/home/jenkins/tools/ant/apache-ant-1.8.4/lib/ant-testutil.jar:/home/jenkins/tools/ant/apache-ant-1.8.4/lib/ant-jdepend.jar:/home/jenkins/tools/ant/apache-ant-1.8.4/lib/ant-apache-bcel.jar:/home/jenkins/tools/ant/apache-ant-1.8.4/lib/ant-apache-xalan2.jar:/home/jenkins/tools/ant/apache-ant-1.8.4/lib/ant-apache-resolver.jar:/home/jenkins/tools/ant/apache-ant-1.8.4/lib/ant-jmf.jar:/home/jenkins/tools/ant/apache-ant-1.8.4/lib/ant-apache-regexp.jar:/home/jenkins/tools/ant/apache-ant-1.8.4/lib/ant-swing.jar:/usr/local/asfpackages/java/jdk1.8.0_172/lib/tools.jar:/x1/jenkins/.ivy2/cache/com.carrotsearch.randomizedtesting/junit4-ant/jars/junit4-ant-2.6.4.jar
com.carrotsearch.ant.tasks.junit4.slave.SlaveMainSafe -eventsfile /x1/jenkins/jenkins-slave/workspace/Lucene-Solr-NightlyTests-7.x/checkout/solr/build/solr-core/test/temp/junit4-J0-20181002_031809_7056822534153860444489.events
@/x1/jenkins/jenkins-slave/workspace/Lucene-Solr-NightlyTests-7.x/checkout/solr/build/solr-core/test/temp/junit4-J0-20181002_031809_7052094999401018932342.suites
-stdin
   [junit4] ERROR: JVM J0 ended with an exception: Quit event not received from the forked
process? This may indicate JVM crash or runner bugs.
   [junit4] 	at com.carrotsearch.ant.tasks.junit4.JUnit4.executeSlave(JUnit4.java:1563)
   [junit4] 	at com.carrotsearch.ant.tasks.junit4.JUnit4.access$000(JUnit4.java:123)
   [junit4] 	at com.carrotsearch.ant.tasks.junit4.JUnit4$2.call(JUnit4.java:997)
   [junit4] 	at com.carrotsearch.ant.tasks.junit4.JUnit4$2.call(JUnit4.java:994)
   [junit4] 	at java.util.concurrent.FutureTask.run(FutureTask.java:266)
   [junit4] 	at java.util.concurrent.ThreadPoolExecutor.runWorker(ThreadPoolExecutor.java:1149)
   [junit4] 	at java.util.concurrent.ThreadPoolExecutor$Worker.run(ThreadPoolExecutor.java:624)
   [junit4] 	at java.lang.Thread.run(Thread.java:748)

BUILD FAILED
/x1/jenkins/jenkins-slave/workspace/Lucene-Solr-NightlyTests-7.x/checkout/build.xml:651: The
following error occurred while executing this line:
/x1/jenkins/jenkins-slave/workspace/Lucene-Solr-NightlyTests-7.x/checkout/build.xml:577: The
following error occurred while executing this line:
/x1/jenkins/jenkins-slave/workspace/Lucene-Solr-NightlyTests-7.x/checkout/build.xml:59: The
following error occurred while executing this line:
/x1/jenkins/jenkins-slave/workspace/Lucene-Solr-NightlyTests-7.x/checkout/solr/build.xml:267:
The following error occurred while executing this line:
/x1/jenkins/jenkins-slave/workspace/Lucene-Solr-NightlyTests-7.x/checkout/solr/common-build.xml:558:
The following error occurred while executing this line:
/x1/jenkins/jenkins-slave/workspace/Lucene-Solr-NightlyTests-7.x/checkout/lucene/common-build.xml:1567:
The following error occurred while executing this line:
/x1/jenkins/jenkins-slave/workspace/Lucene-Solr-NightlyTests-7.x/checkout/lucene/common-build.xml:1092:
At least one slave process threw an exception, first: Quit event not received from the forked
process? This may indicate JVM crash or runner bugs.

Total time: 293 minutes 41 seconds
Build step 'Invoke Ant' marked build as failure
Archiving artifacts
[Fast Archiver] No artifacts from Lucene-Solr-NightlyTests-7.x #333 to compare, so performing
full copy of artifacts
Recording test results
Email was triggered for: Failure - Any
Sending email for trigger: Failure - Any

Mime
View raw message