lucene-dev mailing list archives

Site index · List index
Message view « Date » · « Thread »
Top « Date » · « Thread »
From Policeman Jenkins Server <jenk...@thetaphi.de>
Subject [JENKINS] Lucene-Solr-7.x-Windows (64bit/jdk1.8.0_172) - Build # 865 - Still Unstable!
Date Thu, 01 Nov 2018 12:16:26 GMT
Build: https://jenkins.thetaphi.de/job/Lucene-Solr-7.x-Windows/865/
Java: 64bit/jdk1.8.0_172 -XX:+UseCompressedOops -XX:+UseG1GC

7 tests failed.
FAILED:  org.apache.solr.cloud.autoscaling.TriggerIntegrationTest.testTriggerThrottling

Error Message:
Both triggers should have fired by now

Stack Trace:
java.lang.AssertionError: Both triggers should have fired by now
	at __randomizedtesting.SeedInfo.seed([EEF70F0E17CFAD97:15D5A72BC5654E05]:0)
	at org.junit.Assert.fail(Assert.java:93)
	at org.apache.solr.cloud.autoscaling.TriggerIntegrationTest.testTriggerThrottling(TriggerIntegrationTest.java:222)
	at sun.reflect.NativeMethodAccessorImpl.invoke0(Native Method)
	at sun.reflect.NativeMethodAccessorImpl.invoke(NativeMethodAccessorImpl.java:62)
	at sun.reflect.DelegatingMethodAccessorImpl.invoke(DelegatingMethodAccessorImpl.java:43)
	at java.lang.reflect.Method.invoke(Method.java:498)
	at com.carrotsearch.randomizedtesting.RandomizedRunner.invoke(RandomizedRunner.java:1742)
	at com.carrotsearch.randomizedtesting.RandomizedRunner$8.evaluate(RandomizedRunner.java:935)
	at com.carrotsearch.randomizedtesting.RandomizedRunner$9.evaluate(RandomizedRunner.java:971)
	at com.carrotsearch.randomizedtesting.RandomizedRunner$10.evaluate(RandomizedRunner.java:985)
	at com.carrotsearch.randomizedtesting.rules.SystemPropertiesRestoreRule$1.evaluate(SystemPropertiesRestoreRule.java:57)
	at org.apache.lucene.util.TestRuleSetupTeardownChained$1.evaluate(TestRuleSetupTeardownChained.java:49)
	at org.apache.lucene.util.AbstractBeforeAfterRule$1.evaluate(AbstractBeforeAfterRule.java:45)
	at org.apache.lucene.util.TestRuleThreadAndTestName$1.evaluate(TestRuleThreadAndTestName.java:48)
	at org.apache.lucene.util.TestRuleIgnoreAfterMaxFailures$1.evaluate(TestRuleIgnoreAfterMaxFailures.java:64)
	at org.apache.lucene.util.TestRuleMarkFailure$1.evaluate(TestRuleMarkFailure.java:47)
	at com.carrotsearch.randomizedtesting.rules.StatementAdapter.evaluate(StatementAdapter.java:36)
	at com.carrotsearch.randomizedtesting.ThreadLeakControl$StatementRunner.run(ThreadLeakControl.java:368)
	at com.carrotsearch.randomizedtesting.ThreadLeakControl.forkTimeoutingTask(ThreadLeakControl.java:817)
	at com.carrotsearch.randomizedtesting.ThreadLeakControl$3.evaluate(ThreadLeakControl.java:468)
	at com.carrotsearch.randomizedtesting.RandomizedRunner.runSingleTest(RandomizedRunner.java:944)
	at com.carrotsearch.randomizedtesting.RandomizedRunner$5.evaluate(RandomizedRunner.java:830)
	at com.carrotsearch.randomizedtesting.RandomizedRunner$6.evaluate(RandomizedRunner.java:880)
	at com.carrotsearch.randomizedtesting.RandomizedRunner$7.evaluate(RandomizedRunner.java:891)
	at com.carrotsearch.randomizedtesting.rules.StatementAdapter.evaluate(StatementAdapter.java:36)
	at com.carrotsearch.randomizedtesting.rules.SystemPropertiesRestoreRule$1.evaluate(SystemPropertiesRestoreRule.java:57)
	at org.apache.lucene.util.AbstractBeforeAfterRule$1.evaluate(AbstractBeforeAfterRule.java:45)
	at com.carrotsearch.randomizedtesting.rules.StatementAdapter.evaluate(StatementAdapter.java:36)
	at org.apache.lucene.util.TestRuleStoreClassName$1.evaluate(TestRuleStoreClassName.java:41)
	at com.carrotsearch.randomizedtesting.rules.NoShadowingOrOverridesOnMethodsRule$1.evaluate(NoShadowingOrOverridesOnMethodsRule.java:40)
	at com.carrotsearch.randomizedtesting.rules.NoShadowingOrOverridesOnMethodsRule$1.evaluate(NoShadowingOrOverridesOnMethodsRule.java:40)
	at com.carrotsearch.randomizedtesting.rules.StatementAdapter.evaluate(StatementAdapter.java:36)
	at com.carrotsearch.randomizedtesting.rules.StatementAdapter.evaluate(StatementAdapter.java:36)
	at com.carrotsearch.randomizedtesting.rules.StatementAdapter.evaluate(StatementAdapter.java:36)
	at org.apache.lucene.util.TestRuleAssertionsRequired$1.evaluate(TestRuleAssertionsRequired.java:53)
	at org.apache.lucene.util.TestRuleMarkFailure$1.evaluate(TestRuleMarkFailure.java:47)
	at org.apache.lucene.util.TestRuleIgnoreAfterMaxFailures$1.evaluate(TestRuleIgnoreAfterMaxFailures.java:64)
	at org.apache.lucene.util.TestRuleIgnoreTestSuites$1.evaluate(TestRuleIgnoreTestSuites.java:54)
	at com.carrotsearch.randomizedtesting.rules.StatementAdapter.evaluate(StatementAdapter.java:36)
	at com.carrotsearch.randomizedtesting.ThreadLeakControl$StatementRunner.run(ThreadLeakControl.java:368)
	at java.lang.Thread.run(Thread.java:748)


FAILED:  org.apache.solr.cloud.autoscaling.TriggerIntegrationTest.testTriggerThrottling

Error Message:
Both triggers should have fired by now

Stack Trace:
java.lang.AssertionError: Both triggers should have fired by now
	at __randomizedtesting.SeedInfo.seed([EEF70F0E17CFAD97:15D5A72BC5654E05]:0)
	at org.junit.Assert.fail(Assert.java:93)
	at org.apache.solr.cloud.autoscaling.TriggerIntegrationTest.testTriggerThrottling(TriggerIntegrationTest.java:270)
	at sun.reflect.NativeMethodAccessorImpl.invoke0(Native Method)
	at sun.reflect.NativeMethodAccessorImpl.invoke(NativeMethodAccessorImpl.java:62)
	at sun.reflect.DelegatingMethodAccessorImpl.invoke(DelegatingMethodAccessorImpl.java:43)
	at java.lang.reflect.Method.invoke(Method.java:498)
	at com.carrotsearch.randomizedtesting.RandomizedRunner.invoke(RandomizedRunner.java:1742)
	at com.carrotsearch.randomizedtesting.RandomizedRunner$8.evaluate(RandomizedRunner.java:935)
	at com.carrotsearch.randomizedtesting.RandomizedRunner$9.evaluate(RandomizedRunner.java:971)
	at com.carrotsearch.randomizedtesting.RandomizedRunner$10.evaluate(RandomizedRunner.java:985)
	at com.carrotsearch.randomizedtesting.rules.SystemPropertiesRestoreRule$1.evaluate(SystemPropertiesRestoreRule.java:57)
	at org.apache.lucene.util.TestRuleSetupTeardownChained$1.evaluate(TestRuleSetupTeardownChained.java:49)
	at org.apache.lucene.util.AbstractBeforeAfterRule$1.evaluate(AbstractBeforeAfterRule.java:45)
	at org.apache.lucene.util.TestRuleThreadAndTestName$1.evaluate(TestRuleThreadAndTestName.java:48)
	at org.apache.lucene.util.TestRuleIgnoreAfterMaxFailures$1.evaluate(TestRuleIgnoreAfterMaxFailures.java:64)
	at org.apache.lucene.util.TestRuleMarkFailure$1.evaluate(TestRuleMarkFailure.java:47)
	at com.carrotsearch.randomizedtesting.rules.StatementAdapter.evaluate(StatementAdapter.java:36)
	at com.carrotsearch.randomizedtesting.ThreadLeakControl$StatementRunner.run(ThreadLeakControl.java:368)
	at com.carrotsearch.randomizedtesting.ThreadLeakControl.forkTimeoutingTask(ThreadLeakControl.java:817)
	at com.carrotsearch.randomizedtesting.ThreadLeakControl$3.evaluate(ThreadLeakControl.java:468)
	at com.carrotsearch.randomizedtesting.RandomizedRunner.runSingleTest(RandomizedRunner.java:944)
	at com.carrotsearch.randomizedtesting.RandomizedRunner$5.evaluate(RandomizedRunner.java:830)
	at com.carrotsearch.randomizedtesting.RandomizedRunner$6.evaluate(RandomizedRunner.java:880)
	at com.carrotsearch.randomizedtesting.RandomizedRunner$7.evaluate(RandomizedRunner.java:891)
	at com.carrotsearch.randomizedtesting.rules.StatementAdapter.evaluate(StatementAdapter.java:36)
	at com.carrotsearch.randomizedtesting.rules.SystemPropertiesRestoreRule$1.evaluate(SystemPropertiesRestoreRule.java:57)
	at org.apache.lucene.util.AbstractBeforeAfterRule$1.evaluate(AbstractBeforeAfterRule.java:45)
	at com.carrotsearch.randomizedtesting.rules.StatementAdapter.evaluate(StatementAdapter.java:36)
	at org.apache.lucene.util.TestRuleStoreClassName$1.evaluate(TestRuleStoreClassName.java:41)
	at com.carrotsearch.randomizedtesting.rules.NoShadowingOrOverridesOnMethodsRule$1.evaluate(NoShadowingOrOverridesOnMethodsRule.java:40)
	at com.carrotsearch.randomizedtesting.rules.NoShadowingOrOverridesOnMethodsRule$1.evaluate(NoShadowingOrOverridesOnMethodsRule.java:40)
	at com.carrotsearch.randomizedtesting.rules.StatementAdapter.evaluate(StatementAdapter.java:36)
	at com.carrotsearch.randomizedtesting.rules.StatementAdapter.evaluate(StatementAdapter.java:36)
	at com.carrotsearch.randomizedtesting.rules.StatementAdapter.evaluate(StatementAdapter.java:36)
	at org.apache.lucene.util.TestRuleAssertionsRequired$1.evaluate(TestRuleAssertionsRequired.java:53)
	at org.apache.lucene.util.TestRuleMarkFailure$1.evaluate(TestRuleMarkFailure.java:47)
	at org.apache.lucene.util.TestRuleIgnoreAfterMaxFailures$1.evaluate(TestRuleIgnoreAfterMaxFailures.java:64)
	at org.apache.lucene.util.TestRuleIgnoreTestSuites$1.evaluate(TestRuleIgnoreTestSuites.java:54)
	at com.carrotsearch.randomizedtesting.rules.StatementAdapter.evaluate(StatementAdapter.java:36)
	at com.carrotsearch.randomizedtesting.ThreadLeakControl$StatementRunner.run(ThreadLeakControl.java:368)
	at java.lang.Thread.run(Thread.java:748)


FAILED:  org.apache.solr.cloud.autoscaling.TriggerIntegrationTest.testTriggerThrottling

Error Message:
Both triggers should have fired by now

Stack Trace:
java.lang.AssertionError: Both triggers should have fired by now
	at __randomizedtesting.SeedInfo.seed([EEF70F0E17CFAD97:15D5A72BC5654E05]:0)
	at org.junit.Assert.fail(Assert.java:93)
	at org.apache.solr.cloud.autoscaling.TriggerIntegrationTest.testTriggerThrottling(TriggerIntegrationTest.java:222)
	at sun.reflect.NativeMethodAccessorImpl.invoke0(Native Method)
	at sun.reflect.NativeMethodAccessorImpl.invoke(NativeMethodAccessorImpl.java:62)
	at sun.reflect.DelegatingMethodAccessorImpl.invoke(DelegatingMethodAccessorImpl.java:43)
	at java.lang.reflect.Method.invoke(Method.java:498)
	at com.carrotsearch.randomizedtesting.RandomizedRunner.invoke(RandomizedRunner.java:1742)
	at com.carrotsearch.randomizedtesting.RandomizedRunner$8.evaluate(RandomizedRunner.java:935)
	at com.carrotsearch.randomizedtesting.RandomizedRunner$9.evaluate(RandomizedRunner.java:971)
	at com.carrotsearch.randomizedtesting.RandomizedRunner$10.evaluate(RandomizedRunner.java:985)
	at com.carrotsearch.randomizedtesting.rules.SystemPropertiesRestoreRule$1.evaluate(SystemPropertiesRestoreRule.java:57)
	at org.apache.lucene.util.TestRuleSetupTeardownChained$1.evaluate(TestRuleSetupTeardownChained.java:49)
	at org.apache.lucene.util.AbstractBeforeAfterRule$1.evaluate(AbstractBeforeAfterRule.java:45)
	at org.apache.lucene.util.TestRuleThreadAndTestName$1.evaluate(TestRuleThreadAndTestName.java:48)
	at org.apache.lucene.util.TestRuleIgnoreAfterMaxFailures$1.evaluate(TestRuleIgnoreAfterMaxFailures.java:64)
	at org.apache.lucene.util.TestRuleMarkFailure$1.evaluate(TestRuleMarkFailure.java:47)
	at com.carrotsearch.randomizedtesting.rules.StatementAdapter.evaluate(StatementAdapter.java:36)
	at com.carrotsearch.randomizedtesting.ThreadLeakControl$StatementRunner.run(ThreadLeakControl.java:368)
	at com.carrotsearch.randomizedtesting.ThreadLeakControl.forkTimeoutingTask(ThreadLeakControl.java:817)
	at com.carrotsearch.randomizedtesting.ThreadLeakControl$3.evaluate(ThreadLeakControl.java:468)
	at com.carrotsearch.randomizedtesting.RandomizedRunner.runSingleTest(RandomizedRunner.java:944)
	at com.carrotsearch.randomizedtesting.RandomizedRunner$5.evaluate(RandomizedRunner.java:830)
	at com.carrotsearch.randomizedtesting.RandomizedRunner$6.evaluate(RandomizedRunner.java:880)
	at com.carrotsearch.randomizedtesting.RandomizedRunner$7.evaluate(RandomizedRunner.java:891)
	at com.carrotsearch.randomizedtesting.rules.StatementAdapter.evaluate(StatementAdapter.java:36)
	at com.carrotsearch.randomizedtesting.rules.SystemPropertiesRestoreRule$1.evaluate(SystemPropertiesRestoreRule.java:57)
	at org.apache.lucene.util.AbstractBeforeAfterRule$1.evaluate(AbstractBeforeAfterRule.java:45)
	at com.carrotsearch.randomizedtesting.rules.StatementAdapter.evaluate(StatementAdapter.java:36)
	at org.apache.lucene.util.TestRuleStoreClassName$1.evaluate(TestRuleStoreClassName.java:41)
	at com.carrotsearch.randomizedtesting.rules.NoShadowingOrOverridesOnMethodsRule$1.evaluate(NoShadowingOrOverridesOnMethodsRule.java:40)
	at com.carrotsearch.randomizedtesting.rules.NoShadowingOrOverridesOnMethodsRule$1.evaluate(NoShadowingOrOverridesOnMethodsRule.java:40)
	at com.carrotsearch.randomizedtesting.rules.StatementAdapter.evaluate(StatementAdapter.java:36)
	at com.carrotsearch.randomizedtesting.rules.StatementAdapter.evaluate(StatementAdapter.java:36)
	at com.carrotsearch.randomizedtesting.rules.StatementAdapter.evaluate(StatementAdapter.java:36)
	at org.apache.lucene.util.TestRuleAssertionsRequired$1.evaluate(TestRuleAssertionsRequired.java:53)
	at org.apache.lucene.util.TestRuleMarkFailure$1.evaluate(TestRuleMarkFailure.java:47)
	at org.apache.lucene.util.TestRuleIgnoreAfterMaxFailures$1.evaluate(TestRuleIgnoreAfterMaxFailures.java:64)
	at org.apache.lucene.util.TestRuleIgnoreTestSuites$1.evaluate(TestRuleIgnoreTestSuites.java:54)
	at com.carrotsearch.randomizedtesting.rules.StatementAdapter.evaluate(StatementAdapter.java:36)
	at com.carrotsearch.randomizedtesting.ThreadLeakControl$StatementRunner.run(ThreadLeakControl.java:368)
	at java.lang.Thread.run(Thread.java:748)


FAILED:  org.apache.solr.cloud.autoscaling.TriggerSetPropertiesIntegrationTest.testSetProperties

Error Message:


Stack Trace:
java.lang.AssertionError
	at __randomizedtesting.SeedInfo.seed([EEF70F0E17CFAD97:8593D847A4E23813]:0)
	at org.junit.Assert.fail(Assert.java:92)
	at org.junit.Assert.assertTrue(Assert.java:43)
	at org.junit.Assert.assertTrue(Assert.java:54)
	at org.apache.solr.cloud.autoscaling.TriggerSetPropertiesIntegrationTest.testSetProperties(TriggerSetPropertiesIntegrationTest.java:111)
	at sun.reflect.NativeMethodAccessorImpl.invoke0(Native Method)
	at sun.reflect.NativeMethodAccessorImpl.invoke(NativeMethodAccessorImpl.java:62)
	at sun.reflect.DelegatingMethodAccessorImpl.invoke(DelegatingMethodAccessorImpl.java:43)
	at java.lang.reflect.Method.invoke(Method.java:498)
	at com.carrotsearch.randomizedtesting.RandomizedRunner.invoke(RandomizedRunner.java:1742)
	at com.carrotsearch.randomizedtesting.RandomizedRunner$8.evaluate(RandomizedRunner.java:935)
	at com.carrotsearch.randomizedtesting.RandomizedRunner$9.evaluate(RandomizedRunner.java:971)
	at com.carrotsearch.randomizedtesting.RandomizedRunner$10.evaluate(RandomizedRunner.java:985)
	at com.carrotsearch.randomizedtesting.rules.SystemPropertiesRestoreRule$1.evaluate(SystemPropertiesRestoreRule.java:57)
	at org.apache.lucene.util.TestRuleSetupTeardownChained$1.evaluate(TestRuleSetupTeardownChained.java:49)
	at org.apache.lucene.util.AbstractBeforeAfterRule$1.evaluate(AbstractBeforeAfterRule.java:45)
	at org.apache.lucene.util.TestRuleThreadAndTestName$1.evaluate(TestRuleThreadAndTestName.java:48)
	at org.apache.lucene.util.TestRuleIgnoreAfterMaxFailures$1.evaluate(TestRuleIgnoreAfterMaxFailures.java:64)
	at org.apache.lucene.util.TestRuleMarkFailure$1.evaluate(TestRuleMarkFailure.java:47)
	at com.carrotsearch.randomizedtesting.rules.StatementAdapter.evaluate(StatementAdapter.java:36)
	at com.carrotsearch.randomizedtesting.ThreadLeakControl$StatementRunner.run(ThreadLeakControl.java:368)
	at com.carrotsearch.randomizedtesting.ThreadLeakControl.forkTimeoutingTask(ThreadLeakControl.java:817)
	at com.carrotsearch.randomizedtesting.ThreadLeakControl$3.evaluate(ThreadLeakControl.java:468)
	at com.carrotsearch.randomizedtesting.RandomizedRunner.runSingleTest(RandomizedRunner.java:944)
	at com.carrotsearch.randomizedtesting.RandomizedRunner$5.evaluate(RandomizedRunner.java:830)
	at com.carrotsearch.randomizedtesting.RandomizedRunner$6.evaluate(RandomizedRunner.java:880)
	at com.carrotsearch.randomizedtesting.RandomizedRunner$7.evaluate(RandomizedRunner.java:891)
	at com.carrotsearch.randomizedtesting.rules.StatementAdapter.evaluate(StatementAdapter.java:36)
	at com.carrotsearch.randomizedtesting.rules.SystemPropertiesRestoreRule$1.evaluate(SystemPropertiesRestoreRule.java:57)
	at org.apache.lucene.util.AbstractBeforeAfterRule$1.evaluate(AbstractBeforeAfterRule.java:45)
	at com.carrotsearch.randomizedtesting.rules.StatementAdapter.evaluate(StatementAdapter.java:36)
	at org.apache.lucene.util.TestRuleStoreClassName$1.evaluate(TestRuleStoreClassName.java:41)
	at com.carrotsearch.randomizedtesting.rules.NoShadowingOrOverridesOnMethodsRule$1.evaluate(NoShadowingOrOverridesOnMethodsRule.java:40)
	at com.carrotsearch.randomizedtesting.rules.NoShadowingOrOverridesOnMethodsRule$1.evaluate(NoShadowingOrOverridesOnMethodsRule.java:40)
	at com.carrotsearch.randomizedtesting.rules.StatementAdapter.evaluate(StatementAdapter.java:36)
	at com.carrotsearch.randomizedtesting.rules.StatementAdapter.evaluate(StatementAdapter.java:36)
	at com.carrotsearch.randomizedtesting.rules.StatementAdapter.evaluate(StatementAdapter.java:36)
	at org.apache.lucene.util.TestRuleAssertionsRequired$1.evaluate(TestRuleAssertionsRequired.java:53)
	at org.apache.lucene.util.TestRuleMarkFailure$1.evaluate(TestRuleMarkFailure.java:47)
	at org.apache.lucene.util.TestRuleIgnoreAfterMaxFailures$1.evaluate(TestRuleIgnoreAfterMaxFailures.java:64)
	at org.apache.lucene.util.TestRuleIgnoreTestSuites$1.evaluate(TestRuleIgnoreTestSuites.java:54)
	at com.carrotsearch.randomizedtesting.rules.StatementAdapter.evaluate(StatementAdapter.java:36)
	at com.carrotsearch.randomizedtesting.ThreadLeakControl$StatementRunner.run(ThreadLeakControl.java:368)
	at java.lang.Thread.run(Thread.java:748)


FAILED:  org.apache.solr.cloud.autoscaling.TriggerSetPropertiesIntegrationTest.testSetProperties

Error Message:


Stack Trace:
java.lang.AssertionError
	at __randomizedtesting.SeedInfo.seed([EEF70F0E17CFAD97:8593D847A4E23813]:0)
	at org.junit.Assert.fail(Assert.java:92)
	at org.junit.Assert.assertTrue(Assert.java:43)
	at org.junit.Assert.assertTrue(Assert.java:54)
	at org.apache.solr.cloud.autoscaling.TriggerSetPropertiesIntegrationTest.testSetProperties(TriggerSetPropertiesIntegrationTest.java:111)
	at sun.reflect.NativeMethodAccessorImpl.invoke0(Native Method)
	at sun.reflect.NativeMethodAccessorImpl.invoke(NativeMethodAccessorImpl.java:62)
	at sun.reflect.DelegatingMethodAccessorImpl.invoke(DelegatingMethodAccessorImpl.java:43)
	at java.lang.reflect.Method.invoke(Method.java:498)
	at com.carrotsearch.randomizedtesting.RandomizedRunner.invoke(RandomizedRunner.java:1742)
	at com.carrotsearch.randomizedtesting.RandomizedRunner$8.evaluate(RandomizedRunner.java:935)
	at com.carrotsearch.randomizedtesting.RandomizedRunner$9.evaluate(RandomizedRunner.java:971)
	at com.carrotsearch.randomizedtesting.RandomizedRunner$10.evaluate(RandomizedRunner.java:985)
	at com.carrotsearch.randomizedtesting.rules.SystemPropertiesRestoreRule$1.evaluate(SystemPropertiesRestoreRule.java:57)
	at org.apache.lucene.util.TestRuleSetupTeardownChained$1.evaluate(TestRuleSetupTeardownChained.java:49)
	at org.apache.lucene.util.AbstractBeforeAfterRule$1.evaluate(AbstractBeforeAfterRule.java:45)
	at org.apache.lucene.util.TestRuleThreadAndTestName$1.evaluate(TestRuleThreadAndTestName.java:48)
	at org.apache.lucene.util.TestRuleIgnoreAfterMaxFailures$1.evaluate(TestRuleIgnoreAfterMaxFailures.java:64)
	at org.apache.lucene.util.TestRuleMarkFailure$1.evaluate(TestRuleMarkFailure.java:47)
	at com.carrotsearch.randomizedtesting.rules.StatementAdapter.evaluate(StatementAdapter.java:36)
	at com.carrotsearch.randomizedtesting.ThreadLeakControl$StatementRunner.run(ThreadLeakControl.java:368)
	at com.carrotsearch.randomizedtesting.ThreadLeakControl.forkTimeoutingTask(ThreadLeakControl.java:817)
	at com.carrotsearch.randomizedtesting.ThreadLeakControl$3.evaluate(ThreadLeakControl.java:468)
	at com.carrotsearch.randomizedtesting.RandomizedRunner.runSingleTest(RandomizedRunner.java:944)
	at com.carrotsearch.randomizedtesting.RandomizedRunner$5.evaluate(RandomizedRunner.java:830)
	at com.carrotsearch.randomizedtesting.RandomizedRunner$6.evaluate(RandomizedRunner.java:880)
	at com.carrotsearch.randomizedtesting.RandomizedRunner$7.evaluate(RandomizedRunner.java:891)
	at com.carrotsearch.randomizedtesting.rules.StatementAdapter.evaluate(StatementAdapter.java:36)
	at com.carrotsearch.randomizedtesting.rules.SystemPropertiesRestoreRule$1.evaluate(SystemPropertiesRestoreRule.java:57)
	at org.apache.lucene.util.AbstractBeforeAfterRule$1.evaluate(AbstractBeforeAfterRule.java:45)
	at com.carrotsearch.randomizedtesting.rules.StatementAdapter.evaluate(StatementAdapter.java:36)
	at org.apache.lucene.util.TestRuleStoreClassName$1.evaluate(TestRuleStoreClassName.java:41)
	at com.carrotsearch.randomizedtesting.rules.NoShadowingOrOverridesOnMethodsRule$1.evaluate(NoShadowingOrOverridesOnMethodsRule.java:40)
	at com.carrotsearch.randomizedtesting.rules.NoShadowingOrOverridesOnMethodsRule$1.evaluate(NoShadowingOrOverridesOnMethodsRule.java:40)
	at com.carrotsearch.randomizedtesting.rules.StatementAdapter.evaluate(StatementAdapter.java:36)
	at com.carrotsearch.randomizedtesting.rules.StatementAdapter.evaluate(StatementAdapter.java:36)
	at com.carrotsearch.randomizedtesting.rules.StatementAdapter.evaluate(StatementAdapter.java:36)
	at org.apache.lucene.util.TestRuleAssertionsRequired$1.evaluate(TestRuleAssertionsRequired.java:53)
	at org.apache.lucene.util.TestRuleMarkFailure$1.evaluate(TestRuleMarkFailure.java:47)
	at org.apache.lucene.util.TestRuleIgnoreAfterMaxFailures$1.evaluate(TestRuleIgnoreAfterMaxFailures.java:64)
	at org.apache.lucene.util.TestRuleIgnoreTestSuites$1.evaluate(TestRuleIgnoreTestSuites.java:54)
	at com.carrotsearch.randomizedtesting.rules.StatementAdapter.evaluate(StatementAdapter.java:36)
	at com.carrotsearch.randomizedtesting.ThreadLeakControl$StatementRunner.run(ThreadLeakControl.java:368)
	at java.lang.Thread.run(Thread.java:748)


FAILED:  org.apache.solr.cloud.autoscaling.TriggerSetPropertiesIntegrationTest.testSetProperties

Error Message:


Stack Trace:
java.lang.AssertionError
	at __randomizedtesting.SeedInfo.seed([EEF70F0E17CFAD97:8593D847A4E23813]:0)
	at org.junit.Assert.fail(Assert.java:92)
	at org.junit.Assert.assertTrue(Assert.java:43)
	at org.junit.Assert.assertTrue(Assert.java:54)
	at org.apache.solr.cloud.autoscaling.TriggerSetPropertiesIntegrationTest.testSetProperties(TriggerSetPropertiesIntegrationTest.java:111)
	at sun.reflect.NativeMethodAccessorImpl.invoke0(Native Method)
	at sun.reflect.NativeMethodAccessorImpl.invoke(NativeMethodAccessorImpl.java:62)
	at sun.reflect.DelegatingMethodAccessorImpl.invoke(DelegatingMethodAccessorImpl.java:43)
	at java.lang.reflect.Method.invoke(Method.java:498)
	at com.carrotsearch.randomizedtesting.RandomizedRunner.invoke(RandomizedRunner.java:1742)
	at com.carrotsearch.randomizedtesting.RandomizedRunner$8.evaluate(RandomizedRunner.java:935)
	at com.carrotsearch.randomizedtesting.RandomizedRunner$9.evaluate(RandomizedRunner.java:971)
	at com.carrotsearch.randomizedtesting.RandomizedRunner$10.evaluate(RandomizedRunner.java:985)
	at com.carrotsearch.randomizedtesting.rules.SystemPropertiesRestoreRule$1.evaluate(SystemPropertiesRestoreRule.java:57)
	at org.apache.lucene.util.TestRuleSetupTeardownChained$1.evaluate(TestRuleSetupTeardownChained.java:49)
	at org.apache.lucene.util.AbstractBeforeAfterRule$1.evaluate(AbstractBeforeAfterRule.java:45)
	at org.apache.lucene.util.TestRuleThreadAndTestName$1.evaluate(TestRuleThreadAndTestName.java:48)
	at org.apache.lucene.util.TestRuleIgnoreAfterMaxFailures$1.evaluate(TestRuleIgnoreAfterMaxFailures.java:64)
	at org.apache.lucene.util.TestRuleMarkFailure$1.evaluate(TestRuleMarkFailure.java:47)
	at com.carrotsearch.randomizedtesting.rules.StatementAdapter.evaluate(StatementAdapter.java:36)
	at com.carrotsearch.randomizedtesting.ThreadLeakControl$StatementRunner.run(ThreadLeakControl.java:368)
	at com.carrotsearch.randomizedtesting.ThreadLeakControl.forkTimeoutingTask(ThreadLeakControl.java:817)
	at com.carrotsearch.randomizedtesting.ThreadLeakControl$3.evaluate(ThreadLeakControl.java:468)
	at com.carrotsearch.randomizedtesting.RandomizedRunner.runSingleTest(RandomizedRunner.java:944)
	at com.carrotsearch.randomizedtesting.RandomizedRunner$5.evaluate(RandomizedRunner.java:830)
	at com.carrotsearch.randomizedtesting.RandomizedRunner$6.evaluate(RandomizedRunner.java:880)
	at com.carrotsearch.randomizedtesting.RandomizedRunner$7.evaluate(RandomizedRunner.java:891)
	at com.carrotsearch.randomizedtesting.rules.StatementAdapter.evaluate(StatementAdapter.java:36)
	at com.carrotsearch.randomizedtesting.rules.SystemPropertiesRestoreRule$1.evaluate(SystemPropertiesRestoreRule.java:57)
	at org.apache.lucene.util.AbstractBeforeAfterRule$1.evaluate(AbstractBeforeAfterRule.java:45)
	at com.carrotsearch.randomizedtesting.rules.StatementAdapter.evaluate(StatementAdapter.java:36)
	at org.apache.lucene.util.TestRuleStoreClassName$1.evaluate(TestRuleStoreClassName.java:41)
	at com.carrotsearch.randomizedtesting.rules.NoShadowingOrOverridesOnMethodsRule$1.evaluate(NoShadowingOrOverridesOnMethodsRule.java:40)
	at com.carrotsearch.randomizedtesting.rules.NoShadowingOrOverridesOnMethodsRule$1.evaluate(NoShadowingOrOverridesOnMethodsRule.java:40)
	at com.carrotsearch.randomizedtesting.rules.StatementAdapter.evaluate(StatementAdapter.java:36)
	at com.carrotsearch.randomizedtesting.rules.StatementAdapter.evaluate(StatementAdapter.java:36)
	at com.carrotsearch.randomizedtesting.rules.StatementAdapter.evaluate(StatementAdapter.java:36)
	at org.apache.lucene.util.TestRuleAssertionsRequired$1.evaluate(TestRuleAssertionsRequired.java:53)
	at org.apache.lucene.util.TestRuleMarkFailure$1.evaluate(TestRuleMarkFailure.java:47)
	at org.apache.lucene.util.TestRuleIgnoreAfterMaxFailures$1.evaluate(TestRuleIgnoreAfterMaxFailures.java:64)
	at org.apache.lucene.util.TestRuleIgnoreTestSuites$1.evaluate(TestRuleIgnoreTestSuites.java:54)
	at com.carrotsearch.randomizedtesting.rules.StatementAdapter.evaluate(StatementAdapter.java:36)
	at com.carrotsearch.randomizedtesting.ThreadLeakControl$StatementRunner.run(ThreadLeakControl.java:368)
	at java.lang.Thread.run(Thread.java:748)


FAILED:  org.apache.solr.cloud.autoscaling.TriggerSetPropertiesIntegrationTest.testSetProperties

Error Message:


Stack Trace:
java.lang.AssertionError
	at __randomizedtesting.SeedInfo.seed([EEF70F0E17CFAD97:8593D847A4E23813]:0)
	at org.junit.Assert.fail(Assert.java:92)
	at org.junit.Assert.assertTrue(Assert.java:43)
	at org.junit.Assert.assertTrue(Assert.java:54)
	at org.apache.solr.cloud.autoscaling.TriggerSetPropertiesIntegrationTest.testSetProperties(TriggerSetPropertiesIntegrationTest.java:111)
	at sun.reflect.NativeMethodAccessorImpl.invoke0(Native Method)
	at sun.reflect.NativeMethodAccessorImpl.invoke(NativeMethodAccessorImpl.java:62)
	at sun.reflect.DelegatingMethodAccessorImpl.invoke(DelegatingMethodAccessorImpl.java:43)
	at java.lang.reflect.Method.invoke(Method.java:498)
	at com.carrotsearch.randomizedtesting.RandomizedRunner.invoke(RandomizedRunner.java:1742)
	at com.carrotsearch.randomizedtesting.RandomizedRunner$8.evaluate(RandomizedRunner.java:935)
	at com.carrotsearch.randomizedtesting.RandomizedRunner$9.evaluate(RandomizedRunner.java:971)
	at com.carrotsearch.randomizedtesting.RandomizedRunner$10.evaluate(RandomizedRunner.java:985)
	at com.carrotsearch.randomizedtesting.rules.SystemPropertiesRestoreRule$1.evaluate(SystemPropertiesRestoreRule.java:57)
	at org.apache.lucene.util.TestRuleSetupTeardownChained$1.evaluate(TestRuleSetupTeardownChained.java:49)
	at org.apache.lucene.util.AbstractBeforeAfterRule$1.evaluate(AbstractBeforeAfterRule.java:45)
	at org.apache.lucene.util.TestRuleThreadAndTestName$1.evaluate(TestRuleThreadAndTestName.java:48)
	at org.apache.lucene.util.TestRuleIgnoreAfterMaxFailures$1.evaluate(TestRuleIgnoreAfterMaxFailures.java:64)
	at org.apache.lucene.util.TestRuleMarkFailure$1.evaluate(TestRuleMarkFailure.java:47)
	at com.carrotsearch.randomizedtesting.rules.StatementAdapter.evaluate(StatementAdapter.java:36)
	at com.carrotsearch.randomizedtesting.ThreadLeakControl$StatementRunner.run(ThreadLeakControl.java:368)
	at com.carrotsearch.randomizedtesting.ThreadLeakControl.forkTimeoutingTask(ThreadLeakControl.java:817)
	at com.carrotsearch.randomizedtesting.ThreadLeakControl$3.evaluate(ThreadLeakControl.java:468)
	at com.carrotsearch.randomizedtesting.RandomizedRunner.runSingleTest(RandomizedRunner.java:944)
	at com.carrotsearch.randomizedtesting.RandomizedRunner$5.evaluate(RandomizedRunner.java:830)
	at com.carrotsearch.randomizedtesting.RandomizedRunner$6.evaluate(RandomizedRunner.java:880)
	at com.carrotsearch.randomizedtesting.RandomizedRunner$7.evaluate(RandomizedRunner.java:891)
	at com.carrotsearch.randomizedtesting.rules.StatementAdapter.evaluate(StatementAdapter.java:36)
	at com.carrotsearch.randomizedtesting.rules.SystemPropertiesRestoreRule$1.evaluate(SystemPropertiesRestoreRule.java:57)
	at org.apache.lucene.util.AbstractBeforeAfterRule$1.evaluate(AbstractBeforeAfterRule.java:45)
	at com.carrotsearch.randomizedtesting.rules.StatementAdapter.evaluate(StatementAdapter.java:36)
	at org.apache.lucene.util.TestRuleStoreClassName$1.evaluate(TestRuleStoreClassName.java:41)
	at com.carrotsearch.randomizedtesting.rules.NoShadowingOrOverridesOnMethodsRule$1.evaluate(NoShadowingOrOverridesOnMethodsRule.java:40)
	at com.carrotsearch.randomizedtesting.rules.NoShadowingOrOverridesOnMethodsRule$1.evaluate(NoShadowingOrOverridesOnMethodsRule.java:40)
	at com.carrotsearch.randomizedtesting.rules.StatementAdapter.evaluate(StatementAdapter.java:36)
	at com.carrotsearch.randomizedtesting.rules.StatementAdapter.evaluate(StatementAdapter.java:36)
	at com.carrotsearch.randomizedtesting.rules.StatementAdapter.evaluate(StatementAdapter.java:36)
	at org.apache.lucene.util.TestRuleAssertionsRequired$1.evaluate(TestRuleAssertionsRequired.java:53)
	at org.apache.lucene.util.TestRuleMarkFailure$1.evaluate(TestRuleMarkFailure.java:47)
	at org.apache.lucene.util.TestRuleIgnoreAfterMaxFailures$1.evaluate(TestRuleIgnoreAfterMaxFailures.java:64)
	at org.apache.lucene.util.TestRuleIgnoreTestSuites$1.evaluate(TestRuleIgnoreTestSuites.java:54)
	at com.carrotsearch.randomizedtesting.rules.StatementAdapter.evaluate(StatementAdapter.java:36)
	at com.carrotsearch.randomizedtesting.ThreadLeakControl$StatementRunner.run(ThreadLeakControl.java:368)
	at java.lang.Thread.run(Thread.java:748)




Build Log:
[...truncated 13599 lines...]
   [junit4] Suite: org.apache.solr.cloud.autoscaling.TriggerSetPropertiesIntegrationTest
   [junit4]   2> Creating dataDir: C:\Users\jenkins\workspace\Lucene-Solr-7.x-Windows\solr\build\solr-core\test\J0\temp\solr.cloud.autoscaling.TriggerSetPropertiesIntegrationTest_EEF70F0E17CFAD97-001\init-core-data-001
   [junit4]   2> 1339407 WARN  (SUITE-TriggerSetPropertiesIntegrationTest-seed#[EEF70F0E17CFAD97]-worker) [    ] o.a.s.SolrTestCaseJ4 startTrackingSearchers: numOpens=1 numCloses=1
   [junit4]   2> 1339407 INFO  (SUITE-TriggerSetPropertiesIntegrationTest-seed#[EEF70F0E17CFAD97]-worker) [    ] o.a.s.SolrTestCaseJ4 Using PointFields (NUMERIC_POINTS_SYSPROP=true) w/NUMERIC_DOCVALUES_SYSPROP=false
   [junit4]   2> 1339411 INFO  (SUITE-TriggerSetPropertiesIntegrationTest-seed#[EEF70F0E17CFAD97]-worker) [    ] o.a.s.SolrTestCaseJ4 Randomized ssl (false) and clientAuth (false) via: @org.apache.solr.util.RandomizeSSL(reason=, value=NaN, ssl=NaN, clientAuth=NaN)
   [junit4]   2> 1339411 INFO  (SUITE-TriggerSetPropertiesIntegrationTest-seed#[EEF70F0E17CFAD97]-worker) [    ] o.a.s.SolrTestCaseJ4 SecureRandom sanity checks: test.solr.allowed.securerandom=null & java.security.egd=file:/dev/./urandom
   [junit4]   2> 1339412 INFO  (SUITE-TriggerSetPropertiesIntegrationTest-seed#[EEF70F0E17CFAD97]-worker) [    ] o.a.s.c.MiniSolrCloudCluster Starting cluster of 2 servers in C:\Users\jenkins\workspace\Lucene-Solr-7.x-Windows\solr\build\solr-core\test\J0\temp\solr.cloud.autoscaling.TriggerSetPropertiesIntegrationTest_EEF70F0E17CFAD97-001\tempDir-001
   [junit4]   2> 1339412 INFO  (SUITE-TriggerSetPropertiesIntegrationTest-seed#[EEF70F0E17CFAD97]-worker) [    ] o.a.s.c.ZkTestServer STARTING ZK TEST SERVER
   [junit4]   2> 1339413 INFO  (Thread-2827) [    ] o.a.s.c.ZkTestServer client port:0.0.0.0/0.0.0.0:0
   [junit4]   2> 1339413 INFO  (Thread-2827) [    ] o.a.s.c.ZkTestServer Starting server
   [junit4]   2> 1339422 ERROR (Thread-2827) [    ] o.a.z.s.ZooKeeperServer ZKShutdownHandler is not registered, so ZooKeeper server won't take any action on ERROR or SHUTDOWN server state changes
   [junit4]   2> 1339509 INFO  (SUITE-TriggerSetPropertiesIntegrationTest-seed#[EEF70F0E17CFAD97]-worker) [    ] o.a.s.c.ZkTestServer start zk server on port:56964
   [junit4]   2> 1339512 INFO  (zkConnectionManagerCallback-5271-thread-1) [    ] o.a.s.c.c.ConnectionManager zkClient has connected
   [junit4]   2> 1339518 INFO  (jetty-launcher-5268-thread-2) [    ] o.e.j.s.Server jetty-9.4.11.v20180605; built: 2018-06-05T18:24:03.829Z; git: d5fc0523cfa96bfebfbda19606cad384d772f04c; jvm 1.8.0_172-b11
   [junit4]   2> 1339518 INFO  (jetty-launcher-5268-thread-1) [    ] o.e.j.s.Server jetty-9.4.11.v20180605; built: 2018-06-05T18:24:03.829Z; git: d5fc0523cfa96bfebfbda19606cad384d772f04c; jvm 1.8.0_172-b11
   [junit4]   2> 1339519 INFO  (jetty-launcher-5268-thread-2) [    ] o.e.j.s.session DefaultSessionIdManager workerName=node0
   [junit4]   2> 1339519 INFO  (jetty-launcher-5268-thread-2) [    ] o.e.j.s.session No SessionScavenger set, using defaults
   [junit4]   2> 1339519 INFO  (jetty-launcher-5268-thread-2) [    ] o.e.j.s.session node0 Scavenging every 600000ms
   [junit4]   2> 1339519 INFO  (jetty-launcher-5268-thread-1) [    ] o.e.j.s.session DefaultSessionIdManager workerName=node0
   [junit4]   2> 1339519 INFO  (jetty-launcher-5268-thread-1) [    ] o.e.j.s.session No SessionScavenger set, using defaults
   [junit4]   2> 1339519 INFO  (jetty-launcher-5268-thread-1) [    ] o.e.j.s.session node0 Scavenging every 600000ms
   [junit4]   2> 1339519 INFO  (jetty-launcher-5268-thread-2) [    ] o.e.j.s.h.ContextHandler Started o.e.j.s.ServletContextHandler@5a0b12b0{/solr,null,AVAILABLE}
   [junit4]   2> 1339519 INFO  (jetty-launcher-5268-thread-1) [    ] o.e.j.s.h.ContextHandler Started o.e.j.s.ServletContextHandler@72c3d9c1{/solr,null,AVAILABLE}
   [junit4]   2> 1339523 INFO  (jetty-launcher-5268-thread-1) [    ] o.e.j.s.AbstractConnector Started ServerConnector@42c7177c{HTTP/1.1,[http/1.1]}{127.0.0.1:56969}
   [junit4]   2> 1339523 INFO  (jetty-launcher-5268-thread-2) [    ] o.e.j.s.AbstractConnector Started ServerConnector@55e402a4{HTTP/1.1,[http/1.1]}{127.0.0.1:56968}
   [junit4]   2> 1339523 INFO  (jetty-launcher-5268-thread-1) [    ] o.e.j.s.Server Started @1324822ms
   [junit4]   2> 1339523 INFO  (jetty-launcher-5268-thread-2) [    ] o.e.j.s.Server Started @1324822ms
   [junit4]   2> 1339523 INFO  (jetty-launcher-5268-thread-1) [    ] o.a.s.c.s.e.JettySolrRunner Jetty properties: {hostContext=/solr, hostPort=56969}
   [junit4]   2> 1339523 INFO  (jetty-launcher-5268-thread-2) [    ] o.a.s.c.s.e.JettySolrRunner Jetty properties: {hostContext=/solr, hostPort=56968}
   [junit4]   2> 1339523 ERROR (jetty-launcher-5268-thread-1) [    ] o.a.s.u.StartupLoggingUtils Missing Java Option solr.log.dir. Logging may be missing or incomplete.
   [junit4]   2> 1339523 ERROR (jetty-launcher-5268-thread-2) [    ] o.a.s.u.StartupLoggingUtils Missing Java Option solr.log.dir. Logging may be missing or incomplete.
   [junit4]   2> 1339523 INFO  (jetty-launcher-5268-thread-1) [    ] o.a.s.s.SolrDispatchFilter Using logger factory org.apache.logging.slf4j.Log4jLoggerFactory
   [junit4]   2> 1339523 INFO  (jetty-launcher-5268-thread-2) [    ] o.a.s.s.SolrDispatchFilter Using logger factory org.apache.logging.slf4j.Log4jLoggerFactory
   [junit4]   2> 1339523 INFO  (jetty-launcher-5268-thread-1) [    ] o.a.s.s.SolrDispatchFilter  ___      _       Welcome to Apache Solr? version 7.6.0
   [junit4]   2> 1339523 INFO  (jetty-launcher-5268-thread-2) [    ] o.a.s.s.SolrDispatchFilter  ___      _       Welcome to Apache Solr? version 7.6.0
   [junit4]   2> 1339523 INFO  (jetty-launcher-5268-thread-1) [    ] o.a.s.s.SolrDispatchFilter / __| ___| |_ _   Starting in cloud mode on port null
   [junit4]   2> 1339523 INFO  (jetty-launcher-5268-thread-2) [    ] o.a.s.s.SolrDispatchFilter / __| ___| |_ _   Starting in cloud mode on port null
   [junit4]   2> 1339523 INFO  (jetty-launcher-5268-thread-1) [    ] o.a.s.s.SolrDispatchFilter \__ \/ _ \ | '_|  Install dir: null
   [junit4]   2> 1339523 INFO  (jetty-launcher-5268-thread-2) [    ] o.a.s.s.SolrDispatchFilter \__ \/ _ \ | '_|  Install dir: null
   [junit4]   2> 1339523 INFO  (jetty-launcher-5268-thread-1) [    ] o.a.s.s.SolrDispatchFilter |___/\___/_|_|    Start time: 2018-11-01T11:01:44.921Z
   [junit4]   2> 1339523 INFO  (jetty-launcher-5268-thread-2) [    ] o.a.s.s.SolrDispatchFilter |___/\___/_|_|    Start time: 2018-11-01T11:01:44.921Z
   [junit4]   2> 1339526 INFO  (zkConnectionManagerCallback-5275-thread-1) [    ] o.a.s.c.c.ConnectionManager zkClient has connected
   [junit4]   2> 1339526 INFO  (zkConnectionManagerCallback-5274-thread-1) [    ] o.a.s.c.c.ConnectionManager zkClient has connected
   [junit4]   2> 1339526 INFO  (jetty-launcher-5268-thread-2) [    ] o.a.s.s.SolrDispatchFilter solr.xml found in ZooKeeper. Loading...
   [junit4]   2> 1339526 INFO  (jetty-launcher-5268-thread-1) [    ] o.a.s.s.SolrDispatchFilter solr.xml found in ZooKeeper. Loading...
   [junit4]   2> 1339546 WARN  (NIOServerCxn.Factory:0.0.0.0/0.0.0.0:0) [    ] o.a.z.s.NIOServerCnxn Unable to read additional data from client sessionid 0x10014e4c4630002, likely client has closed socket
   [junit4]   2> 1339546 WARN  (NIOServerCxn.Factory:0.0.0.0/0.0.0.0:0) [    ] o.a.z.s.NIOServerCnxn Unable to read additional data from client sessionid 0x10014e4c4630001, likely client has closed socket
   [junit4]   2> 1340021 INFO  (jetty-launcher-5268-thread-1) [    ] o.a.s.c.ZkContainer Zookeeper client=127.0.0.1:56964/solr
   [junit4]   2> 1340023 INFO  (zkConnectionManagerCallback-5279-thread-1) [    ] o.a.s.c.c.ConnectionManager zkClient has connected
   [junit4]   2> 1340027 INFO  (zkConnectionManagerCallback-5281-thread-1) [    ] o.a.s.c.c.ConnectionManager zkClient has connected
   [junit4]   2> 1340058 INFO  (jetty-launcher-5268-thread-2) [    ] o.a.s.c.ZkContainer Zookeeper client=127.0.0.1:56964/solr
   [junit4]   2> 1340059 INFO  (zkConnectionManagerCallback-5287-thread-1) [    ] o.a.s.c.c.ConnectionManager zkClient has connected
   [junit4]   2> 1340062 INFO  (zkConnectionManagerCallback-5289-thread-1) [    ] o.a.s.c.c.ConnectionManager zkClient has connected
   [junit4]   2> 1340072 INFO  (jetty-launcher-5268-thread-2) [n:127.0.0.1:56968_solr    ] o.a.s.c.OverseerElectionContext I am going to be the leader 127.0.0.1:56968_solr
   [junit4]   2> 1340073 INFO  (jetty-launcher-5268-thread-2) [n:127.0.0.1:56968_solr    ] o.a.s.c.Overseer Overseer (id=72080566817849350-127.0.0.1:56968_solr-n_0000000000) starting
   [junit4]   2> 1340078 INFO  (zkConnectionManagerCallback-5296-thread-1) [    ] o.a.s.c.c.ConnectionManager zkClient has connected
   [junit4]   2> 1340080 INFO  (jetty-launcher-5268-thread-2) [n:127.0.0.1:56968_solr    ] o.a.s.c.s.i.ZkClientClusterStateProvider Cluster at 127.0.0.1:56964/solr ready
   [junit4]   2> 1340081 INFO  (jetty-launcher-5268-thread-2) [n:127.0.0.1:56968_solr    ] o.a.s.c.ZkController Register node as live in ZooKeeper:/live_nodes/127.0.0.1:56968_solr
   [junit4]   2> 1340081 DEBUG (OverseerAutoScalingTriggerThread-72080566817849350-127.0.0.1:56968_solr-n_0000000000) [    ] o.a.s.c.a.OverseerTriggerThread Adding .auto_add_replicas and .scheduled_maintenance triggers
   [junit4]   2> 1340082 INFO  (OverseerStateUpdate-72080566817849350-127.0.0.1:56968_solr-n_0000000000) [n:127.0.0.1:56968_solr    ] o.a.s.c.Overseer Starting to work on the main queue : 127.0.0.1:56968_solr
   [junit4]   2> 1340084 INFO  (zkCallback-5295-thread-1) [    ] o.a.s.c.c.ZkStateReader Updated live nodes from ZooKeeper... (0) -> (1)
   [junit4]   2> 1340084 DEBUG (OverseerAutoScalingTriggerThread-72080566817849350-127.0.0.1:56968_solr-n_0000000000) [    ] o.a.s.c.a.OverseerTriggerThread Refreshing /autoscaling.json with znode version 1
   [junit4]   2> 1340084 DEBUG (OverseerAutoScalingTriggerThread-72080566817849350-127.0.0.1:56968_solr-n_0000000000) [    ] o.a.s.c.a.OverseerTriggerThread Current znodeVersion 1, lastZnodeVersion -1
   [junit4]   2> 1340085 DEBUG (OverseerAutoScalingTriggerThread-72080566817849350-127.0.0.1:56968_solr-n_0000000000) [    ] o.a.s.c.a.OverseerTriggerThread Processed trigger updates upto znodeVersion 1
   [junit4]   2> 1340085 INFO  (OverseerStateUpdate-72080566817849350-127.0.0.1:56968_solr-n_0000000000) [n:127.0.0.1:56968_solr    ] o.a.s.c.c.ZkStateReader Updated live nodes from ZooKeeper... (0) -> (1)
   [junit4]   2> 1340088 DEBUG (OverseerAutoScalingTriggerThread-72080566817849350-127.0.0.1:56968_solr-n_0000000000) [    ] o.a.s.c.a.NodeLostTrigger NodeLostTrigger .auto_add_replicas - Initial livenodes: [127.0.0.1:56968_solr]
   [junit4]   2> 1340089 DEBUG (OverseerAutoScalingTriggerThread-72080566817849350-127.0.0.1:56968_solr-n_0000000000) [    ] o.a.s.c.a.OverseerTriggerThread -- clean old nodeAdded markers
   [junit4]   2> 1340089 DEBUG (OverseerAutoScalingTriggerThread-72080566817849350-127.0.0.1:56968_solr-n_0000000000) [    ] o.a.s.c.a.OverseerTriggerThread Current znodeVersion 1, lastZnodeVersion 1
   [junit4]   2> 1340090 DEBUG (ScheduledTrigger-6288-thread-2) [    ] o.a.s.c.a.NodeLostTrigger Running NodeLostTrigger: .auto_add_replicas with currently live nodes: 1
   [junit4]   2> 1340101 INFO  (jetty-launcher-5268-thread-1) [n:127.0.0.1:56969_solr    ] o.a.s.c.c.ZkStateReader Updated live nodes from ZooKeeper... (0) -> (1)
   [junit4]   2> 1340102 INFO  (jetty-launcher-5268-thread-1) [n:127.0.0.1:56969_solr    ] o.a.s.c.TransientSolrCoreCacheDefault Allocating transient cache for 2147483647 transient cores
   [junit4]   2> 1340102 INFO  (jetty-launcher-5268-thread-1) [n:127.0.0.1:56969_solr    ] o.a.s.c.ZkController Register node as live in ZooKeeper:/live_nodes/127.0.0.1:56969_solr
   [junit4]   2> 1340109 INFO  (zkCallback-5288-thread-1) [    ] o.a.s.c.c.ZkStateReader Updated live nodes from ZooKeeper... (1) -> (2)
   [junit4]   2> 1340109 INFO  (zkCallback-5295-thread-1) [    ] o.a.s.c.c.ZkStateReader Updated live nodes from ZooKeeper... (1) -> (2)
   [junit4]   2> 1340110 INFO  (zkCallback-5280-thread-1) [    ] o.a.s.c.c.ZkStateReader Updated live nodes from ZooKeeper... (1) -> (2)
   [junit4]   2> 1340131 INFO  (jetty-launcher-5268-thread-2) [n:127.0.0.1:56968_solr    ] o.a.s.h.a.MetricsHistoryHandler No .system collection, keeping metrics history in memory.
   [junit4]   2> 1340133 INFO  (zkConnectionManagerCallback-5302-thread-1) [    ] o.a.s.c.c.ConnectionManager zkClient has connected
   [junit4]   2> 1340134 INFO  (jetty-launcher-5268-thread-1) [n:127.0.0.1:56969_solr    ] o.a.s.c.c.ZkStateReader Updated live nodes from ZooKeeper... (0) -> (2)
   [junit4]   2> 1340134 INFO  (jetty-launcher-5268-thread-1) [n:127.0.0.1:56969_solr    ] o.a.s.c.s.i.ZkClientClusterStateProvider Cluster at 127.0.0.1:56964/solr ready
   [junit4]   2> 1340135 INFO  (jetty-launcher-5268-thread-1) [n:127.0.0.1:56969_solr    ] o.a.s.h.a.MetricsHistoryHandler No .system collection, keeping metrics history in memory.
   [junit4]   2> 1340181 INFO  (jetty-launcher-5268-thread-2) [n:127.0.0.1:56968_solr    ] o.a.s.m.r.SolrJmxReporter JMX monitoring for 'solr_56968.solr.node' (registry 'solr.node') enabled at server: com.sun.jmx.mbeanserver.JmxMBeanServer@357c9d12
   [junit4]   2> 1340181 INFO  (jetty-launcher-5268-thread-1) [n:127.0.0.1:56969_solr    ] o.a.s.m.r.SolrJmxReporter JMX monitoring for 'solr_56969.solr.node' (registry 'solr.node') enabled at server: com.sun.jmx.mbeanserver.JmxMBeanServer@357c9d12
   [junit4]   2> 1340188 INFO  (jetty-launcher-5268-thread-1) [n:127.0.0.1:56969_solr    ] o.a.s.m.r.SolrJmxReporter JMX monitoring for 'solr_56969.solr.jvm' (registry 'solr.jvm') enabled at server: com.sun.jmx.mbeanserver.JmxMBeanServer@357c9d12
   [junit4]   2> 1340188 INFO  (jetty-launcher-5268-thread-1) [n:127.0.0.1:56969_solr    ] o.a.s.m.r.SolrJmxReporter JMX monitoring for 'solr_56969.solr.jetty' (registry 'solr.jetty') enabled at server: com.sun.jmx.mbeanserver.JmxMBeanServer@357c9d12
   [junit4]   2> 1340188 INFO  (jetty-launcher-5268-thread-2) [n:127.0.0.1:56968_solr    ] o.a.s.m.r.SolrJmxReporter JMX monitoring for 'solr_56968.solr.jvm' (registry 'solr.jvm') enabled at server: com.sun.jmx.mbeanserver.JmxMBeanServer@357c9d12
   [junit4]   2> 1340188 INFO  (jetty-launcher-5268-thread-2) [n:127.0.0.1:56968_solr    ] o.a.s.m.r.SolrJmxReporter JMX monitoring for 'solr_56968.solr.jetty' (registry 'solr.jetty') enabled at server: com.sun.jmx.mbeanserver.JmxMBeanServer@357c9d12
   [junit4]   2> 1340190 INFO  (jetty-launcher-5268-thread-2) [n:127.0.0.1:56968_solr    ] o.a.s.c.CorePropertiesLocator Found 0 core definitions underneath C:\Users\jenkins\workspace\Lucene-Solr-7.x-Windows\solr\build\solr-core\test\J0\temp\solr.cloud.autoscaling.TriggerSetPropertiesIntegrationTest_EEF70F0E17CFAD97-001\tempDir-001\node2\.
   [junit4]   2> 1340190 INFO  (jetty-launcher-5268-thread-1) [n:127.0.0.1:56969_solr    ] o.a.s.c.CorePropertiesLocator Found 0 core definitions underneath C:\Users\jenkins\workspace\Lucene-Solr-7.x-Windows\solr\build\solr-core\test\J0\temp\solr.cloud.autoscaling.TriggerSetPropertiesIntegrationTest_EEF70F0E17CFAD97-001\tempDir-001\node1\.
   [junit4]   2> 1340233 INFO  (zkConnectionManagerCallback-5305-thread-1) [    ] o.a.s.c.c.ConnectionManager zkClient has connected
   [junit4]   2> 1340239 INFO  (zkConnectionManagerCallback-5310-thread-1) [    ] o.a.s.c.c.ConnectionManager zkClient has connected
   [junit4]   2> 1340241 INFO  (SUITE-TriggerSetPropertiesIntegrationTest-seed#[EEF70F0E17CFAD97]-worker) [    ] o.a.s.c.c.ZkStateReader Updated live nodes from ZooKeeper... (0) -> (2)
   [junit4]   2> 1340241 INFO  (SUITE-TriggerSetPropertiesIntegrationTest-seed#[EEF70F0E17CFAD97]-worker) [    ] o.a.s.c.s.i.ZkClientClusterStateProvider Cluster at 127.0.0.1:56964/solr ready
   [junit4]   2> 1340251 INFO  (qtp1504792746-14952) [n:127.0.0.1:56969_solr    ] o.a.s.s.HttpSolrCall [admin] webapp=null path=/admin/metrics params={prefix=CONTAINER.fs.usableSpace,CONTAINER.fs.totalSpace,CORE.coreName&wt=javabin&version=2&group=solr.node,solr.core} status=0 QTime=3
   [junit4]   2> 1340254 INFO  (qtp1123186052-14961) [n:127.0.0.1:56968_solr    ] o.a.s.s.HttpSolrCall [admin] webapp=null path=/admin/metrics params={prefix=CONTAINER.fs.usableSpace,CONTAINER.fs.totalSpace,CORE.coreName&wt=javabin&version=2&group=solr.node,solr.core} status=0 QTime=2
   [junit4]   2> 1340255 DEBUG (qtp1504792746-14964) [n:127.0.0.1:56969_solr    ] o.a.s.c.a.AutoScalingHandler Verified autoscaling configuration
   [junit4]   2> 1340255 INFO  (qtp1504792746-14964) [n:127.0.0.1:56969_solr    ] o.a.s.s.HttpSolrCall [admin] webapp=null path=/admin/autoscaling params={wt=javabin&version=2} status=0 QTime=9
   [junit4]   2> 1340255 DEBUG (zkCallback-5295-thread-1) [    ] o.a.s.c.a.OverseerTriggerThread Refreshing /autoscaling.json with znode version 2
   [junit4]   2> 1340256 DEBUG (OverseerAutoScalingTriggerThread-72080566817849350-127.0.0.1:56968_solr-n_0000000000) [    ] o.a.s.c.a.OverseerTriggerThread Processed trigger updates upto znodeVersion 2
   [junit4]   2> 1340275 DEBUG (OverseerAutoScalingTriggerThread-72080566817849350-127.0.0.1:56968_solr-n_0000000000) [    ] o.a.s.c.a.OverseerTriggerThread -- clean old nodeAdded markers
   [junit4]   2> 1340278 DEBUG (OverseerAutoScalingTriggerThread-72080566817849350-127.0.0.1:56968_solr-n_0000000000) [    ] o.a.s.c.a.OverseerTriggerThread Current znodeVersion 2, lastZnodeVersion 2
   [junit4]   2> 1340290 INFO  (TEST-TriggerSetPropertiesIntegrationTest.testSetProperties-seed#[EEF70F0E17CFAD97]) [    ] o.a.s.SolrTestCaseJ4 ###Starting testSetProperties
   [junit4]   2> 1341052 DEBUG (ScheduledTrigger-6288-thread-1) [    ] o.a.s.c.a.NodeLostTrigger Running NodeLostTrigger: .auto_add_replicas with currently live nodes: 2
   [junit4]   2> 1341262 DEBUG (TEST-TriggerSetPropertiesIntegrationTest.testSetProperties-seed#[EEF70F0E17CFAD97]) [    ] o.a.s.c.a.ScheduledTriggers Shutting down scheduled thread pool executor now
   [junit4]   2> 1341262 DEBUG (TEST-TriggerSetPropertiesIntegrationTest.testSetProperties-seed#[EEF70F0E17CFAD97]) [    ] o.a.s.c.a.ScheduledTriggers Shutting down action executor now
   [junit4]   2> 1341262 DEBUG (TEST-TriggerSetPropertiesIntegrationTest.testSetProperties-seed#[EEF70F0E17CFAD97]) [    ] o.a.s.c.a.ScheduledTriggers Awaiting termination for action executor
   [junit4]   2> 1341262 DEBUG (TEST-TriggerSetPropertiesIntegrationTest.testSetProperties-seed#[EEF70F0E17CFAD97]) [    ] o.a.s.c.a.ScheduledTriggers Awaiting termination for scheduled thread pool executor
   [junit4]   2> 1341262 DEBUG (TEST-TriggerSetPropertiesIntegrationTest.testSetProperties-seed#[EEF70F0E17CFAD97]) [    ] o.a.s.c.a.ScheduledTriggers ScheduledTriggers closed completely
   [junit4]   2> 1341263 INFO  (TEST-TriggerSetPropertiesIntegrationTest.testSetProperties-seed#[EEF70F0E17CFAD97]) [    ] o.a.s.SolrTestCaseJ4 ###Ending testSetProperties
   [junit4]   2> NOTE: reproduce with: ant test  -Dtestcase=TriggerSetPropertiesIntegrationTest -Dtests.method=testSetProperties -Dtests.seed=EEF70F0E17CFAD97 -Dtests.slow=true -Dtests.locale=zh-SG -Dtests.timezone=America/Argentina/San_Luis -Dtests.asserts=true -Dtests.file.encoding=US-ASCII
   [junit4] FAILURE 1.01s J0 | TriggerSetPropertiesIntegrationTest.testSetProperties <<<
   [junit4]    > Throwable #1: java.lang.AssertionError
   [junit4]    > 	at __randomizedtesting.SeedInfo.seed([EEF70F0E17CFAD97:8593D847A4E23813]:0)
   [junit4]    > 	at org.apache.solr.cloud.autoscaling.TriggerSetPropertiesIntegrationTest.testSetProperties(TriggerSetPropertiesIntegrationTest.java:111)
   [junit4]    > 	at java.lang.Thread.run(Thread.java:748)
   [junit4]   2> 1341271 WARN  (NIOServerCxn.Factory:0.0.0.0/0.0.0.0:0) [    ] o.a.z.s.NIOServerCnxn Unable to read additional data from client sessionid 0x10014e4c463000a, likely client has closed socket
   [junit4]   2> 1341273 INFO  (jetty-closer-5269-thread-2) [    ] o.e.j.s.AbstractConnector Stopped ServerConnector@55e402a4{HTTP/1.1,[http/1.1]}{127.0.0.1:0}
   [junit4]   2> 1341278 INFO  (jetty-closer-5269-thread-2) [    ] o.a.s.c.CoreContainer Shutting down CoreContainer instance=534463860
   [junit4]   2> 1341286 INFO  (jetty-closer-5269-thread-2) [    ] o.a.s.m.SolrMetricManager Closing metric reporters for registry=solr.node, tag=null
   [junit4]   2> 1341286 INFO  (jetty-closer-5269-thread-2) [    ] o.a.s.m.r.SolrJmxReporter Closing reporter [org.apache.solr.metrics.reporters.SolrJmxReporter@3f036254: rootName = solr_56968, domain = solr.node, service url = null, agent id = null] for registry solr.node / com.codahale.metrics.MetricRegistry@2d32f268
   [junit4]   2> 1341286 INFO  (jetty-closer-5269-thread-1) [    ] o.e.j.s.AbstractConnector Stopped ServerConnector@42c7177c{HTTP/1.1,[http/1.1]}{127.0.0.1:0}
   [junit4]   2> 1341290 INFO  (jetty-closer-5269-thread-1) [    ] o.a.s.c.CoreContainer Shutting down CoreContainer instance=1252155346
   [junit4]   2> 1341290 INFO  (jetty-closer-5269-thread-1) [    ] o.a.s.m.SolrMetricManager Closing metric reporters for registry=solr.node, tag=null
   [junit4]   2> 1341290 INFO  (jetty-closer-5269-thread-1) [    ] o.a.s.m.r.SolrJmxReporter Closing reporter [org.apache.solr.metrics.reporters.SolrJmxReporter@1579fb54: rootName = solr_56969, domain = solr.node, service url = null, agent id = null] for registry solr.node / com.codahale.metrics.MetricRegistry@32d343ca
   [junit4]   2> 1341344 INFO  (jetty-closer-5269-thread-1) [    ] o.a.s.m.SolrMetricManager Closing metric reporters for registry=solr.jvm, tag=null
   [junit4]   2> 1341344 INFO  (jetty-closer-5269-thread-1) [    ] o.a.s.m.r.SolrJmxReporter Closing reporter [org.apache.solr.metrics.reporters.SolrJmxReporter@5de13bc3: rootName = solr_56969, domain = solr.jvm, service url = null, agent id = null] for registry solr.jvm / com.codahale.metrics.MetricRegistry@68f9c637
   [junit4]   2> 1341346 INFO  (jetty-closer-5269-thread-1) [    ] o.a.s.m.SolrMetricManager Closing metric reporters for registry=solr.jetty, tag=null
   [junit4]   2> 1341346 INFO  (jetty-closer-5269-thread-1) [    ] o.a.s.m.r.SolrJmxReporter Closing reporter [org.apache.solr.metrics.reporters.SolrJmxReporter@4da4ffd8: rootName = solr_56969, domain = solr.jetty, service url = null, agent id = null] for registry solr.jetty / com.codahale.metrics.MetricRegistry@528349c6
   [junit4]   2> 1341349 INFO  (jetty-closer-5269-thread-2) [    ] o.a.s.m.SolrMetricManager Closing metric reporters for registry=solr.jvm, tag=null
   [junit4]   2> 1341349 INFO  (jetty-closer-5269-thread-2) [    ] o.a.s.m.r.SolrJmxReporter Closing reporter [org.apache.solr.metrics.reporters.SolrJmxReporter@2e073483: rootName = solr_56968, domain = solr.jvm, service url = null, agent id = null] for registry solr.jvm / com.codahale.metrics.MetricRegistry@68f9c637
   [junit4]   2> 1341363 INFO  (jetty-closer-5269-thread-2) [    ] o.a.s.m.SolrMetricManager Closing metric reporters for registry=solr.jetty, tag=null
   [junit4]   2> 1341363 INFO  (jetty-closer-5269-thread-2) [    ] o.a.s.m.r.SolrJmxReporter Closing reporter [org.apache.solr.metrics.reporters.SolrJmxReporter@541d65f0: rootName = solr_56968, domain = solr.jetty, service url = null, agent id = null] for registry solr.jetty / com.codahale.metrics.MetricRegistry@528349c6
   [junit4]   2> 1341364 INFO  (jetty-closer-5269-thread-1) [    ] o.a.s.c.ZkController Remove node as live in ZooKeeper:/live_nodes/127.0.0.1:56969_solr
   [junit4]   2> 1341364 INFO  (jetty-closer-5269-thread-1) [    ] o.a.s.m.SolrMetricManager Closing metric reporters for registry=solr.cluster, tag=null
   [junit4]   2> 1341364 INFO  (jetty-closer-5269-thread-2) [    ] o.a.s.c.ZkController Remove node as live in ZooKeeper:/live_nodes/127.0.0.1:56968_solr
   [junit4]   2> 1341385 INFO  (zkCallback-5295-thread-1) [    ] o.a.s.c.c.ZkStateReader Updated live nodes from ZooKeeper... (2) -> (1)
   [junit4]   2> 1341387 INFO  (zkCallback-5280-thread-1) [    ] o.a.s.c.c.ZkStateReader Updated live nodes from ZooKeeper... (2) -> (1)
   [junit4]   2> 1341397 INFO  (zkCallback-5288-thread-1) [    ] o.a.s.c.c.ZkStateReader Updated live nodes from ZooKeeper... (2) -> (1)
   [junit4]   2> 1341398 INFO  (zkCallback-5301-thread-1) [    ] o.a.s.c.c.ZkStateReader Updated live nodes from ZooKeeper... (2) -> (1)
   [junit4]   2> 1341399 INFO  (jetty-closer-5269-thread-2) [    ] o.a.s.m.SolrMetricManager Closing metric reporters for registry=solr.cluster, tag=null
   [junit4]   2> 1341399 INFO  (jetty-closer-5269-thread-2) [    ] o.a.s.c.TransientSolrCoreCacheDefault Allocating transient cache for 2147483647 transient cores
   [junit4]   2> 1341399 INFO  (jetty-closer-5269-thread-2) [    ] o.a.s.c.Overseer Overseer (id=72080566817849350-127.0.0.1:56968_solr-n_0000000000) closing
   [junit4]   2> 1341399 WARN  (OverseerAutoScalingTriggerThread-72080566817849350-127.0.0.1:56968_solr-n_0000000000) [    ] o.a.s.c.a.OverseerTriggerThread OverseerTriggerThread woken up but we are closed, exiting.
   [junit4]   2> 1341399 DEBUG (jetty-closer-5269-thread-2) [    ] o.a.s.c.a.ScheduledTriggers Shutting down scheduled thread pool executor now
   [junit4]   2> 1341399 DEBUG (jetty-closer-5269-thread-2) [    ] o.a.s.c.a.ScheduledTriggers Shutting down action executor now
   [junit4]   2> 1341399 DEBUG (jetty-closer-5269-thread-2) [    ] o.a.s.c.a.ScheduledTriggers Awaiting termination for action executor
   [junit4]   2> 1341399 DEBUG (jetty-closer-5269-thread-2) [    ] o.a.s.c.a.ScheduledTriggers Awaiting termination for scheduled thread pool executor
   [junit4]   2> 1341399 DEBUG (jetty-closer-5269-thread-2) [    ] o.a.s.c.a.ScheduledTriggers ScheduledTriggers closed completely
   [junit4]   2> 1341399 DEBUG (jetty-closer-5269-thread-2) [    ] o.a.s.c.a.OverseerTriggerThread OverseerTriggerThread has been closed explicitly
   [junit4]   2> 1341399 INFO  (OverseerStateUpdate-72080566817849350-127.0.0.1:56968_solr-n_0000000000) [n:127.0.0.1:56968_solr    ] o.a.s.c.Overseer Overseer Loop exiting : 127.0.0.1:56968_solr
   [junit4]   2> 1341401 INFO  (zkCallback-5280-thread-1) [    ] o.a.s.c.c.ZkStateReader Updated live nodes from ZooKeeper... (1) -> (0)
   [junit4]   2> 1341403 INFO  (zkCallback-5288-thread-2) [    ] o.a.s.c.c.ZkStateReader Updated live nodes from ZooKeeper... (1) -> (0)
   [junit4]   2> 1341403 INFO  (zkCallback-5295-thread-1) [    ] o.a.s.c.c.ZkStateReader Updated live nodes from ZooKeeper... (1) -> (0)
   [junit4]   2> 1341405 INFO  (jetty-closer-5269-thread-2) [    ] o.e.j.s.h.ContextHandler Stopped o.e.j.s.ServletContextHandler@5a0b12b0{/solr,null,UNAVAILABLE}
   [junit4]   2> 1341405 INFO  (jetty-closer-5269-thread-2) [    ] o.e.j.s.session node0 Stopped scavenging
   [junit4]   2> 1341405 INFO  (zkCallback-5280-thread-1) [    ] o.a.s.c.OverseerElectionContext I am going to be the leader 127.0.0.1:56969_solr
   [junit4]   2> 1342840 WARN  (zkCallback-5301-thread-1) [    ] o.a.s.c.c.ZkStateReader ZooKeeper watch triggered, but Solr cannot talk to ZK: [KeeperErrorCode = Session expired for /live_nodes]
   [junit4]   2> 1342841 INFO  (jetty-closer-5269-thread-1) [    ] o.e.j.s.h.ContextHandler Stopped o.e.j.s.ServletContextHandler@72c3d9c1{/solr,null,UNAVAILABLE}
   [junit4]   2> 1342841 INFO  (jetty-closer-5269-thread-1) [    ] o.e.j.s.session node0 Stopped scavenging
   [junit4]   2> 1342842 ERROR (SUITE-TriggerSetPropertiesIntegrationTest-seed#[EEF70F0E17CFAD97]-worker) [    ] o.a.z.s.ZooKeeperServer ZKShutdownHandler is not registered, so ZooKeeper server won't take any action on ERROR or SHUTDOWN server state changes
   [junit4]   2> 1342842 INFO  (SUITE-TriggerSetPropertiesIntegrationTest-seed#[EEF70F0E17CFAD97]-worker) [    ] o.a.s.c.ZkTestServer connecting to 127.0.0.1:56964 56964
   [junit4]   2> 1342843 INFO  (Thread-2827) [    ] o.a.s.c.ZkTestServer connecting to 127.0.0.1:56964 56964
   [junit4]   2> 1342844 WARN  (Thread-2827) [    ] o.a.s.c.ZkTestServer Watch limit violations: 
   [junit4]   2> Maximum concurrent create/delete watches above limit:
   [junit4]   2> 
   [junit4]   2> 	5	/solr/aliases.json
   [junit4]   2> 	5	/solr/clusterprops.json
   [junit4]   2> 	2	/solr/security.json
   [junit4]   2> 
   [junit4]   2> Maximum concurrent data watches above limit:
   [junit4]   2> 
   [junit4]   2> 	5	/solr/clusterstate.json
   [junit4]   2> 
   [junit4]   2> Maximum concurrent children watches above limit:
   [junit4]   2> 
   [junit4]   2> 	5	/solr/live_nodes
   [junit4]   2> 	5	/solr/collections
   [junit4]   2> 
   [junit4]   2> NOTE: leaving temporary files on disk at: C:\Users\jenkins\workspace\Lucene-Solr-7.x-Windows\solr\build\solr-core\test\J0\temp\solr.cloud.autoscaling.TriggerSetPropertiesIntegrationTest_EEF70F0E17CFAD97-001
   [junit4]   2> Nov 01, 2018 11:01:48 AM com.carrotsearch.randomizedtesting.ThreadLeakControl checkThreadLeaks
   [junit4]   2> WARNING: Will linger awaiting termination of 2 leaked thread(s).
   [junit4]   2> NOTE: test params are: codec=Asserting(Lucene70): {}, docValues:{}, maxPointsInLeafNode=555, maxMBSortInHeap=7.687117393849354, sim=RandomSimilarity(queryNorm=true): {}, locale=zh-SG, timezone=America/Argentina/San_Luis
   [junit4]   2> NOTE: Windows 10 10.0 amd64/Oracle Corporation 1.8.0_172 (64-bit)/cpus=3,threads=1,free=212651096,total=536870912
   [junit4]   2> NOTE: All tests run in this JVM: [TestCustomSort, LegacyCloudClusterPropTest, MultiTermTest, ShowFileRequestHandlerTest, TestCoreDiscovery, BadComponentTest, ReplicationFactorTest, TestTrieFacet, ClassificationUpdateProcessorIntegrationTest, TestConfigReload, PeerSyncReplicationTest, CollectionTooManyReplicasTest, DeleteReplicaTest, ConnectionManagerTest, DocValuesMissingTest, SpatialHeatmapFacetsTest, DOMUtilTest, DirectUpdateHandlerTest, TestSegmentSorting, LeaderElectionIntegrationTest, TestFilteredDocIdSet, TestRecovery, ScheduledTriggerTest, TestHdfsCloudBackupRestore, DistributedFacetPivotSmallAdvancedTest, TestNonDefinedSimilarityFactory, TestLuceneIndexBackCompat, LeaderTragicEventTest, HdfsNNFailoverTest, SecurityConfHandlerTest, TestZkAclsWithHadoopAuth, MBeansHandlerTest, MaxSizeAutoCommitTest, TestRawTransformer, SolrCloudExampleTest, TestQueryTypes, PreAnalyzedUpdateProcessorTest, TestRTimerTree, HighlighterMaxOffsetTest, TestFileDictionaryLookup, TestCoreAdminApis, AutoScalingHandlerTest, TestSha256AuthenticationProvider, TestSchemaManager, TestExpandComponent, ZkFailoverTest, CollectionsAPIDistributedZkTest, TestFieldCacheSort, QueryEqualityTest, CustomCollectionTest, TestMaxTokenLenTokenizer, DocValuesNotIndexedTest, TestLegacyField, TestDistributedGrouping, SaslZkACLProviderTest, ScheduledMaintenanceTriggerTest, OverseerCollectionConfigSetProcessorTest, TestReplicationHandlerBackup, TestFastLRUCache, TestSolrQueryResponse, SolrMetricsIntegrationTest, TestUseDocValuesAsStored2, ScriptEngineTest, TermVectorComponentDistributedTest, CdcrWithNodesRestartsTest, LIRRollingUpdatesTest, SliceStateTest, TestStressVersions, LargeFieldTest, TestImplicitCoreProperties, TestClusterStateMutator, SolrIndexSplitterTest, CoreAdminOperationTest, TestLegacyFieldCache, TestManagedSchemaAPI, DistributedQueryElevationComponentTest, TestCloudManagedSchema, TestExportWriter, TestRangeQuery, TestAuthenticationFramework, TestRestManager, TestEmbeddedSolrServerConstructors, TestDocTermOrds, DocumentAnalysisRequestHandlerTest, MoveReplicaTest, TestNRTOpen, TestConfigSetsAPI, AsyncCallRequestStatusResponseTest, TestJsonFacets, TestSolrConfigHandlerConcurrent, CoreSorterTest, CopyFieldTest, TestJavabinTupleStreamParser, TestLeaderInitiatedRecoveryThread, TestHdfsUpdateLog, TestTlogReplica, TestLMDirichletSimilarityFactory, TriggerSetPropertiesIntegrationTest]
   [junit4] Completed [271/836 (1!)] on J0 in 4.18s, 1 test, 1 failure <<< FAILURES!

[...truncated 937 lines...]
   [junit4] Suite: org.apache.solr.cloud.autoscaling.TriggerIntegrationTest
   [junit4]   2> Creating dataDir: C:\Users\jenkins\workspace\Lucene-Solr-7.x-Windows\solr\build\solr-core\test\J0\temp\solr.cloud.autoscaling.TriggerIntegrationTest_EEF70F0E17CFAD97-001\init-core-data-001
   [junit4]   2> 2895450 INFO  (SUITE-TriggerIntegrationTest-seed#[EEF70F0E17CFAD97]-worker) [    ] o.a.s.c.MiniSolrCloudCluster Starting cluster of 2 servers in C:\Users\jenkins\workspace\Lucene-Solr-7.x-Windows\solr\build\solr-core\test\J0\temp\solr.cloud.autoscaling.TriggerIntegrationTest_EEF70F0E17CFAD97-001\tempDir-001
   [junit4]   2> 2895450 INFO  (SUITE-TriggerIntegrationTest-seed#[EEF70F0E17CFAD97]-worker) [    ] o.a.s.c.ZkTestServer STARTING ZK TEST SERVER
   [junit4]   2> 2895450 INFO  (Thread-5710) [    ] o.a.s.c.ZkTestServer client port:0.0.0.0/0.0.0.0:0
   [junit4]   2> 2895450 INFO  (Thread-5710) [    ] o.a.s.c.ZkTestServer Starting server
   [junit4]   2> 2895455 ERROR (Thread-5710) [    ] o.a.z.s.ZooKeeperServer ZKShutdownHandler is not registered, so ZooKeeper server won't take any action on ERROR or SHUTDOWN server state changes
   [junit4]   2> 2895561 INFO  (SUITE-TriggerIntegrationTest-seed#[EEF70F0E17CFAD97]-worker) [    ] o.a.s.c.ZkTestServer start zk server on port:55511
   [junit4]   2> 2895569 INFO  (zkConnectionManagerCallback-11238-thread-1) [    ] o.a.s.c.c.ConnectionManager zkClient has connected
   [junit4]   2> 2895580 INFO  (jetty-launcher-11235-thread-2) [    ] o.e.j.s.Server jetty-9.4.11.v20180605; built: 2018-06-05T18:24:03.829Z; git: d5fc0523cfa96bfebfbda19606cad384d772f04c; jvm 1.8.0_172-b11
   [junit4]   2> 2895580 INFO  (jetty-launcher-11235-thread-1) [    ] o.e.j.s.Server jetty-9.4.11.v20180605; built: 2018-06-05T18:24:03.829Z; git: d5fc0523cfa96bfebfbda19606cad384d772f04c; jvm 1.8.0_172-b11
   [junit4]   2> 2895580 INFO  (jetty-launcher-11235-thread-2) [    ] o.e.j.s.session DefaultSessionIdManager workerName=node0
   [junit4]   2> 2895580 INFO  (jetty-launcher-11235-thread-2) [    ] o.e.j.s.session No SessionScavenger set, using defaults
   [junit4]   2> 2895580 INFO  (jetty-launcher-11235-thread-2) [    ] o.e.j.s.session node0 Scavenging every 660000ms
   [junit4]   2> 2895580 INFO  (jetty-launcher-11235-thread-1) [    ] o.e.j.s.session DefaultSessionIdManager workerName=node0
   [junit4]   2> 2895580 INFO  (jetty-launcher-11235-thread-1) [    ] o.e.j.s.session No SessionScavenger set, using defaults
   [junit4]   2> 2895580 INFO  (jetty-launcher-11235-thread-2) [    ] o.e.j.s.h.ContextHandler Started o.e.j.s.ServletContextHandler@5d51f469{/solr,null,AVAILABLE}
   [junit4]   2> 2895580 INFO  (jetty-launcher-11235-thread-1) [    ] o.e.j.s.session node0 Scavenging every 660000ms
   [junit4]   2> 2895580 INFO  (jetty-launcher-11235-thread-1) [    ] o.e.j.s.h.ContextHandler Started o.e.j.s.ServletContextHandler@26587c69{/solr,null,AVAILABLE}
   [junit4]   2> 2895584 INFO  (jetty-launcher-11235-thread-1) [    ] o.e.j.s.AbstractConnector Started ServerConnector@38f7ec47{HTTP/1.1,[http/1.1]}{127.0.0.1:55516}
   [junit4]   2> 2895584 INFO  (jetty-launcher-11235-thread-1) [    ] o.e.j.s.Server Started @2866593ms
   [junit4]   2> 2895584 INFO  (jetty-launcher-11235-thread-2) [    ] o.e.j.s.AbstractConnector Started ServerConnector@208080af{HTTP/1.1,[http/1.1]}{127.0.0.1:55515}
   [junit4]   2> 2895584 INFO  (jetty-launcher-11235-thread-2) [    ] o.e.j.s.Server Started @2866593ms
   [junit4]   2> 2895584 INFO  (jetty-launcher-11235-thread-1) [    ] o.a.s.c.s.e.JettySolrRunner Jetty properties: {hostContext=/solr, hostPort=55516}
   [junit4]   2> 2895584 INFO  (jetty-launcher-11235-thread-2) [    ] o.a.s.c.s.e.JettySolrRunner Jetty properties: {hostContext=/solr, hostPort=55515}
   [junit4]   2> 2895584 ERROR (jetty-launcher-11235-thread-2) [    ] o.a.s.u.StartupLoggingUtils Missing Java Option solr.log.dir. Logging may be missing or incomplete.
   [junit4]   2> 2895584 ERROR (jetty-launcher-11235-thread-1) [    ] o.a.s.u.StartupLoggingUtils Missing Java Option solr.log.dir. Logging may be missing or incomplete.
   [junit4]   2> 2895584 INFO  (jetty-launcher-11235-thread-2) [    ] o.a.s.s.SolrDispatchFilter Using logger factory org.apache.logging.slf4j.Log4jLoggerFactory
   [junit4]   2> 2895584 INFO  (jetty-launcher-11235-thread-1) [    ] o.a.s.s.SolrDispatchFilter Using logger factory org.apache.logging.slf4j.Log4jLoggerFactory
   [junit4]   2> 2895584 INFO  (jetty-launcher-11235-thread-2) [    ] o.a.s.s.SolrDispatchFilter  ___      _       Welcome to Apache Solr? version 7.6.0
   [junit4]   2> 2895584 INFO  (jetty-launcher-11235-thread-1) [    ] o.a.s.s.SolrDispatchFilter  ___      _       Welcome to Apache Solr? version 7.6.0
   [junit4]   2> 2895584 INFO  (jetty-launcher-11235-thread-2) [    ] o.a.s.s.SolrDispatchFilter / __| ___| |_ _   Starting in cloud mode on port null
   [junit4]   2> 2895584 INFO  (jetty-launcher-11235-thread-1) [    ] o.a.s.s.SolrDispatchFilter / __| ___| |_ _   Starting in cloud mode on port null
   [junit4]   2> 2895584 INFO  (jetty-launcher-11235-thread-2) [    ] o.a.s.s.SolrDispatchFilter \__ \/ _ \ | '_|  Install dir: null
   [junit4]   2> 2895584 INFO  (jetty-launcher-11235-thread-1) [    ] o.a.s.s.SolrDispatchFilter \__ \/ _ \ | '_|  Install dir: null
   [junit4]   2> 2895584 INFO  (jetty-launcher-11235-thread-2) [    ] o.a.s.s.SolrDispatchFilter |___/\___/_|_|    Start time: 2018-11-01T11:27:40.982Z
   [junit4]   2> 2895584 INFO  (jetty-launcher-11235-thread-1) [    ] o.a.s.s.SolrDispatchFilter |___/\___/_|_|    Start time: 2018-11-01T11:27:40.982Z
   [junit4]   2> 2895588 INFO  (zkConnectionManagerCallback-11242-thread-1) [    ] o.a.s.c.c.ConnectionManager zkClient has connected
   [junit4]   2> 2895588 INFO  (zkConnectionManagerCallback-11241-thread-1) [    ] o.a.s.c.c.ConnectionManager zkClient has connected
   [junit4]   2> 2895588 INFO  (jetty-launcher-11235-thread-2) [    ] o.a.s.s.SolrDispatchFilter solr.xml found in ZooKeeper. Loading...
   [junit4]   2> 2895588 INFO  (jetty-launcher-11235-thread-1) [    ] o.a.s.s.SolrDispatchFilter solr.xml found in ZooKeeper. Loading...
   [junit4]   2> 2895603 WARN  (NIOServerCxn.Factory:0.0.0.0/0.0.0.0:0) [    ] o.a.z.s.NIOServerCnxn Unable to read additional data from client sessionid 0x10014fc4ae40001, likely client has closed socket
   [junit4]   2> 2895764 INFO  (jetty-launcher-11235-thread-2) [    ] o.a.s.c.ZkContainer Zookeeper client=127.0.0.1:55511/solr
   [junit4]   2> 2895767 INFO  (zkConnectionManagerCallback-11246-thread-1) [    ] o.a.s.c.c.ConnectionManager zkClient has connected
   [junit4]   2> 2895768 WARN  (NIOServerCxn.Factory:0.0.0.0/0.0.0.0:0) [    ] o.a.z.s.NIOServerCnxn Unable to read additional data from client sessionid 0x10014fc4ae40003, likely client has closed socket
   [junit4]   2> 2895769 INFO  (zkConnectionManagerCallback-11248-thread-1) [    ] o.a.s.c.c.ConnectionManager zkClient has connected
   [junit4]   2> 2895780 INFO  (jetty-launcher-11235-thread-1) [    ] o.a.s.c.ZkContainer Zookeeper client=127.0.0.1:55511/solr
   [junit4]   2> 2895783 INFO  (zkConnectionManagerCallback-11254-thread-1) [    ] o.a.s.c.c.ConnectionManager zkClient has connected
   [junit4]   2> 2895785 INFO  (zkConnectionManagerCallback-11256-thread-1) [    ] o.a.s.c.c.ConnectionManager zkClient has connected
   [junit4]   2> 2895795 INFO  (jetty-launcher-11235-thread-1) [n:127.0.0.1:55516_solr    ] o.a.s.c.OverseerElectionContext I am going to be the leader 127.0.0.1:55516_solr
   [junit4]   2> 2895796 INFO  (jetty-launcher-11235-thread-1) [n:127.0.0.1:55516_solr    ] o.a.s.c.Overseer Overseer (id=72080667858698246-127.0.0.1:55516_solr-n_0000000000) starting
   [junit4]   2> 2895802 INFO  (zkConnectionManagerCallback-11263-thread-1) [    ] o.a.s.c.c.ConnectionManager zkClient has connected
   [junit4]   2> 2895803 INFO  (jetty-launcher-11235-thread-1) [n:127.0.0.1:55516_solr    ] o.a.s.c.s.i.ZkClientClusterStateProvider Cluster at 127.0.0.1:55511/solr ready
   [junit4]   2> 2895804 INFO  (jetty-launcher-11235-thread-1) [n:127.0.0.1:55516_solr    ] o.a.s.c.ZkController Register node as live in ZooKeeper:/live_nodes/127.0.0.1:55516_solr
   [junit4]   2> 2895804 DEBUG (OverseerAutoScalingTriggerThread-72080667858698246-127.0.0.1:55516_solr-n_0000000000) [    ] o.a.s.c.a.OverseerTriggerThread Adding .auto_add_replicas and .scheduled_maintenance triggers
   [junit4]   2> 2895804 INFO  (OverseerStateUpdate-72080667858698246-127.0.0.1:55516_solr-n_0000000000) [n:127.0.0.1:55516_solr    ] o.a.s.c.Overseer Starting to work on the main queue : 127.0.0.1:55516_solr
   [junit4]   2> 2895806 DEBUG (OverseerAutoScalingTriggerThread-72080667858698246-127.0.0.1:55516_solr-n_0000000000) [    ] o.a.s.c.a.OverseerTriggerThread Refreshing /autoscaling.json with znode version 1
   [junit4]   2> 2895806 DEBUG (OverseerAutoScalingTriggerThread-72080667858698246-127.0.0.1:55516_solr-n_0000000000) [    ] o.a.s.c.a.OverseerTriggerThread Current znodeVersion 1, lastZnodeVersion -1
   [junit4]   2> 2895806 DEBUG (OverseerAutoScalingTriggerThread-72080667858698246-127.0.0.1:55516_solr-n_0000000000) [    ] o.a.s.c.a.OverseerTriggerThread Processed trigger updates upto znodeVersion 1
   [junit4]   2> 2895806 INFO  (OverseerStateUpdate-72080667858698246-127.0.0.1:55516_solr-n_0000000000) [n:127.0.0.1:55516_solr    ] o.a.s.c.c.ZkStateReader Updated live nodes from ZooKeeper... (0) -> (1)
   [junit4]   2> 2895809 DEBUG (OverseerAutoScalingTriggerThread-72080667858698246-127.0.0.1:55516_solr-n_0000000000) [    ] o.a.s.c.a.NodeLostTrigger NodeLostTrigger .auto_add_replicas - Initial livenodes: []
   [junit4]   2> 2895810 DEBUG (OverseerAutoScalingTriggerThread-72080667858698246-127.0.0.1:55516_solr-n_0000000000) [    ] o.a.s.c.a.OverseerTriggerThread -- clean old nodeAdded markers
   [junit4]   2> 2895810 DEBUG (OverseerAutoScalingTriggerThread-72080667858698246-127.0.0.1:55516_solr-n_0000000000) [    ] o.a.s.c.a.OverseerTriggerThread Current znodeVersion 1, lastZnodeVersion 1
   [junit4]   2> 2895812 INFO  (zkCallback-11262-thread-1) [    ] o.a.s.c.c.ZkStateReader Updated live nodes from ZooKeeper... (0) -> (1)
   [junit4]   2> 2895813 DEBUG (ScheduledTrigger-12302-thread-2) [    ] o.a.s.c.a.NodeLostTrigger Running NodeLostTrigger: .auto_add_replicas with currently live nodes: 1
   [junit4]   2> 2895849 INFO  (jetty-launcher-11235-thread-2) [n:127.0.0.1:55515_solr    ] o.a.s.c.c.ZkStateReader Updated live nodes from ZooKeeper... (0) -> (1)
   [junit4]   2> 2895853 INFO  (jetty-launcher-11235-thread-2) [n:127.0.0.1:55515_solr    ] o.a.s.c.TransientSolrCoreCacheDefault Allocating transient cache for 2147483647 transient cores
   [junit4]   2> 2895853 INFO  (jetty-launcher-11235-thread-2) [n:127.0.0.1:55515_solr    ] o.a.s.c.ZkController Register node as live in ZooKeeper:/live_nodes/127.0.0.1:55515_solr
   [junit4]   2> 2895853 DEBUG (OverseerStateUpdate-72080667858698246-127.0.0.1:55516_solr-n_0000000000) [n:127.0.0.1:55516_solr    ] o.a.s.c.Overseer processMessage: queueSize: 1, message = {
   [junit4]   2>   "operation":"downnode",
   [junit4]   2>   "node_name":"127.0.0.1:55515_solr"} current state version: 0
   [junit4]   2> 2895854 INFO  (zkCallback-11255-thread-1) [    ] o.a.s.c.c.ZkStateReader Updated live nodes from ZooKeeper... (1) -> (2)
   [junit4]   2> 2895854 INFO  (zkCallback-11262-thread-1) [    ] o.a.s.c.c.ZkStateReader Updated live nodes from ZooKeeper... (1) -> (2)
   [junit4]   2> 2895854 INFO  (zkCallback-11247-thread-1) [    ] o.a.s.c.c.ZkStateReader Updated live nodes from ZooKeeper... (1) -> (2)
   [junit4]   2> 2895865 INFO  (jetty-launcher-11235-thread-1) [n:127.0.0.1:55516_solr    ] o.a.s.h.a.MetricsHistoryHandler No .system collection, keeping metrics history in memory.
   [junit4]   2> 2895873 INFO  (zkConnectionManagerCallback-11269-thread-1) [    ] o.a.s.c.c.ConnectionManager zkClient has connected
   [junit4]   2> 2895875 INFO  (jetty-launcher-11235-thread-2) [n:127.0.0.1:55515_solr    ] o.a.s.c.c.ZkStateReader Updated live nodes from ZooKeeper... (0) -> (2)
   [junit4]   2> 2895875 INFO  (jetty-launcher-11235-thread-2) [n:127.0.0.1:55515_solr    ] o.a.s.c.s.i.ZkClientClusterStateProvider Cluster at 127.0.0.1:55511/solr ready
   [junit4]   2> 2895875 INFO  (jetty-launcher-11235-thread-2) [n:127.0.0.1:55515_solr    ] o.a.s.h.a.MetricsHistoryHandler No .system collection, keeping metrics history in memory.
   [junit4]   2> 2895920 INFO  (jetty-launcher-11235-thread-1) [n:127.0.0.1:55516_solr    ] o.a.s.m.r.SolrJmxReporter JMX monitoring for 'solr_55516.solr.node' (registry 'solr.node') enabled at server: com.sun.jmx.mbeanserver.JmxMBeanServer@357c9d12
   [junit4]   2> 2895933 INFO  (jetty-launcher-11235-thread-2) [n:127.0.0.1:55515_solr    ] o.a.s.m.r.SolrJmxReporter JMX monitoring for 'solr_55515.solr.node' (registry 'solr.node') enabled at server: com.sun.jmx.mbeanserver.JmxMBeanServer@357c9d12
   [junit4]   2> 2895939 INFO  (jetty-launcher-11235-thread-1) [n:127.0.0.1:55516_solr    ] o.a.s.m.r.SolrJmxReporter JMX monitoring for 'solr_55516.solr.jvm' (registry 'solr.jvm') enabled at server: com.sun.jmx.mbeanserver.JmxMBeanServer@357c9d12
   [junit4]   2> 2895939 INFO  (jetty-launcher-11235-thread-1) [n:127.0.0.1:55516_solr    ] o.a.s.m.r.SolrJmxReporter JMX monitoring for 'solr_55516.solr.jetty' (registry 'solr.jetty') enabled at server: com.sun.jmx.mbeanserver.JmxMBeanServer@357c9d12
   [junit4]   2> 2895940 INFO  (jetty-launcher-11235-thread-2) [n:127.0.0.1:55515_solr    ] o.a.s.m.r.SolrJmxReporter JMX monitoring for 'solr_55515.solr.jvm' (registry 'solr.jvm') enabled at server: com.sun.jmx.mbeanserver.JmxMBeanServer@357c9d12
   [junit4]   2> 2895940 INFO  (jetty-launcher-11235-thread-2) [n:127.0.0.1:55515_solr    ] o.a.s.m.r.SolrJmxReporter JMX monitoring for 'solr_55515.solr.jetty' (registry 'solr.jetty') enabled at server: com.sun.jmx.mbeanserver.JmxMBeanServer@357c9d12
   [junit4]   2> 2895941 INFO  (jetty-launcher-11235-thread-1) [n:127.0.0.1:55516_solr    ] o.a.s.c.CorePropertiesLocator Found 0 core definitions underneath C:\Users\jenkins\workspace\Lucene-Solr-7.x-Windows\solr\build\solr-core\test\J0\temp\solr.cloud.autoscaling.TriggerIntegrationTest_EEF70F0E17CFAD97-001\tempDir-001\node1\.
   [junit4]   2> 2895941 INFO  (jetty-launcher-11235-thread-2) [n:127.0.0.1:55515_solr    ] o.a.s.c.CorePropertiesLocator Found 0 core definitions underneath C:\Users\jenkins\workspace\Lucene-Solr-7.x-Windows\solr\build\solr-core\test\J0\temp\solr.cloud.autoscaling.TriggerIntegrationTest_EEF70F0E17CFAD97-001\tempDir-001\node2\.
   [junit4]   2> 2895990 INFO  (zkConnectionManagerCallback-11272-thread-1) [    ] o.a.s.c.c.ConnectionManager zkClient has connected
   [junit4]   2> 2895998 INFO  (zkConnectionManagerCallback-11277-thread-1) [    ] o.a.s.c.c.ConnectionManager zkClient has connected
   [junit4]   2> 2896000 INFO  (SUITE-TriggerIntegrationTest-seed#[EEF70F0E17CFAD97]-worker) [    ] o.a.s.c.c.ZkStateReader Updated live nodes from ZooKeeper... (0) -> (2)
   [junit4]   2> 2896001 INFO  (SUITE-TriggerIntegrationTest-seed#[EEF70F0E17CFAD97]-worker) [    ] o.a.s.c.s.i.ZkClientClusterStateProvider Cluster at 127.0.0.1:55511/solr ready
   [junit4]   2> 2896010 INFO  (qtp2027617734-33518) [n:127.0.0.1:55515_solr    ] o.a.s.s.HttpSolrCall [admin] webapp=null path=/admin/metrics params={prefix=CONTAINER.fs.usableSpace,CONTAINER.fs.totalSpace,CORE.coreName&wt=javabin&version=2&group=solr.node,solr.core} status=0 QTime=2
   [junit4]   2> 2896019 INFO  (qtp1659393014-33516) [n:127.0.0.1:55516_solr    ] o.a.s.s.HttpSolrCall [admin] webapp=null path=/admin/metrics params={prefix=CONTAINER.fs.usableSpace,CONTAINER.fs.totalSpace,CORE.coreName&wt=javabin&version=2&group=solr.node,solr.core} status=0 QTime=7
   [junit4]   2> 2896020 DEBUG (qtp1659393014-33524) [n:127.0.0.1:55516_solr    ] o.a.s.c.a.AutoScalingHandler Verified autoscaling configuration
   [junit4]   2> 2896020 INFO  (qtp1659393014-33524) [n:127.0.0.1:55516_solr    ] o.a.s.s.HttpSolrCall [admin] webapp=null path=/admin/autoscaling params={wt=javabin&version=2} status=0 QTime=13
   [junit4]   2> 2896020 DEBUG (zkCallback-11262-thread-1) [    ] o.a.s.c.a.OverseerTriggerThread Refreshing /autoscaling.json with znode version 2
   [junit4]   2> 2896022 DEBUG (OverseerAutoScalingTriggerThread-72080667858698246-127.0.0.1:55516_solr-n_0000000000) [    ] o.a.s.c.a.OverseerTriggerThread Processed trigger updates upto znodeVersion 2
   [junit4]   2> 2896068 DEBUG (OverseerAutoScalingTriggerThread-72080667858698246-127.0.0.1:55516_solr-n_0000000000) [    ] o.a.s.c.a.OverseerTriggerThread -- clean old nodeAdded markers
   [junit4]   2> 2896079 DEBUG (OverseerAutoScalingTriggerThread-72080667858698246-127.0.0.1:55516_solr-n_0000000000) [    ] o.a.s.c.a.OverseerTriggerThread Current znodeVersion 2, lastZnodeVersion 2
   [junit4]   2> 2896160 INFO  (zkConnectionManagerCallback-11279-thread-1) [    ] o.a.s.c.c.ConnectionManager zkClient has connected
   [junit4]   2> 2896162 WARN  (NIOServerCxn.Factory:0.0.0.0/0.0.0.0:0) [    ] o.a.z.s.NIOServerCnxn Unable to read additional data from client sessionid 0x10014fc4ae4000b, likely client has closed socket
   [junit4]   2> 2896163 INFO  (qtp1659393014-33525) [n:127.0.0.1:55516_solr    ] o.a.s.h.a.CollectionsHandler Invoked Collection Action :overseerstatus with params action=OVERSEERSTATUS&wt=javabin&version=2 and sendToOCPQueue=true
   [junit4]   2> 2896166 INFO  (qtp1659393014-33525) [n:127.0.0.1:55516_solr    ] o.a.s.s.HttpSolrCall [admin] webapp=null path=/admin/collections params={action=OVERSEERSTATUS&wt=javabin&version=2} status=0 QTime=3
   [junit4]   2> 2896169 INFO  (TEST-TriggerIntegrationTest.testTriggerThrottling-seed#[EEF70F0E17CFAD97]) [    ] o.a.s.c.a.ScheduledTriggers -- removing trigger: .auto_add_replicas
   [junit4]   2> 2896173 INFO  (TEST-TriggerIntegrationTest.testTriggerThrottling-seed#[EEF70F0E17CFAD97]) [    ] o.a.s.c.a.TriggerIntegrationTest /autoscaling.json reset, new znode version 3
   [junit4]   2> 2896173 DEBUG (zkCallback-11262-thread-1) [    ] o.a.s.c.a.OverseerTriggerThread Refreshing /autoscaling.json with znode version 3
   [junit4]   2> 2896173 DEBUG (OverseerAutoScalingTriggerThread-72080667858698246-127.0.0.1:55516_solr-n_0000000000) [    ] o.a.s.c.a.OverseerTriggerThread Processed trigger updates upto znodeVersion 3
   [junit4]   2> 2896173 DEBUG (OverseerAutoScalingTriggerThread-72080667858698246-127.0.0.1:55516_solr-n_0000000000) [    ] o.a.s.c.a.OverseerTriggerThread -- clean old nodeLost markers
   [junit4]   2> 2896174 DEBUG (OverseerAutoScalingTriggerThread-72080667858698246-127.0.0.1:55516_solr-n_0000000000) [    ] o.a.s.c.a.OverseerTriggerThread -- clean old nodeAdded markers
   [junit4]   2> 2896174 DEBUG (OverseerAutoScalingTriggerThread-72080667858698246-127.0.0.1:55516_solr-n_0000000000) [    ] o.a.s.c.a.OverseerTriggerThread Current znodeVersion 3, lastZnodeVersion 3
   [junit4]   2> 2896174 INFO  (TEST-TriggerIntegrationTest.testTriggerThrottling-seed#[EEF70F0E17CFAD97]) [    ] o.a.s.c.c.ZkStateReader Updated live nodes from ZooKeeper... (0) -> (2)
   [junit4]   2> 2896175 INFO  (TEST-TriggerIntegrationTest.testTriggerThrottling-seed#[EEF70F0E17CFAD97]) [    ] o.e.j.s.AbstractConnector Stopped ServerConnector@38f7ec47{HTTP/1.1,[http/1.1]}{127.0.0.1:0}
   [junit4]   2> 2896180 INFO  (TEST-TriggerIntegrationTest.testTriggerThrottling-seed#[EEF70F0E17CFAD97]) [    ] o.a.s.c.CoreContainer Shutting down CoreContainer instance=2016163756
   [junit4]   2> 2896180 INFO  (TEST-TriggerIntegrationTest.testTriggerThrottling-seed#[EEF70F0E17CFAD97]) [    ] o.a.s.m.SolrMetricManager Closing metric reporters for registry=solr.node, tag=null
   [junit4]   2> 2896180 INFO  (TEST-TriggerIntegrationTest.testTriggerThrottling-seed#[EEF70F0E17CFAD97]) [    ] o.a.s.m.r.SolrJmxReporter Closing reporter [org.apache.solr.metrics.reporters.SolrJmxReporter@56527470: rootName = solr_55516, domain = solr.node, service url = null, agent id = null] for registry solr.node / com.codahale.metrics.MetricRegistry@fe48d5c
   [junit4]   2> 2896197 INFO  (TEST-TriggerIntegrationTest.testTriggerThrottling-seed#[EEF70F0E17CFAD97]) [    ] o.a.s.m.SolrMetricManager Closing metric reporters for registry=solr.jvm, tag=null
   [junit4]   2> 2896197 INFO  (TEST-TriggerIntegrationTest.testTriggerThrottling-seed#[EEF70F0E17CFAD97]) [    ] o.a.s.m.r.SolrJmxReporter Closing reporter [org.apache.solr.metrics.reporters.SolrJmxReporter@3f4d462a: rootName = solr_55516, domain = solr.jvm, service url = null, agent id = null] for registry solr.jvm / com.codahale.metrics.MetricRegistry@68f9c637
   [junit4]   2> 2896200 INFO  (TEST-TriggerIntegrationTest.testTriggerThrottling-seed#[EEF70F0E17CFAD97]) [    ] o.a.s.m.SolrMetricManager Closing metric reporters for registry=solr.jetty, tag=null
   [junit4]   2> 2896200 INFO  (TEST-TriggerIntegrationTest.testTriggerThrottling-seed#[EEF70F0E17CFAD97]) [    ] o.a.s.m.r.SolrJmxReporter Closing reporter [org.apache.solr.metrics.reporters.SolrJmxReporter@217f3065: rootName = solr_55516, domain = solr.jetty, service url = null, agent id = null] for registry solr.jetty / com.codahale.metrics.MetricRegistry@528349c6
   [junit4]   2> 2896203 INFO  (TEST-TriggerIntegrationTest.testTriggerThrottling-seed#[EEF70F0E17CFAD97]) [    ] o.a.s.c.ZkController Remove node as live in ZooKeeper:/live_nodes/127.0.0.1:55516_solr
   [junit4]   2> 2896203 INFO  (TEST-TriggerIntegrationTest.testTriggerThrottling-seed#[EEF70F0E17CFAD97]) [    ] o.a.s.m.SolrMetricManager Closing metric reporters for registry=solr.cluster, tag=null
   [junit4]   2> 2896203 INFO  (TEST-TriggerIntegrationTest.testTriggerThrottling-seed#[EEF70F0E17CFAD97]) [    ] o.a.s.c.TransientSolrCoreCacheDefault Allocating transient cache for 2147483647 transient cores
   [junit4]   2> 2896203 DEBUG (OverseerStateUpdate-72080667858698246-127.0.0.1:55516_solr-n_0000000000) [n:127.0.0.1:55516_solr    ] o.a.s.c.Overseer processMessage: queueSize: 1, message = {
   [junit4]   2>   "operation":"downnode",
   [junit4]   2>   "node_name":"127.0.0.1:55516_solr"} current state version: 0
   [junit4]   2> 2896204 INFO  (TEST-TriggerIntegrationTest.testTriggerThrottling-seed#[EEF70F0E17CFAD97]) [    ] o.a.s.c.Overseer Overseer (id=72080667858698246-127.0.0.1:55516_solr-n_0000000000) closing
   [junit4]   2> 2896206 INFO  (zkCallback-11268-thread-1) [    ] o.a.s.c.c.ZkStateReader Updated live nodes from ZooKeeper... (2) -> (1)
   [junit4]   2> 2896206 INFO  (zkCallback-11255-thread-1) [    ] o.a.s.c.c.ZkStateReader Updated live nodes from ZooKeeper... (2) -> (1)
   [junit4]   2> 2896206 INFO  (OverseerStateUpdate-72080667858698246-127.0.0.1:55516_solr-n_0000000000) [n:127.0.0.1:55516_solr    ] o.a.s.c.Overseer Overseer Loop exiting : 127.0.0.1:55516_solr
   [junit4]   2> 2896206 DEBUG (TEST-TriggerIntegrationTest.testTriggerThrottling-seed#[EEF70F0E17CFAD97]) [    ] o.a.s.c.a.ScheduledTriggers Shutting down scheduled thread pool executor now
   [junit4]   2> 2896206 INFO  (zkCallback-11247-thread-1) [    ] o.a.s.c.c.ZkStateReader Updated live nodes from ZooKeeper... (2) -> (1)
   [junit4]   2> 2896206 DEBUG (TEST-TriggerIntegrationTest.testTriggerThrottling-seed#[EEF70F0E17CFAD97]) [    ] o.a.s.c.a.ScheduledTriggers Shutting down action executor now
   [junit4]   2> 2896206 DEBUG (TEST-TriggerIntegrationTest.testTriggerThrottling-seed#[EEF70F0E17CFAD97]) [    ] o.a.s.c.a.ScheduledTriggers Awaiting termination for action executor
   [junit4]   2> 2896206 DEBUG (TEST-TriggerIntegrationTest.testTriggerThrottling-seed#[EEF70F0E17CFAD97]) [    ] o.a.s.c.a.ScheduledTriggers Awaiting termination for scheduled thread pool executor
   [junit4]   2> 2896206 WARN  (OverseerAutoScalingTriggerThread-72080667858698246-127.0.0.1:55516_solr-n_0000000000) [    ] o.a.s.c.a.OverseerTriggerThread OverseerTriggerThread woken up but we are closed, exiting.
   [junit4]   2> 2896206 DEBUG (TEST-TriggerIntegrationTest.testTriggerThrottling-seed#[EEF70F0E17CFAD97]) [    ] o.a.s.c.a.ScheduledTriggers ScheduledTriggers closed completely
   [junit4]   2> 2896206 DEBUG (TEST-TriggerIntegrationTest.testTriggerThrottling-seed#[EEF70F0E17CFAD97]) [    ] o.a.s.c.a.OverseerTriggerThread OverseerTriggerThread has been closed explicitly
   [junit4]   2> 2896206 INFO  (zkCallback-11276-thread-1) [    ] o.a.s.c.c.ZkStateReader Updated live nodes from ZooKeeper... (2) -> (1)
   [junit4]   2> 2896206 INFO  (zkCallback-11276-thread-2) [    ] o.a.s.c.c.ZkStateReader Updated live nodes from ZooKeeper... (2) -> (1)
   [junit4]   2> 2896208 INFO  (zkCallback-11262-thread-1) [    ] o.a.s.c.c.ZkStateReader Updated live nodes from ZooKeeper... (2) -> (1)
   [junit4]   2> 2896212 INFO  (TEST-TriggerIntegrationTest.testTriggerThrottling-seed#[EEF70F0E17CFAD97]) [    ] o.e.j.s.h.ContextHandler Stopped o.e.j.s.ServletContextHandler@26587c69{/solr,null,UNAVAILABLE}
   [junit4]   2> 2896212 INFO  (zkCallback-11247-thread-1) [    ] o.a.s.c.OverseerElectionContext I am going to be the leader 127.0.0.1:55515_solr
   [junit4]   2> 2896215 INFO  (TEST-TriggerIntegrationTest.testTriggerThrottling-seed#[EEF70F0E17CFAD97]) [    ] o.e.j.s.session node0 Stopped scavenging
   [junit4]   2> 2896216 INFO  (zkCallback-11247-thread-1) [n:127.0.0.1:55515_solr    ] o.a.s.c.Overseer Overseer (id=72080667858698244-127.0.0.1:55515_solr-n_0000000001) starting
   [junit4]   2> 2896221 INFO  (OverseerStateUpdate-72080667858698244-127.0.0.1:55515_solr-n_0000000001) [n:127.0.0.1:55515_solr    ] o.a.s.c.Overseer Starting to work on the main queue : 127.0.0.1:55515_solr
   [junit4]   2> 2896221 DEBUG (OverseerAutoScalingTriggerThread-72080667858698244-127.0.0.1:55515_solr-n_0000000001) [    ] o.a.s.c.a.OverseerTriggerThread Adding .auto_add_replicas and .scheduled_maintenance triggers
   [junit4]   2> 2896222 DEBUG (OverseerAutoScalingTriggerThread-72080667858698244-127.0.0.1:55515_solr-n_0000000001) [    ] o.a.s.c.a.OverseerTriggerThread Refreshing /autoscaling.json with znode version 4
   [junit4]   2> 2896222 DEBUG (OverseerAutoScalingTriggerThread-72080667858698244-127.0.0.1:55515_solr-n_0000000001) [    ] o.a.s.c.a.OverseerTriggerThread Current znodeVersion 4, lastZnodeVersion -1
   [junit4]   2> 2896222 DEBUG (OverseerAutoScalingTriggerThread-72080667858698244-127.0.0.1:55515_solr-n_0000000001) [    ] o.a.s.c.a.OverseerTriggerThread Processed trigger updates upto znodeVersion 4
   [junit4]   2> 2896223 DEBUG (OverseerStateUpdate-72080667858698244-127.0.0.1:55515_solr-n_0000000001) [n:127.0.0.1:55515_solr    ] o.a.s.c.Overseer processMessage: queueSize: 1, message = {
   [junit4]   2>   "operation":"downnode",
   [junit4]   2>   "node_name":"127.0.0.1:55516_solr"} current state version: 0
   [junit4]   2> 2896225 DEBUG (OverseerAutoScalingTriggerThread-72080667858698244-127.0.0.1:55515_solr-n_0000000001) [    ] o.a.s.c.a.NodeLostTrigger NodeLostTrigger .auto_add_replicas - Initial livenodes: [127.0.0.1:55515_solr]
   [junit4]   2> 2896225 DEBUG (OverseerAutoScalingTriggerThread-72080667858698244-127.0.0.1:55515_solr-n_0000000001) [    ] o.a.s.c.a.OverseerTriggerThread -- clean old nodeAdded markers
   [junit4]   2> 2896226 DEBUG (OverseerAutoScalingTriggerThread-72080667858698244-127.0.0.1:55515_solr-n_0000000001) [    ] o.a.s.c.a.OverseerTriggerThread Current znodeVersion 4, lastZnodeVersion 4
   [junit4]   2> 2896226 DEBUG (ScheduledTrigger-12315-thread-1) [    ] o.a.s.c.a.NodeLostTrigger Running NodeLostTrigger: .auto_add_replicas with currently live nodes: 1
   [junit4]   2> 2897328 DEBUG (ScheduledTrigger-12315-thread-1) [    ] o.a.s.c.a.NodeLostTrigger Running NodeLostTrigger: .auto_add_replicas with currently live nodes: 1
   [junit4]   2> 2898434 DEBUG (ScheduledTrigger-12

[...truncated too long message...]

ale.metrics.MetricRegistry@6de22860
   [junit4]   2> 249581 INFO  (jetty-closer-408-thread-3) [    ] o.a.s.m.SolrMetricManager Closing metric reporters for registry=solr.cluster, tag=null
   [junit4]   2> 249582 INFO  (zkCallback-584-thread-1) [    ] o.a.s.c.c.ZkStateReader Updated live nodes from ZooKeeper... (3) -> (2)
   [junit4]   2> 249582 INFO  (zkCallback-575-thread-1) [    ] o.a.s.c.c.ZkStateReader Updated live nodes from ZooKeeper... (3) -> (2)
   [junit4]   2> 249582 INFO  (zkCallback-568-thread-1) [    ] o.a.s.c.c.ZkStateReader Updated live nodes from ZooKeeper... (3) -> (2)
   [junit4]   2> 249582 INFO  (zkCallback-600-thread-1) [    ] o.a.s.c.c.ZkStateReader Updated live nodes from ZooKeeper... (3) -> (2)
   [junit4]   2> 249582 INFO  (zkCallback-607-thread-1) [    ] o.a.s.c.c.ZkStateReader Updated live nodes from ZooKeeper... (3) -> (2)
   [junit4]   2> 249582 INFO  (jetty-closer-408-thread-2) [    ] o.a.s.c.ZkController Remove node as live in ZooKeeper:/live_nodes/127.0.0.1:50292_solr
   [junit4]   2> 249582 INFO  (zkCallback-591-thread-1) [    ] o.a.s.c.c.ZkStateReader Updated live nodes from ZooKeeper... (3) -> (2)
   [junit4]   2> 249586 INFO  (jetty-closer-408-thread-2) [    ] o.a.s.m.SolrMetricManager Closing metric reporters for registry=solr.cluster, tag=null
   [junit4]   2> 249587 INFO  (zkCallback-584-thread-1) [    ] o.a.s.c.c.ZkStateReader Updated live nodes from ZooKeeper... (2) -> (1)
   [junit4]   2> 249587 INFO  (jetty-closer-408-thread-4) [    ] o.a.s.c.ZkController Remove node as live in ZooKeeper:/live_nodes/127.0.0.1:50328_solr
   [junit4]   2> 249589 INFO  (zkCallback-568-thread-1) [    ] o.a.s.c.c.ZkStateReader Updated live nodes from ZooKeeper... (2) -> (1)
   [junit4]   2> 249589 INFO  (zkCallback-575-thread-1) [    ] o.a.s.c.c.ZkStateReader Updated live nodes from ZooKeeper... (2) -> (1)
   [junit4]   2> 249589 INFO  (zkCallback-607-thread-1) [    ] o.a.s.c.c.ZkStateReader Updated live nodes from ZooKeeper... (2) -> (1)
   [junit4]   2> 249589 INFO  (zkCallback-600-thread-1) [    ] o.a.s.c.c.ZkStateReader Updated live nodes from ZooKeeper... (2) -> (1)
   [junit4]   2> 249590 INFO  (jetty-closer-408-thread-3) [    ] o.e.j.s.h.ContextHandler Stopped o.e.j.s.ServletContextHandler@42a7037e{/solr,null,UNAVAILABLE}
   [junit4]   2> 249591 INFO  (jetty-closer-408-thread-3) [    ] o.e.j.s.session node0 Stopped scavenging
   [junit4]   2> 249591 INFO  (jetty-closer-408-thread-4) [    ] o.a.s.m.SolrMetricManager Closing metric reporters for registry=solr.cluster, tag=null
   [junit4]   2> 249594 WARN  (NIOServerCxn.Factory:0.0.0.0/0.0.0.0:0) [    ] o.a.z.s.NIOServerCnxn Unable to read additional data from client sessionid 0x10015256dac0029, likely client has closed socket
   [junit4]   2> 249595 INFO  (zkCallback-607-thread-1) [    ] o.a.s.c.c.ZkStateReader Updated live nodes from ZooKeeper... (1) -> (0)
   [junit4]   2> 249595 INFO  (zkCallback-600-thread-3) [    ] o.a.s.c.c.ZkStateReader Updated live nodes from ZooKeeper... (1) -> (0)
   [junit4]   2> 249598 INFO  (zkCallback-600-thread-2) [    ] o.a.s.c.OverseerElectionContext I am going to be the leader 127.0.0.1:50328_solr
   [junit4]   2> 251064 WARN  (zkCallback-568-thread-1) [    ] o.a.s.c.c.ZkStateReader ZooKeeper watch triggered, but Solr cannot talk to ZK: [KeeperErrorCode = Session expired for /live_nodes]
   [junit4]   2> 251064 INFO  (jetty-closer-408-thread-2) [    ] o.e.j.s.h.ContextHandler Stopped o.e.j.s.ServletContextHandler@5538f2b{/solr,null,UNAVAILABLE}
   [junit4]   2> 251065 INFO  (jetty-closer-408-thread-2) [    ] o.e.j.s.session node0 Stopped scavenging
   [junit4]   2> 251070 INFO  (jetty-closer-408-thread-4) [    ] o.e.j.s.h.ContextHandler Stopped o.e.j.s.ServletContextHandler@738763ae{/solr,null,UNAVAILABLE}
   [junit4]   2> 251070 INFO  (jetty-closer-408-thread-4) [    ] o.e.j.s.session node0 Stopped scavenging
   [junit4]   2> 251070 ERROR (SUITE-TriggerIntegrationTest-seed#[EEF70F0E17CFAD97]-worker) [    ] o.a.z.s.ZooKeeperServer ZKShutdownHandler is not registered, so ZooKeeper server won't take any action on ERROR or SHUTDOWN server state changes
   [junit4]   2> 251072 INFO  (SUITE-TriggerIntegrationTest-seed#[EEF70F0E17CFAD97]-worker) [    ] o.a.s.c.ZkTestServer connecting to 127.0.0.1:49877 49877
   [junit4]   2> 251073 INFO  (Thread-230) [    ] o.a.s.c.ZkTestServer connecting to 127.0.0.1:49877 49877
   [junit4]   2> 251074 WARN  (Thread-230) [    ] o.a.s.c.ZkTestServer Watch limit violations: 
   [junit4]   2> Maximum concurrent create/delete watches above limit:
   [junit4]   2> 
   [junit4]   2> 	27	/solr/aliases.json
   [junit4]   2> 	27	/solr/clusterprops.json
   [junit4]   2> 	11	/solr/security.json
   [junit4]   2> 
   [junit4]   2> Maximum concurrent data watches above limit:
   [junit4]   2> 
   [junit4]   2> 	27	/solr/clusterstate.json
   [junit4]   2> 	10	/solr/aliases.json
   [junit4]   2> 	7	/solr/autoscaling.json
   [junit4]   2> 	2	/solr/overseer_elect/election/72080844535889934-127.0.0.1:49956_solr-n_0000000002
   [junit4]   2> 
   [junit4]   2> Maximum concurrent children watches above limit:
   [junit4]   2> 
   [junit4]   2> 	66	/solr/live_nodes
   [junit4]   2> 	27	/solr/collections
   [junit4]   2> 	7	/solr/autoscaling/events/.auto_add_replicas
   [junit4]   2> 	7	/solr/autoscaling/events/.scheduled_maintenance
   [junit4]   2> 	7	/solr/overseer/collection-queue-work
   [junit4]   2> 	7	/solr/overseer/queue-work
   [junit4]   2> 	6	/solr/overseer/queue
   [junit4]   2> 	2	/solr/autoscaling/events/node_added_triggerCTOOR
   [junit4]   2> 
   [junit4]   2> NOTE: leaving temporary files on disk at: C:\Users\jenkins\workspace\Lucene-Solr-7.x-Windows\solr\build\solr-core\test\J0\temp\solr.cloud.autoscaling.TriggerIntegrationTest_EEF70F0E17CFAD97-001
   [junit4]   2> Nov 01, 2018 12:14:37 PM com.carrotsearch.randomizedtesting.ThreadLeakControl checkThreadLeaks
   [junit4]   2> WARNING: Will linger awaiting termination of 1 leaked thread(s).
   [junit4]   2> NOTE: test params are: codec=Asserting(Lucene70): {}, docValues:{}, maxPointsInLeafNode=909, maxMBSortInHeap=5.644751602519357, sim=RandomSimilarity(queryNorm=true): {}, locale=sr-Latn, timezone=Pacific/Funafuti
   [junit4]   2> NOTE: Windows 10 10.0 amd64/Oracle Corporation 1.8.0_172 (64-bit)/cpus=3,threads=1,free=54374560,total=100663296
   [junit4]   2> NOTE: All tests run in this JVM: [TriggerIntegrationTest, TriggerIntegrationTest, TriggerIntegrationTest]
   [junit4] Completed [10/10 (5!)] on J0 in 92.52s, 4 tests, 1 failure <<< FAILURES!
   [junit4] 
   [junit4] 
   [junit4] Tests with failures [seed: EEF70F0E17CFAD97]:
   [junit4]   - org.apache.solr.cloud.autoscaling.TriggerSetPropertiesIntegrationTest.testSetProperties
   [junit4]   - org.apache.solr.cloud.autoscaling.TriggerIntegrationTest.testTriggerThrottling
   [junit4]   - org.apache.solr.cloud.autoscaling.TriggerIntegrationTest.testTriggerThrottling
   [junit4]   - org.apache.solr.cloud.autoscaling.TriggerSetPropertiesIntegrationTest.testSetProperties
   [junit4]   - org.apache.solr.cloud.autoscaling.TriggerSetPropertiesIntegrationTest.testSetProperties
   [junit4] 
   [junit4] 
   [junit4] JVM J0:     0.86 ..   252.63 =   251.77s
   [junit4] JVM J1:     0.86 ..   240.46 =   239.60s
   [junit4] Execution time total: 4 minutes 12 seconds
   [junit4] Tests summary: 10 suites, 25 tests, 5 failures

BUILD FAILED
C:\Users\jenkins\workspace\Lucene-Solr-7.x-Windows\lucene\common-build.xml:1567: The following error occurred while executing this line:
C:\Users\jenkins\workspace\Lucene-Solr-7.x-Windows\lucene\common-build.xml:1092: There were test failures: 10 suites, 25 tests, 5 failures [seed: EEF70F0E17CFAD97]

Total time: 4 minutes 14 seconds

[repro] Setting last failure code to 1

[repro] Failures:
[repro]   2/5 failed: org.apache.solr.cloud.autoscaling.TriggerIntegrationTest
[repro]   3/5 failed: org.apache.solr.cloud.autoscaling.TriggerSetPropertiesIntegrationTest
[repro] Exiting with code 1

C:\Users\jenkins\workspace\Lucene-Solr-7.x-Windows>IF EXIST lucene\build move /y lucene\build lucene\build.repro 
        1 dir(s) moved.

C:\Users\jenkins\workspace\Lucene-Solr-7.x-Windows>IF EXIST solr\build move /y solr\build solr\build.repro 
        1 dir(s) moved.

C:\Users\jenkins\workspace\Lucene-Solr-7.x-Windows>IF EXIST lucene\build.orig move /y lucene\build.orig lucene\build 
        1 dir(s) moved.

C:\Users\jenkins\workspace\Lucene-Solr-7.x-Windows>IF EXIST solr\build.orig move /y solr\build.orig solr\build 
        1 dir(s) moved.

C:\Users\jenkins\workspace\Lucene-Solr-7.x-Windows>exit 0 
Archiving artifacts
Setting ANT_1_8_2_HOME=C:\Users\jenkins\tools\hudson.tasks.Ant_AntInstallation\ANT_1.8.2
[WARNINGS] Parsing warnings in console log with parser Java Compiler (javac)
Setting ANT_1_8_2_HOME=C:\Users\jenkins\tools\hudson.tasks.Ant_AntInstallation\ANT_1.8.2
Setting ANT_1_8_2_HOME=C:\Users\jenkins\tools\hudson.tasks.Ant_AntInstallation\ANT_1.8.2
<Git Blamer> Using GitBlamer to create author and commit information for all warnings.
<Git Blamer> GIT_COMMIT=50e10d327428ea05df493e6bcd62aaeccb7ec0b9, workspace=C:\Users\jenkins\workspace\Lucene-Solr-7.x-Windows
[WARNINGS] Computing warning deltas based on reference build #864
Recording test results
Setting ANT_1_8_2_HOME=C:\Users\jenkins\tools\hudson.tasks.Ant_AntInstallation\ANT_1.8.2
Build step 'Publish JUnit test result report' changed build result to UNSTABLE
Email was triggered for: Unstable (Test Failures)
Sending email for trigger: Unstable (Test Failures)
Setting ANT_1_8_2_HOME=C:\Users\jenkins\tools\hudson.tasks.Ant_AntInstallation\ANT_1.8.2
Setting ANT_1_8_2_HOME=C:\Users\jenkins\tools\hudson.tasks.Ant_AntInstallation\ANT_1.8.2
Setting ANT_1_8_2_HOME=C:\Users\jenkins\tools\hudson.tasks.Ant_AntInstallation\ANT_1.8.2
Setting ANT_1_8_2_HOME=C:\Users\jenkins\tools\hudson.tasks.Ant_AntInstallation\ANT_1.8.2

Mime
View raw message