lucene-dev mailing list archives

Site index · List index
Message view « Date » · « Thread »
Top « Date » · « Thread »
From Apache Jenkins Server <jenk...@builds.apache.org>
Subject [JENKINS] Lucene-Solr-Tests-7.x - Build # 996 - Unstable
Date Thu, 01 Nov 2018 12:26:32 GMT
Build: https://builds.apache.org/job/Lucene-Solr-Tests-7.x/996/

1 tests failed.
FAILED:  org.apache.solr.cloud.autoscaling.sim.TestSimPolicyCloud.testCreateCollectionAddReplica

Error Message:
Timeout waiting for collection to become active Live Nodes: [127.0.0.1:10001_solr, 127.0.0.1:10004_solr, 127.0.0.1:10000_solr, 127.0.0.1:10002_solr, 127.0.0.1:10003_solr] Last available state: DocCollection(testCreateCollectionAddReplica//clusterstate.json/22)={   "replicationFactor":"1",   "pullReplicas":"0",   "router":{"name":"compositeId"},   "maxShardsPerNode":"1",   "autoAddReplicas":"false",   "nrtReplicas":"1",   "tlogReplicas":"0",   "autoCreated":"true",   "policy":"c1",   "shards":{"shard1":{       "replicas":{"core_node1":{           "core":"testCreateCollectionAddReplica_shard1_replica_n1",           "SEARCHER.searcher.maxDoc":0,           "SEARCHER.searcher.deletedDocs":0,           "INDEX.sizeInBytes":10240,           "node_name":"127.0.0.1:10002_solr",           "state":"active",           "type":"NRT",           "INDEX.sizeInGB":9.5367431640625E-6,           "SEARCHER.searcher.numDocs":0}},       "range":"80000000-7fffffff",       "state":"active"}}}

Stack Trace:
java.lang.AssertionError: Timeout waiting for collection to become active
Live Nodes: [127.0.0.1:10001_solr, 127.0.0.1:10004_solr, 127.0.0.1:10000_solr, 127.0.0.1:10002_solr, 127.0.0.1:10003_solr]
Last available state: DocCollection(testCreateCollectionAddReplica//clusterstate.json/22)={
  "replicationFactor":"1",
  "pullReplicas":"0",
  "router":{"name":"compositeId"},
  "maxShardsPerNode":"1",
  "autoAddReplicas":"false",
  "nrtReplicas":"1",
  "tlogReplicas":"0",
  "autoCreated":"true",
  "policy":"c1",
  "shards":{"shard1":{
      "replicas":{"core_node1":{
          "core":"testCreateCollectionAddReplica_shard1_replica_n1",
          "SEARCHER.searcher.maxDoc":0,
          "SEARCHER.searcher.deletedDocs":0,
          "INDEX.sizeInBytes":10240,
          "node_name":"127.0.0.1:10002_solr",
          "state":"active",
          "type":"NRT",
          "INDEX.sizeInGB":9.5367431640625E-6,
          "SEARCHER.searcher.numDocs":0}},
      "range":"80000000-7fffffff",
      "state":"active"}}}
	at __randomizedtesting.SeedInfo.seed([5952EA9E819093FF:D9728FB090D37B59]:0)
	at org.apache.solr.cloud.CloudTestUtils.waitForState(CloudTestUtils.java:70)
	at org.apache.solr.cloud.autoscaling.sim.TestSimPolicyCloud.testCreateCollectionAddReplica(TestSimPolicyCloud.java:123)
	at sun.reflect.NativeMethodAccessorImpl.invoke0(Native Method)
	at sun.reflect.NativeMethodAccessorImpl.invoke(NativeMethodAccessorImpl.java:62)
	at sun.reflect.DelegatingMethodAccessorImpl.invoke(DelegatingMethodAccessorImpl.java:43)
	at java.lang.reflect.Method.invoke(Method.java:498)
	at com.carrotsearch.randomizedtesting.RandomizedRunner.invoke(RandomizedRunner.java:1742)
	at com.carrotsearch.randomizedtesting.RandomizedRunner$8.evaluate(RandomizedRunner.java:935)
	at com.carrotsearch.randomizedtesting.RandomizedRunner$9.evaluate(RandomizedRunner.java:971)
	at com.carrotsearch.randomizedtesting.RandomizedRunner$10.evaluate(RandomizedRunner.java:985)
	at org.junit.rules.ExpectedException$ExpectedExceptionStatement.evaluate(ExpectedException.java:110)
	at com.carrotsearch.randomizedtesting.rules.SystemPropertiesRestoreRule$1.evaluate(SystemPropertiesRestoreRule.java:57)
	at org.apache.lucene.util.TestRuleSetupTeardownChained$1.evaluate(TestRuleSetupTeardownChained.java:49)
	at org.apache.lucene.util.AbstractBeforeAfterRule$1.evaluate(AbstractBeforeAfterRule.java:45)
	at org.apache.lucene.util.TestRuleThreadAndTestName$1.evaluate(TestRuleThreadAndTestName.java:48)
	at org.apache.lucene.util.TestRuleIgnoreAfterMaxFailures$1.evaluate(TestRuleIgnoreAfterMaxFailures.java:64)
	at org.apache.lucene.util.TestRuleMarkFailure$1.evaluate(TestRuleMarkFailure.java:47)
	at com.carrotsearch.randomizedtesting.rules.StatementAdapter.evaluate(StatementAdapter.java:36)
	at com.carrotsearch.randomizedtesting.ThreadLeakControl$StatementRunner.run(ThreadLeakControl.java:368)
	at com.carrotsearch.randomizedtesting.ThreadLeakControl.forkTimeoutingTask(ThreadLeakControl.java:817)
	at com.carrotsearch.randomizedtesting.ThreadLeakControl$3.evaluate(ThreadLeakControl.java:468)
	at com.carrotsearch.randomizedtesting.RandomizedRunner.runSingleTest(RandomizedRunner.java:944)
	at com.carrotsearch.randomizedtesting.RandomizedRunner$5.evaluate(RandomizedRunner.java:830)
	at com.carrotsearch.randomizedtesting.RandomizedRunner$6.evaluate(RandomizedRunner.java:880)
	at com.carrotsearch.randomizedtesting.RandomizedRunner$7.evaluate(RandomizedRunner.java:891)
	at com.carrotsearch.randomizedtesting.rules.StatementAdapter.evaluate(StatementAdapter.java:36)
	at com.carrotsearch.randomizedtesting.rules.SystemPropertiesRestoreRule$1.evaluate(SystemPropertiesRestoreRule.java:57)
	at org.apache.lucene.util.AbstractBeforeAfterRule$1.evaluate(AbstractBeforeAfterRule.java:45)
	at com.carrotsearch.randomizedtesting.rules.StatementAdapter.evaluate(StatementAdapter.java:36)
	at org.apache.lucene.util.TestRuleStoreClassName$1.evaluate(TestRuleStoreClassName.java:41)
	at com.carrotsearch.randomizedtesting.rules.NoShadowingOrOverridesOnMethodsRule$1.evaluate(NoShadowingOrOverridesOnMethodsRule.java:40)
	at com.carrotsearch.randomizedtesting.rules.NoShadowingOrOverridesOnMethodsRule$1.evaluate(NoShadowingOrOverridesOnMethodsRule.java:40)
	at com.carrotsearch.randomizedtesting.rules.StatementAdapter.evaluate(StatementAdapter.java:36)
	at com.carrotsearch.randomizedtesting.rules.StatementAdapter.evaluate(StatementAdapter.java:36)
	at com.carrotsearch.randomizedtesting.rules.StatementAdapter.evaluate(StatementAdapter.java:36)
	at org.apache.lucene.util.TestRuleAssertionsRequired$1.evaluate(TestRuleAssertionsRequired.java:53)
	at org.apache.lucene.util.TestRuleMarkFailure$1.evaluate(TestRuleMarkFailure.java:47)
	at org.apache.lucene.util.TestRuleIgnoreAfterMaxFailures$1.evaluate(TestRuleIgnoreAfterMaxFailures.java:64)
	at org.apache.lucene.util.TestRuleIgnoreTestSuites$1.evaluate(TestRuleIgnoreTestSuites.java:54)
	at com.carrotsearch.randomizedtesting.rules.StatementAdapter.evaluate(StatementAdapter.java:36)
	at com.carrotsearch.randomizedtesting.ThreadLeakControl$StatementRunner.run(ThreadLeakControl.java:368)
	at java.lang.Thread.run(Thread.java:748)
Caused by: java.util.concurrent.TimeoutException: last ClusterState: znodeVersion: 23
live nodes:[127.0.0.1:10001_solr, 127.0.0.1:10004_solr, 127.0.0.1:10000_solr, 127.0.0.1:10002_solr, 127.0.0.1:10003_solr]
collections:{testCreateCollectionAddReplica=DocCollection(testCreateCollectionAddReplica//clusterstate.json/22)={
  "replicationFactor":"1",
  "pullReplicas":"0",
  "router":{"name":"compositeId"},
  "maxShardsPerNode":"1",
  "autoAddReplicas":"false",
  "nrtReplicas":"1",
  "tlogReplicas":"0",
  "autoCreated":"true",
  "policy":"c1",
  "shards":{"shard1":{
      "replicas":{"core_node1":{
          "core":"testCreateCollectionAddReplica_shard1_replica_n1",
          "SEARCHER.searcher.maxDoc":0,
          "SEARCHER.searcher.deletedDocs":0,
          "INDEX.sizeInBytes":10240,
          "node_name":"127.0.0.1:10002_solr",
          "state":"active",
          "type":"NRT",
          "INDEX.sizeInGB":9.5367431640625E-6,
          "SEARCHER.searcher.numDocs":0}},
      "range":"80000000-7fffffff",
      "state":"active"}}}}, last coll state: DocCollection(testCreateCollectionAddReplica//clusterstate.json/22)={
  "replicationFactor":"1",
  "pullReplicas":"0",
  "router":{"name":"compositeId"},
  "maxShardsPerNode":"1",
  "autoAddReplicas":"false",
  "nrtReplicas":"1",
  "tlogReplicas":"0",
  "autoCreated":"true",
  "policy":"c1",
  "shards":{"shard1":{
      "replicas":{"core_node1":{
          "core":"testCreateCollectionAddReplica_shard1_replica_n1",
          "SEARCHER.searcher.maxDoc":0,
          "SEARCHER.searcher.deletedDocs":0,
          "INDEX.sizeInBytes":10240,
          "node_name":"127.0.0.1:10002_solr",
          "state":"active",
          "type":"NRT",
          "INDEX.sizeInGB":9.5367431640625E-6,
          "SEARCHER.searcher.numDocs":0}},
      "range":"80000000-7fffffff",
      "state":"active"}}}
	at org.apache.solr.cloud.CloudTestUtils.waitForState(CloudTestUtils.java:112)
	at org.apache.solr.cloud.CloudTestUtils.waitForState(CloudTestUtils.java:64)
	... 41 more




Build Log:
[...truncated 14346 lines...]
   [junit4] Suite: org.apache.solr.cloud.autoscaling.sim.TestSimPolicyCloud
   [junit4]   2> Creating dataDir: /x1/jenkins/jenkins-slave/workspace/Lucene-Solr-Tests-7.x/solr/build/solr-core/test/J1/temp/solr.cloud.autoscaling.sim.TestSimPolicyCloud_5952EA9E819093FF-001/init-core-data-001
   [junit4]   2> 1900050 WARN  (SUITE-TestSimPolicyCloud-seed#[5952EA9E819093FF]-worker) [    ] o.a.s.SolrTestCaseJ4 startTrackingSearchers: numOpens=10 numCloses=10
   [junit4]   2> 1900050 INFO  (SUITE-TestSimPolicyCloud-seed#[5952EA9E819093FF]-worker) [    ] o.a.s.SolrTestCaseJ4 Using PointFields (NUMERIC_POINTS_SYSPROP=true) w/NUMERIC_DOCVALUES_SYSPROP=false
   [junit4]   2> 1900053 INFO  (SUITE-TestSimPolicyCloud-seed#[5952EA9E819093FF]-worker) [    ] o.a.s.SolrTestCaseJ4 Randomized ssl (true) and clientAuth (false) via: @org.apache.solr.util.RandomizeSSL(reason=, value=NaN, ssl=NaN, clientAuth=NaN)
   [junit4]   2> 1900054 INFO  (SUITE-TestSimPolicyCloud-seed#[5952EA9E819093FF]-worker) [    ] o.a.s.SolrTestCaseJ4 SecureRandom sanity checks: test.solr.allowed.securerandom=null & java.security.egd=file:/dev/./urandom
   [junit4]   2> 1900095 DEBUG (Simulated OverseerAutoScalingTriggerThread) [    ] o.a.s.c.a.OverseerTriggerThread Adding .auto_add_replicas and .scheduled_maintenance triggers
   [junit4]   2> 1900095 DEBUG (Simulated OverseerAutoScalingTriggerThread) [    ] o.a.s.c.a.OverseerTriggerThread Refreshing /autoscaling.json with znode version 0
   [junit4]   2> 1900095 DEBUG (SUITE-TestSimPolicyCloud-seed#[5952EA9E819093FF]-worker) [    ] o.a.s.c.a.s.SimClusterStateProvider --- new Overseer leader: 127.0.0.1:10000_solr
   [junit4]   2> 1900096 DEBUG (Simulated OverseerAutoScalingTriggerThread) [    ] o.a.s.c.a.OverseerTriggerThread Current znodeVersion 0, lastZnodeVersion -1
   [junit4]   2> 1900096 DEBUG (Simulated OverseerAutoScalingTriggerThread) [    ] o.a.s.c.a.OverseerTriggerThread Processed trigger updates upto znodeVersion 0
   [junit4]   2> 1900096 DEBUG (SUITE-TestSimPolicyCloud-seed#[5952EA9E819093FF]-worker) [    ] o.a.s.c.a.s.SimClusterStateProvider ** creating new collection states, currentVersion=0
   [junit4]   2> 1900098 DEBUG (SUITE-TestSimPolicyCloud-seed#[5952EA9E819093FF]-worker) [    ] o.a.s.c.a.s.SimClusterStateProvider ** saved cluster state version 0
   [junit4]   2> 1900098 INFO  (SUITE-TestSimPolicyCloud-seed#[5952EA9E819093FF]-worker) [    ] o.a.s.h.a.MetricsHistoryHandler No .system collection, keeping metrics history in memory.
   [junit4]   2> 1900104 INFO  (TEST-TestSimPolicyCloud.testCreateCollectionSplitShard-seed#[5952EA9E819093FF]) [    ] o.a.s.SolrTestCaseJ4 ###Starting testCreateCollectionSplitShard
   [junit4]   2> 1900104 DEBUG (TEST-TestSimPolicyCloud.testCreateCollectionSplitShard-seed#[5952EA9E819093FF]) [    ] o.a.s.c.a.OverseerTriggerThread Refreshing /autoscaling.json with znode version 1
   [junit4]   2> 1900105 INFO  (TEST-TestSimPolicyCloud.testCreateCollectionSplitShard-seed#[5952EA9E819093FF]) [    ] o.a.s.c.a.s.SimCloudManager === Restarting OverseerTriggerThread and clearing object cache...
   [junit4]   2> 1900113 DEBUG (Simulated OverseerAutoScalingTriggerThread) [    ] o.a.s.c.a.NodeLostTrigger NodeLostTrigger .auto_add_replicas - Initial livenodes: [127.0.0.1:10001_solr, 127.0.0.1:10004_solr, 127.0.0.1:10000_solr, 127.0.0.1:10002_solr, 127.0.0.1:10003_solr]
   [junit4]   2> 1900115 DEBUG (Simulated OverseerAutoScalingTriggerThread) [    ] o.a.s.c.a.OverseerTriggerThread -- clean old nodeAdded markers
   [junit4]   2> 1900115 WARN  (Simulated OverseerAutoScalingTriggerThread) [    ] o.a.s.c.a.OverseerTriggerThread Interrupted
   [junit4]   2> java.lang.InterruptedException: null
   [junit4]   2> 	at java.util.concurrent.locks.AbstractQueuedSynchronizer.acquireInterruptibly(AbstractQueuedSynchronizer.java:1220) ~[?:1.8.0_172]
   [junit4]   2> 	at java.util.concurrent.locks.ReentrantLock.lockInterruptibly(ReentrantLock.java:335) ~[?:1.8.0_172]
   [junit4]   2> 	at org.apache.solr.cloud.autoscaling.OverseerTriggerThread.run(OverseerTriggerThread.java:177) [java/:?]
   [junit4]   2> 	at java.lang.Thread.run(Thread.java:748) [?:1.8.0_172]
   [junit4]   2> 1900122 DEBUG (TEST-TestSimPolicyCloud.testCreateCollectionSplitShard-seed#[5952EA9E819093FF]) [    ] o.a.s.c.a.ScheduledTriggers Shutting down scheduled thread pool executor now
   [junit4]   2> 1900122 DEBUG (TEST-TestSimPolicyCloud.testCreateCollectionSplitShard-seed#[5952EA9E819093FF]) [    ] o.a.s.c.a.ScheduledTriggers Shutting down action executor now
   [junit4]   2> 1900122 DEBUG (TEST-TestSimPolicyCloud.testCreateCollectionSplitShard-seed#[5952EA9E819093FF]) [    ] o.a.s.c.a.ScheduledTriggers Awaiting termination for action executor
   [junit4]   2> 1900122 DEBUG (TEST-TestSimPolicyCloud.testCreateCollectionSplitShard-seed#[5952EA9E819093FF]) [    ] o.a.s.c.a.ScheduledTriggers Awaiting termination for scheduled thread pool executor
   [junit4]   2> 1900125 DEBUG (TEST-TestSimPolicyCloud.testCreateCollectionSplitShard-seed#[5952EA9E819093FF]) [    ] o.a.s.c.a.ScheduledTriggers ScheduledTriggers closed completely
   [junit4]   2> 1900125 DEBUG (TEST-TestSimPolicyCloud.testCreateCollectionSplitShard-seed#[5952EA9E819093FF]) [    ] o.a.s.c.a.OverseerTriggerThread OverseerTriggerThread has been closed explicitly
   [junit4]   2> 1900127 DEBUG (Simulated OverseerAutoScalingTriggerThread) [    ] o.a.s.c.a.OverseerTriggerThread Adding .auto_add_replicas and .scheduled_maintenance triggers
   [junit4]   2> 1900127 DEBUG (Simulated OverseerAutoScalingTriggerThread) [    ] o.a.s.c.a.OverseerTriggerThread Refreshing /autoscaling.json with znode version 2
   [junit4]   2> 1900128 DEBUG (Simulated OverseerAutoScalingTriggerThread) [    ] o.a.s.c.a.OverseerTriggerThread Current znodeVersion 2, lastZnodeVersion -1
   [junit4]   2> 1900128 DEBUG (Simulated OverseerAutoScalingTriggerThread) [    ] o.a.s.c.a.OverseerTriggerThread Processed trigger updates upto znodeVersion 2
   [junit4]   2> 1900133 DEBUG (Simulated OverseerAutoScalingTriggerThread) [    ] o.a.s.c.a.NodeLostTrigger NodeLostTrigger .auto_add_replicas - Initial livenodes: [127.0.0.1:10001_solr, 127.0.0.1:10004_solr, 127.0.0.1:10000_solr, 127.0.0.1:10002_solr, 127.0.0.1:10003_solr]
   [junit4]   2> 1900134 DEBUG (Simulated OverseerAutoScalingTriggerThread) [    ] o.a.s.c.a.OverseerTriggerThread -- clean old nodeAdded markers
   [junit4]   2> 1900134 DEBUG (Simulated OverseerAutoScalingTriggerThread) [    ] o.a.s.c.a.OverseerTriggerThread Current znodeVersion 2, lastZnodeVersion 2
   [junit4]   2> 1900134 DEBUG (ScheduledTrigger-6364-thread-2) [    ] o.a.s.c.a.NodeLostTrigger Running NodeLostTrigger: .auto_add_replicas with currently live nodes: 5
   [junit4]   2> 1900155 DEBUG (ScheduledTrigger-6364-thread-1) [    ] o.a.s.c.a.NodeLostTrigger Running NodeLostTrigger: .auto_add_replicas with currently live nodes: 5
   [junit4]   2> 1900175 DEBUG (ScheduledTrigger-6364-thread-4) [    ] o.a.s.c.a.NodeLostTrigger Running NodeLostTrigger: .auto_add_replicas with currently live nodes: 5
   [junit4]   2> 1900195 DEBUG (ScheduledTrigger-6364-thread-3) [    ] o.a.s.c.a.NodeLostTrigger Running NodeLostTrigger: .auto_add_replicas with currently live nodes: 5
   [junit4]   2> 1900216 DEBUG (ScheduledTrigger-6364-thread-2) [    ] o.a.s.c.a.NodeLostTrigger Running NodeLostTrigger: .auto_add_replicas with currently live nodes: 5
   [junit4]   2> 1900236 DEBUG (ScheduledTrigger-6364-thread-3) [    ] o.a.s.c.a.NodeLostTrigger Running NodeLostTrigger: .auto_add_replicas with currently live nodes: 5
   [junit4]   2> 1900256 DEBUG (ScheduledTrigger-6364-thread-1) [    ] o.a.s.c.a.NodeLostTrigger Running NodeLostTrigger: .auto_add_replicas with currently live nodes: 5
   [junit4]   2> 1900276 DEBUG (ScheduledTrigger-6364-thread-3) [    ] o.a.s.c.a.NodeLostTrigger Running NodeLostTrigger: .auto_add_replicas with currently live nodes: 5
   [junit4]   2> 1900297 DEBUG (ScheduledTrigger-6364-thread-1) [    ] o.a.s.c.a.NodeLostTrigger Running NodeLostTrigger: .auto_add_replicas with currently live nodes: 5
   [junit4]   2> 1900317 DEBUG (ScheduledTrigger-6364-thread-3) [    ] o.a.s.c.a.NodeLostTrigger Running NodeLostTrigger: .auto_add_replicas with currently live nodes: 5
   [junit4]   2> 1900330 DEBUG (simCloudManagerPool-6363-thread-1) [    ] o.a.s.c.a.s.SimClusterStateProvider ** creating new collection states, currentVersion=1
   [junit4]   2> 1900330 DEBUG (simCloudManagerPool-6363-thread-1) [    ] o.a.s.c.a.s.SimClusterStateProvider ** saved cluster state version 1
   [junit4]   2> 1900333 DEBUG (simCloudManagerPool-6363-thread-1) [    ] o.a.s.c.a.AutoScalingHandler Verified autoscaling configuration
   [junit4]   2> 1900333 DEBUG (simCloudManagerPool-6363-thread-1) [    ] o.a.s.c.a.OverseerTriggerThread Refreshing /autoscaling.json with znode version 3
   [junit4]   2> 1900334 DEBUG (Simulated OverseerAutoScalingTriggerThread) [    ] o.a.s.c.a.OverseerTriggerThread Processed trigger updates upto znodeVersion 3
   [junit4]   2> 1900334 DEBUG (Simulated OverseerAutoScalingTriggerThread) [    ] o.a.s.c.a.OverseerTriggerThread -- clean old nodeAdded markers
   [junit4]   2> 1900334 DEBUG (Simulated OverseerAutoScalingTriggerThread) [    ] o.a.s.c.a.OverseerTriggerThread Current znodeVersion 3, lastZnodeVersion 3
   [junit4]   2> 1900335 DEBUG (simCloudManagerPool-6363-thread-2) [    ] o.a.s.c.a.s.SimClusterStateProvider -- simCreateCollection testCreateCollectionSplitShard, currentVersion=2
   [junit4]   2> 1900336 DEBUG (simCloudManagerPool-6363-thread-2) [    ] o.a.s.c.a.s.SimClusterStateProvider ** creating new collection states, currentVersion=2
   [junit4]   2> 1900336 DEBUG (simCloudManagerPool-6363-thread-2) [    ] o.a.s.c.a.s.SimClusterStateProvider ** saved cluster state version 2
   [junit4]   2> 1900337 DEBUG (ScheduledTrigger-6364-thread-1) [    ] o.a.s.c.a.NodeLostTrigger Running NodeLostTrigger: .auto_add_replicas with currently live nodes: 5
   [junit4]   2> 1900349 DEBUG (simCloudManagerPool-6363-thread-2) [    ] o.a.s.c.a.s.SimClusterStateProvider ** creating new collection states, currentVersion=3
   [junit4]   2> 1900353 DEBUG (simCloudManagerPool-6363-thread-2) [    ] o.a.s.c.a.s.SimClusterStateProvider ** saved cluster state version 3
   [junit4]   2> 1900357 DEBUG (ScheduledTrigger-6364-thread-1) [    ] o.a.s.c.a.NodeLostTrigger Running NodeLostTrigger: .auto_add_replicas with currently live nodes: 5
   [junit4]   2> 1900359 DEBUG (simCloudManagerPool-6363-thread-2) [    ] o.a.s.c.a.s.SimClusterStateProvider -- finished createCollection testCreateCollectionSplitShard, currentVersion=4
   [junit4]   2> 1900371 DEBUG (simCloudManagerPool-6363-thread-3) [    ] o.a.s.c.a.s.SimClusterStateProvider ** creating new collection states, currentVersion=4
   [junit4]   2> 1900373 DEBUG (simCloudManagerPool-6363-thread-3) [    ] o.a.s.c.a.s.SimClusterStateProvider ** saved cluster state version 4
   [junit4]   2> 1900377 DEBUG (ScheduledTrigger-6364-thread-1) [    ] o.a.s.c.a.NodeLostTrigger Running NodeLostTrigger: .auto_add_replicas with currently live nodes: 5
   [junit4]   2> 1900378 DEBUG (simCloudManagerPool-6363-thread-5) [    ] o.a.s.c.a.s.SimClusterStateProvider -- elected new leader for testCreateCollectionSplitShard / shard1 (currentVersion=5): {"core_node1":{
   [junit4]   2>     "core":"testCreateCollectionSplitShard_shard1_replica_n1",
   [junit4]   2>     "shard":"shard1",
   [junit4]   2>     "collection":"testCreateCollectionSplitShard",
   [junit4]   2>     "node_name":"127.0.0.1:10002_solr",
   [junit4]   2>     "type":"NRT",
   [junit4]   2>     "leader":"true",
   [junit4]   2>     "SEARCHER.searcher.maxDoc":0,
   [junit4]   2>     "SEARCHER.searcher.deletedDocs":0,
   [junit4]   2>     "INDEX.sizeInBytes":10240,
   [junit4]   2>     "state":"active",
   [junit4]   2>     "INDEX.sizeInGB":9.5367431640625E-6,
   [junit4]   2>     "SEARCHER.searcher.numDocs":0}}
   [junit4]   2> 1900387 DEBUG (simCloudManagerPool-6363-thread-4) [    ] o.a.s.c.a.s.SimClusterStateProvider ** creating new collection states, currentVersion=5
   [junit4]   2> 1900388 DEBUG (simCloudManagerPool-6363-thread-4) [    ] o.a.s.c.a.s.SimClusterStateProvider ** saved cluster state version 5
   [junit4]   2> 1900388 DEBUG (TEST-TestSimPolicyCloud.testCreateCollectionSplitShard-seed#[5952EA9E819093FF]) [    ] o.a.s.c.a.s.SimClusterStateProvider ** creating new collection states, currentVersion=6
   [junit4]   2> 1900388 DEBUG (TEST-TestSimPolicyCloud.testCreateCollectionSplitShard-seed#[5952EA9E819093FF]) [    ] o.a.s.c.a.s.SimClusterStateProvider ** saved cluster state version 6
   [junit4]   2> 1900398 DEBUG (ScheduledTrigger-6364-thread-3) [    ] o.a.s.c.a.NodeLostTrigger Running NodeLostTrigger: .auto_add_replicas with currently live nodes: 5
   [junit4]   2> 1900418 DEBUG (ScheduledTrigger-6364-thread-2) [    ] o.a.s.c.a.NodeLostTrigger Running NodeLostTrigger: .auto_add_replicas with currently live nodes: 5
   [junit4]   2> 1900438 DEBUG (ScheduledTrigger-6364-thread-2) [    ] o.a.s.c.a.NodeLostTrigger Running NodeLostTrigger: .auto_add_replicas with currently live nodes: 5
   [junit4]   2> 1900458 DEBUG (ScheduledTrigger-6364-thread-2) [    ] o.a.s.c.a.NodeLostTrigger Running NodeLostTrigger: .auto_add_replicas with currently live nodes: 5
   [junit4]   2> 1900478 DEBUG (ScheduledTrigger-6364-thread-2) [    ] o.a.s.c.a.NodeLostTrigger Running NodeLostTrigger: .auto_add_replicas with currently live nodes: 5
   [junit4]   2> 1900490 INFO  (simCloudManagerPool-6363-thread-6) [    ] o.a.s.c.a.c.SplitShardCmd numSubShards set at: 2
   [junit4]   2> 1900499 DEBUG (ScheduledTrigger-6364-thread-2) [    ] o.a.s.c.a.NodeLostTrigger Running NodeLostTrigger: .auto_add_replicas with currently live nodes: 5
   [junit4]   2> 1900519 DEBUG (ScheduledTrigger-6364-thread-2) [    ] o.a.s.c.a.NodeLostTrigger Running NodeLostTrigger: .auto_add_replicas with currently live nodes: 5
   [junit4]   2> 1900539 DEBUG (simCloudManagerPool-6363-thread-6) [    ] o.a.s.c.a.s.SimClusterStateProvider ** creating new collection states, currentVersion=7
   [junit4]   2> 1900539 DEBUG (simCloudManagerPool-6363-thread-6) [    ] o.a.s.c.a.s.SimClusterStateProvider ** saved cluster state version 7
   [junit4]   2> 1900540 DEBUG (ScheduledTrigger-6364-thread-2) [    ] o.a.s.c.a.NodeLostTrigger Running NodeLostTrigger: .auto_add_replicas with currently live nodes: 5
   [junit4]   2> 1900543 DEBUG (simCloudManagerPool-6363-thread-6) [    ] o.a.s.c.a.s.SimClusterStateProvider ** no leader in testCreateCollectionSplitShard / shard1_0:{
   [junit4]   2>   "parent":"shard1",
   [junit4]   2>   "stateTimestamp":"1541073032461156250",
   [junit4]   2>   "range":"80000000-ffffffff",
   [junit4]   2>   "state":"construction",
   [junit4]   2>   "replicas":{
   [junit4]   2>     "core_node6":{
   [junit4]   2>       "core":"testCreateCollectionSplitShard_shard1_0_replica_n5",
   [junit4]   2>       "SEARCHER.searcher.maxDoc":0,
   [junit4]   2>       "SEARCHER.searcher.deletedDocs":0,
   [junit4]   2>       "INDEX.sizeInBytes":20480,
   [junit4]   2>       "node_name":"127.0.0.1:10002_solr",
   [junit4]   2>       "base_url":"http://127.0.0.1:10002/solr",
   [junit4]   2>       "state":"active",
   [junit4]   2>       "type":"NRT",
   [junit4]   2>       "INDEX.sizeInGB":1.9073486328125E-5,
   [junit4]   2>       "SEARCHER.searcher.numDocs":0},
   [junit4]   2>     "core_node8":{
   [junit4]   2>       "core":"testCreateCollectionSplitShard_shard1_0_replica_n7",
   [junit4]   2>       "SEARCHER.searcher.maxDoc":0,
   [junit4]   2>       "SEARCHER.searcher.deletedDocs":0,
   [junit4]   2>       "INDEX.sizeInBytes":20480,
   [junit4]   2>       "node_name":"127.0.0.1:10001_solr",
   [junit4]   2>       "base_url":"http://127.0.0.1:10001/solr",
   [junit4]   2>       "state":"active",
   [junit4]   2>       "type":"NRT",
   [junit4]   2>       "INDEX.sizeInGB":1.9073486328125E-5,
   [junit4]   2>       "SEARCHER.searcher.numDocs":0}}}
   [junit4]   2> 1900545 DEBUG (simCloudManagerPool-6363-thread-7) [    ] o.a.s.c.a.s.SimClusterStateProvider -- elected new leader for testCreateCollectionSplitShard / shard1_1 (currentVersion=8): {"core_node10":{
   [junit4]   2>     "core":"testCreateCollectionSplitShard_shard1_1_replica_n9",
   [junit4]   2>     "shard":"shard1_1",
   [junit4]   2>     "collection":"testCreateCollectionSplitShard",
   [junit4]   2>     "node_name":"127.0.0.1:10001_solr",
   [junit4]   2>     "type":"NRT",
   [junit4]   2>     "leader":"true",
   [junit4]   2>     "SEARCHER.searcher.maxDoc":0,
   [junit4]   2>     "SEARCHER.searcher.deletedDocs":0,
   [junit4]   2>     "INDEX.sizeInBytes":10240,
   [junit4]   2>     "base_url":"http://127.0.0.1:10001/solr",
   [junit4]   2>     "state":"active",
   [junit4]   2>     "INDEX.sizeInGB":9.5367431640625E-6,
   [junit4]   2>     "SEARCHER.searcher.numDocs":0}}
   [junit4]   2> 1900546 DEBUG (simCloudManagerPool-6363-thread-8) [    ] o.a.s.c.a.s.SimClusterStateProvider -- elected new leader for testCreateCollectionSplitShard / shard1_0 (currentVersion=8): {"core_node6":{
   [junit4]   2>     "core":"testCreateCollectionSplitShard_shard1_0_replica_n5",
   [junit4]   2>     "shard":"shard1_0",
   [junit4]   2>     "collection":"testCreateCollectionSplitShard",
   [junit4]   2>     "node_name":"127.0.0.1:10002_solr",
   [junit4]   2>     "type":"NRT",
   [junit4]   2>     "leader":"true",
   [junit4]   2>     "SEARCHER.searcher.maxDoc":0,
   [junit4]   2>     "SEARCHER.searcher.deletedDocs":0,
   [junit4]   2>     "INDEX.sizeInBytes":20480,
   [junit4]   2>     "base_url":"http://127.0.0.1:10002/solr",
   [junit4]   2>     "state":"active",
   [junit4]   2>     "INDEX.sizeInGB":1.9073486328125E-5,
   [junit4]   2>     "SEARCHER.searcher.numDocs":0}}
   [junit4]   2> 1900546 DEBUG (simCloudManagerPool-6363-thread-6) [    ] o.a.s.c.a.s.SimClusterStateProvider ** creating new collection states, currentVersion=8
   [junit4]   2> 1900546 DEBUG (simCloudManagerPool-6363-thread-6) [    ] o.a.s.c.a.s.SimClusterStateProvider ** saved cluster state version 8
   [junit4]   2> 1900548 DEBUG (TEST-TestSimPolicyCloud.testCreateCollectionSplitShard-seed#[5952EA9E819093FF]) [    ] o.a.s.c.a.s.SimClusterStateProvider ** creating new collection states, currentVersion=9
   [junit4]   2> 1900549 DEBUG (TEST-TestSimPolicyCloud.testCreateCollectionSplitShard-seed#[5952EA9E819093FF]) [    ] o.a.s.c.a.s.SimClusterStateProvider ** saved cluster state version 9
   [junit4]   2> 1900560 DEBUG (ScheduledTrigger-6364-thread-3) [    ] o.a.s.c.a.NodeLostTrigger Running NodeLostTrigger: .auto_add_replicas with currently live nodes: 5
   [junit4]   2> 1900581 DEBUG (ScheduledTrigger-6364-thread-1) [    ] o.a.s.c.a.NodeLostTrigger Running NodeLostTrigger: .auto_add_replicas with currently live nodes: 5
   [junit4]   2> 1900601 DEBUG (ScheduledTrigger-6364-thread-1) [    ] o.a.s.c.a.NodeLostTrigger Running NodeLostTrigger: .auto_add_replicas with currently live nodes: 5
   [junit4]   2> 1900621 DEBUG (ScheduledTrigger-6364-thread-2) [    ] o.a.s.c.a.NodeLostTrigger Running NodeLostTrigger: .auto_add_replicas with currently live nodes: 5
   [junit4]   2> 1900641 DEBUG (ScheduledTrigger-6364-thread-4) [    ] o.a.s.c.a.NodeLostTrigger Running NodeLostTrigger: .auto_add_replicas with currently live nodes: 5
   [junit4]   2> 1900651 INFO  (TEST-TestSimPolicyCloud.testCreateCollectionSplitShard-seed#[5952EA9E819093FF]) [    ] o.a.s.SolrTestCaseJ4 ###Ending testCreateCollectionSplitShard
   [junit4]   2> 1900652 DEBUG (TEST-TestSimPolicyCloud.testCreateCollectionSplitShard-seed#[5952EA9E819093FF]) [    ] o.a.s.c.a.s.SimClusterStateProvider ** creating new collection states, currentVersion=10
   [junit4]   2> 1900652 DEBUG (TEST-TestSimPolicyCloud.testCreateCollectionSplitShard-seed#[5952EA9E819093FF]) [    ] o.a.s.c.a.s.SimClusterStateProvider ** saved cluster state version 10
   [junit4]   2> 1900654 INFO  (TEST-TestSimPolicyCloud.testCreateCollectionSplitShard-seed#[5952EA9E819093FF]) [    ] o.a.s.c.a.s.SimSolrCloudTestCase #######################################
   [junit4]   2> ############ CLUSTER STATE ############
   [junit4]   2> #######################################
   [junit4]   2> ## Live nodes:		5
   [junit4]   2> ## Empty nodes:	5
   [junit4]   2> ## Dead nodes:		0
   [junit4]   2> ## Collections:
   [junit4]   2> ## Max replicas per node:	0
   [junit4]   2> ## Min replicas per node:	0
   [junit4]   2> ## Total replicas:		0
   [junit4]   2> ######### Solr op counts ##########
   [junit4]   2> ##		- CREATE             1
   [junit4]   2> ##		- DELETE             1
   [junit4]   2> ##		- SPLITSHARD         1
   [junit4]   2> ##		- autoscaling        1
   [junit4]   2> ######### Autoscaling event counts ###########
   [junit4]   2> 
   [junit4]   2> 1900662 DEBUG (ScheduledTrigger-6364-thread-1) [    ] o.a.s.c.a.NodeLostTrigger Running NodeLostTrigger: .auto_add_replicas with currently live nodes: 5
   [junit4]   2> 1900669 INFO  (TEST-TestSimPolicyCloud.testMetricsTag-seed#[5952EA9E819093FF]) [    ] o.a.s.SolrTestCaseJ4 ###Starting testMetricsTag
   [junit4]   2> 1900670 DEBUG (TEST-TestSimPolicyCloud.testMetricsTag-seed#[5952EA9E819093FF]) [    ] o.a.s.c.a.OverseerTriggerThread Refreshing /autoscaling.json with znode version 4
   [junit4]   2> 1900670 DEBUG (Simulated OverseerAutoScalingTriggerThread) [    ] o.a.s.c.a.OverseerTriggerThread Processed trigger updates upto znodeVersion 4
   [junit4]   2> 1900670 DEBUG (Simulated OverseerAutoScalingTriggerThread) [    ] o.a.s.c.a.OverseerTriggerThread -- clean old nodeLost markers
   [junit4]   2> 1900670 DEBUG (Simulated OverseerAutoScalingTriggerThread) [    ] o.a.s.c.a.OverseerTriggerThread -- clean old nodeAdded markers
   [junit4]   2> 1900670 DEBUG (Simulated OverseerAutoScalingTriggerThread) [    ] o.a.s.c.a.OverseerTriggerThread Current znodeVersion 4, lastZnodeVersion 4
   [junit4]   2> 1900671 INFO  (TEST-TestSimPolicyCloud.testMetricsTag-seed#[5952EA9E819093FF]) [    ] o.a.s.c.a.s.SimCloudManager === Restarting OverseerTriggerThread and clearing object cache...
   [junit4]   2> 1900671 WARN  (Simulated OverseerAutoScalingTriggerThread) [    ] o.a.s.c.a.OverseerTriggerThread Interrupted
   [junit4]   2> java.lang.InterruptedException: null
   [junit4]   2> 	at java.util.concurrent.locks.AbstractQueuedSynchronizer$ConditionObject.reportInterruptAfterWait(AbstractQueuedSynchronizer.java:2014) ~[?:1.8.0_172]
   [junit4]   2> 	at java.util.concurrent.locks.AbstractQueuedSynchronizer$ConditionObject.await(AbstractQueuedSynchronizer.java:2048) ~[?:1.8.0_172]
   [junit4]   2> 	at org.apache.solr.cloud.autoscaling.OverseerTriggerThread.run(OverseerTriggerThread.java:189) [java/:?]
   [junit4]   2> 	at java.lang.Thread.run(Thread.java:748) [?:1.8.0_172]
   [junit4]   2> 1900672 DEBUG (TEST-TestSimPolicyCloud.testMetricsTag-seed#[5952EA9E819093FF]) [    ] o.a.s.c.a.ScheduledTriggers Shutting down scheduled thread pool executor now
   [junit4]   2> 1900672 DEBUG (TEST-TestSimPolicyCloud.testMetricsTag-seed#[5952EA9E819093FF]) [    ] o.a.s.c.a.ScheduledTriggers Shutting down action executor now
   [junit4]   2> 1900672 DEBUG (TEST-TestSimPolicyCloud.testMetricsTag-seed#[5952EA9E819093FF]) [    ] o.a.s.c.a.ScheduledTriggers Awaiting termination for action executor
   [junit4]   2> 1900672 DEBUG (TEST-TestSimPolicyCloud.testMetricsTag-seed#[5952EA9E819093FF]) [    ] o.a.s.c.a.ScheduledTriggers Awaiting termination for scheduled thread pool executor
   [junit4]   2> 1900672 DEBUG (TEST-TestSimPolicyCloud.testMetricsTag-seed#[5952EA9E819093FF]) [    ] o.a.s.c.a.ScheduledTriggers ScheduledTriggers closed completely
   [junit4]   2> 1900672 DEBUG (TEST-TestSimPolicyCloud.testMetricsTag-seed#[5952EA9E819093FF]) [    ] o.a.s.c.a.OverseerTriggerThread OverseerTriggerThread has been closed explicitly
   [junit4]   2> 1900685 DEBUG (Simulated OverseerAutoScalingTriggerThread) [    ] o.a.s.c.a.OverseerTriggerThread Adding .auto_add_replicas and .scheduled_maintenance triggers
   [junit4]   2> 1900686 DEBUG (Simulated OverseerAutoScalingTriggerThread) [    ] o.a.s.c.a.OverseerTriggerThread Refreshing /autoscaling.json with znode version 5
   [junit4]   2> 1900686 DEBUG (Simulated OverseerAutoScalingTriggerThread) [    ] o.a.s.c.a.OverseerTriggerThread Current znodeVersion 5, lastZnodeVersion -1
   [junit4]   2> 1900686 DEBUG (Simulated OverseerAutoScalingTriggerThread) [    ] o.a.s.c.a.OverseerTriggerThread Processed trigger updates upto znodeVersion 5
   [junit4]   2> 1900687 DEBUG (Simulated OverseerAutoScalingTriggerThread) [    ] o.a.s.c.a.NodeLostTrigger NodeLostTrigger .auto_add_replicas - Initial livenodes: [127.0.0.1:10001_solr, 127.0.0.1:10004_solr, 127.0.0.1:10000_solr, 127.0.0.1:10002_solr, 127.0.0.1:10003_solr]
   [junit4]   2> 1900687 DEBUG (Simulated OverseerAutoScalingTriggerThread) [    ] o.a.s.c.a.OverseerTriggerThread -- clean old nodeAdded markers
   [junit4]   2> 1900687 DEBUG (Simulated OverseerAutoScalingTriggerThread) [    ] o.a.s.c.a.OverseerTriggerThread Current znodeVersion 5, lastZnodeVersion 5
   [junit4]   2> 1900687 DEBUG (ScheduledTrigger-6367-thread-2) [    ] o.a.s.c.a.NodeLostTrigger Running NodeLostTrigger: .auto_add_replicas with currently live nodes: 5
   [junit4]   2> 1900708 DEBUG (ScheduledTrigger-6367-thread-3) [    ] o.a.s.c.a.NodeLostTrigger Running NodeLostTrigger: .auto_add_replicas with currently live nodes: 5
   [junit4]   2> 1900729 DEBUG (ScheduledTrigger-6367-thread-4) [    ] o.a.s.c.a.NodeLostTrigger Running NodeLostTrigger: .auto_add_replicas with currently live nodes: 5
   [junit4]   2> 1900750 DEBUG (ScheduledTrigger-6367-thread-3) [    ] o.a.s.c.a.NodeLostTrigger Running NodeLostTrigger: .auto_add_replicas with currently live nodes: 5
   [junit4]   2> 1900770 DEBUG (ScheduledTrigger-6367-thread-4) [    ] o.a.s.c.a.NodeLostTrigger Running NodeLostTrigger: .auto_add_replicas with currently live nodes: 5
   [junit4]   2> 1900790 DEBUG (ScheduledTrigger-6367-thread-3) [    ] o.a.s.c.a.NodeLostTrigger Running NodeLostTrigger: .auto_add_replicas with currently live nodes: 5
   [junit4]   2> 1900810 DEBUG (ScheduledTrigger-6367-thread-4) [    ] o.a.s.c.a.NodeLostTrigger Running NodeLostTrigger: .auto_add_replicas with currently live nodes: 5
   [junit4]   2> 1900831 DEBUG (ScheduledTrigger-6367-thread-3) [    ] o.a.s.c.a.NodeLostTrigger Running NodeLostTrigger: .auto_add_replicas with currently live nodes: 5
   [junit4]   2> 1900851 DEBUG (ScheduledTrigger-6367-thread-4) [    ] o.a.s.c.a.NodeLostTrigger Running NodeLostTrigger: .auto_add_replicas with currently live nodes: 5
   [junit4]   2> 1900871 DEBUG (ScheduledTrigger-6367-thread-3) [    ] o.a.s.c.a.NodeLostTrigger Running NodeLostTrigger: .auto_add_replicas with currently live nodes: 5
   [junit4]   2> 1900874 ERROR (simCloudManagerPool-6366-thread-1) [    ] o.a.s.h.RequestHandlerBase org.apache.solr.api.ApiBag$ExceptionWithErrObject: Error in command payload, errors: [{set-cluster-policy=[{cores=<10, node=#ANY}, {replica=<2, shard=#EACH, node=#ANY}, {metrics:abc=overseer, replica=0}], errorMessages=[Invalid metrics: param in {
   [junit4]   2>   "metrics:abc":"overseer",
   [junit4]   2>   "replica":0} must have at 2 or 3 segments after 'metrics:' separated by ':']}], 
   [junit4]   2> 	at org.apache.solr.cloud.autoscaling.AutoScalingHandler.processOps(AutoScalingHandler.java:210)
   [junit4]   2> 	at org.apache.solr.cloud.autoscaling.AutoScalingHandler.handleRequestBody(AutoScalingHandler.java:148)
   [junit4]   2> 	at org.apache.solr.handler.RequestHandlerBase.handleRequest(RequestHandlerBase.java:199)
   [junit4]   2> 	at org.apache.solr.cloud.autoscaling.sim.SimCloudManager.simHandleSolrRequest(SimCloudManager.java:706)
   [junit4]   2> 	at org.apache.solr.cloud.autoscaling.sim.SimCloudManager.lambda$request$15(SimCloudManager.java:651)
   [junit4]   2> 	at java.util.concurrent.FutureTask.run(FutureTask.java:266)
   [junit4]   2> 	at org.apache.solr.common.util.ExecutorUtil$MDCAwareThreadPoolExecutor.lambda$execute$0(ExecutorUtil.java:209)
   [junit4]   2> 	at java.util.concurrent.ThreadPoolExecutor.runWorker(ThreadPoolExecutor.java:1149)
   [junit4]   2> 	at java.util.concurrent.ThreadPoolExecutor$Worker.run(ThreadPoolExecutor.java:624)
   [junit4]   2> 	at java.lang.Thread.run(Thread.java:748)
   [junit4]   2> 
   [junit4]   2> 1900875 DEBUG (simCloudManagerPool-6366-thread-1) [    ] o.a.s.c.a.s.SimCloudManager -- exception handling request
   [junit4]   2> org.apache.solr.api.ApiBag$ExceptionWithErrObject: Error in command payload
   [junit4]   2> 	at org.apache.solr.cloud.autoscaling.AutoScalingHandler.processOps(AutoScalingHandler.java:210) ~[java/:?]
   [junit4]   2> 	at org.apache.solr.cloud.autoscaling.AutoScalingHandler.handleRequestBody(AutoScalingHandler.java:148) ~[java/:?]
   [junit4]   2> 	at org.apache.solr.handler.RequestHandlerBase.handleRequest(RequestHandlerBase.java:199) ~[java/:?]
   [junit4]   2> 	at org.apache.solr.cloud.autoscaling.sim.SimCloudManager.simHandleSolrRequest(SimCloudManager.java:706) ~[test/:?]
   [junit4]   2> 	at org.apache.solr.cloud.autoscaling.sim.SimCloudManager.lambda$request$15(SimCloudManager.java:651) ~[test/:?]
   [junit4]   2> 	at java.util.concurrent.FutureTask.run(FutureTask.java:266) ~[?:1.8.0_172]
   [junit4]   2> 	at org.apache.solr.common.util.ExecutorUtil$MDCAwareThreadPoolExecutor.lambda$execute$0(ExecutorUtil.java:209) ~[java/:?]
   [junit4]   2> 	at java.util.concurrent.ThreadPoolExecutor.runWorker(ThreadPoolExecutor.java:1149) [?:1.8.0_172]
   [junit4]   2> 	at java.util.concurrent.ThreadPoolExecutor$Worker.run(ThreadPoolExecutor.java:624) [?:1.8.0_172]
   [junit4]   2> 	at java.lang.Thread.run(Thread.java:748) [?:1.8.0_172]
   [junit4]   2> 1900878 DEBUG (simCloudManagerPool-6366-thread-2) [    ] o.a.s.c.a.s.SimClusterStateProvider ** creating new collection states, currentVersion=11
   [junit4]   2> 1900878 DEBUG (simCloudManagerPool-6366-thread-2) [    ] o.a.s.c.a.s.SimClusterStateProvider ** saved cluster state version 11
   [junit4]   2> 1900878 DEBUG (simCloudManagerPool-6366-thread-2) [    ] o.a.s.c.a.AutoScalingHandler Verified autoscaling configuration
   [junit4]   2> 1900878 DEBUG (simCloudManagerPool-6366-thread-2) [    ] o.a.s.c.a.OverseerTriggerThread Refreshing /autoscaling.json with znode version 6
   [junit4]   2> 1900879 DEBUG (Simulated OverseerAutoScalingTriggerThread) [    ] o.a.s.c.a.OverseerTriggerThread Processed trigger updates upto znodeVersion 6
   [junit4]   2> 1900879 DEBUG (Simulated OverseerAutoScalingTriggerThread) [    ] o.a.s.c.a.OverseerTriggerThread -- clean old nodeAdded markers
   [junit4]   2> 1900879 DEBUG (Simulated OverseerAutoScalingTriggerThread) [    ] o.a.s.c.a.OverseerTriggerThread Current znodeVersion 6, lastZnodeVersion 6
   [junit4]   2> 1900880 DEBUG (simCloudManagerPool-6366-thread-3) [    ] o.a.s.c.a.s.SimClusterStateProvider -- simCreateCollection metricsTest, currentVersion=12
   [junit4]   2> 1900880 DEBUG (simCloudManagerPool-6366-thread-3) [    ] o.a.s.c.a.s.SimClusterStateProvider ** creating new collection states, currentVersion=12
   [junit4]   2> 1900880 DEBUG (simCloudManagerPool-6366-thread-3) [    ] o.a.s.c.a.s.SimClusterStateProvider ** saved cluster state version 12
   [junit4]   2> 1900891 DEBUG (simCloudManagerPool-6366-thread-3) [    ] o.a.s.c.a.s.SimClusterStateProvider ** creating new collection states, currentVersion=13
   [junit4]   2> 1900891 DEBUG (simCloudManagerPool-6366-thread-3) [    ] o.a.s.c.a.s.SimClusterStateProvider ** saved cluster state version 13
   [junit4]   2> 1900892 DEBUG (ScheduledTrigger-6367-thread-4) [    ] o.a.s.c.a.NodeLostTrigger Running NodeLostTrigger: .auto_add_replicas with currently live nodes: 5
   [junit4]   2> 1900893 DEBUG (simCloudManagerPool-6366-thread-3) [    ] o.a.s.c.a.s.SimClusterStateProvider -- finished createCollection metricsTest, currentVersion=14
   [junit4]   2> 1900893 DEBUG (TEST-TestSimPolicyCloud.testMetricsTag-seed#[5952EA9E819093FF]) [    ] o.a.s.c.a.s.SimClusterStateProvider ** creating new collection states, currentVersion=14
   [junit4]   2> 1900893 DEBUG (TEST-TestSimPolicyCloud.testMetricsTag-seed#[5952EA9E819093FF]) [    ] o.a.s.c.a.s.SimClusterStateProvider ** saved cluster state version 14
   [junit4]   2> 1900904 DEBUG (simCloudManagerPool-6366-thread-4) [    ] o.a.s.c.a.s.SimClusterStateProvider ** creating new collection states, currentVersion=15
   [junit4]   2> 1900904 DEBUG (simCloudManagerPool-6366-thread-4) [    ] o.a.s.c.a.s.SimClusterStateProvider ** saved cluster state version 15
   [junit4]   2> 1900905 DEBUG (TEST-TestSimPolicyCloud.testMetricsTag-seed#[5952EA9E819093FF]) [    ] o.a.s.c.a.s.SimClusterStateProvider ** creating new collection states, currentVersion=16
   [junit4]   2> 1900908 DEBUG (TEST-TestSimPolicyCloud.testMetricsTag-seed#[5952EA9E819093FF]) [    ] o.a.s.c.a.s.SimClusterStateProvider ** saved cluster state version 16
   [junit4]   2> 1900909 INFO  (TEST-TestSimPolicyCloud.testMetricsTag-seed#[5952EA9E819093FF]) [    ] o.a.s.SolrTestCaseJ4 ###Ending testMetricsTag
   [junit4]   2> 1900910 DEBUG (TEST-TestSimPolicyCloud.testMetricsTag-seed#[5952EA9E819093FF]) [    ] o.a.s.c.a.s.SimClusterStateProvider ** creating new collection states, currentVersion=17
   [junit4]   2> 1900910 DEBUG (TEST-TestSimPolicyCloud.testMetricsTag-seed#[5952EA9E819093FF]) [    ] o.a.s.c.a.s.SimClusterStateProvider ** saved cluster state version 17
   [junit4]   2> 1900912 DEBUG (ScheduledTrigger-6367-thread-3) [    ] o.a.s.c.a.NodeLostTrigger Running NodeLostTrigger: .auto_add_replicas with currently live nodes: 5
   [junit4]   2> 1900916 DEBUG (simCloudManagerPool-6366-thread-5) [    ] o.a.s.c.a.s.SimClusterStateProvider -- elected new leader for metricsTest / shard1 (currentVersion=18): {"core_node1":{
   [junit4]   2>     "core":"metricsTest_shard1_replica_n1",
   [junit4]   2>     "shard":"shard1",
   [junit4]   2>     "collection":"metricsTest",
   [junit4]   2>     "node_name":"127.0.0.1:10003_solr",
   [junit4]   2>     "type":"NRT",
   [junit4]   2>     "leader":"true",
   [junit4]   2>     "SEARCHER.searcher.maxDoc":0,
   [junit4]   2>     "SEARCHER.searcher.deletedDocs":0,
   [junit4]   2>     "INDEX.sizeInBytes":10240,
   [junit4]   2>     "state":"active",
   [junit4]   2>     "INDEX.sizeInGB":9.5367431640625E-6,
   [junit4]   2>     "SEARCHER.searcher.numDocs":0}}
   [junit4]   2> 1900932 DEBUG (ScheduledTrigger-6367-thread-1) [    ] o.a.s.c.a.NodeLostTrigger Running NodeLostTrigger: .auto_add_replicas with currently live nodes: 5
   [junit4]   2> 1900952 DEBUG (ScheduledTrigger-6367-thread-2) [    ] o.a.s.c.a.NodeLostTrigger Running NodeLostTrigger: .auto_add_replicas with currently live nodes: 5
   [junit4]   2> 1900970 INFO  (TEST-TestSimPolicyCloud.testMetricsTag-seed#[5952EA9E819093FF]) [    ] o.a.s.c.a.s.SimSolrCloudTestCase #######################################
   [junit4]   2> ############ CLUSTER STATE ############
   [junit4]   2> #######################################
   [junit4]   2> ## Live nodes:		5
   [junit4]   2> ## Empty nodes:	4
   [junit4]   2> ## Dead nodes:		0
   [junit4]   2> ## Collections:
   [junit4]   2> ##  * metricsTest
   [junit4]   2> ##    shardsTotal	1
   [junit4]   2> ##    shardsState	{active=1}
   [junit4]   2> ##      shardsWithoutLeader	1
   [junit4]   2> ##    totalReplicas	1
   [junit4]   2> ##      activeReplicas	1
   [junit4]   2> ##      inactiveReplicas	0
   [junit4]   2> ##    totalActiveDocs	0
   [junit4]   2> ##      bufferedDocs	0
   [junit4]   2> ##      maxActiveSliceDocs	0
   [junit4]   2> ##      minActiveSliceDocs	0
   [junit4]   2> ##      avgActiveSliceDocs	0
   [junit4]   2> ##    totalInactiveDocs	0
   [junit4]   2> ##      maxInactiveSliceDocs	0
   [junit4]   2> ##      minInactiveSliceDocs	0
   [junit4]   2> ##      avgInactiveSliceDocs	NaN
   [junit4]   2> ##    totalActiveBytes	10,240
   [junit4]   2> ##      maxActiveSliceBytes	10,240
   [junit4]   2> ##      minActiveSliceBytes	10,240
   [junit4]   2> ##      avgActiveSliceBytes	10,240
   [junit4]   2> ##    totalInactiveBytes	0
   [junit4]   2> ##      maxInactiveSliceBytes	0
   [junit4]   2> ##      minInactiveSliceBytes	0
   [junit4]   2> ##      avgInactiveSliceBytes	NaN
   [junit4]   2> ##    totalActiveDeletedDocs	0
   [junit4]   2> ## Max replicas per node:	1
   [junit4]   2> ## Min replicas per node:	0
   [junit4]   2> ## Total replicas:		1
   [junit4]   2> ## * metricsTest		1
   [junit4]   2> ##		- active           1
   [junit4]   2> ######### Solr op counts ##########
   [junit4]   2> ##		- CREATE             1
   [junit4]   2> ##		- autoscaling        2
   [junit4]   2> ######### Autoscaling event counts ###########
   [junit4]   2> 
   [junit4] IGNOR/A 0.00s J1 | TestSimPolicyCloud.testCreateCollectionAddShardUsingPolicy
   [junit4]    > Assumption #1: 'badapple' test group is disabled (@BadApple(bugUrl=https://issues.apache.org/jira/browse/SOLR-12028))
   [junit4]   2> 1900973 DEBUG (ScheduledTrigger-6367-thread-2) [    ] o.a.s.c.a.NodeLostTrigger Running NodeLostTrigger: .auto_add_replicas with currently live nodes: 5
   [junit4]   2> 1900988 INFO  (TEST-TestSimPolicyCloud.testCreateCollectionAddReplica-seed#[5952EA9E819093FF]) [    ] o.a.s.SolrTestCaseJ4 ###Starting testCreateCollectionAddReplica
   [junit4]   2> 1900988 DEBUG (TEST-TestSimPolicyCloud.testCreateCollectionAddReplica-seed#[5952EA9E819093FF]) [    ] o.a.s.c.a.OverseerTriggerThread Refreshing /autoscaling.json with znode version 7
   [junit4]   2> 1900988 DEBUG (Simulated OverseerAutoScalingTriggerThread) [    ] o.a.s.c.a.OverseerTriggerThread Processed trigger updates upto znodeVersion 7
   [junit4]   2> 1900988 DEBUG (Simulated OverseerAutoScalingTriggerThread) [    ] o.a.s.c.a.OverseerTriggerThread -- clean old nodeLost markers
   [junit4]   2> 1900988 DEBUG (Simulated OverseerAutoScalingTriggerThread) [    ] o.a.s.c.a.OverseerTriggerThread -- clean old nodeAdded markers
   [junit4]   2> 1900988 DEBUG (Simulated OverseerAutoScalingTriggerThread) [    ] o.a.s.c.a.OverseerTriggerThread Current znodeVersion 7, lastZnodeVersion 7
   [junit4]   2> 1900989 INFO  (TEST-TestSimPolicyCloud.testCreateCollectionAddReplica-seed#[5952EA9E819093FF]) [    ] o.a.s.c.a.s.SimCloudManager === Restarting OverseerTriggerThread and clearing object cache...
   [junit4]   2> 1900989 WARN  (Simulated OverseerAutoScalingTriggerThread) [    ] o.a.s.c.a.OverseerTriggerThread Interrupted
   [junit4]   2> java.lang.InterruptedException: null
   [junit4]   2> 	at java.util.concurrent.locks.AbstractQueuedSynchronizer$ConditionObject.reportInterruptAfterWait(AbstractQueuedSynchronizer.java:2014) ~[?:1.8.0_172]
   [junit4]   2> 	at java.util.concurrent.locks.AbstractQueuedSynchronizer$ConditionObject.await(AbstractQueuedSynchronizer.java:2048) ~[?:1.8.0_172]
   [junit4]   2> 	at org.apache.solr.cloud.autoscaling.OverseerTriggerThread.run(OverseerTriggerThread.java:189) [java/:?]
   [junit4]   2> 	at java.lang.Thread.run(Thread.java:748) [?:1.8.0_172]
   [junit4]   2> 1900993 DEBUG (TEST-TestSimPolicyCloud.testCreateCollectionAddReplica-seed#[5952EA9E819093FF]) [    ] o.a.s.c.a.ScheduledTriggers Shutting down scheduled thread pool executor now
   [junit4]   2> 1900993 DEBUG (TEST-TestSimPolicyCloud.testCreateCollectionAddReplica-seed#[5952EA9E819093FF]) [    ] o.a.s.c.a.ScheduledTriggers Shutting down action executor now
   [junit4]   2> 1900993 DEBUG (TEST-TestSimPolicyCloud.testCreateCollectionAddReplica-seed#[5952EA9E819093FF]) [    ] o.a.s.c.a.ScheduledTriggers Awaiting termination for action executor
   [junit4]   2> 1900994 DEBUG (TEST-TestSimPolicyCloud.testCreateCollectionAddReplica-seed#[5952EA9E819093FF]) [    ] o.a.s.c.a.ScheduledTriggers Awaiting termination for scheduled thread pool executor
   [junit4]   2> 1900994 DEBUG (TEST-TestSimPolicyCloud.testCreateCollectionAddReplica-seed#[5952EA9E819093FF]) [    ] o.a.s.c.a.ScheduledTriggers ScheduledTriggers closed completely
   [junit4]   2> 1900994 DEBUG (TEST-TestSimPolicyCloud.testCreateCollectionAddReplica-seed#[5952EA9E819093FF]) [    ] o.a.s.c.a.OverseerTriggerThread OverseerTriggerThread has been closed explicitly
   [junit4]   2> 1900995 DEBUG (Simulated OverseerAutoScalingTriggerThread) [    ] o.a.s.c.a.OverseerTriggerThread Adding .auto_add_replicas and .scheduled_maintenance triggers
   [junit4]   2> 1900995 DEBUG (Simulated OverseerAutoScalingTriggerThread) [    ] o.a.s.c.a.OverseerTriggerThread Refreshing /autoscaling.json with znode version 8
   [junit4]   2> 1900996 DEBUG (Simulated OverseerAutoScalingTriggerThread) [    ] o.a.s.c.a.OverseerTriggerThread Current znodeVersion 8, lastZnodeVersion -1
   [junit4]   2> 1900996 DEBUG (Simulated OverseerAutoScalingTriggerThread) [    ] o.a.s.c.a.OverseerTriggerThread Processed trigger updates upto znodeVersion 8
   [junit4]   2> 1900996 DEBUG (Simulated OverseerAutoScalingTriggerThread) [    ] o.a.s.c.a.NodeLostTrigger NodeLostTrigger .auto_add_replicas - Initial livenodes: [127.0.0.1:10001_solr, 127.0.0.1:10004_solr, 127.0.0.1:10000_solr, 127.0.0.1:10002_solr, 127.0.0.1:10003_solr]
   [junit4]   2> 1900999 DEBUG (Simulated OverseerAutoScalingTriggerThread) [    ] o.a.s.c.a.OverseerTriggerThread -- clean old nodeAdded markers
   [junit4]   2> 1900999 DEBUG (Simulated OverseerAutoScalingTriggerThread) [    ] o.a.s.c.a.OverseerTriggerThread Current znodeVersion 8, lastZnodeVersion 8
   [junit4]   2> 1900999 DEBUG (ScheduledTrigger-6370-thread-2) [    ] o.a.s.c.a.NodeLostTrigger Running NodeLostTrigger: .auto_add_replicas with currently live nodes: 5
   [junit4]   2> 1901020 DEBUG (ScheduledTrigger-6370-thread-1) [    ] o.a.s.c.a.NodeLostTrigger Running NodeLostTrigger: .auto_add_replicas with currently live nodes: 5
   [junit4]   2> 1901041 DEBUG (ScheduledTrigger-6370-thread-4) [    ] o.a.s.c.a.NodeLostTrigger Running NodeLostTrigger: .auto_add_replicas with currently live nodes: 5
   [junit4]   2> 1901061 DEBUG (ScheduledTrigger-6370-thread-1) [    ] o.a.s.c.a.NodeLostTrigger Running NodeLostTrigger: .auto_add_replicas with currently live nodes: 5
   [junit4]   2> 1901081 DEBUG (ScheduledTrigger-6370-thread-4) [    ] o.a.s.c.a.NodeLostTrigger Running NodeLostTrigger: .auto_add_replicas with currently live nodes: 5
   [junit4]   2> 1901101 DEBUG (ScheduledTrigger-6370-thread-1) [    ] o.a.s.c.a.NodeLostTrigger Running NodeLostTrigger: .auto_add_replicas with currently live nodes: 5
   [junit4]   2> 1901122 DEBUG (ScheduledTrigger-6370-thread-4) [    ] o.a.s.c.a.NodeLostTrigger Running NodeLostTrigger: .auto_add_replicas with currently live nodes: 5
   [junit4]   2> 1901142 DEBUG (ScheduledTrigger-6370-thread-1) [    ] o.a.s.c.a.NodeLostTrigger Running NodeLostTrigger: .auto_add_replicas with currently live nodes: 5
   [junit4]   2> 1901162 DEBUG (ScheduledTrigger-6370-thread-4) [    ] o.a.s.c.a.NodeLostTrigger Running NodeLostTrigger: .auto_add_replicas with currently live nodes: 5
   [junit4]   2> 1901182 DEBUG (ScheduledTrigger-6370-thread-1) [    ] o.a.s.c.a.NodeLostTrigger Running NodeLostTrigger: .auto_add_replicas with currently live nodes: 5
   [junit4]   2> 1901196 DEBUG (simCloudManagerPool-6369-thread-1) [    ] o.a.s.c.a.s.SimClusterStateProvider ** creating new collection states, currentVersion=18
   [junit4]   2> 1901196 DEBUG (simCloudManagerPool-6369-thread-1) [    ] o.a.s.c.a.s.SimClusterStateProvider ** saved cluster state version 18
   [junit4]   2> 1901196 DEBUG (simCloudManagerPool-6369-thread-1) [    ] o.a.s.c.a.AutoScalingHandler Verified autoscaling configuration
   [junit4]   2> 1901197 DEBUG (simCloudManagerPool-6369-thread-1) [    ] o.a.s.c.a.OverseerTriggerThread Refreshing /autoscaling.json with znode version 9
   [junit4]   2> 1901198 DEBUG (Simulated OverseerAutoScalingTriggerThread) [    ] o.a.s.c.a.OverseerTriggerThread Processed trigger updates upto znodeVersion 9
   [junit4]   2> 1901198 DEBUG (Simulated OverseerAutoScalingTriggerThread) [    ] o.a.s.c.a.OverseerTriggerThread -- clean old nodeAdded markers
   [junit4]   2> 1901198 DEBUG (Simulated OverseerAutoScalingTriggerThread) [    ] o.a.s.c.a.OverseerTriggerThread Current znodeVersion 9, lastZnodeVersion 9
   [junit4]   2> 1901198 DEBUG (simCloudManagerPool-6369-thread-2) [    ] o.a.s.c.a.s.SimClusterStateProvider -- simCreateCollection testCreateCollectionAddReplica, currentVersion=19
   [junit4]   2> 1901198 DEBUG (simCloudManagerPool-6369-thread-2) [    ] o.a.s.c.a.s.SimClusterStateProvider ** creating new collection states, currentVersion=19
   [junit4]   2> 1901199 DEBUG (simCloudManagerPool-6369-thread-2) [    ] o.a.s.c.a.s.SimClusterStateProvider ** saved cluster state version 19
   [junit4]   2> 1901202 DEBUG (ScheduledTrigger-6370-thread-4) [    ] o.a.s.c.a.NodeLostTrigger Running NodeLostTrigger: .auto_add_replicas with currently live nodes: 5
   [junit4]   2> 1901209 DEBUG (simCloudManagerPool-6369-thread-2) [    ] o.a.s.c.a.s.SimClusterStateProvider ** creating new collection states, currentVersion=20
   [junit4]   2> 1901209 DEBUG (simCloudManagerPool-6369-thread-2) [    ] o.a.s.c.a.s.SimClusterStateProvider ** saved cluster state version 20
   [junit4]   2> 1901211 DEBUG (simCloudManagerPool-6369-thread-2) [    ] o.a.s.c.a.s.SimClusterStateProvider -- finished createCollection testCreateCollectionAddReplica, currentVersion=21
   [junit4]   2> 1901221 DEBUG (simCloudManagerPool-6369-thread-3) [    ] o.a.s.c.a.s.SimClusterStateProvider ** creating new collection states, currentVersion=21
   [junit4]   2> 1901222 DEBUG (simCloudManagerPool-6369-thread-3) [    ] o.a.s.c.a.s.SimClusterStateProvider ** saved cluster state version 21
   [junit4]   2> 1901222 DEBUG (TEST-TestSimPolicyCloud.testCreateCollectionAddReplica-seed#[5952EA9E819093FF]) [    ] o.a.s.c.a.s.SimClusterStateProvider ** creating new collection states, currentVersion=22
   [junit4]   2> 1901222 DEBUG (simCloudManagerPool-6369-thread-4) [    ] o.a.s.c.a.s.SimClusterStateProvider -- elected new leader for testCreateCollectionAddReplica / shard1 (currentVersion=22): {"core_node1":{
   [junit4]   2>     "core":"testCreateCollectionAddReplica_shard1_replica_n1",
   [junit4]   2>     "shard":"shard1",
   [junit4]   2>     "collection":"testCreateCollectionAddReplica",
   [junit4]   2>     "node_name":"127.0.0.1:10002_solr",
   [junit4]   2>     "type":"NRT",
   [junit4]   2>     "leader":"true",
   [junit4]   2>     "SEARCHER.searcher.maxDoc":0,
   [junit4]   2>     "SEARCHER.searcher.deletedDocs":0,
   [junit4]   2>     "INDEX.sizeInBytes":10240,
   [junit4]   2>     "state":"active",
   [junit4]   2>     "INDEX.sizeInGB":9.5367431640625E-6,
   [junit4]   2>     "SEARCHER.searcher.numDocs":0}}
   [junit4]   2> 1901223 DEBUG (TEST-TestSimPolicyCloud.testCreateCollectionAddReplica-seed#[5952EA9E819093FF]) [    ] o.a.s.c.a.s.SimClusterStateProvider ** saved cluster state version 22
   [junit4]   2> 1901223 DEBUG (ScheduledTrigger-6370-thread-1) [    ] o.a.s.c.a.NodeLostTrigger Running NodeLostTrigger: .auto_add_replicas with currently live nodes: 5
   [junit4]   2> 1901243 DEBUG (ScheduledTrigger-6370-thread-4) [    ] o.a.s.c.a.NodeLostTrigger Running NodeLostTrigger: .auto_add_replicas with currently live nodes: 5
   [junit4]   2> 1901263 DEBUG (ScheduledTrigger-6370-thread-1) [    ] o.a.s.c.a.NodeLostTrigger Running NodeLostTrigger: .auto_add_replicas with currently live nodes: 5
   [junit4]   2> 1901283 DEBUG (ScheduledTrigger-6370-thread-4) [    ] o.a.s.c.a.NodeLostTrigger Running NodeLostTrigger: .auto_add_replicas with currently live nodes: 5
   [junit4]   2> 1901304 DEBUG (ScheduledTrigger-6370-thread-3) [    ] o.a.s.c.a.NodeLostTrigger Running NodeLostTrigger: .auto_add_replicas with currently live nodes: 5
   [junit4]   2> 1901324 DEBUG (ScheduledTrigger-6370-thread-4) [    ] o.a.s.c.a.NodeLostTrigger Running NodeLostTrigger: .auto_add_replicas with currently live nodes: 5
   [junit4]   2> 1901344 DEBUG (ScheduledTrigger-6370-thread-3) [    ] o.a.s.c.a.NodeLostTrigger Running NodeLostTrigger: .auto_add_replicas with currently live nodes: 5
   [junit4]   2> 1901364 DEBUG (ScheduledTrigger-6370-thread-4) [    ] o.a.s.c.a.NodeLostTrigger Running NodeLostTrigger: .auto_add_replicas with currently live nodes: 5
   [junit4]   2> 1901384 DEBUG (ScheduledTrigger-6370-thread-1) [    ] o.a.s.c.a.NodeLostTrigger Running NodeLostTrigger: .auto_add_replicas with currently live nodes: 5
   [junit4]   2> 1901405 DEBUG (ScheduledTrigger-6370-thread-4) [    ] o.a.s.c.a.NodeLostTrigger Running NodeLostTrigger: .auto_add_replicas with currently live nodes: 5
   [junit4]   2> 1901425 DEBUG (ScheduledTrigger-6370-thread-1) [    ] o.a.s.c.a.NodeLostTrigger Running NodeLostTrigger: .auto_add_replicas with currently live nodes: 5
   [junit4]   2> 1901445 DEBUG (ScheduledTrigger-6370-thread-4) [    ] o.a.s.c.a.NodeLostTrigger Running NodeLostTrigger: .auto_add_replicas with currently live nodes: 5
   [junit4]   2> 1901465 DEBUG (ScheduledTrigger-6370-thread-1) [    ] o.a.s.c.a.NodeLostTrigger Running NodeLostTrigger: .auto_add_replicas with currently live nodes: 5
   [junit4]   2> 1901485 DEBUG (ScheduledTrigger-6370-thread-2) [    ] o.a.s.c.a.NodeLostTrigger Running NodeLostTrigger: .auto_add_replicas with currently live nodes: 5
   [junit4]   2> 1901506 DEBUG (ScheduledTrigger-6370-thread-1) [    ] o.a.s.c.a.NodeLostTrigger Running NodeLostTrigger: .auto_add_replicas with currently live nodes: 5
   [junit4]   2> 1901526 DEBUG (ScheduledTrigger-6370-thread-2) [    ] o.a.s.c.a.NodeLostTrigger Running NodeLostTrigger: .auto_add_replicas with currently live nodes: 5
   [junit4]   2> 1901546 DEBUG (ScheduledTrigger-6370-thread-1) [    ] o.a.s.c.a.NodeLostTrigger Running NodeLostTrigger: .auto_add_replicas with currently live nodes: 5
   [junit4]   2> 1901566 DEBUG (ScheduledTrigger-6370-thread-4) [    ] o.a.s.c.a.NodeLostTrigger Running NodeLostTrigger: .auto_add_replicas with currently live nodes: 5
   [junit4]   2> 1901586 DEBUG (ScheduledTrigger-6370-thread-1) [    ] o.a.s.c.a.NodeLostTrigger Running NodeLostTrigger: .auto_add_replicas with currently live nodes: 5
   [junit4]   2> 1901607 DEBUG (ScheduledTrigger-6370-thread-4) [    ] o.a.s.c.a.NodeLostTrigger Running NodeLostTrigger: .auto_add_replicas with currently live nodes: 5
   [junit4]   2> 1901627 DEBUG (ScheduledTrigger-6370-thread-1) [    ] o.a.s.c.a.NodeLostTrigger Running NodeLostTrigger: .auto_add_replicas with currently live nodes: 5
   [junit4]   2> 1901647 DEBUG (ScheduledTrigger-6370-thread-4) [    ] o.a.s.c.a.NodeLostTrigger Running NodeLostTrigger: .auto_add_replicas with currently live nodes: 5
   [junit4]   2> 1901667 DEBUG (ScheduledTrigger-6370-thread-3) [    ] o.a.s.c.a.NodeLostTrigger Running NodeLostTrigger: .auto_add_replicas with currently live nodes: 5
   [junit4]   2> 1901687 DEBUG (ScheduledTrigger-6370-thread-4) [    ] o.a.s.c.a.NodeLostTrigger Running NodeLostTrigger: .auto_add_replicas with currently live nodes: 5
   [junit4]   2> 1901708 DEBUG (ScheduledTrigger-6370-thread-3) [    ] o.a.s.c.a.NodeLostTrigger Running NodeLostTrigger: .auto_add_replicas with currently live nodes: 5
   [junit4]   2> 1901728 DEBUG (ScheduledTrigger-6370-thread-4) [    ] o.a.s.c.a.NodeLostTrigger Running NodeLostTrigger: .auto_add_replicas with currently live nodes: 5
   [junit4]   2> 1901748 DEBUG (ScheduledTrigger-6370-thread-3) [    ] o.a.s.c.a.NodeLostTrigger Running NodeLostTrigger: .auto_add_replicas with currently live nodes: 5
   [junit4]   2> 1901768 DEBUG (ScheduledTrigger-6370-thread-3) [    ] o.a.s.c.a.NodeLostTrigger Running NodeLostTrigger: .auto_add_replicas with currently live nodes: 5
   [junit4]   2> 1901789 DEBUG (ScheduledTrigger-6370-thread-2) [    ] o.a.s.c.a.NodeLostTrigger Running NodeLostTrigger: .auto_add_replicas with currently live nodes: 5
   [junit4]   2> 1901809 DEBUG (ScheduledTrigger-6370-thread-3) [    ] o.a.s.c.a.NodeLostTrigger Running NodeLostTrigger: .auto_add_replicas with currently live nodes: 5
   [junit4]   2> 1901829 DEBUG (ScheduledTrigger-6370-thread-1) [    ] o.a.s.c.a.NodeLostTrigger Running NodeLostTrigger: .auto_add_replicas with currently live nodes: 5
   [junit4]   2> 1901849 DEBUG (ScheduledTrigger-6370-thread-3) [    ] o.a.s.c.a.NodeLostTrigger Running NodeLostTrigger: .auto_add_replicas with currently live nodes: 5
   [junit4]   2> 1901869 DEBUG (ScheduledTrigger-6370-thread-1) [    ] o.a.s.c.a.NodeLostTrigger Running NodeLostTrigger: .auto_add_replicas with currently live nodes: 5
   [junit4]   2> 1901890 DEBUG (ScheduledTrigger-6370-thread-3) [    ] o.a.s.c.a.NodeLostTrigger Running NodeLostTrigger: .auto_add_replicas with currently live nodes: 5
   [junit4]   2> 1901910 DEBUG (ScheduledTrigger-6370-thread-1) [    ] o.a.s.c.a.NodeLostTrigger Running NodeLostTrigger: .auto_add_replicas with currently live nodes: 5
   [junit4]   2> 1901930 DEBUG (ScheduledTrigger-6370-thread-3) [    ] o.a.s.c.a.NodeLostTrigger Running NodeLostTrigger: .auto_add_replicas with currently live nodes: 5
   [junit4]   2> 1901950 DEBUG (ScheduledTrigger-6370-thread-1) [    ] o.a.s.c.a.NodeLostTrigger Running NodeLostTrigger: .auto_add_replicas with currently live nodes: 5
   [junit4]   2> 1901970 DEBUG (ScheduledTrigger-6370-thread-3) [    ] o.a.s.c.a.NodeLostTrigger Running NodeLostTrigger: .auto_add_replicas with currently live nodes: 5
   [junit4]   2> 1901991 DEBUG (ScheduledTrigger-6370-thread-1) [    ] o.a.s.c.a.NodeLostTrigger Running NodeLostTrigger: .auto_add_replicas with currently live nodes: 5
   [junit4]   2> 1902011 DEBUG (ScheduledTrigger-6370-thread-3) [    ] o.a.s.c.a.NodeLostTrigger Running NodeLostTrigger: .auto_add_replicas with currently live nodes: 5
   [junit4]   2> 1902031 DEBUG (ScheduledTrigger-6370-thread-1) [    ] o.a.s.c.a.NodeLostTrigger Running NodeLostTrigger: .auto_add_replicas with currently live nodes: 5
   [junit4]   2> 1902051 DEBUG (ScheduledTrigger-6370-thread-3) [    ] o.a.s.c.a.NodeLostTrigger Running NodeLostTrigger: .auto_add_replicas with currently live nodes: 5
   [junit4]   2> 1902071 DEBUG (ScheduledTrigger-6370-thread-1) [    ] o.a.s.c.a.NodeLostTrigger Running NodeLostTrigger: .auto_add_replicas with currently live nodes: 5
   [junit4]   2> 1902092 DEBUG (ScheduledTrigger-6370-thread-3) [    ] o.a.s.c.a.NodeLostTrigger Running NodeLostTrigger: .auto_add_replicas with currently live nodes: 5
   [junit4]   2> 1902112 DEBUG (ScheduledTrigger-6370-thread-2) [    ] o.a.s.c.a.NodeLostTrigger Running NodeLostTrigger: .auto_add_replicas with currently live nodes: 5
   [junit4]   2> 1902132 DEBUG (ScheduledTrigger-6370-thread-3) [    ] o.a.s.c.a.NodeLostTrigger Running NodeLostTrigger: .auto_add_replicas with currently live nodes: 5
   [junit4]   2> 1902153 DEBUG (ScheduledTrigger-6370-thread-2) [    ] o.a.s.c.a.NodeLostTrigger Running NodeLostTrigger: .auto_add_replicas with currently live nodes: 5
   [junit4]   2> 1902173 DEBUG (ScheduledTrigger-6370-thread-4) [    ] o.a.s.c.a.NodeLostTrigger Running NodeLostTrigger: .auto_add_replicas with currently live nodes: 5
   [junit4]   2> 1902193 DEBUG (ScheduledTrigger-6370-thread-2) [    ] o.a.s.c.a.NodeLostTrigger Running NodeLostTrigger: .auto_add_replicas with currently live nodes: 5
   [junit4]   2> 1902213 DEBUG (ScheduledTrigger-6370-thread-4) [    ] o.a.s.c.a.NodeLostTrigger Running NodeLostTrigger: .auto_add_replicas with currently live nodes: 5
   [junit4]   2> 1902233 DEBUG (ScheduledTrigger-6370-thread-3) [    ] o.a.s.c.a.NodeLostTrigger Running NodeLostTrigger: .auto_add_replicas with currently live nodes: 5
   [junit4]   2> 1902254 DEBUG (ScheduledTrigger-6370-thread-4) [    ] o.a.s.c.a.NodeLostTrigger Running NodeLostTrigger: .auto_add_replicas with currently live nodes: 5
   [junit4]   2> 1902274 DEBUG (ScheduledTrigger-6370-thread-3) [    ] o.a.s.c.a.NodeLostTrigger Running NodeLostTrigger: .auto_add_replicas with currently live nodes: 5
   [junit4]   2> 1902294 DEBUG (ScheduledTrigger-6370-thread-2) [    ] o.a.s.c.a.NodeLostTrigger Running NodeLostTrigger: .auto_add_replicas with currently live nodes: 5
   [junit4]   2> 1902314 DEBUG (ScheduledTrigger-6370-thread-2) [    ] o.a.s.c.a.NodeLostTrigger Running NodeLostTrigger: .auto_add_replicas with currently live nodes: 5
   [junit4]   2> 1902334 DEBUG (ScheduledTrigger-6370-thread-4) [    ] o.a.s.c.a.NodeLostTrigger Running NodeLostTrigger: .auto_add_replicas with currently live nodes: 5
   [junit4]   2> 1902355 DEBUG (ScheduledTrigger-6370-thread-2) [    ] o.a.s.c.a.NodeLostTrigger Running NodeLostTrigger: .auto_add_replicas with currently live nodes: 5
   [junit4]   2> 1902375 DEBUG (ScheduledTrigger-6370-thread-4) [    ] o.a.s.c.a.NodeLostTrigger Running NodeLostTrigger: .auto_add_replicas with currently live nodes: 5
   [junit4]   2> 1902395 DEBUG (ScheduledTrigger-6370-thread-3) [    ] o.a.s.c.a.NodeLostTrigger Running NodeLostTrigger: .auto_add_replicas with currently live nodes: 5
   [junit4]   2> 1902415 DEBUG (ScheduledTrigger-6370-thread-4) [    ] o.a.s.c.a.NodeLostTrigger Running NodeLostTrigger: .auto_add_replicas with currently live nodes: 5
   [junit4]   2> 1902436 DEBUG (ScheduledTrigger-6370-thread-3) [    ] o.a.s.c.a.NodeLostTrigger Running NodeLostTrigger: .auto_add_replicas with currently live nodes: 5
   [junit4]   2> 1902456 DEBUG (ScheduledTrigger-6370-thread-4) [    ] o.a.s.c.a.NodeLostTrigger Running NodeLostTrigger: .auto_add_replicas with currently live nodes: 5
   [junit4]   2> 1902476 DEBUG (ScheduledTrigger-6370-thread-3) [    ] o.a.s.c.a.NodeLostTrigger Running NodeLostTrigger: .auto_add_replicas with currently live nodes: 5
   [junit4]   2> 1902496 DEBUG (ScheduledTrigger-6370-thread-4) [    ] o.a.s.c.a.NodeLostTrigger Running NodeLostTrigger: .auto_add_replicas with currently live nodes: 5
   [junit4]   2> 1902516 DEBUG (ScheduledTrigger-6370-thread-1) [    ] o.a.s.c.a.NodeLostTrigger Running NodeLostTrigger: .auto_add_replicas with currently live nodes: 5
   [junit4]   2> 1902537 DEBUG (ScheduledTrigger-6370-thread-4) [    ] o.a.s.c.a.NodeLostTrigger Running NodeLostTrigger: .auto_add_replicas with currently live nodes: 5
   [junit4]   2> 1902557 DEBUG (ScheduledTrigger-6370-thread-1) [    ] o.a.s.c.a.NodeLostTrigger Running NodeLostTrigger: .auto_add_replicas with currently live nodes: 5
   [junit4]   2> 1902577 DEBUG (ScheduledTrigger-6370-thread-4) [    ] o.a.s.c.a.NodeLostTrigger Running NodeLostTrigger: .auto_add_replicas with currently live nodes: 5
   [junit4]   2> 1902597 DEBUG (ScheduledTrigger-6370-thread-1) [    ] o.a.s.c.a.NodeLostTrigger Running NodeLostTrigger: .auto_add_replicas with currently live nodes: 5
   [junit4]   2> 1902617 DEBUG (ScheduledTrigger-6370-thread-4) [    ] o.a.s.c.a.NodeLostTrigger Running NodeLostTrigger: .auto_add_replicas with currently live nodes: 5
   [junit4]   2> 1902638 DEBUG (ScheduledTrigger-6370-thread-1) [    ] o.a.s.c.a.NodeLostTrigger Running NodeLostTrigger: .auto_add_replicas with currently live nodes: 5
   [junit4]   2> 1902658 DEBUG (ScheduledTrigger-6370-thread-4) [    ] o.a.s.c.a.NodeLostTrigger Running NodeLostTrigger: .auto_add_replicas with currently live nodes: 5
   [junit4]   2> 1902678 DEBUG (ScheduledTrigger-6370-thread-1) [    ] o.a.s.c.a.NodeLostTrigger Running NodeLostTrigger: .auto_add_replicas with currently live nodes: 5
   [junit4]   2> 1902698 DEBUG (ScheduledTrigger-6370-thread-4) [    ] o.a.s.c.a.NodeLostTrigger Running NodeLostTrigger: .auto_add_replicas with currently live nodes: 5
   [junit4]   2> 1902719 DEBUG (ScheduledTrigger-6370-thread-1) [    ] o.a.s.c.a.NodeLostTrigger Running NodeLostTrigger: .auto_add_replicas with currently live nodes: 5
   [junit4]   2> 1902739 DEBUG (ScheduledTrigger-6370-thread-3) [    ] o.a.s.c.a.NodeLostTrigger Running NodeLostTrigger: .auto_add_replicas with currently live nodes: 5
   [junit4]   2> 1902759 DEBUG (ScheduledTrigger-6370-thread-1) [    ] o.a.s.c.a.NodeLostTrigger Running NodeLostTrigger: .auto_add_replicas with currently live nodes: 5
   [junit4]   2> 1902779 DEBUG (ScheduledTrigger-6370-thread-3) [    ] o.a.s.c.a.NodeLostTrigger Running NodeLostTrigger: .auto_add_replicas with currently live nodes: 5
   [junit4]   2> 1902799 DEBUG (ScheduledTrigger-6370-thread-1) [    ] o.a.s.c.a.NodeLostTrigger Running NodeLostTrigger: .auto_add_replicas with currently live nodes: 5
   [junit4]   2> 1902820 DEBUG (ScheduledTrigger-6370-thread-3) [    ] o.a.s.c.a.NodeLostTrigger Running NodeLostTrigger: .auto_add_replicas with currently live nodes: 5
   [junit4]   2> 1902840 DEBUG (ScheduledTrigger-6370-thread-1) [    ] o.a.s.c.a.NodeLostTrigger Running NodeLostTrigger: .auto_add_replicas with currently live nodes: 5
   [junit4]   2> 1902860 DEBUG (ScheduledTrigger-6370-thread-3) [    ] o.a.s.c.a.NodeLostTrigger Running NodeLostTrigger: .auto_add_replicas with currently live nodes: 5
   [junit4]   2> 1902880 DEBUG (ScheduledTrigger-6370-thread-1) [    ] o.a.s.c.a.NodeLostTrigger Running NodeLostTrigger: .auto_add_replicas with currently live nodes: 5
   [junit4]   2> 1902900 DEBUG (ScheduledTrigger-6370-thread-4) [    ] o.a.s.c.a.NodeLostTrigger Running NodeLostTrigger: .auto_add_replicas with currently live nodes: 5
   [junit4]   2> 1902921 DEBUG (ScheduledTrigger-6370-thread-1) [    ] o.a.s.c.a.NodeLostTrigger Running NodeLostTrigger: .auto_add_replicas with currently live nodes: 5
   [junit4]   2> 1902941 DEBUG (ScheduledTrigger-6370-thread-2) [    ] o.a.s.c.a.NodeLostTrigger Running NodeLostTrigger: .auto_add_replicas with currently live nodes: 5
   [junit4]   2> 1902961 DEBUG (ScheduledTrigger-6370-thread-1) [    ] o.a.s.c.a.NodeLostTrigger Running NodeLostTrigger: .auto_add_replicas with currently live nodes: 5
   [junit4]   2> 1902981 DEBUG (ScheduledTrigger-6370-thread-2) [    ] o.a.s.c.a.NodeLostTrigger Running NodeLostTrigger: .auto_add_replicas with currently live nodes: 5
   [junit4]   2> 1903001 DEBUG (ScheduledTrigger-6370-thread-4) [    ] o.a.s.c.a.NodeLostTrigger Running NodeLostTrigger: .auto_add_replicas with currently live nodes: 5
   [junit4]   2> 1903012 INFO  (TEST-TestSimPolicyCloud.testCreateCollectionAddReplica-seed#[5952EA9E819093FF]) [    ] o.a.s.SolrTestCaseJ4 ###Ending testCreateCollectionAddReplica
   [junit4]   2> 1903013 DEBUG (TEST-TestSimPolicyCloud.testCreateCollectionAddReplica-seed#[5952EA9E819093FF]) [    ] o.a.s.c.a.s.SimClusterStateProvider ** creating new collection states, currentVersion=23
   [junit4]   2> 1903013 DEBUG (TEST-TestSimPolicyCloud.testCreateCollectionAddReplica-seed#[5952EA9E819093FF]) [    ] o.a.s.c.a.s.SimClusterStateProvider ** saved cluster state version 23
   [junit4]   2> 1903014 INFO  (TEST-TestSimPolicyCloud.testCreateCollectionAddReplica-seed#[5952EA9E819093FF]) [    ] o.a.s.c.a.s.SimSolrCloudTestCase #######################################
   [junit4]   2> ############ CLUSTER STATE ############
   [junit4]   2> #######################################
   [junit4]   2> ## Live nodes:		5
   [junit4]   2> ## Empty nodes:	4
   [junit4]   2> ## Dead nodes:		0
   [junit4]   2> ## Collections:
   [junit4]   2> ##  * testCreateCollectionAddReplica
   [junit4]   2> ##    shardsTotal	1
   [junit4]   2> ##    shardsState	{active=1}
   [junit4]   2> ##      shardsWithoutLeader	0
   [junit4]   2> ##    totalReplicas	1
   [junit4]   2> ##      activeReplicas	1
   [junit4]   2> ##      inactiveReplicas	0
   [junit4]   2> ##    totalActiveDocs	0
   [junit4]   2> ##      bufferedDocs	0
   [junit4]   2> ##      maxActiveSliceDocs	0
   [junit4]   2> ##      minActiveSliceDocs	0
   [junit4]   2> ##      avgActiveSliceDocs	0
   [junit4]   2> ##    totalInactiveDocs	0
   [junit4]   2> ##      maxInactiveSliceDocs	0
   [junit4]   2> ##      minInactiveSliceDocs	0
   [junit4]   2> ##      avgInactiveSliceDocs	NaN
   [junit4]   2> ##    totalActiveBytes	10,240
   [junit4]   2> ##      maxActiveSliceBytes	10,240
   [junit4]   2> ##      minActiveSliceBytes	10,240
   [junit4]   2> ##      avgActiveSliceBytes	10,240
   [junit4]   2> ##    totalInactiveBytes	0
   [junit4]   2> ##      maxInactiveSliceBytes	0
   [junit4]   2> ##      minInactiveSliceBytes	0
   [junit4]   2> ##      avgInactiveSliceBytes	NaN
   [junit4]   2> ##    totalActiveDeletedDocs	0
   [junit4]   2> ## Max replicas per node:	1
   [junit4]   2> ## Min replicas per node:	0
   [junit4]   2> ## Total replicas:		1
   [junit4]   2> ## * testCreateCollectionAddReplica		1
   [junit4]   2> ##		- active           1
   [junit4]   2> ######### Solr op counts ##########
   [junit4]   2> ##		- CREATE             1
   [junit4]   2> ##		- autoscaling        1
   [junit4]   2> ######### Autoscaling event counts ###########
   [junit4]   2> 
   [junit4]   2> NOTE: reproduce with: ant test  -Dtestcase=TestSimPolicyCloud -Dtests.method=testCreateCollectionAddReplica -Dtests.seed=5952EA9E819093FF -Dtests.multiplier=2 -Dtests.slow=true -Dtests.locale=it-IT -Dtests.timezone=Etc/UTC -Dtests.asserts=true -Dtests.file.encoding=ISO-8859-1
   [junit4] FAILURE 2.05s J1 | TestSimPolicyCloud.testCreateCollectionAddReplica <<<
   [junit4]    > Throwable #1: java.lang.AssertionError: Timeout waiting for collection to become active
   [junit4]    > Live Nodes: [127.0.0.1:10001_solr, 127.0.0.1:10004_solr, 127.0.0.1:10000_solr, 127.0.0.1:10002_solr, 127.0.0.1:10003_solr]
   [junit4]    > Last available state: DocCollection(testCreateCollectionAddReplica//clusterstate.json/22)={
   [junit4]    >   "replicationFactor":"1",
   [junit4]    >   "pullReplicas":"0",
   [junit4]    >   "router":{"name":"compositeId"},
   [junit4]    >   "maxShardsPerNode":"1",
   [junit4]    >   "autoAddReplicas":"false",
   [junit4]    >   "nrtReplicas":"1",
   [junit4]    >   "tlogReplicas":"0",
   [junit4]    >   "autoCreated":"true",
   [junit4]    >   "policy":"c1",
   [junit4]    >   "shards":{"shard1":{
   [junit4]    >       "replicas":{"core_node1":{
   [junit4]    >           "core":"testCreateCollectionAddReplica_shard1_replica_n1",
   [junit4]    >           "SEARCHER.searcher.maxDoc":0,
   [junit4]    >           "SEARCHER.searcher.deletedDocs":0,
   [junit4]    >           "INDEX.sizeInBytes":10240,
   [junit4]    >           "node_name":"127.0.0.1:10002_solr",
   [junit4]    >           "state":"active",
   [junit4]    >           "type":"NRT",
   [junit4]    >           "INDEX.sizeInGB":9.5367431640625E-6,
   [junit4]    >           "SEARCHER.searcher.numDocs":0}},
   [junit4]    >       "range":"80000000-7fffffff",
   [junit4]    >       "state":"active"}}}
   [junit4]    > 	at __randomizedtesting.SeedInfo.seed([5952EA9E819093FF:D9728FB090D37B59]:0)
   [junit4]    > 	at org.apache.solr.cloud.CloudTestUtils.waitForState(CloudTestUtils.java:70)
   [junit4]    > 	at org.apache.solr.cloud.autoscaling.sim.TestSimPolicyCloud.testCreateCollectionAddReplica(TestSimPolicyCloud.java:123)
   [junit4]    > 	at java.lang.Thread.run(Thread.java:748)
   [junit4]    > Caused by: java.util.concurrent.TimeoutException: last ClusterState: znodeVersion: 23
   [junit4]    > live nodes:[127.0.0.1:10001_solr, 127.0.0.1:10004_solr, 127.0.0.1:10000_solr, 127.0.0.1:10002_solr, 127.0.0.1:10003_solr]
   [junit4]    > collections:{testCreateCollectionAddReplica=DocCollection(testCreateCollectionAddReplica//clusterstate.json/22)={
   [junit4]    >   "replicationFactor":"1",
   [junit4]    >   "pullReplicas":"0",
   [junit4]    >   "router":{"name":"compositeId"},
   [junit4]    >   "maxShardsPerNode":"1",
   [junit4]    >   "autoAddReplicas":"false",
   [junit4]    >   "nrtReplicas":"1",
   [junit4]    >   "tlogReplicas":"0",
   [junit4]    >   "autoCreated":"true",
   [junit4]    >   "policy":"c1",
   [junit4]    >   "shards":{"shard1":{
   [junit4]    >       "replicas":{"core_node1":{
   [junit4]    >           "core":"testCreateCollectionAddReplica_shard1_replica_n1",
   [junit4]    >           "SEARCHER.searcher.maxDoc":0,
   [junit4]    >           "SEARCHER.searcher.deletedDocs":0,
   [junit4]    >           "INDEX.sizeInBytes":10240,
   [junit4]    >           "node_name":"127.0.0.1:10002_solr",
   [junit4]    >           "state":"active",
   [junit4]    >           "type":"NRT",
   [junit4]    >           "INDEX.sizeInGB":9.5367431640625E-6,
   [junit4]    >           "SEARCHER.searcher.numDocs":0}},
   [junit4]    >       "range":"80000000-7fffffff",
   [junit4]    >       "state":"active"}}}}, last coll state: DocCollection(testCreateCollectionAddReplica//clusterstate.json/22)={
   [junit4]    >   "replicationFactor":"1",
   [junit4]    >   "pullReplicas":"0",
   [junit4]    >   "router":{"name":"compositeId"},
   [junit4]    >   "maxShardsPerNode":"1",
   [junit4]    >   "autoAddReplicas":"false",
   [junit4]    >   "nrtReplicas":"1",
   [junit4]    >   "tlogReplicas":"0",
   [junit4]    >   "autoCreated":"true",
   [junit4]    >   "policy":"c1",
   [junit4]    >   "shards":{"shard1":{
   [junit4]    >       "replicas":{"core_node1":{
   [junit4]    >           "core":"testCreateCollectionAddReplica_shard1_replica_n1",
   [junit4]    >           "SEARCHER.searcher.maxDoc":0,
   [junit4]    >           "SEARCHER.searcher.deletedDocs":0,
   [junit4]    >           "INDEX.sizeInBytes":10240,
   [junit4]    >           "node_name":"127.0.0.1:10002_solr",
   [junit4]    >           "state":"active",
   [junit4]    >           "type":"NRT",
   [junit4]    >           "INDEX.sizeInGB":9.5367431640625E-6,
   [junit4]    >           "SEARCHER.searcher.numDocs":0}},
   [junit4]    >       "range":"80000000-7fffffff",
   [junit4]    >       "state":"active"}}}
   [junit4]    > 	at org.apache.solr.cloud.CloudTestUtils.waitForState(CloudTestUtils.java:112)
   [junit4]    > 	at org.apache.solr.cloud.CloudTestUtils.waitForState(CloudTestUtils.java:64)
   [junit4]    > 	... 41 more
   [junit4]   2> 1903022 DEBUG (ScheduledTrigger-6370-thread-3) [    ] o.a.s.c.a.NodeLostTrigger Running NodeLostTrigger: .auto_add_replicas with currently live nodes: 5
   [junit4]   2> 1903022 INFO  (TEST-TestSimPolicyCloud.testDataProviderPerReplicaDetails-seed#[5952EA9E819093FF]) [    ] o.a.s.SolrTestCaseJ4 ###Starting testDataProviderPerReplicaDetails
   [junit4]   2> 1903022 DEBUG (TEST-TestSimPolicyCloud.testDataProviderPerReplicaDetails-seed#[5952EA9E819093FF]) [    ] o.a.s.c.a.OverseerTriggerThread Refreshing /autoscaling.json with znode version 10
   [junit4]   2> 1903022 DEBUG (Simulated OverseerAutoScalingTriggerThread) [    ] o.a.s.c.a.OverseerTriggerThread Processed trigger updates upto znodeVersion 10
   [junit4]   2> 1903022 INFO  (TEST-TestSimPolicyCloud.testDataProviderPerReplicaDetails-seed#[5952EA9E819093FF]) [    ] o.a.s.c.a.s.SimCloudManager === Restarting OverseerTriggerThread and clearing object cache...
   [junit4]   2> 1903022 DEBUG (Simulated OverseerAutoScalingTriggerThread) [    ] o.a.s.c.a.OverseerTriggerThread -- clean old nodeLost markers
   [junit4]   2> 1903023 DEBUG (Simulated OverseerAutoScalingTriggerThread) [    ] o.a.s.c.a.OverseerTriggerThread -- clean old nodeAdded markers
   [junit4]   2> 1903023 DEBUG (TEST-TestSimPolicyCloud.testDataProviderPerReplicaDetails-seed#[5952EA9E819093FF]) [    ] o.a.s.c.a.ScheduledTriggers Shutting down scheduled thread pool executor now
   [junit4]   2> 1903023 WARN  (Simulated OverseerAutoScalingTriggerThread) [    ] o.a.s.c.a.OverseerTriggerThread Interrupted
   [junit4]   2> java.lang.InterruptedException: null
   [junit4]   2> 	at java.util.concurrent.locks.AbstractQueuedSynchronizer.acquireInterruptibly(AbstractQueuedSynchronizer.java:1220) ~[?:1.8.0_172]
   [junit4]   2> 	at java.util.concurrent.locks.ReentrantLock.lockInterruptibly(ReentrantLock.java:335) ~[?:1.8.0_172]
   [junit4]   2> 	at org.apache.solr.cloud.autoscaling.OverseerTriggerThread.run(OverseerTriggerThread.java:177) [java/:?]
   [junit4]   2> 	at java.lang.Thread.run(Thread.java:748) [?:1.8.0_172]
   [junit4]   2> 1903024 DEBUG (TEST-TestSimPolicyCloud.testDataProviderPerReplicaDetails-seed#[5952EA9E819093FF]) [    ] o.a.s.c.a.ScheduledTriggers Shutting down action executor now
   [junit4]   2> 1903024 DEBUG (TEST-TestSimPolicyCloud.testDataProviderPerReplicaDetails-seed#[5952EA9E819093FF]) [    ] o.a.s.c.a.ScheduledTriggers Awaiting termination for action executor
   [junit4]   2> 1903024 DEBUG (TEST-TestSimPolicyCloud.testDataProviderPerReplicaDetails-seed#[5952EA9E819093FF]) [    ] o.a.s.c.a.ScheduledTriggers Awaiting termination for scheduled thread pool executor
   [junit4]   2> 1903024 DEBUG (TEST-TestSimPolicyCloud.testDataProviderPerReplicaDetails-seed#[5952EA9E819093FF]) [    ] o.a.s.c.a.ScheduledTriggers ScheduledTriggers closed completely
   [junit4]   2> 1903024 DEBUG (TEST-TestSimPolicyCloud.testDataProviderPerReplicaDetails-seed#[5952EA9E819093FF]) [    ] o.a.s.c.a.OverseerTriggerThread OverseerTriggerThread has been closed explicitly
   [junit4]   2> 1903025 DEBUG (Simulated OverseerAutoScalingTriggerThread) [    ] o.a.s.c.a.OverseerTriggerThread Adding .auto_add_replicas and .scheduled_maintenance triggers
   [junit4]   2> 1903025 DEBUG (Simulated OverseerAutoScalingTriggerThread) [    ] o.a.s.c.a.OverseerTriggerThread Refreshing /autoscaling.json with znode version 11
   [junit4]   2> 1903025 DEBUG (Simulated OverseerAutoScalingTriggerThread) [    ] o.a.s.c.a.OverseerTriggerThread Current znodeVersion 11, lastZnodeVersion -1
   [junit4]   2> 1903026 DEBUG (Simulated OverseerAutoScalingTriggerThread) [    ] o.a.s.c.a.OverseerTriggerThread Processed trigger updates upto znodeVersion 11
   [junit4]   2> 1903026 DEBUG (Simulated OverseerAutoScalingTriggerThread) [    ] o.a.s.c.a.NodeLostTrigger NodeLostTrigger .auto_add_replicas - Initial livenodes: [127.0.0.1:10001_solr, 127.0.0.1:10004_solr, 127.0.0.1:10000_solr, 127.0.0.1:10002_solr, 127.0.0.1:10003_solr]
   [junit4]   2> 1903026 DEBUG (Simulated OverseerAutoScalingTriggerThread) [    ] o.a.s.c.a.OverseerTriggerThread -- clean old nodeAdded markers
   [junit4]   2> 1903026 DEBUG (Simulated OverseerAutoScalingTriggerThread) [    ] o.a.s.c.a.OverseerTriggerThread Current znodeVersion 11, lastZnodeVersion 11
   [junit4]   2> 1903026 DEBUG (ScheduledTrigger-6373-thread-2) [    ] o.a.s.c.a.NodeLostTrigger Running NodeLostTrigger: .auto_add_replicas with currently live nodes: 5
   [junit4]   2> 1903053 DEBUG (ScheduledTrigger-6373-thread-3) [    ] o.a.s.c.a.NodeLostTrigger Running NodeLostTrigger: .auto_add_replicas with currently live nodes: 5
   [junit4]   2> 1903074 DEBUG (ScheduledTrigger-6373-thread-4) [    ] o.a.s.c.a.NodeLostTrigger Running NodeLostTrigger: .auto_add_replicas with currently live nodes: 5
   [junit4]   2> 1903094 DEBUG (ScheduledTrigger-6373-thread-3) [    ] o.a.s.c.a.NodeLostTrigger Running NodeLostTrigger: .auto_add_replicas with currently live nodes: 5
   [junit4]   2> 1903114 DEBUG (ScheduledTrigger-6373-thread-4) [    ] o.a.s.c.a.NodeLostTrigger Running NodeLostTrigger: .auto_add_replicas with currently live nodes: 5
   [junit4]   2> 1903134 DEBUG (ScheduledTrigger-6373-thread-3) [    ] o.a.s.c.a.NodeLostTrigger Running NodeLostTrigger: .auto_add_replicas with currently live nodes: 5
   [junit4]   2> 1903155 DEBUG (ScheduledTrigger-6373-thread-2) [    ] o.a.s.c.a.NodeLostTrigger Running NodeLostTrigger: .auto_add_replicas with currently live nodes: 5
   [junit4]   2> 1903175 DEBUG (ScheduledTrigger-6373-thread-3) [    ] o.a.s.c.a.NodeLostTrigger Running NodeLostTrigger: .auto_add_replicas with currently live nodes: 5
   [junit4]   2> 1903195 DEBUG (ScheduledTrigger-6373-thread-2) [    ] o.a.s.c.a.NodeLostTrigger Running NodeLostTrigger: .auto_add_replicas with currently live nodes: 5
   [junit4]   2> 1903215 DEBUG (ScheduledTrigger-6373-thread-1) [    ] o.a.s.c.a.NodeLostTrigger Running NodeLostTrigger: .auto_add_replicas with currently live nodes: 5
   [junit4]   2> 1903225 DEBUG (simCloudManagerPool-6372-thread-1) [    ] o.a.s.c.a.s.SimClusterStateProvider -- simCreateCollection perReplicaDataColl, currentVersion=24
   [junit4]   2> 1903226 DEBUG (simCloudManagerPool-6372-thread-1) [    ] o.a.s.c.a.s.SimClusterStateProvider ** creating new collection states, currentVersion=24
   [junit4]   2> 1903226 DEBUG (simCloudManagerPool-6372-thread-1) [    ] o.a.s.c.a.s.SimClusterStateProvider ** saved cluster state version 24
   [junit4]   2> 1903236 DEBUG (ScheduledTrigger-6373-thread-2) [    ] o.a.s.c.a.NodeLostTrigger Running NodeLostTrigger: .auto_add_replicas with currently live nodes: 5
   [junit4]   2> 1903236 DEBUG (simCloudManagerPool-6372-thread-1) [    ] o.a.s.c.a.s.SimClusterStateProvider ** creating new collection states, currentVersion=25
   [junit4]   2> 1903236 DEBUG (simCloudManagerPool-6372-thread-1) [    ] o.a.s.c.a.s.SimClusterStateProvider ** saved cluster state version 25
   [junit4]   2> 1903239 DEBUG (simCloudManagerPool-6372-thread-1) [    ] o.a.s.c.a.s.SimClusterStateProvider -- finished createCollection perReplicaDataColl, currentVersion=26
   [junit4]   2> 1903248 DEBUG (simCloudManagerPool-6372-thread-2) [    ] o.a.s.c.a.s.SimClusterStateProvider ** creating new collection states, currentVersion=26
   [junit4]   2> 1903249 DEBUG (simCloudManagerPool-6372-thread-2) [    ] o.a.s.c.a.s.SimClusterStateProvider ** saved cluster state version 26
   [junit4]   2> 1903249 DEBUG (simCloudManagerPool-6372-thread-7) [    ] o.a.s.c.a.s.SimClusterStateProvider -- elected new leader for perReplicaDataColl / shard1 (currentVersion=27): {"core_node1":{
   [junit4]   2>     "core":"perReplicaDataColl_shard1_replica_n1",
   [junit4]   2>     "shard":"shard1",
   [junit4]   2>     "collection":"perReplicaDataColl",
   [junit4]   2>     "node_name":"127.0.0.1:10003_solr",
   [junit4]   2>     "type":"NRT",
   [junit4]   2>     "leader":"true",
   [junit4]   2>     "SEARCHER.searcher.maxDoc":0,
   [junit4]   2>     "SEARCHER.searcher.deletedDocs":0,
   [junit4]   2>     "INDEX.sizeInBytes":10240,
   [junit4]   2>     "state":"active",
   [junit4]   2>     "INDEX.sizeInGB":9.5367431640625E-6,
   [junit4]   2>     "SEARCHER.searcher.numDocs":0}}
   [junit4]   2> 1903256 DEBUG (ScheduledTrigger-6373-thread-3) [    ] o.a.s.c.a.NodeLostTrigger Running NodeLostTrigger: .auto_add_replicas with currently live nodes: 5
   [junit4]   2> 1903259 DEBUG (simCloudManagerPool-6372-thread-3) [    ] o.a.s.c.a.s.SimClusterStateProvider ** creating new collection states, currentVersion=27
   [junit4]   2> 1903259 DEBUG (simCloudManagerPool-6372-thread-3) [    ] o.a.s.c.a.s.SimClusterStateProvider ** saved cluster state version 27
   [junit4]   2> 1903270 DEBUG (simCloudManagerPool-6372-thread-4) [    ] o.a.s.c.a.s.SimClusterStateProvider ** creating new collection states, currentVersion=28
   [junit4]   2> 1903270 DEBUG (simCloudManagerPool-6372-thread-4) [    ] o.a.s.c.a.s.SimClusterStateProvider ** saved cluster state version 28
   [junit4]   2> 1903270 DEBUG (TEST-TestSimPolicyCloud.testDataProviderPerReplicaDetails-seed#[5952EA9E819093FF]) [    ] o.a.s.c.a.s.SimClusterStateProvider ** creating new collection states, currentVersion=29
   [junit4]   2> 1903271 DEBUG (TEST-TestSimPolicyCloud.testDataProviderPerReplicaDetails-seed#[5952EA9E819093FF]) [    ] o.a.s.c.a.s.SimClusterStateProvider ** saved cluster state version 29
   [junit4]   2> 1903276 DEBUG (ScheduledTrigger-6373-thread-2) [    ] o.a.s.c.a.NodeLostTrigger Running NodeLostTrigger: .auto_add_replicas with currently live nodes: 5
   [junit4]   2> 1903281 DEBUG (simCloudManagerPool-6372-thread-6) [    ] o.a.s.c.a.s.SimClusterStateProvider ** creating new collection states, currentVersion=30
   [junit4]   2> 1903281 DEBUG (simCloudManagerPool-6372-thread-6) [    ] o.a.s.c.a.s.SimClusterStateProvider ** saved cluster state version 30
   [junit4]   2> 1903292 DEBUG (simCloudManagerPool-6372-thread-5) [    ] o.a.s.c.a.s.SimClusterStateProvider ** creating new collection states, currentVersion=31
   [junit4]   2> 1903292 DEBUG (simCloudManagerPool-6372-thread-5) [    ] o.a.s.c.a.s.SimClusterStateProvider ** saved cluster state version 31
   [junit4]   2> 1903293 DEBUG (TEST-TestSimPolicyCloud.testDataProviderPerReplicaDetails-seed#[5952EA9E819093FF]) [    ] o.a.s.c.a.s.SimClusterStateProvider ** creating new collection states, currentVersion=32
   [junit4]   2> 1903293 DEBUG (TEST-TestSimPolicyCloud.testDataProviderPerReplicaDetails-seed#[5952EA9E819093FF]) [    ] o.a.s.c.a.s.SimClusterStateProvider ** saved cluster state version 32
   [junit4]   2> 1903296 DEBUG (ScheduledTrigger-6373-thread-3) [    ] o.a.s.c.a.NodeLostTrigger Running NodeLostTrigger: .auto_add_replicas with currently live nodes: 5
   [junit4]   2> 1903316 DEBUG (ScheduledTrigger-6373-thread-2) [    ] o.a.s.c.a.NodeLostTrigger Running NodeLostTrigger: .auto_add_replicas with currently live nodes: 5
   [junit4]   2> 1903337 DEBUG (ScheduledTrigger-6373-thread-3) [    ] o.a.s.c.a.NodeLostTrigger Running NodeLostTrigger: .auto_add_replicas with currently live nodes: 5
   [junit4]   2> 1903357 DEBUG (ScheduledTrigger-6373-thread-4) [    ] o.a.s.c.a.NodeLostTrigger Running NodeLostTrigger: .auto_add_replicas with currently live nodes: 5
   [junit4]   2> 1903377 DEBUG (ScheduledTrigger-6373-thread-4) [    ] o.a.s.c.a.NodeLostTrigger Running NodeLostTrigger: .auto_add_replicas with currently live nodes: 5
   [junit4]   2> 1903397 DEBUG (ScheduledTrigger-6373-thread-1) [    ] o.a.s.c.a.NodeLostTrigger Running NodeLostTrigger: .auto_add_replicas with currently live nodes: 5
   [junit4]   2> 1903397 INFO  (TEST-TestSimPolicyCloud.testDataProviderPerReplicaDetails-seed#[5952EA9E819093FF]) [    ] o.a.s.SolrTestCas

[...truncated too long message...]

-check:
[loadresource] Do not set property disallowed.ivy.jars.list as its length is 0.

-ivy-fail-disallowed-ivy-version:

ivy-fail:

ivy-fail:

ivy-configure:
[ivy:configure] :: loading settings :: file = /x1/jenkins/jenkins-slave/workspace/Lucene-Solr-Tests-7.x/lucene/top-level-ivy-settings.xml

resolve:

ivy-availability-check:
[loadresource] Do not set property disallowed.ivy.jars.list as its length is 0.

-ivy-fail-disallowed-ivy-version:

ivy-fail:

ivy-configure:
[ivy:configure] :: loading settings :: file = /x1/jenkins/jenkins-slave/workspace/Lucene-Solr-Tests-7.x/lucene/top-level-ivy-settings.xml

resolve:

ivy-availability-check:
[loadresource] Do not set property disallowed.ivy.jars.list as its length is 0.

-ivy-fail-disallowed-ivy-version:

ivy-fail:

ivy-fail:

ivy-configure:
[ivy:configure] :: loading settings :: file = /x1/jenkins/jenkins-slave/workspace/Lucene-Solr-Tests-7.x/lucene/top-level-ivy-settings.xml

resolve:

ivy-availability-check:
[loadresource] Do not set property disallowed.ivy.jars.list as its length is 0.

-ivy-fail-disallowed-ivy-version:

ivy-fail:

ivy-configure:
[ivy:configure] :: loading settings :: file = /x1/jenkins/jenkins-slave/workspace/Lucene-Solr-Tests-7.x/lucene/top-level-ivy-settings.xml

resolve:

ivy-availability-check:
[loadresource] Do not set property disallowed.ivy.jars.list as its length is 0.

-ivy-fail-disallowed-ivy-version:

ivy-fail:

ivy-fail:

ivy-configure:
[ivy:configure] :: loading settings :: file = /x1/jenkins/jenkins-slave/workspace/Lucene-Solr-Tests-7.x/lucene/top-level-ivy-settings.xml

resolve:

ivy-availability-check:
[loadresource] Do not set property disallowed.ivy.jars.list as its length is 0.

-ivy-fail-disallowed-ivy-version:

ivy-fail:

ivy-fail:

ivy-configure:
[ivy:configure] :: loading settings :: file = /x1/jenkins/jenkins-slave/workspace/Lucene-Solr-Tests-7.x/lucene/top-level-ivy-settings.xml

resolve:

ivy-availability-check:
[loadresource] Do not set property disallowed.ivy.jars.list as its length is 0.

-ivy-fail-disallowed-ivy-version:

ivy-fail:

ivy-fail:

ivy-configure:
[ivy:configure] :: loading settings :: file = /x1/jenkins/jenkins-slave/workspace/Lucene-Solr-Tests-7.x/lucene/top-level-ivy-settings.xml

resolve:

ivy-availability-check:
[loadresource] Do not set property disallowed.ivy.jars.list as its length is 0.

-ivy-fail-disallowed-ivy-version:

ivy-fail:

ivy-fail:

ivy-configure:
[ivy:configure] :: loading settings :: file = /x1/jenkins/jenkins-slave/workspace/Lucene-Solr-Tests-7.x/lucene/top-level-ivy-settings.xml

resolve:

ivy-availability-check:
[loadresource] Do not set property disallowed.ivy.jars.list as its length is 0.

-ivy-fail-disallowed-ivy-version:

ivy-fail:

ivy-fail:

ivy-configure:
[ivy:configure] :: loading settings :: file = /x1/jenkins/jenkins-slave/workspace/Lucene-Solr-Tests-7.x/lucene/top-level-ivy-settings.xml

resolve:

ivy-availability-check:
[loadresource] Do not set property disallowed.ivy.jars.list as its length is 0.

-ivy-fail-disallowed-ivy-version:

ivy-fail:

ivy-fail:

ivy-configure:
[ivy:configure] :: loading settings :: file = /x1/jenkins/jenkins-slave/workspace/Lucene-Solr-Tests-7.x/lucene/top-level-ivy-settings.xml

resolve:

ivy-availability-check:
[loadresource] Do not set property disallowed.ivy.jars.list as its length is 0.

-ivy-fail-disallowed-ivy-version:

ivy-fail:

ivy-fail:

ivy-configure:
[ivy:configure] :: loading settings :: file = /x1/jenkins/jenkins-slave/workspace/Lucene-Solr-Tests-7.x/lucene/top-level-ivy-settings.xml

resolve:

ivy-availability-check:
[loadresource] Do not set property disallowed.ivy.jars.list as its length is 0.

-ivy-fail-disallowed-ivy-version:

ivy-fail:

ivy-fail:

ivy-configure:
[ivy:configure] :: loading settings :: file = /x1/jenkins/jenkins-slave/workspace/Lucene-Solr-Tests-7.x/lucene/top-level-ivy-settings.xml

resolve:

ivy-availability-check:
[loadresource] Do not set property disallowed.ivy.jars.list as its length is 0.

-ivy-fail-disallowed-ivy-version:

ivy-fail:

ivy-fail:

ivy-configure:
[ivy:configure] :: loading settings :: file = /x1/jenkins/jenkins-slave/workspace/Lucene-Solr-Tests-7.x/lucene/top-level-ivy-settings.xml

resolve:

ivy-availability-check:
[loadresource] Do not set property disallowed.ivy.jars.list as its length is 0.

-ivy-fail-disallowed-ivy-version:

ivy-fail:

ivy-fail:

ivy-configure:
[ivy:configure] :: loading settings :: file = /x1/jenkins/jenkins-slave/workspace/Lucene-Solr-Tests-7.x/lucene/top-level-ivy-settings.xml

resolve:

jar-checksums:
    [mkdir] Created dir: /x1/jenkins/jenkins-slave/workspace/Lucene-Solr-Tests-7.x/solr/null130983746
     [copy] Copying 241 files to /x1/jenkins/jenkins-slave/workspace/Lucene-Solr-Tests-7.x/solr/null130983746
   [delete] Deleting directory /x1/jenkins/jenkins-slave/workspace/Lucene-Solr-Tests-7.x/solr/null130983746

check-working-copy:
[ivy:cachepath] :: resolving dependencies :: org.eclipse.jgit#org.eclipse.jgit-caller;working
[ivy:cachepath] 	confs: [default]
[ivy:cachepath] 	found org.eclipse.jgit#org.eclipse.jgit;4.6.0.201612231935-r in public
[ivy:cachepath] 	found com.jcraft#jsch;0.1.53 in public
[ivy:cachepath] 	found com.googlecode.javaewah#JavaEWAH;1.1.6 in public
[ivy:cachepath] 	found org.apache.httpcomponents#httpclient;4.3.6 in public
[ivy:cachepath] 	found org.apache.httpcomponents#httpcore;4.3.3 in public
[ivy:cachepath] 	found commons-logging#commons-logging;1.1.3 in public
[ivy:cachepath] 	found commons-codec#commons-codec;1.6 in public
[ivy:cachepath] 	found org.slf4j#slf4j-api;1.7.2 in public
[ivy:cachepath] :: resolution report :: resolve 29ms :: artifacts dl 2ms
	---------------------------------------------------------------------
	|                  |            modules            ||   artifacts   |
	|       conf       | number| search|dwnlded|evicted|| number|dwnlded|
	---------------------------------------------------------------------
	|      default     |   8   |   0   |   0   |   0   ||   8   |   0   |
	---------------------------------------------------------------------
[wc-checker] Initializing working copy...
[wc-checker] SLF4J: Failed to load class "org.slf4j.impl.StaticLoggerBinder".
[wc-checker] SLF4J: Defaulting to no-operation (NOP) logger implementation
[wc-checker] SLF4J: See http://www.slf4j.org/codes.html#StaticLoggerBinder for further details.
[wc-checker] Checking working copy status...

-jenkins-base:

BUILD SUCCESSFUL
Total time: 104 minutes 5 seconds
Archiving artifacts
java.lang.InterruptedException: no matches found within 10000
	at hudson.FilePath$34.hasMatch(FilePath.java:2678)
	at hudson.FilePath$34.invoke(FilePath.java:2557)
	at hudson.FilePath$34.invoke(FilePath.java:2547)
	at hudson.FilePath$FileCallableWrapper.call(FilePath.java:2918)
Also:   hudson.remoting.Channel$CallSiteStackTrace: Remote call to lucene
		at hudson.remoting.Channel.attachCallSiteStackTrace(Channel.java:1741)
		at hudson.remoting.UserRequest$ExceptionResponse.retrieve(UserRequest.java:357)
		at hudson.remoting.Channel.call(Channel.java:955)
		at hudson.FilePath.act(FilePath.java:1036)
		at hudson.FilePath.act(FilePath.java:1025)
		at hudson.FilePath.validateAntFileMask(FilePath.java:2547)
		at hudson.tasks.ArtifactArchiver.perform(ArtifactArchiver.java:243)
		at hudson.tasks.BuildStepCompatibilityLayer.perform(BuildStepCompatibilityLayer.java:81)
		at hudson.tasks.BuildStepMonitor$1.perform(BuildStepMonitor.java:20)
		at hudson.model.AbstractBuild$AbstractBuildExecution.perform(AbstractBuild.java:744)
		at hudson.model.AbstractBuild$AbstractBuildExecution.performAllBuildSteps(AbstractBuild.java:690)
		at hudson.model.Build$BuildExecution.post2(Build.java:186)
		at hudson.model.AbstractBuild$AbstractBuildExecution.post(AbstractBuild.java:635)
		at hudson.model.Run.execute(Run.java:1819)
		at hudson.model.FreeStyleBuild.run(FreeStyleBuild.java:43)
		at hudson.model.ResourceController.execute(ResourceController.java:97)
		at hudson.model.Executor.run(Executor.java:429)
Caused: hudson.FilePath$TunneledInterruptedException
	at hudson.FilePath$FileCallableWrapper.call(FilePath.java:2920)
	at hudson.remoting.UserRequest.perform(UserRequest.java:212)
	at hudson.remoting.UserRequest.perform(UserRequest.java:54)
	at hudson.remoting.Request$2.run(Request.java:369)
	at hudson.remoting.InterceptingExecutorService$1.call(InterceptingExecutorService.java:72)
	at java.util.concurrent.FutureTask.run(FutureTask.java:266)
	at java.util.concurrent.ThreadPoolExecutor.runWorker(ThreadPoolExecutor.java:1142)
	at java.util.concurrent.ThreadPoolExecutor$Worker.run(ThreadPoolExecutor.java:617)
	at java.lang.Thread.run(Thread.java:748)
Caused: java.lang.InterruptedException: java.lang.InterruptedException: no matches found within 10000
	at hudson.FilePath.act(FilePath.java:1038)
	at hudson.FilePath.act(FilePath.java:1025)
	at hudson.FilePath.validateAntFileMask(FilePath.java:2547)
	at hudson.tasks.ArtifactArchiver.perform(ArtifactArchiver.java:243)
	at hudson.tasks.BuildStepCompatibilityLayer.perform(BuildStepCompatibilityLayer.java:81)
	at hudson.tasks.BuildStepMonitor$1.perform(BuildStepMonitor.java:20)
	at hudson.model.AbstractBuild$AbstractBuildExecution.perform(AbstractBuild.java:744)
	at hudson.model.AbstractBuild$AbstractBuildExecution.performAllBuildSteps(AbstractBuild.java:690)
	at hudson.model.Build$BuildExecution.post2(Build.java:186)
	at hudson.model.AbstractBuild$AbstractBuildExecution.post(AbstractBuild.java:635)
	at hudson.model.Run.execute(Run.java:1819)
	at hudson.model.FreeStyleBuild.run(FreeStyleBuild.java:43)
	at hudson.model.ResourceController.execute(ResourceController.java:97)
	at hudson.model.Executor.run(Executor.java:429)
No artifacts found that match the file pattern "**/*.events,heapdumps/**,**/hs_err_pid*". Configuration error?
Recording test results
Build step 'Publish JUnit test result report' changed build result to UNSTABLE
Email was triggered for: Unstable (Test Failures)
Sending email for trigger: Unstable (Test Failures)

Mime
View raw message