lucene-dev mailing list archives

Site index · List index
Message view « Date » · « Thread »
Top « Date » · « Thread »
From Policeman Jenkins Server <jenk...@thetaphi.de>
Subject [JENKINS] Lucene-Solr-master-MacOSX (64bit/jdk-9) - Build # 4906 - Still Unstable!
Date Thu, 01 Nov 2018 14:13:51 GMT
Build: https://jenkins.thetaphi.de/job/Lucene-Solr-master-MacOSX/4906/
Java: 64bit/jdk-9 -XX:-UseCompressedOops -XX:+UseConcMarkSweepGC

5 tests failed.
FAILED:  org.apache.solr.cloud.TestTlogReplica.testRecovery

Error Message:
Can not find doc 7 in https://127.0.0.1:55630/solr

Stack Trace:
java.lang.AssertionError: Can not find doc 7 in https://127.0.0.1:55630/solr
	at __randomizedtesting.SeedInfo.seed([120442557453C590:D3F43BF959030F37]:0)
	at org.junit.Assert.fail(Assert.java:93)
	at org.junit.Assert.assertTrue(Assert.java:43)
	at org.junit.Assert.assertNotNull(Assert.java:526)
	at org.apache.solr.cloud.TestTlogReplica.checkRTG(TestTlogReplica.java:902)
	at org.apache.solr.cloud.TestTlogReplica.testRecovery(TestTlogReplica.java:567)
	at java.base/jdk.internal.reflect.NativeMethodAccessorImpl.invoke0(Native Method)
	at java.base/jdk.internal.reflect.NativeMethodAccessorImpl.invoke(NativeMethodAccessorImpl.java:62)
	at java.base/jdk.internal.reflect.DelegatingMethodAccessorImpl.invoke(DelegatingMethodAccessorImpl.java:43)
	at java.base/java.lang.reflect.Method.invoke(Method.java:564)
	at com.carrotsearch.randomizedtesting.RandomizedRunner.invoke(RandomizedRunner.java:1742)
	at com.carrotsearch.randomizedtesting.RandomizedRunner$8.evaluate(RandomizedRunner.java:935)
	at com.carrotsearch.randomizedtesting.RandomizedRunner$9.evaluate(RandomizedRunner.java:971)
	at com.carrotsearch.randomizedtesting.RandomizedRunner$10.evaluate(RandomizedRunner.java:985)
	at com.carrotsearch.randomizedtesting.rules.SystemPropertiesRestoreRule$1.evaluate(SystemPropertiesRestoreRule.java:57)
	at org.apache.lucene.util.TestRuleSetupTeardownChained$1.evaluate(TestRuleSetupTeardownChained.java:49)
	at org.apache.lucene.util.AbstractBeforeAfterRule$1.evaluate(AbstractBeforeAfterRule.java:45)
	at org.apache.lucene.util.TestRuleThreadAndTestName$1.evaluate(TestRuleThreadAndTestName.java:48)
	at org.apache.lucene.util.TestRuleIgnoreAfterMaxFailures$1.evaluate(TestRuleIgnoreAfterMaxFailures.java:64)
	at org.apache.lucene.util.TestRuleMarkFailure$1.evaluate(TestRuleMarkFailure.java:47)
	at com.carrotsearch.randomizedtesting.rules.StatementAdapter.evaluate(StatementAdapter.java:36)
	at com.carrotsearch.randomizedtesting.ThreadLeakControl$StatementRunner.run(ThreadLeakControl.java:368)
	at com.carrotsearch.randomizedtesting.ThreadLeakControl.forkTimeoutingTask(ThreadLeakControl.java:817)
	at com.carrotsearch.randomizedtesting.ThreadLeakControl$3.evaluate(ThreadLeakControl.java:468)
	at com.carrotsearch.randomizedtesting.RandomizedRunner.runSingleTest(RandomizedRunner.java:944)
	at com.carrotsearch.randomizedtesting.RandomizedRunner$5.evaluate(RandomizedRunner.java:830)
	at com.carrotsearch.randomizedtesting.RandomizedRunner$6.evaluate(RandomizedRunner.java:880)
	at com.carrotsearch.randomizedtesting.RandomizedRunner$7.evaluate(RandomizedRunner.java:891)
	at com.carrotsearch.randomizedtesting.rules.StatementAdapter.evaluate(StatementAdapter.java:36)
	at com.carrotsearch.randomizedtesting.rules.SystemPropertiesRestoreRule$1.evaluate(SystemPropertiesRestoreRule.java:57)
	at org.apache.lucene.util.AbstractBeforeAfterRule$1.evaluate(AbstractBeforeAfterRule.java:45)
	at com.carrotsearch.randomizedtesting.rules.StatementAdapter.evaluate(StatementAdapter.java:36)
	at org.apache.lucene.util.TestRuleStoreClassName$1.evaluate(TestRuleStoreClassName.java:41)
	at com.carrotsearch.randomizedtesting.rules.NoShadowingOrOverridesOnMethodsRule$1.evaluate(NoShadowingOrOverridesOnMethodsRule.java:40)
	at com.carrotsearch.randomizedtesting.rules.NoShadowingOrOverridesOnMethodsRule$1.evaluate(NoShadowingOrOverridesOnMethodsRule.java:40)
	at com.carrotsearch.randomizedtesting.rules.StatementAdapter.evaluate(StatementAdapter.java:36)
	at com.carrotsearch.randomizedtesting.rules.StatementAdapter.evaluate(StatementAdapter.java:36)
	at org.apache.lucene.util.TestRuleAssertionsRequired$1.evaluate(TestRuleAssertionsRequired.java:53)
	at org.apache.lucene.util.TestRuleMarkFailure$1.evaluate(TestRuleMarkFailure.java:47)
	at org.apache.lucene.util.TestRuleIgnoreAfterMaxFailures$1.evaluate(TestRuleIgnoreAfterMaxFailures.java:64)
	at org.apache.lucene.util.TestRuleIgnoreTestSuites$1.evaluate(TestRuleIgnoreTestSuites.java:54)
	at com.carrotsearch.randomizedtesting.rules.StatementAdapter.evaluate(StatementAdapter.java:36)
	at com.carrotsearch.randomizedtesting.ThreadLeakControl$StatementRunner.run(ThreadLeakControl.java:368)
	at java.base/java.lang.Thread.run(Thread.java:844)


FAILED:  org.apache.solr.cloud.TestTlogReplica.testRecovery

Error Message:
Can not find doc 7 in https://127.0.0.1:55950/solr

Stack Trace:
java.lang.AssertionError: Can not find doc 7 in https://127.0.0.1:55950/solr
	at __randomizedtesting.SeedInfo.seed([120442557453C590:D3F43BF959030F37]:0)
	at org.junit.Assert.fail(Assert.java:93)
	at org.junit.Assert.assertTrue(Assert.java:43)
	at org.junit.Assert.assertNotNull(Assert.java:526)
	at org.apache.solr.cloud.TestTlogReplica.checkRTG(TestTlogReplica.java:902)
	at org.apache.solr.cloud.TestTlogReplica.testRecovery(TestTlogReplica.java:567)
	at java.base/jdk.internal.reflect.NativeMethodAccessorImpl.invoke0(Native Method)
	at java.base/jdk.internal.reflect.NativeMethodAccessorImpl.invoke(NativeMethodAccessorImpl.java:62)
	at java.base/jdk.internal.reflect.DelegatingMethodAccessorImpl.invoke(DelegatingMethodAccessorImpl.java:43)
	at java.base/java.lang.reflect.Method.invoke(Method.java:564)
	at com.carrotsearch.randomizedtesting.RandomizedRunner.invoke(RandomizedRunner.java:1742)
	at com.carrotsearch.randomizedtesting.RandomizedRunner$8.evaluate(RandomizedRunner.java:935)
	at com.carrotsearch.randomizedtesting.RandomizedRunner$9.evaluate(RandomizedRunner.java:971)
	at com.carrotsearch.randomizedtesting.RandomizedRunner$10.evaluate(RandomizedRunner.java:985)
	at com.carrotsearch.randomizedtesting.rules.SystemPropertiesRestoreRule$1.evaluate(SystemPropertiesRestoreRule.java:57)
	at org.apache.lucene.util.TestRuleSetupTeardownChained$1.evaluate(TestRuleSetupTeardownChained.java:49)
	at org.apache.lucene.util.AbstractBeforeAfterRule$1.evaluate(AbstractBeforeAfterRule.java:45)
	at org.apache.lucene.util.TestRuleThreadAndTestName$1.evaluate(TestRuleThreadAndTestName.java:48)
	at org.apache.lucene.util.TestRuleIgnoreAfterMaxFailures$1.evaluate(TestRuleIgnoreAfterMaxFailures.java:64)
	at org.apache.lucene.util.TestRuleMarkFailure$1.evaluate(TestRuleMarkFailure.java:47)
	at com.carrotsearch.randomizedtesting.rules.StatementAdapter.evaluate(StatementAdapter.java:36)
	at com.carrotsearch.randomizedtesting.ThreadLeakControl$StatementRunner.run(ThreadLeakControl.java:368)
	at com.carrotsearch.randomizedtesting.ThreadLeakControl.forkTimeoutingTask(ThreadLeakControl.java:817)
	at com.carrotsearch.randomizedtesting.ThreadLeakControl$3.evaluate(ThreadLeakControl.java:468)
	at com.carrotsearch.randomizedtesting.RandomizedRunner.runSingleTest(RandomizedRunner.java:944)
	at com.carrotsearch.randomizedtesting.RandomizedRunner$5.evaluate(RandomizedRunner.java:830)
	at com.carrotsearch.randomizedtesting.RandomizedRunner$6.evaluate(RandomizedRunner.java:880)
	at com.carrotsearch.randomizedtesting.RandomizedRunner$7.evaluate(RandomizedRunner.java:891)
	at com.carrotsearch.randomizedtesting.rules.StatementAdapter.evaluate(StatementAdapter.java:36)
	at com.carrotsearch.randomizedtesting.rules.SystemPropertiesRestoreRule$1.evaluate(SystemPropertiesRestoreRule.java:57)
	at org.apache.lucene.util.AbstractBeforeAfterRule$1.evaluate(AbstractBeforeAfterRule.java:45)
	at com.carrotsearch.randomizedtesting.rules.StatementAdapter.evaluate(StatementAdapter.java:36)
	at org.apache.lucene.util.TestRuleStoreClassName$1.evaluate(TestRuleStoreClassName.java:41)
	at com.carrotsearch.randomizedtesting.rules.NoShadowingOrOverridesOnMethodsRule$1.evaluate(NoShadowingOrOverridesOnMethodsRule.java:40)
	at com.carrotsearch.randomizedtesting.rules.NoShadowingOrOverridesOnMethodsRule$1.evaluate(NoShadowingOrOverridesOnMethodsRule.java:40)
	at com.carrotsearch.randomizedtesting.rules.StatementAdapter.evaluate(StatementAdapter.java:36)
	at com.carrotsearch.randomizedtesting.rules.StatementAdapter.evaluate(StatementAdapter.java:36)
	at org.apache.lucene.util.TestRuleAssertionsRequired$1.evaluate(TestRuleAssertionsRequired.java:53)
	at org.apache.lucene.util.TestRuleMarkFailure$1.evaluate(TestRuleMarkFailure.java:47)
	at org.apache.lucene.util.TestRuleIgnoreAfterMaxFailures$1.evaluate(TestRuleIgnoreAfterMaxFailures.java:64)
	at org.apache.lucene.util.TestRuleIgnoreTestSuites$1.evaluate(TestRuleIgnoreTestSuites.java:54)
	at com.carrotsearch.randomizedtesting.rules.StatementAdapter.evaluate(StatementAdapter.java:36)
	at com.carrotsearch.randomizedtesting.ThreadLeakControl$StatementRunner.run(ThreadLeakControl.java:368)
	at java.base/java.lang.Thread.run(Thread.java:844)


FAILED:  org.apache.solr.cloud.TestTlogReplica.testRecovery

Error Message:
Can not find doc 7 in https://127.0.0.1:55970/solr

Stack Trace:
java.lang.AssertionError: Can not find doc 7 in https://127.0.0.1:55970/solr
	at __randomizedtesting.SeedInfo.seed([120442557453C590:D3F43BF959030F37]:0)
	at org.junit.Assert.fail(Assert.java:93)
	at org.junit.Assert.assertTrue(Assert.java:43)
	at org.junit.Assert.assertNotNull(Assert.java:526)
	at org.apache.solr.cloud.TestTlogReplica.checkRTG(TestTlogReplica.java:902)
	at org.apache.solr.cloud.TestTlogReplica.testRecovery(TestTlogReplica.java:567)
	at java.base/jdk.internal.reflect.NativeMethodAccessorImpl.invoke0(Native Method)
	at java.base/jdk.internal.reflect.NativeMethodAccessorImpl.invoke(NativeMethodAccessorImpl.java:62)
	at java.base/jdk.internal.reflect.DelegatingMethodAccessorImpl.invoke(DelegatingMethodAccessorImpl.java:43)
	at java.base/java.lang.reflect.Method.invoke(Method.java:564)
	at com.carrotsearch.randomizedtesting.RandomizedRunner.invoke(RandomizedRunner.java:1742)
	at com.carrotsearch.randomizedtesting.RandomizedRunner$8.evaluate(RandomizedRunner.java:935)
	at com.carrotsearch.randomizedtesting.RandomizedRunner$9.evaluate(RandomizedRunner.java:971)
	at com.carrotsearch.randomizedtesting.RandomizedRunner$10.evaluate(RandomizedRunner.java:985)
	at com.carrotsearch.randomizedtesting.rules.SystemPropertiesRestoreRule$1.evaluate(SystemPropertiesRestoreRule.java:57)
	at org.apache.lucene.util.TestRuleSetupTeardownChained$1.evaluate(TestRuleSetupTeardownChained.java:49)
	at org.apache.lucene.util.AbstractBeforeAfterRule$1.evaluate(AbstractBeforeAfterRule.java:45)
	at org.apache.lucene.util.TestRuleThreadAndTestName$1.evaluate(TestRuleThreadAndTestName.java:48)
	at org.apache.lucene.util.TestRuleIgnoreAfterMaxFailures$1.evaluate(TestRuleIgnoreAfterMaxFailures.java:64)
	at org.apache.lucene.util.TestRuleMarkFailure$1.evaluate(TestRuleMarkFailure.java:47)
	at com.carrotsearch.randomizedtesting.rules.StatementAdapter.evaluate(StatementAdapter.java:36)
	at com.carrotsearch.randomizedtesting.ThreadLeakControl$StatementRunner.run(ThreadLeakControl.java:368)
	at com.carrotsearch.randomizedtesting.ThreadLeakControl.forkTimeoutingTask(ThreadLeakControl.java:817)
	at com.carrotsearch.randomizedtesting.ThreadLeakControl$3.evaluate(ThreadLeakControl.java:468)
	at com.carrotsearch.randomizedtesting.RandomizedRunner.runSingleTest(RandomizedRunner.java:944)
	at com.carrotsearch.randomizedtesting.RandomizedRunner$5.evaluate(RandomizedRunner.java:830)
	at com.carrotsearch.randomizedtesting.RandomizedRunner$6.evaluate(RandomizedRunner.java:880)
	at com.carrotsearch.randomizedtesting.RandomizedRunner$7.evaluate(RandomizedRunner.java:891)
	at com.carrotsearch.randomizedtesting.rules.StatementAdapter.evaluate(StatementAdapter.java:36)
	at com.carrotsearch.randomizedtesting.rules.SystemPropertiesRestoreRule$1.evaluate(SystemPropertiesRestoreRule.java:57)
	at org.apache.lucene.util.AbstractBeforeAfterRule$1.evaluate(AbstractBeforeAfterRule.java:45)
	at com.carrotsearch.randomizedtesting.rules.StatementAdapter.evaluate(StatementAdapter.java:36)
	at org.apache.lucene.util.TestRuleStoreClassName$1.evaluate(TestRuleStoreClassName.java:41)
	at com.carrotsearch.randomizedtesting.rules.NoShadowingOrOverridesOnMethodsRule$1.evaluate(NoShadowingOrOverridesOnMethodsRule.java:40)
	at com.carrotsearch.randomizedtesting.rules.NoShadowingOrOverridesOnMethodsRule$1.evaluate(NoShadowingOrOverridesOnMethodsRule.java:40)
	at com.carrotsearch.randomizedtesting.rules.StatementAdapter.evaluate(StatementAdapter.java:36)
	at com.carrotsearch.randomizedtesting.rules.StatementAdapter.evaluate(StatementAdapter.java:36)
	at org.apache.lucene.util.TestRuleAssertionsRequired$1.evaluate(TestRuleAssertionsRequired.java:53)
	at org.apache.lucene.util.TestRuleMarkFailure$1.evaluate(TestRuleMarkFailure.java:47)
	at org.apache.lucene.util.TestRuleIgnoreAfterMaxFailures$1.evaluate(TestRuleIgnoreAfterMaxFailures.java:64)
	at org.apache.lucene.util.TestRuleIgnoreTestSuites$1.evaluate(TestRuleIgnoreTestSuites.java:54)
	at com.carrotsearch.randomizedtesting.rules.StatementAdapter.evaluate(StatementAdapter.java:36)
	at com.carrotsearch.randomizedtesting.ThreadLeakControl$StatementRunner.run(ThreadLeakControl.java:368)
	at java.base/java.lang.Thread.run(Thread.java:844)


FAILED:  org.apache.solr.cloud.TestTlogReplica.testRecovery

Error Message:
Can not find doc 7 in https://127.0.0.1:56264/solr

Stack Trace:
java.lang.AssertionError: Can not find doc 7 in https://127.0.0.1:56264/solr
	at __randomizedtesting.SeedInfo.seed([120442557453C590:D3F43BF959030F37]:0)
	at org.junit.Assert.fail(Assert.java:93)
	at org.junit.Assert.assertTrue(Assert.java:43)
	at org.junit.Assert.assertNotNull(Assert.java:526)
	at org.apache.solr.cloud.TestTlogReplica.checkRTG(TestTlogReplica.java:902)
	at org.apache.solr.cloud.TestTlogReplica.testRecovery(TestTlogReplica.java:567)
	at java.base/jdk.internal.reflect.NativeMethodAccessorImpl.invoke0(Native Method)
	at java.base/jdk.internal.reflect.NativeMethodAccessorImpl.invoke(NativeMethodAccessorImpl.java:62)
	at java.base/jdk.internal.reflect.DelegatingMethodAccessorImpl.invoke(DelegatingMethodAccessorImpl.java:43)
	at java.base/java.lang.reflect.Method.invoke(Method.java:564)
	at com.carrotsearch.randomizedtesting.RandomizedRunner.invoke(RandomizedRunner.java:1742)
	at com.carrotsearch.randomizedtesting.RandomizedRunner$8.evaluate(RandomizedRunner.java:935)
	at com.carrotsearch.randomizedtesting.RandomizedRunner$9.evaluate(RandomizedRunner.java:971)
	at com.carrotsearch.randomizedtesting.RandomizedRunner$10.evaluate(RandomizedRunner.java:985)
	at com.carrotsearch.randomizedtesting.rules.SystemPropertiesRestoreRule$1.evaluate(SystemPropertiesRestoreRule.java:57)
	at org.apache.lucene.util.TestRuleSetupTeardownChained$1.evaluate(TestRuleSetupTeardownChained.java:49)
	at org.apache.lucene.util.AbstractBeforeAfterRule$1.evaluate(AbstractBeforeAfterRule.java:45)
	at org.apache.lucene.util.TestRuleThreadAndTestName$1.evaluate(TestRuleThreadAndTestName.java:48)
	at org.apache.lucene.util.TestRuleIgnoreAfterMaxFailures$1.evaluate(TestRuleIgnoreAfterMaxFailures.java:64)
	at org.apache.lucene.util.TestRuleMarkFailure$1.evaluate(TestRuleMarkFailure.java:47)
	at com.carrotsearch.randomizedtesting.rules.StatementAdapter.evaluate(StatementAdapter.java:36)
	at com.carrotsearch.randomizedtesting.ThreadLeakControl$StatementRunner.run(ThreadLeakControl.java:368)
	at com.carrotsearch.randomizedtesting.ThreadLeakControl.forkTimeoutingTask(ThreadLeakControl.java:817)
	at com.carrotsearch.randomizedtesting.ThreadLeakControl$3.evaluate(ThreadLeakControl.java:468)
	at com.carrotsearch.randomizedtesting.RandomizedRunner.runSingleTest(RandomizedRunner.java:944)
	at com.carrotsearch.randomizedtesting.RandomizedRunner$5.evaluate(RandomizedRunner.java:830)
	at com.carrotsearch.randomizedtesting.RandomizedRunner$6.evaluate(RandomizedRunner.java:880)
	at com.carrotsearch.randomizedtesting.RandomizedRunner$7.evaluate(RandomizedRunner.java:891)
	at com.carrotsearch.randomizedtesting.rules.StatementAdapter.evaluate(StatementAdapter.java:36)
	at com.carrotsearch.randomizedtesting.rules.SystemPropertiesRestoreRule$1.evaluate(SystemPropertiesRestoreRule.java:57)
	at org.apache.lucene.util.AbstractBeforeAfterRule$1.evaluate(AbstractBeforeAfterRule.java:45)
	at com.carrotsearch.randomizedtesting.rules.StatementAdapter.evaluate(StatementAdapter.java:36)
	at org.apache.lucene.util.TestRuleStoreClassName$1.evaluate(TestRuleStoreClassName.java:41)
	at com.carrotsearch.randomizedtesting.rules.NoShadowingOrOverridesOnMethodsRule$1.evaluate(NoShadowingOrOverridesOnMethodsRule.java:40)
	at com.carrotsearch.randomizedtesting.rules.NoShadowingOrOverridesOnMethodsRule$1.evaluate(NoShadowingOrOverridesOnMethodsRule.java:40)
	at com.carrotsearch.randomizedtesting.rules.StatementAdapter.evaluate(StatementAdapter.java:36)
	at com.carrotsearch.randomizedtesting.rules.StatementAdapter.evaluate(StatementAdapter.java:36)
	at org.apache.lucene.util.TestRuleAssertionsRequired$1.evaluate(TestRuleAssertionsRequired.java:53)
	at org.apache.lucene.util.TestRuleMarkFailure$1.evaluate(TestRuleMarkFailure.java:47)
	at org.apache.lucene.util.TestRuleIgnoreAfterMaxFailures$1.evaluate(TestRuleIgnoreAfterMaxFailures.java:64)
	at org.apache.lucene.util.TestRuleIgnoreTestSuites$1.evaluate(TestRuleIgnoreTestSuites.java:54)
	at com.carrotsearch.randomizedtesting.rules.StatementAdapter.evaluate(StatementAdapter.java:36)
	at com.carrotsearch.randomizedtesting.ThreadLeakControl$StatementRunner.run(ThreadLeakControl.java:368)
	at java.base/java.lang.Thread.run(Thread.java:844)


FAILED:  org.apache.solr.cloud.TestTlogReplica.testRecovery

Error Message:
Can not find doc 7 in https://127.0.0.1:63911/solr

Stack Trace:
java.lang.AssertionError: Can not find doc 7 in https://127.0.0.1:63911/solr
	at __randomizedtesting.SeedInfo.seed([120442557453C590:D3F43BF959030F37]:0)
	at org.junit.Assert.fail(Assert.java:93)
	at org.junit.Assert.assertTrue(Assert.java:43)
	at org.junit.Assert.assertNotNull(Assert.java:526)
	at org.apache.solr.cloud.TestTlogReplica.checkRTG(TestTlogReplica.java:902)
	at org.apache.solr.cloud.TestTlogReplica.testRecovery(TestTlogReplica.java:567)
	at java.base/jdk.internal.reflect.NativeMethodAccessorImpl.invoke0(Native Method)
	at java.base/jdk.internal.reflect.NativeMethodAccessorImpl.invoke(NativeMethodAccessorImpl.java:62)
	at java.base/jdk.internal.reflect.DelegatingMethodAccessorImpl.invoke(DelegatingMethodAccessorImpl.java:43)
	at java.base/java.lang.reflect.Method.invoke(Method.java:564)
	at com.carrotsearch.randomizedtesting.RandomizedRunner.invoke(RandomizedRunner.java:1742)
	at com.carrotsearch.randomizedtesting.RandomizedRunner$8.evaluate(RandomizedRunner.java:935)
	at com.carrotsearch.randomizedtesting.RandomizedRunner$9.evaluate(RandomizedRunner.java:971)
	at com.carrotsearch.randomizedtesting.RandomizedRunner$10.evaluate(RandomizedRunner.java:985)
	at com.carrotsearch.randomizedtesting.rules.SystemPropertiesRestoreRule$1.evaluate(SystemPropertiesRestoreRule.java:57)
	at org.apache.lucene.util.TestRuleSetupTeardownChained$1.evaluate(TestRuleSetupTeardownChained.java:49)
	at org.apache.lucene.util.AbstractBeforeAfterRule$1.evaluate(AbstractBeforeAfterRule.java:45)
	at org.apache.lucene.util.TestRuleThreadAndTestName$1.evaluate(TestRuleThreadAndTestName.java:48)
	at org.apache.lucene.util.TestRuleIgnoreAfterMaxFailures$1.evaluate(TestRuleIgnoreAfterMaxFailures.java:64)
	at org.apache.lucene.util.TestRuleMarkFailure$1.evaluate(TestRuleMarkFailure.java:47)
	at com.carrotsearch.randomizedtesting.rules.StatementAdapter.evaluate(StatementAdapter.java:36)
	at com.carrotsearch.randomizedtesting.ThreadLeakControl$StatementRunner.run(ThreadLeakControl.java:368)
	at com.carrotsearch.randomizedtesting.ThreadLeakControl.forkTimeoutingTask(ThreadLeakControl.java:817)
	at com.carrotsearch.randomizedtesting.ThreadLeakControl$3.evaluate(ThreadLeakControl.java:468)
	at com.carrotsearch.randomizedtesting.RandomizedRunner.runSingleTest(RandomizedRunner.java:944)
	at com.carrotsearch.randomizedtesting.RandomizedRunner$5.evaluate(RandomizedRunner.java:830)
	at com.carrotsearch.randomizedtesting.RandomizedRunner$6.evaluate(RandomizedRunner.java:880)
	at com.carrotsearch.randomizedtesting.RandomizedRunner$7.evaluate(RandomizedRunner.java:891)
	at com.carrotsearch.randomizedtesting.rules.StatementAdapter.evaluate(StatementAdapter.java:36)
	at com.carrotsearch.randomizedtesting.rules.SystemPropertiesRestoreRule$1.evaluate(SystemPropertiesRestoreRule.java:57)
	at org.apache.lucene.util.AbstractBeforeAfterRule$1.evaluate(AbstractBeforeAfterRule.java:45)
	at com.carrotsearch.randomizedtesting.rules.StatementAdapter.evaluate(StatementAdapter.java:36)
	at org.apache.lucene.util.TestRuleStoreClassName$1.evaluate(TestRuleStoreClassName.java:41)
	at com.carrotsearch.randomizedtesting.rules.NoShadowingOrOverridesOnMethodsRule$1.evaluate(NoShadowingOrOverridesOnMethodsRule.java:40)
	at com.carrotsearch.randomizedtesting.rules.NoShadowingOrOverridesOnMethodsRule$1.evaluate(NoShadowingOrOverridesOnMethodsRule.java:40)
	at com.carrotsearch.randomizedtesting.rules.StatementAdapter.evaluate(StatementAdapter.java:36)
	at com.carrotsearch.randomizedtesting.rules.StatementAdapter.evaluate(StatementAdapter.java:36)
	at org.apache.lucene.util.TestRuleAssertionsRequired$1.evaluate(TestRuleAssertionsRequired.java:53)
	at org.apache.lucene.util.TestRuleMarkFailure$1.evaluate(TestRuleMarkFailure.java:47)
	at org.apache.lucene.util.TestRuleIgnoreAfterMaxFailures$1.evaluate(TestRuleIgnoreAfterMaxFailures.java:64)
	at org.apache.lucene.util.TestRuleIgnoreTestSuites$1.evaluate(TestRuleIgnoreTestSuites.java:54)
	at com.carrotsearch.randomizedtesting.rules.StatementAdapter.evaluate(StatementAdapter.java:36)
	at com.carrotsearch.randomizedtesting.ThreadLeakControl$StatementRunner.run(ThreadLeakControl.java:368)
	at java.base/java.lang.Thread.run(Thread.java:844)




Build Log:
[...truncated 2001 lines...]
   [junit4] JVM J0: stderr was not empty, see: /Users/jenkins/workspace/Lucene-Solr-master-MacOSX/lucene/build/core/test/temp/junit4-J0-20181101_121912_4465206296332236886309.syserr
   [junit4] >>> JVM J0 emitted unexpected output (verbatim) ----
   [junit4] Java HotSpot(TM) 64-Bit Server VM warning: Option UseConcMarkSweepGC was deprecated in version 9.0 and will likely be removed in a future release.
   [junit4] <<< JVM J0: EOF ----

[...truncated 3 lines...]
   [junit4] JVM J1: stderr was not empty, see: /Users/jenkins/workspace/Lucene-Solr-master-MacOSX/lucene/build/core/test/temp/junit4-J1-20181101_121912_4466467528362136514687.syserr
   [junit4] >>> JVM J1 emitted unexpected output (verbatim) ----
   [junit4] Java HotSpot(TM) 64-Bit Server VM warning: Option UseConcMarkSweepGC was deprecated in version 9.0 and will likely be removed in a future release.
   [junit4] <<< JVM J1: EOF ----

[...truncated 293 lines...]
   [junit4] JVM J0: stderr was not empty, see: /Users/jenkins/workspace/Lucene-Solr-master-MacOSX/lucene/build/test-framework/test/temp/junit4-J0-20181101_122729_42717147247601219648153.syserr
   [junit4] >>> JVM J0 emitted unexpected output (verbatim) ----
   [junit4] Java HotSpot(TM) 64-Bit Server VM warning: Option UseConcMarkSweepGC was deprecated in version 9.0 and will likely be removed in a future release.
   [junit4] <<< JVM J0: EOF ----

[...truncated 3 lines...]
   [junit4] JVM J1: stderr was not empty, see: /Users/jenkins/workspace/Lucene-Solr-master-MacOSX/lucene/build/test-framework/test/temp/junit4-J1-20181101_122729_4274855587488120822485.syserr
   [junit4] >>> JVM J1 emitted unexpected output (verbatim) ----
   [junit4] Java HotSpot(TM) 64-Bit Server VM warning: Option UseConcMarkSweepGC was deprecated in version 9.0 and will likely be removed in a future release.
   [junit4] <<< JVM J1: EOF ----

[...truncated 1080 lines...]
   [junit4] JVM J0: stderr was not empty, see: /Users/jenkins/workspace/Lucene-Solr-master-MacOSX/lucene/build/analysis/common/test/temp/junit4-J0-20181101_122849_69414561731808113300668.syserr
   [junit4] >>> JVM J0 emitted unexpected output (verbatim) ----
   [junit4] Java HotSpot(TM) 64-Bit Server VM warning: Option UseConcMarkSweepGC was deprecated in version 9.0 and will likely be removed in a future release.
   [junit4] <<< JVM J0: EOF ----

[...truncated 3 lines...]
   [junit4] JVM J1: stderr was not empty, see: /Users/jenkins/workspace/Lucene-Solr-master-MacOSX/lucene/build/analysis/common/test/temp/junit4-J1-20181101_122849_69516336561132062591064.syserr
   [junit4] >>> JVM J1 emitted unexpected output (verbatim) ----
   [junit4] Java HotSpot(TM) 64-Bit Server VM warning: Option UseConcMarkSweepGC was deprecated in version 9.0 and will likely be removed in a future release.
   [junit4] <<< JVM J1: EOF ----

[...truncated 256 lines...]
   [junit4] JVM J1: stderr was not empty, see: /Users/jenkins/workspace/Lucene-Solr-master-MacOSX/lucene/build/analysis/icu/test/temp/junit4-J1-20181101_123111_06114556332164801134962.syserr
   [junit4] >>> JVM J1 emitted unexpected output (verbatim) ----
   [junit4] Java HotSpot(TM) 64-Bit Server VM warning: Option UseConcMarkSweepGC was deprecated in version 9.0 and will likely be removed in a future release.
   [junit4] <<< JVM J1: EOF ----

[...truncated 3 lines...]
   [junit4] JVM J0: stderr was not empty, see: /Users/jenkins/workspace/Lucene-Solr-master-MacOSX/lucene/build/analysis/icu/test/temp/junit4-J0-20181101_123111_0617553266872943145500.syserr
   [junit4] >>> JVM J0 emitted unexpected output (verbatim) ----
   [junit4] Java HotSpot(TM) 64-Bit Server VM warning: Option UseConcMarkSweepGC was deprecated in version 9.0 and will likely be removed in a future release.
   [junit4] <<< JVM J0: EOF ----

[...truncated 247 lines...]
   [junit4] JVM J1: stderr was not empty, see: /Users/jenkins/workspace/Lucene-Solr-master-MacOSX/lucene/build/analysis/kuromoji/test/temp/junit4-J1-20181101_123123_81560162749453059981.syserr
   [junit4] >>> JVM J1 emitted unexpected output (verbatim) ----
   [junit4] Java HotSpot(TM) 64-Bit Server VM warning: Option UseConcMarkSweepGC was deprecated in version 9.0 and will likely be removed in a future release.
   [junit4] <<< JVM J1: EOF ----

[...truncated 9 lines...]
   [junit4] JVM J0: stderr was not empty, see: /Users/jenkins/workspace/Lucene-Solr-master-MacOSX/lucene/build/analysis/kuromoji/test/temp/junit4-J0-20181101_123123_81517351574854711276687.syserr
   [junit4] >>> JVM J0 emitted unexpected output (verbatim) ----
   [junit4] Java HotSpot(TM) 64-Bit Server VM warning: Option UseConcMarkSweepGC was deprecated in version 9.0 and will likely be removed in a future release.
   [junit4] <<< JVM J0: EOF ----

[...truncated 162 lines...]
   [junit4] JVM J0: stderr was not empty, see: /Users/jenkins/workspace/Lucene-Solr-master-MacOSX/lucene/build/analysis/morfologik/test/temp/junit4-J0-20181101_123150_6495311598307651702007.syserr
   [junit4] >>> JVM J0 emitted unexpected output (verbatim) ----
   [junit4] Java HotSpot(TM) 64-Bit Server VM warning: Option UseConcMarkSweepGC was deprecated in version 9.0 and will likely be removed in a future release.
   [junit4] <<< JVM J0: EOF ----

[...truncated 3 lines...]
   [junit4] JVM J1: stderr was not empty, see: /Users/jenkins/workspace/Lucene-Solr-master-MacOSX/lucene/build/analysis/morfologik/test/temp/junit4-J1-20181101_123150_6492835335269822456319.syserr
   [junit4] >>> JVM J1 emitted unexpected output (verbatim) ----
   [junit4] Java HotSpot(TM) 64-Bit Server VM warning: Option UseConcMarkSweepGC was deprecated in version 9.0 and will likely be removed in a future release.
   [junit4] <<< JVM J1: EOF ----

[...truncated 207 lines...]
   [junit4] JVM J0: stderr was not empty, see: /Users/jenkins/workspace/Lucene-Solr-master-MacOSX/lucene/build/analysis/nori/test/temp/junit4-J0-20181101_123155_9381535707570922114508.syserr
   [junit4] >>> JVM J0 emitted unexpected output (verbatim) ----
   [junit4] Java HotSpot(TM) 64-Bit Server VM warning: Option UseConcMarkSweepGC was deprecated in version 9.0 and will likely be removed in a future release.
   [junit4] <<< JVM J0: EOF ----

[...truncated 3 lines...]
   [junit4] JVM J1: stderr was not empty, see: /Users/jenkins/workspace/Lucene-Solr-master-MacOSX/lucene/build/analysis/nori/test/temp/junit4-J1-20181101_123155_938951126341205197190.syserr
   [junit4] >>> JVM J1 emitted unexpected output (verbatim) ----
   [junit4] Java HotSpot(TM) 64-Bit Server VM warning: Option UseConcMarkSweepGC was deprecated in version 9.0 and will likely be removed in a future release.
   [junit4] <<< JVM J1: EOF ----

[...truncated 171 lines...]
   [junit4] JVM J1: stderr was not empty, see: /Users/jenkins/workspace/Lucene-Solr-master-MacOSX/lucene/build/analysis/opennlp/test/temp/junit4-J1-20181101_123205_96414998324766435091639.syserr
   [junit4] >>> JVM J1 emitted unexpected output (verbatim) ----
   [junit4] Java HotSpot(TM) 64-Bit Server VM warning: Option UseConcMarkSweepGC was deprecated in version 9.0 and will likely be removed in a future release.
   [junit4] <<< JVM J1: EOF ----

   [junit4] JVM J0: stderr was not empty, see: /Users/jenkins/workspace/Lucene-Solr-master-MacOSX/lucene/build/analysis/opennlp/test/temp/junit4-J0-20181101_123205_964596511713636472525.syserr
   [junit4] >>> JVM J0 emitted unexpected output (verbatim) ----
   [junit4] Java HotSpot(TM) 64-Bit Server VM warning: Option UseConcMarkSweepGC was deprecated in version 9.0 and will likely be removed in a future release.
   [junit4] <<< JVM J0: EOF ----

[...truncated 176 lines...]
   [junit4] JVM J1: stderr was not empty, see: /Users/jenkins/workspace/Lucene-Solr-master-MacOSX/lucene/build/analysis/phonetic/test/temp/junit4-J1-20181101_123209_8071179014988718211708.syserr
   [junit4] >>> JVM J1 emitted unexpected output (verbatim) ----
   [junit4] Java HotSpot(TM) 64-Bit Server VM warning: Option UseConcMarkSweepGC was deprecated in version 9.0 and will likely be removed in a future release.
   [junit4] <<< JVM J1: EOF ----

[...truncated 3 lines...]
   [junit4] JVM J0: stderr was not empty, see: /Users/jenkins/workspace/Lucene-Solr-master-MacOSX/lucene/build/analysis/phonetic/test/temp/junit4-J0-20181101_123209_8073942486244314646796.syserr
   [junit4] >>> JVM J0 emitted unexpected output (verbatim) ----
   [junit4] Java HotSpot(TM) 64-Bit Server VM warning: Option UseConcMarkSweepGC was deprecated in version 9.0 and will likely be removed in a future release.
   [junit4] <<< JVM J0: EOF ----

[...truncated 159 lines...]
   [junit4] JVM J0: stderr was not empty, see: /Users/jenkins/workspace/Lucene-Solr-master-MacOSX/lucene/build/analysis/smartcn/test/temp/junit4-J0-20181101_123219_79315475846140233575162.syserr
   [junit4] >>> JVM J0 emitted unexpected output (verbatim) ----
   [junit4] Java HotSpot(TM) 64-Bit Server VM warning: Option UseConcMarkSweepGC was deprecated in version 9.0 and will likely be removed in a future release.
   [junit4] <<< JVM J0: EOF ----

[...truncated 3 lines...]
   [junit4] JVM J1: stderr was not empty, see: /Users/jenkins/workspace/Lucene-Solr-master-MacOSX/lucene/build/analysis/smartcn/test/temp/junit4-J1-20181101_123219_7934036845599864028027.syserr
   [junit4] >>> JVM J1 emitted unexpected output (verbatim) ----
   [junit4] Java HotSpot(TM) 64-Bit Server VM warning: Option UseConcMarkSweepGC was deprecated in version 9.0 and will likely be removed in a future release.
   [junit4] <<< JVM J1: EOF ----

[...truncated 167 lines...]
   [junit4] JVM J1: stderr was not empty, see: /Users/jenkins/workspace/Lucene-Solr-master-MacOSX/lucene/build/analysis/stempel/test/temp/junit4-J1-20181101_123227_3156556813504999643664.syserr
   [junit4] JVM J0: stderr was not empty, see: /Users/jenkins/workspace/Lucene-Solr-master-MacOSX/lucene/build/analysis/stempel/test/temp/junit4-J0-20181101_123227_31415941634395422413832.syserr
   [junit4] >>> JVM J1 emitted unexpected output (verbatim) ----
   [junit4] Java HotSpot(TM) 64-Bit Server VM warning: Option UseConcMarkSweepGC was deprecated in version 9.0 and will likely be removed in a future release.
   [junit4] <<< JVM J1: EOF ----

[...truncated 163 lines...]
   [junit4] JVM J1: stderr was not empty, see: /Users/jenkins/workspace/Lucene-Solr-master-MacOSX/lucene/build/backward-codecs/test/temp/junit4-J1-20181101_123231_1863060220515548730255.syserr
   [junit4] >>> JVM J1 emitted unexpected output (verbatim) ----
   [junit4] Java HotSpot(TM) 64-Bit Server VM warning: Option UseConcMarkSweepGC was deprecated in version 9.0 and will likely be removed in a future release.
   [junit4] <<< JVM J1: EOF ----

[...truncated 19 lines...]
   [junit4] JVM J0: stderr was not empty, see: /Users/jenkins/workspace/Lucene-Solr-master-MacOSX/lucene/build/backward-codecs/test/temp/junit4-J0-20181101_123231_18614307416917699566685.syserr
   [junit4] >>> JVM J0 emitted unexpected output (verbatim) ----
   [junit4] Java HotSpot(TM) 64-Bit Server VM warning: Option UseConcMarkSweepGC was deprecated in version 9.0 and will likely be removed in a future release.
   [junit4] <<< JVM J0: EOF ----

[...truncated 1550 lines...]
   [junit4] JVM J0: stderr was not empty, see: /Users/jenkins/workspace/Lucene-Solr-master-MacOSX/lucene/build/benchmark/test/temp/junit4-J0-20181101_123306_90815848069918585510599.syserr
   [junit4] >>> JVM J0 emitted unexpected output (verbatim) ----
   [junit4] Java HotSpot(TM) 64-Bit Server VM warning: Option UseConcMarkSweepGC was deprecated in version 9.0 and will likely be removed in a future release.
   [junit4] <<< JVM J0: EOF ----

[...truncated 3 lines...]
   [junit4] JVM J1: stderr was not empty, see: /Users/jenkins/workspace/Lucene-Solr-master-MacOSX/lucene/build/benchmark/test/temp/junit4-J1-20181101_123306_9096388169459600905378.syserr
   [junit4] >>> JVM J1 emitted unexpected output (verbatim) ----
   [junit4] Java HotSpot(TM) 64-Bit Server VM warning: Option UseConcMarkSweepGC was deprecated in version 9.0 and will likely be removed in a future release.
   [junit4] <<< JVM J1: EOF ----

[...truncated 251 lines...]
   [junit4] JVM J1: stderr was not empty, see: /Users/jenkins/workspace/Lucene-Solr-master-MacOSX/lucene/build/classification/test/temp/junit4-J1-20181101_123317_9831761066105676374466.syserr
   [junit4] >>> JVM J1 emitted unexpected output (verbatim) ----
   [junit4] Java HotSpot(TM) 64-Bit Server VM warning: Option UseConcMarkSweepGC was deprecated in version 9.0 and will likely be removed in a future release.
   [junit4] <<< JVM J1: EOF ----

[...truncated 3 lines...]
   [junit4] JVM J0: stderr was not empty, see: /Users/jenkins/workspace/Lucene-Solr-master-MacOSX/lucene/build/classification/test/temp/junit4-J0-20181101_123317_9835924523133774083475.syserr
   [junit4] >>> JVM J0 emitted unexpected output (verbatim) ----
   [junit4] Java HotSpot(TM) 64-Bit Server VM warning: Option UseConcMarkSweepGC was deprecated in version 9.0 and will likely be removed in a future release.
   [junit4] <<< JVM J0: EOF ----

[...truncated 257 lines...]
   [junit4] JVM J1: stderr was not empty, see: /Users/jenkins/workspace/Lucene-Solr-master-MacOSX/lucene/build/codecs/test/temp/junit4-J1-20181101_123335_12912644841288066648762.syserr
   [junit4] >>> JVM J1 emitted unexpected output (verbatim) ----
   [junit4] Java HotSpot(TM) 64-Bit Server VM warning: Option UseConcMarkSweepGC was deprecated in version 9.0 and will likely be removed in a future release.
   [junit4] <<< JVM J1: EOF ----

[...truncated 7 lines...]
   [junit4] JVM J0: stderr was not empty, see: /Users/jenkins/workspace/Lucene-Solr-master-MacOSX/lucene/build/codecs/test/temp/junit4-J0-20181101_123335_12910928994788143393097.syserr
   [junit4] >>> JVM J0 emitted unexpected output (verbatim) ----
   [junit4] Java HotSpot(TM) 64-Bit Server VM warning: Option UseConcMarkSweepGC was deprecated in version 9.0 and will likely be removed in a future release.
   [junit4] <<< JVM J0: EOF ----

[...truncated 234 lines...]
   [junit4] JVM J0: stderr was not empty, see: /Users/jenkins/workspace/Lucene-Solr-master-MacOSX/lucene/build/demo/test/temp/junit4-J0-20181101_123532_42813798843628910923991.syserr
   [junit4] >>> JVM J0 emitted unexpected output (verbatim) ----
   [junit4] Java HotSpot(TM) 64-Bit Server VM warning: Option UseConcMarkSweepGC was deprecated in version 9.0 and will likely be removed in a future release.
   [junit4] <<< JVM J0: EOF ----

   [junit4] JVM J1: stderr was not empty, see: /Users/jenkins/workspace/Lucene-Solr-master-MacOSX/lucene/build/demo/test/temp/junit4-J1-20181101_123532_4286946511166723831583.syserr
   [junit4] >>> JVM J1 emitted unexpected output (verbatim) ----
   [junit4] Java HotSpot(TM) 64-Bit Server VM warning: Option UseConcMarkSweepGC was deprecated in version 9.0 and will likely be removed in a future release.
   [junit4] <<< JVM J1: EOF ----

[...truncated 167 lines...]
   [junit4] JVM J0: stderr was not empty, see: /Users/jenkins/workspace/Lucene-Solr-master-MacOSX/lucene/build/expressions/test/temp/junit4-J0-20181101_123536_5566262975161374982801.syserr
   [junit4] >>> JVM J0 emitted unexpected output (verbatim) ----
   [junit4] Java HotSpot(TM) 64-Bit Server VM warning: Option UseConcMarkSweepGC was deprecated in version 9.0 and will likely be removed in a future release.
   [junit4] <<< JVM J0: EOF ----

[...truncated 9 lines...]
   [junit4] JVM J1: stderr was not empty, see: /Users/jenkins/workspace/Lucene-Solr-master-MacOSX/lucene/build/expressions/test/temp/junit4-J1-20181101_123536_5586156809576301972742.syserr
   [junit4] >>> JVM J1 emitted unexpected output (verbatim) ----
   [junit4] Java HotSpot(TM) 64-Bit Server VM warning: Option UseConcMarkSweepGC was deprecated in version 9.0 and will likely be removed in a future release.
   [junit4] <<< JVM J1: EOF ----

[...truncated 237 lines...]
   [junit4] JVM J1: stderr was not empty, see: /Users/jenkins/workspace/Lucene-Solr-master-MacOSX/lucene/build/facet/test/temp/junit4-J1-20181101_123543_54317366930343353187581.syserr
   [junit4] >>> JVM J1 emitted unexpected output (verbatim) ----
   [junit4] Java HotSpot(TM) 64-Bit Server VM warning: Option UseConcMarkSweepGC was deprecated in version 9.0 and will likely be removed in a future release.
   [junit4] <<< JVM J1: EOF ----

   [junit4] JVM J0: stderr was not empty, see: /Users/jenkins/workspace/Lucene-Solr-master-MacOSX/lucene/build/facet/test/temp/junit4-J0-20181101_123543_5439681517555221428775.syserr
   [junit4] >>> JVM J0 emitted unexpected output (verbatim) ----
   [junit4] Java HotSpot(TM) 64-Bit Server VM warning: Option UseConcMarkSweepGC was deprecated in version 9.0 and will likely be removed in a future release.
   [junit4] <<< JVM J0: EOF ----

[...truncated 185 lines...]
   [junit4] JVM J0: stderr was not empty, see: /Users/jenkins/workspace/Lucene-Solr-master-MacOSX/lucene/build/grouping/test/temp/junit4-J0-20181101_123612_7114550607222381668545.syserr
   [junit4] >>> JVM J0 emitted unexpected output (verbatim) ----
   [junit4] Java HotSpot(TM) 64-Bit Server VM warning: Option UseConcMarkSweepGC was deprecated in version 9.0 and will likely be removed in a future release.
   [junit4] <<< JVM J0: EOF ----

   [junit4] JVM J1: stderr was not empty, see: /Users/jenkins/workspace/Lucene-Solr-master-MacOSX/lucene/build/grouping/test/temp/junit4-J1-20181101_123612_71112357878544110234851.syserr
   [junit4] >>> JVM J1 emitted unexpected output (verbatim) ----
   [junit4] Java HotSpot(TM) 64-Bit Server VM warning: Option UseConcMarkSweepGC was deprecated in version 9.0 and will likely be removed in a future release.
   [junit4] <<< JVM J1: EOF ----

[...truncated 258 lines...]
   [junit4] JVM J0: stderr was not empty, see: /Users/jenkins/workspace/Lucene-Solr-master-MacOSX/lucene/build/highlighter/test/temp/junit4-J0-20181101_123621_34518368875408707439562.syserr
   [junit4] >>> JVM J0 emitted unexpected output (verbatim) ----
   [junit4] Java HotSpot(TM) 64-Bit Server VM warning: Option UseConcMarkSweepGC was deprecated in version 9.0 and will likely be removed in a future release.
   [junit4] <<< JVM J0: EOF ----

   [junit4] JVM J1: stderr was not empty, see: /Users/jenkins/workspace/Lucene-Solr-master-MacOSX/lucene/build/highlighter/test/temp/junit4-J1-20181101_123621_34517968417142273532797.syserr
   [junit4] >>> JVM J1 emitted unexpected output (verbatim) ----
   [junit4] Java HotSpot(TM) 64-Bit Server VM warning: Option UseConcMarkSweepGC was deprecated in version 9.0 and will likely be removed in a future release.
   [junit4] <<< JVM J1: EOF ----

[...truncated 163 lines...]
   [junit4] JVM J0: stderr was not empty, see: /Users/jenkins/workspace/Lucene-Solr-master-MacOSX/lucene/build/join/test/temp/junit4-J0-20181101_123638_56616915520029231792253.syserr
   [junit4] >>> JVM J0 emitted unexpected output (verbatim) ----
   [junit4] Java HotSpot(TM) 64-Bit Server VM warning: Option UseConcMarkSweepGC was deprecated in version 9.0 and will likely be removed in a future release.
   [junit4] <<< JVM J0: EOF ----

[...truncated 6 lines...]
   [junit4] JVM J1: stderr was not empty, see: /Users/jenkins/workspace/Lucene-Solr-master-MacOSX/lucene/build/join/test/temp/junit4-J1-20181101_123638_5663221256515296731954.syserr
   [junit4] >>> JVM J1 emitted unexpected output (verbatim) ----
   [junit4] Java HotSpot(TM) 64-Bit Server VM warning: Option UseConcMarkSweepGC was deprecated in version 9.0 and will likely be removed in a future release.
   [junit4] <<< JVM J1: EOF ----

[...truncated 155 lines...]
   [junit4] JVM J0: stderr was not empty, see: /Users/jenkins/workspace/Lucene-Solr-master-MacOSX/lucene/build/memory/test/temp/junit4-J0-20181101_123650_7425402013956926682901.syserr
   [junit4] >>> JVM J0 emitted unexpected output (verbatim) ----
   [junit4] Java HotSpot(TM) 64-Bit Server VM warning: Option UseConcMarkSweepGC was deprecated in version 9.0 and will likely be removed in a future release.
   [junit4] <<< JVM J0: EOF ----

[...truncated 3 lines...]
   [junit4] JVM J1: stderr was not empty, see: /Users/jenkins/workspace/Lucene-Solr-master-MacOSX/lucene/build/memory/test/temp/junit4-J1-20181101_123650_7443924476448741784207.syserr
   [junit4] >>> JVM J1 emitted unexpected output (verbatim) ----
   [junit4] Java HotSpot(TM) 64-Bit Server VM warning: Option UseConcMarkSweepGC was deprecated in version 9.0 and will likely be removed in a future release.
   [junit4] <<< JVM J1: EOF ----

[...truncated 191 lines...]
   [junit4] JVM J0: stderr was not empty, see: /Users/jenkins/workspace/Lucene-Solr-master-MacOSX/lucene/build/misc/test/temp/junit4-J0-20181101_123657_9011994964137807464387.syserr
   [junit4] >>> JVM J0 emitted unexpected output (verbatim) ----
   [junit4] Java HotSpot(TM) 64-Bit Server VM warning: Option UseConcMarkSweepGC was deprecated in version 9.0 and will likely be removed in a future release.
   [junit4] <<< JVM J0: EOF ----

[...truncated 3 lines...]
   [junit4] JVM J1: stderr was not empty, see: /Users/jenkins/workspace/Lucene-Solr-master-MacOSX/lucene/build/misc/test/temp/junit4-J1-20181101_123657_90112519465902358614085.syserr
   [junit4] >>> JVM J1 emitted unexpected output (verbatim) ----
   [junit4] Java HotSpot(TM) 64-Bit Server VM warning: Option UseConcMarkSweepGC was deprecated in version 9.0 and will likely be removed in a future release.
   [junit4] <<< JVM J1: EOF ----

[...truncated 306 lines...]
   [junit4] JVM J1: stderr was not empty, see: /Users/jenkins/workspace/Lucene-Solr-master-MacOSX/lucene/build/queries/test/temp/junit4-J1-20181101_123719_13216555834404796044222.syserr
   [junit4] >>> JVM J1 emitted unexpected output (verbatim) ----
   [junit4] Java HotSpot(TM) 64-Bit Server VM warning: Option UseConcMarkSweepGC was deprecated in version 9.0 and will likely be removed in a future release.
   [junit4] <<< JVM J1: EOF ----

[...truncated 3 lines...]
   [junit4] JVM J0: stderr was not empty, see: /Users/jenkins/workspace/Lucene-Solr-master-MacOSX/lucene/build/queries/test/temp/junit4-J0-20181101_123719_1322696256077588907058.syserr
   [junit4] >>> JVM J0 emitted unexpected output (verbatim) ----
   [junit4] Java HotSpot(TM) 64-Bit Server VM warning: Option UseConcMarkSweepGC was deprecated in version 9.0 and will likely be removed in a future release.
   [junit4] <<< JVM J0: EOF ----

[...truncated 234 lines...]
   [junit4] JVM J1: stderr was not empty, see: /Users/jenkins/workspace/Lucene-Solr-master-MacOSX/lucene/build/queryparser/test/temp/junit4-J1-20181101_123728_8404578850656089139815.syserr
   [junit4] >>> JVM J1 emitted unexpected output (verbatim) ----
   [junit4] Java HotSpot(TM) 64-Bit Server VM warning: Option UseConcMarkSweepGC was deprecated in version 9.0 and will likely be removed in a future release.
   [junit4] <<< JVM J1: EOF ----

   [junit4] JVM J0: stderr was not empty, see: /Users/jenkins/workspace/Lucene-Solr-master-MacOSX/lucene/build/queryparser/test/temp/junit4-J0-20181101_123728_8406908225941362036904.syserr
   [junit4] >>> JVM J0 emitted unexpected output (verbatim) ----
   [junit4] Java HotSpot(TM) 64-Bit Server VM warning: Option UseConcMarkSweepGC was deprecated in version 9.0 and will likely be removed in a future release.
   [junit4] <<< JVM J0: EOF ----

[...truncated 216 lines...]
   [junit4] JVM J0: stderr was not empty, see: /Users/jenkins/workspace/Lucene-Solr-master-MacOSX/lucene/build/replicator/test/temp/junit4-J0-20181101_123738_8545491934311017961382.syserr
   [junit4] >>> JVM J0 emitted unexpected output (verbatim) ----
   [junit4] Java HotSpot(TM) 64-Bit Server VM warning: Option UseConcMarkSweepGC was deprecated in version 9.0 and will likely be removed in a future release.
   [junit4] <<< JVM J0: EOF ----

[...truncated 3 lines...]
   [junit4] JVM J1: stderr was not empty, see: /Users/jenkins/workspace/Lucene-Solr-master-MacOSX/lucene/build/replicator/test/temp/junit4-J1-20181101_123738_8548365217556423665415.syserr
   [junit4] >>> JVM J1 emitted unexpected output (verbatim) ----
   [junit4] Java HotSpot(TM) 64-Bit Server VM warning: Option UseConcMarkSweepGC was deprecated in version 9.0 and will likely be removed in a future release.
   [junit4] <<< JVM J1: EOF ----

[...truncated 216 lines...]
   [junit4] JVM J1: stderr was not empty, see: /Users/jenkins/workspace/Lucene-Solr-master-MacOSX/lucene/build/sandbox/test/temp/junit4-J1-20181101_123753_965737790107469637284.syserr
   [junit4] >>> JVM J1 emitted unexpected output (verbatim) ----
   [junit4] Java HotSpot(TM) 64-Bit Server VM warning: Option UseConcMarkSweepGC was deprecated in version 9.0 and will likely be removed in a future release.
   [junit4] <<< JVM J1: EOF ----

[...truncated 3 lines...]
   [junit4] JVM J0: stderr was not empty, see: /Users/jenkins/workspace/Lucene-Solr-master-MacOSX/lucene/build/sandbox/test/temp/junit4-J0-20181101_123753_9655998758628307891078.syserr
   [junit4] >>> JVM J0 emitted unexpected output (verbatim) ----
   [junit4] Java HotSpot(TM) 64-Bit Server VM warning: Option UseConcMarkSweepGC was deprecated in version 9.0 and will likely be removed in a future release.
   [junit4] <<< JVM J0: EOF ----

[...truncated 299 lines...]
   [junit4] JVM J0: stderr was not empty, see: /Users/jenkins/workspace/Lucene-Solr-master-MacOSX/lucene/build/spatial-extras/test/temp/junit4-J0-20181101_123908_73318065585722574575843.syserr
   [junit4] >>> JVM J0 emitted unexpected output (verbatim) ----
   [junit4] Java HotSpot(TM) 64-Bit Server VM warning: Option UseConcMarkSweepGC was deprecated in version 9.0 and will likely be removed in a future release.
   [junit4] <<< JVM J0: EOF ----

[...truncated 3 lines...]
   [junit4] JVM J1: stderr was not empty, see: /Users/jenkins/workspace/Lucene-Solr-master-MacOSX/lucene/build/spatial-extras/test/temp/junit4-J1-20181101_123908_7333888373696773665128.syserr
   [junit4] >>> JVM J1 emitted unexpected output (verbatim) ----
   [junit4] Java HotSpot(TM) 64-Bit Server VM warning: Option UseConcMarkSweepGC was deprecated in version 9.0 and will likely be removed in a future release.
   [junit4] <<< JVM J1: EOF ----

[...truncated 151 lines...]
   [junit4] JVM J0: stderr was not empty, see: /Users/jenkins/workspace/Lucene-Solr-master-MacOSX/lucene/build/spatial/test/temp/junit4-J0-20181101_123945_2995175366924568292261.syserr
   [junit4] >>> JVM J0 emitted unexpected output (verbatim) ----
   [junit4] Java HotSpot(TM) 64-Bit Server VM warning: Option UseConcMarkSweepGC was deprecated in version 9.0 and will likely be removed in a future release.
   [junit4] <<< JVM J0: EOF ----

[...truncated 186 lines...]
   [junit4] JVM J1: stderr was not empty, see: /Users/jenkins/workspace/Lucene-Solr-master-MacOSX/lucene/build/spatial3d/test/temp/junit4-J1-20181101_123948_84014539042291140328412.syserr
   [junit4] >>> JVM J1 emitted unexpected output (verbatim) ----
   [junit4] Java HotSpot(TM) 64-Bit Server VM warning: Option UseConcMarkSweepGC was deprecated in version 9.0 and will likely be removed in a future release.
   [junit4] <<< JVM J1: EOF ----

[...truncated 5 lines...]
   [junit4] JVM J0: stderr was not empty, see: /Users/jenkins/workspace/Lucene-Solr-master-MacOSX/lucene/build/spatial3d/test/temp/junit4-J0-20181101_123948_84017116484357142932007.syserr
   [junit4] >>> JVM J0 emitted unexpected output (verbatim) ----
   [junit4] Java HotSpot(TM) 64-Bit Server VM warning: Option UseConcMarkSweepGC was deprecated in version 9.0 and will likely be removed in a future release.
   [junit4] <<< JVM J0: EOF ----

[...truncated 240 lines...]
   [junit4] JVM J0: stderr was not empty, see: /Users/jenkins/workspace/Lucene-Solr-master-MacOSX/lucene/build/suggest/test/temp/junit4-J0-20181101_124014_33713435874286284184924.syserr
   [junit4] >>> JVM J0 emitted unexpected output (verbatim) ----
   [junit4] Java HotSpot(TM) 64-Bit Server VM warning: Option UseConcMarkSweepGC was deprecated in version 9.0 and will likely be removed in a future release.
   [junit4] <<< JVM J0: EOF ----

[...truncated 24 lines...]
   [junit4] JVM J1: stderr was not empty, see: /Users/jenkins/workspace/Lucene-Solr-master-MacOSX/lucene/build/suggest/test/temp/junit4-J1-20181101_124014_3419189794673752866339.syserr
   [junit4] >>> JVM J1 emitted unexpected output (verbatim) ----
   [junit4] Java HotSpot(TM) 64-Bit Server VM warning: Option UseConcMarkSweepGC was deprecated in version 9.0 and will likely be removed in a future release.
   [junit4] <<< JVM J1: EOF ----

[...truncated 3551 lines...]
   [junit4] Suite: org.apache.solr.cloud.TestTlogReplica
   [junit4]   2> Creating dataDir: /Users/jenkins/workspace/Lucene-Solr-master-MacOSX/solr/build/solr-core/test/J1/temp/solr.cloud.TestTlogReplica_120442557453C590-001/init-core-data-001
   [junit4]   2> 2768163 WARN  (SUITE-TestTlogReplica-seed#[120442557453C590]-worker) [    ] o.a.s.SolrTestCaseJ4 startTrackingSearchers: numOpens=146 numCloses=146
   [junit4]   2> 2768163 INFO  (SUITE-TestTlogReplica-seed#[120442557453C590]-worker) [    ] o.a.s.SolrTestCaseJ4 Using PointFields (NUMERIC_POINTS_SYSPROP=true) w/NUMERIC_DOCVALUES_SYSPROP=false
   [junit4]   2> 2768164 INFO  (SUITE-TestTlogReplica-seed#[120442557453C590]-worker) [    ] o.a.s.SolrTestCaseJ4 Randomized ssl (true) and clientAuth (false) via: @org.apache.solr.util.RandomizeSSL(reason="", value=0.0/0.0, ssl=0.0/0.0, clientAuth=0.0/0.0) w/ MAC_OS_X supressed clientAuth
   [junit4]   2> 2768165 INFO  (SUITE-TestTlogReplica-seed#[120442557453C590]-worker) [    ] o.a.s.SolrTestCaseJ4 SecureRandom sanity checks: test.solr.allowed.securerandom=null & java.security.egd=file:/dev/./urandom
   [junit4]   2> 2768165 INFO  (SUITE-TestTlogReplica-seed#[120442557453C590]-worker) [    ] o.a.s.c.MiniSolrCloudCluster Starting cluster of 2 servers in /Users/jenkins/workspace/Lucene-Solr-master-MacOSX/solr/build/solr-core/test/J1/temp/solr.cloud.TestTlogReplica_120442557453C590-001/tempDir-001
   [junit4]   2> 2768165 INFO  (SUITE-TestTlogReplica-seed#[120442557453C590]-worker) [    ] o.a.s.c.ZkTestServer STARTING ZK TEST SERVER
   [junit4]   2> 2768170 INFO  (Thread-5185) [    ] o.a.s.c.ZkTestServer client port:0.0.0.0/0.0.0.0:0
   [junit4]   2> 2768170 INFO  (Thread-5185) [    ] o.a.s.c.ZkTestServer Starting server
   [junit4]   2> 2768173 ERROR (Thread-5185) [    ] o.a.z.s.ZooKeeperServer ZKShutdownHandler is not registered, so ZooKeeper server won't take any action on ERROR or SHUTDOWN server state changes
   [junit4]   2> 2768270 INFO  (SUITE-TestTlogReplica-seed#[120442557453C590]-worker) [    ] o.a.s.c.ZkTestServer start zk server on port:63906
   [junit4]   2> 2768283 INFO  (zkConnectionManagerCallback-10188-thread-1) [    ] o.a.s.c.c.ConnectionManager zkClient has connected
   [junit4]   2> 2768290 INFO  (jetty-launcher-10185-thread-2) [    ] o.e.j.s.Server jetty-9.4.11.v20180605; built: 2018-06-05T18:24:03.829Z; git: d5fc0523cfa96bfebfbda19606cad384d772f04c; jvm 9+181
   [junit4]   2> 2768290 INFO  (jetty-launcher-10185-thread-1) [    ] o.e.j.s.Server jetty-9.4.11.v20180605; built: 2018-06-05T18:24:03.829Z; git: d5fc0523cfa96bfebfbda19606cad384d772f04c; jvm 9+181
   [junit4]   2> 2768292 INFO  (jetty-launcher-10185-thread-2) [    ] o.e.j.s.session DefaultSessionIdManager workerName=node0
   [junit4]   2> 2768292 INFO  (jetty-launcher-10185-thread-2) [    ] o.e.j.s.session No SessionScavenger set, using defaults
   [junit4]   2> 2768292 INFO  (jetty-launcher-10185-thread-2) [    ] o.e.j.s.session node0 Scavenging every 660000ms
   [junit4]   2> 2768293 INFO  (jetty-launcher-10185-thread-2) [    ] o.e.j.s.h.ContextHandler Started o.e.j.s.ServletContextHandler@6107e0fa{/solr,null,AVAILABLE}
   [junit4]   2> 2768293 INFO  (jetty-launcher-10185-thread-1) [    ] o.e.j.s.session DefaultSessionIdManager workerName=node0
   [junit4]   2> 2768293 INFO  (jetty-launcher-10185-thread-1) [    ] o.e.j.s.session No SessionScavenger set, using defaults
   [junit4]   2> 2768293 INFO  (jetty-launcher-10185-thread-1) [    ] o.e.j.s.session node0 Scavenging every 600000ms
   [junit4]   2> 2768293 INFO  (jetty-launcher-10185-thread-1) [    ] o.e.j.s.h.ContextHandler Started o.e.j.s.ServletContextHandler@5dff4ca3{/solr,null,AVAILABLE}
   [junit4]   2> 2768295 INFO  (jetty-launcher-10185-thread-2) [    ] o.e.j.s.AbstractConnector Started ServerConnector@6ef6df98{SSL,[ssl, http/1.1]}{127.0.0.1:63911}
   [junit4]   2> 2768295 INFO  (jetty-launcher-10185-thread-1) [    ] o.e.j.s.AbstractConnector Started ServerConnector@6d7cb778{SSL,[ssl, http/1.1]}{127.0.0.1:63912}
   [junit4]   2> 2768295 INFO  (jetty-launcher-10185-thread-2) [    ] o.e.j.s.Server Started @2768386ms
   [junit4]   2> 2768295 INFO  (jetty-launcher-10185-thread-1) [    ] o.e.j.s.Server Started @2768386ms
   [junit4]   2> 2768295 INFO  (jetty-launcher-10185-thread-1) [    ] o.a.s.c.s.e.JettySolrRunner Jetty properties: {hostContext=/solr, hostPort=63912}
   [junit4]   2> 2768295 INFO  (jetty-launcher-10185-thread-2) [    ] o.a.s.c.s.e.JettySolrRunner Jetty properties: {hostContext=/solr, hostPort=63911}
   [junit4]   2> 2768295 ERROR (jetty-launcher-10185-thread-1) [    ] o.a.s.u.StartupLoggingUtils Missing Java Option solr.log.dir. Logging may be missing or incomplete.
   [junit4]   2> 2768295 ERROR (jetty-launcher-10185-thread-2) [    ] o.a.s.u.StartupLoggingUtils Missing Java Option solr.log.dir. Logging may be missing or incomplete.
   [junit4]   2> 2768295 INFO  (jetty-launcher-10185-thread-1) [    ] o.a.s.s.SolrDispatchFilter Using logger factory org.apache.logging.slf4j.Log4jLoggerFactory
   [junit4]   2> 2768295 INFO  (jetty-launcher-10185-thread-2) [    ] o.a.s.s.SolrDispatchFilter Using logger factory org.apache.logging.slf4j.Log4jLoggerFactory
   [junit4]   2> 2768295 INFO  (jetty-launcher-10185-thread-1) [    ] o.a.s.s.SolrDispatchFilter  ___      _       Welcome to Apache Solr™ version 8.0.0
   [junit4]   2> 2768295 INFO  (jetty-launcher-10185-thread-2) [    ] o.a.s.s.SolrDispatchFilter  ___      _       Welcome to Apache Solr™ version 8.0.0
   [junit4]   2> 2768295 INFO  (jetty-launcher-10185-thread-1) [    ] o.a.s.s.SolrDispatchFilter / __| ___| |_ _   Starting in cloud mode on port null
   [junit4]   2> 2768295 INFO  (jetty-launcher-10185-thread-2) [    ] o.a.s.s.SolrDispatchFilter / __| ___| |_ _   Starting in cloud mode on port null
   [junit4]   2> 2768295 INFO  (jetty-launcher-10185-thread-1) [    ] o.a.s.s.SolrDispatchFilter \__ \/ _ \ | '_|  Install dir: null
   [junit4]   2> 2768295 INFO  (jetty-launcher-10185-thread-2) [    ] o.a.s.s.SolrDispatchFilter \__ \/ _ \ | '_|  Install dir: null
   [junit4]   2> 2768295 INFO  (jetty-launcher-10185-thread-1) [    ] o.a.s.s.SolrDispatchFilter |___/\___/_|_|    Start time: 2018-11-01T13:28:15.809531Z
   [junit4]   2> 2768295 INFO  (jetty-launcher-10185-thread-2) [    ] o.a.s.s.SolrDispatchFilter |___/\___/_|_|    Start time: 2018-11-01T13:28:15.809538Z
   [junit4]   2> 2768297 INFO  (zkConnectionManagerCallback-10191-thread-1) [    ] o.a.s.c.c.ConnectionManager zkClient has connected
   [junit4]   2> 2768297 INFO  (zkConnectionManagerCallback-10192-thread-1) [    ] o.a.s.c.c.ConnectionManager zkClient has connected
   [junit4]   2> 2768297 INFO  (jetty-launcher-10185-thread-2) [    ] o.a.s.s.SolrDispatchFilter solr.xml found in ZooKeeper. Loading...
   [junit4]   2> 2768297 INFO  (jetty-launcher-10185-thread-1) [    ] o.a.s.s.SolrDispatchFilter solr.xml found in ZooKeeper. Loading...
   [junit4]   2> 2768344 INFO  (jetty-launcher-10185-thread-2) [    ] o.a.s.c.ZkContainer Zookeeper client=127.0.0.1:63906/solr
   [junit4]   2> 2768345 INFO  (zkConnectionManagerCallback-10196-thread-1) [    ] o.a.s.c.c.ConnectionManager zkClient has connected
   [junit4]   2> 2768348 INFO  (zkConnectionManagerCallback-10198-thread-1) [    ] o.a.s.c.c.ConnectionManager zkClient has connected
   [junit4]   2> 2768505 INFO  (jetty-launcher-10185-thread-2) [n:127.0.0.1:63911_solr    ] o.a.s.c.OverseerElectionContext I am going to be the leader 127.0.0.1:63911_solr
   [junit4]   2> 2768506 INFO  (jetty-launcher-10185-thread-2) [n:127.0.0.1:63911_solr    ] o.a.s.c.Overseer Overseer (id=72277272206245892-127.0.0.1:63911_solr-n_0000000000) starting
   [junit4]   2> 2768517 INFO  (zkConnectionManagerCallback-10205-thread-1) [    ] o.a.s.c.c.ConnectionManager zkClient has connected
   [junit4]   2> 2768520 INFO  (jetty-launcher-10185-thread-2) [n:127.0.0.1:63911_solr    ] o.a.s.c.s.i.ZkClientClusterStateProvider Cluster at 127.0.0.1:63906/solr ready
   [junit4]   2> 2768521 INFO  (OverseerStateUpdate-72277272206245892-127.0.0.1:63911_solr-n_0000000000) [n:127.0.0.1:63911_solr    ] o.a.s.c.Overseer Starting to work on the main queue : 127.0.0.1:63911_solr
   [junit4]   2> 2768521 DEBUG (OverseerAutoScalingTriggerThread-72277272206245892-127.0.0.1:63911_solr-n_0000000000) [    ] o.a.s.c.a.OverseerTriggerThread Adding .auto_add_replicas and .scheduled_maintenance triggers
   [junit4]   2> 2768522 DEBUG (OverseerAutoScalingTriggerThread-72277272206245892-127.0.0.1:63911_solr-n_0000000000) [    ] o.a.s.c.a.OverseerTriggerThread Refreshing /autoscaling.json with znode version 1
   [junit4]   2> 2768522 DEBUG (OverseerAutoScalingTriggerThread-72277272206245892-127.0.0.1:63911_solr-n_0000000000) [    ] o.a.s.c.a.OverseerTriggerThread Current znodeVersion 1, lastZnodeVersion -1
   [junit4]   2> 2768522 DEBUG (OverseerAutoScalingTriggerThread-72277272206245892-127.0.0.1:63911_solr-n_0000000000) [    ] o.a.s.c.a.OverseerTriggerThread Processed trigger updates upto znodeVersion 1
   [junit4]   2> 2768523 INFO  (jetty-launcher-10185-thread-2) [n:127.0.0.1:63911_solr    ] o.a.s.c.ZkController Register node as live in ZooKeeper:/live_nodes/127.0.0.1:63911_solr
   [junit4]   2> 2768525 INFO  (zkCallback-10204-thread-1) [    ] o.a.s.c.c.ZkStateReader Updated live nodes from ZooKeeper... (0) -> (1)
   [junit4]   2> 2768525 INFO  (zkCallback-10197-thread-1) [    ] o.a.s.c.c.ZkStateReader Updated live nodes from ZooKeeper... (0) -> (1)
   [junit4]   2> 2768529 DEBUG (OverseerAutoScalingTriggerThread-72277272206245892-127.0.0.1:63911_solr-n_0000000000) [    ] o.a.s.c.a.NodeLostTrigger NodeLostTrigger .auto_add_replicas - Initial livenodes: [127.0.0.1:63911_solr]
   [junit4]   2> 2768529 DEBUG (OverseerAutoScalingTriggerThread-72277272206245892-127.0.0.1:63911_solr-n_0000000000) [    ] o.a.s.c.a.OverseerTriggerThread -- clean old nodeAdded markers
   [junit4]   2> 2768530 DEBUG (OverseerAutoScalingTriggerThread-72277272206245892-127.0.0.1:63911_solr-n_0000000000) [    ] o.a.s.c.a.OverseerTriggerThread Current znodeVersion 1, lastZnodeVersion 1
   [junit4]   2> 2768531 DEBUG (ScheduledTrigger-12483-thread-1) [    ] o.a.s.c.a.NodeLostTrigger Running NodeLostTrigger: .auto_add_replicas with currently live nodes: 1
   [junit4]   2> 2768553 INFO  (jetty-launcher-10185-thread-2) [n:127.0.0.1:63911_solr    ] o.a.s.h.a.MetricsHistoryHandler No .system collection, keeping metrics history in memory.
   [junit4]   2> 2768570 INFO  (jetty-launcher-10185-thread-2) [n:127.0.0.1:63911_solr    ] o.a.s.m.r.SolrJmxReporter JMX monitoring for 'solr_63911.solr.node' (registry 'solr.node') enabled at server: com.sun.jmx.mbeanserver.JmxMBeanServer@2e5de21c
   [junit4]   2> 2768576 INFO  (jetty-launcher-10185-thread-2) [n:127.0.0.1:63911_solr    ] o.a.s.m.r.SolrJmxReporter JMX monitoring for 'solr_63911.solr.jvm' (registry 'solr.jvm') enabled at server: com.sun.jmx.mbeanserver.JmxMBeanServer@2e5de21c
   [junit4]   2> 2768576 INFO  (jetty-launcher-10185-thread-2) [n:127.0.0.1:63911_solr    ] o.a.s.m.r.SolrJmxReporter JMX monitoring for 'solr_63911.solr.jetty' (registry 'solr.jetty') enabled at server: com.sun.jmx.mbeanserver.JmxMBeanServer@2e5de21c
   [junit4]   2> 2768577 INFO  (jetty-launcher-10185-thread-2) [n:127.0.0.1:63911_solr    ] o.a.s.c.CorePropertiesLocator Found 0 core definitions underneath /Users/jenkins/workspace/Lucene-Solr-master-MacOSX/solr/build/solr-core/test/J1/temp/solr.cloud.TestTlogReplica_120442557453C590-001/tempDir-001/node2/.
   [junit4]   2> 2768598 INFO  (jetty-launcher-10185-thread-1) [    ] o.a.s.c.ZkContainer Zookeeper client=127.0.0.1:63906/solr
   [junit4]   2> 2768600 INFO  (zkConnectionManagerCallback-10210-thread-1) [    ] o.a.s.c.c.ConnectionManager zkClient has connected
   [junit4]   2> 2768603 INFO  (zkConnectionManagerCallback-10212-thread-1) [    ] o.a.s.c.c.ConnectionManager zkClient has connected
   [junit4]   2> 2768616 INFO  (jetty-launcher-10185-thread-1) [n:127.0.0.1:63912_solr    ] o.a.s.c.c.ZkStateReader Updated live nodes from ZooKeeper... (0) -> (1)
   [junit4]   2> 2768624 INFO  (jetty-launcher-10185-thread-1) [n:127.0.0.1:63912_solr    ] o.a.s.c.TransientSolrCoreCacheDefault Allocating transient cache for 2147483647 transient cores
   [junit4]   2> 2768624 INFO  (jetty-launcher-10185-thread-1) [n:127.0.0.1:63912_solr    ] o.a.s.c.ZkController Register node as live in ZooKeeper:/live_nodes/127.0.0.1:63912_solr
   [junit4]   2> 2768624 DEBUG (OverseerStateUpdate-72277272206245892-127.0.0.1:63911_solr-n_0000000000) [n:127.0.0.1:63911_solr    ] o.a.s.c.Overseer processMessage: queueSize: 1, message = {
   [junit4]   2>   "operation":"downnode",
   [junit4]   2>   "node_name":"127.0.0.1:63912_solr"} current state version: 0
   [junit4]   2> 2768625 INFO  (zkCallback-10204-thread-1) [    ] o.a.s.c.c.ZkStateReader Updated live nodes from ZooKeeper... (1) -> (2)
   [junit4]   2> 2768625 INFO  (zkCallback-10211-thread-1) [    ] o.a.s.c.c.ZkStateReader Updated live nodes from ZooKeeper... (1) -> (2)
   [junit4]   2> 2768625 INFO  (zkCallback-10197-thread-1) [    ] o.a.s.c.c.ZkStateReader Updated live nodes from ZooKeeper... (1) -> (2)
   [junit4]   2> 2768641 INFO  (zkConnectionManagerCallback-10219-thread-1) [    ] o.a.s.c.c.ConnectionManager zkClient has connected
   [junit4]   2> 2768643 INFO  (jetty-launcher-10185-thread-1) [n:127.0.0.1:63912_solr    ] o.a.s.c.c.ZkStateReader Updated live nodes from ZooKeeper... (0) -> (2)
   [junit4]   2> 2768645 INFO  (jetty-launcher-10185-thread-1) [n:127.0.0.1:63912_solr    ] o.a.s.c.s.i.ZkClientClusterStateProvider Cluster at 127.0.0.1:63906/solr ready
   [junit4]   2> 2768645 INFO  (jetty-launcher-10185-thread-1) [n:127.0.0.1:63912_solr    ] o.a.s.h.a.MetricsHistoryHandler No .system collection, keeping metrics history in memory.
   [junit4]   2> 2768658 INFO  (jetty-launcher-10185-thread-1) [n:127.0.0.1:63912_solr    ] o.a.s.m.r.SolrJmxReporter JMX monitoring for 'solr_63912.solr.node' (registry 'solr.node') enabled at server: com.sun.jmx.mbeanserver.JmxMBeanServer@2e5de21c
   [junit4]   2> 2768670 INFO  (jetty-launcher-10185-thread-1) [n:127.0.0.1:63912_solr    ] o.a.s.m.r.SolrJmxReporter JMX monitoring for 'solr_63912.solr.jvm' (registry 'solr.jvm') enabled at server: com.sun.jmx.mbeanserver.JmxMBeanServer@2e5de21c
   [junit4]   2> 2768670 INFO  (jetty-launcher-10185-thread-1) [n:127.0.0.1:63912_solr    ] o.a.s.m.r.SolrJmxReporter JMX monitoring for 'solr_63912.solr.jetty' (registry 'solr.jetty') enabled at server: com.sun.jmx.mbeanserver.JmxMBeanServer@2e5de21c
   [junit4]   2> 2768671 INFO  (jetty-launcher-10185-thread-1) [n:127.0.0.1:63912_solr    ] o.a.s.c.CorePropertiesLocator Found 0 core definitions underneath /Users/jenkins/workspace/Lucene-Solr-master-MacOSX/solr/build/solr-core/test/J1/temp/solr.cloud.TestTlogReplica_120442557453C590-001/tempDir-001/node1/.
   [junit4]   2> 2768690 INFO  (zkConnectionManagerCallback-10222-thread-1) [    ] o.a.s.c.c.ConnectionManager zkClient has connected
   [junit4]   2> 2768694 INFO  (zkConnectionManagerCallback-10227-thread-1) [    ] o.a.s.c.c.ConnectionManager zkClient has connected
   [junit4]   2> 2768696 INFO  (SUITE-TestTlogReplica-seed#[120442557453C590]-worker) [    ] o.a.s.c.c.ZkStateReader Updated live nodes from ZooKeeper... (0) -> (2)
   [junit4]   2> 2768698 INFO  (SUITE-TestTlogReplica-seed#[120442557453C590]-worker) [    ] o.a.s.c.s.i.ZkClientClusterStateProvider Cluster at 127.0.0.1:63906/solr ready
   [junit4]   2> 2768703 INFO  (SUITE-TestTlogReplica-seed#[120442557453C590]-worker) [    ] o.a.s.c.TestTlogReplica Using legacyCloud?: false
   [junit4]   2> 2768715 INFO  (qtp959088588-31530) [n:127.0.0.1:63911_solr    ] o.a.s.h.a.CollectionsHandler Invoked Collection Action :clusterprop with params val=false&name=legacyCloud&action=CLUSTERPROP&wt=javabin&version=2 and sendToOCPQueue=true
   [junit4]   2> 2768718 INFO  (qtp959088588-31530) [n:127.0.0.1:63911_solr    ] o.a.s.s.HttpSolrCall [admin] webapp=null path=/admin/collections params={val=false&name=legacyCloud&action=CLUSTERPROP&wt=javabin&version=2} status=0 QTime=2
   [junit4]   2> 2768739 INFO  (TEST-TestTlogReplica.testBasicLeaderElection-seed#[120442557453C590]) [    ] o.a.s.SolrTestCaseJ4 ###Starting testBasicLeaderElection
   [junit4]   2> 2768741 INFO  (qtp959088588-31532) [n:127.0.0.1:63911_solr    ] o.a.s.h.a.CollectionsHandler Invoked Collection Action :create with params pullReplicas=0&collection.configName=conf&maxShardsPerNode=100&name=tlog_replica_test_basic_leader_election&nrtReplicas=0&action=CREATE&numShards=1&tlogReplicas=2&wt=javabin&version=2 and sendToOCPQueue=true
   [junit4]   2> 2768743 INFO  (OverseerThreadFactory-12485-thread-1-processing-n:127.0.0.1:63911_solr) [n:127.0.0.1:63911_solr    ] o.a.s.c.a.c.CreateCollectionCmd Create collection tlog_replica_test_basic_leader_election
   [junit4]   2> 2768753 DEBUG (OverseerStateUpdate-72277272206245892-127.0.0.1:63911_solr-n_0000000000) [n:127.0.0.1:63911_solr    ] o.a.s.c.Overseer processMessage: queueSize: 1, message = {
   [junit4]   2>   "name":"tlog_replica_test_basic_leader_election",
   [junit4]   2>   "fromApi":"true",
   [junit4]   2>   "collection.configName":"conf",
   [junit4]   2>   "numShards":"1",
   [junit4]   2>   "maxShardsPerNode":"100",
   [junit4]   2>   "pullReplicas":"0",
   [junit4]   2>   "tlogReplicas":"2",
   [junit4]   2>   "nrtReplicas":"0",
   [junit4]   2>   "stateFormat":"2",
   [junit4]   2>   "replicationFactor":"0",
   [junit4]   2>   "operation":"create"} current state version: 0
   [junit4]   2> 2768870 INFO  (qtp959088588-31534) [n:127.0.0.1:63911_solr    ] o.a.s.s.HttpSolrCall [admin] webapp=null path=/admin/metrics params={prefix=CONTAINER.fs.usableSpace,CONTAINER.fs.totalSpace,CORE.coreName&wt=javabin&version=2&group=solr.node,solr.core} status=0 QTime=0
   [junit4]   2> 2768883 INFO  (qtp216526097-31535) [n:127.0.0.1:63912_solr    ] o.a.s.s.HttpSolrCall [admin] webapp=null path=/admin/metrics params={prefix=CONTAINER.fs.usableSpace,CONTAINER.fs.totalSpace,CORE.coreName&wt=javabin&version=2&group=solr.node,solr.core} status=0 QTime=0
   [junit4]   2> 2768891 DEBUG (OverseerStateUpdate-72277272206245892-127.0.0.1:63911_solr-n_0000000000) [n:127.0.0.1:63911_solr    ] o.a.s.c.Overseer processMessage: queueSize: 1, message = {
   [junit4]   2>   "operation":"ADDREPLICA",
   [junit4]   2>   "collection":"tlog_replica_test_basic_leader_election",
   [junit4]   2>   "shard":"shard1",
   [junit4]   2>   "core":"tlog_replica_test_basic_leader_election_shard1_replica_t1",
   [junit4]   2>   "state":"down",
   [junit4]   2>   "base_url":"https://127.0.0.1:63912/solr",
   [junit4]   2>   "type":"TLOG",
   [junit4]   2>   "waitForFinalState":"false"} current state version: 0
   [junit4]   2> 2768891 INFO  (OverseerStateUpdate-72277272206245892-127.0.0.1:63911_solr-n_0000000000) [n:127.0.0.1:63911_solr    ] o.a.s.c.o.SliceMutator createReplica() {
   [junit4]   2>   "operation":"ADDREPLICA",
   [junit4]   2>   "collection":"tlog_replica_test_basic_leader_election",
   [junit4]   2>   "shard":"shard1",
   [junit4]   2>   "core":"tlog_replica_test_basic_leader_election_shard1_replica_t1",
   [junit4]   2>   "state":"down",
   [junit4]   2>   "base_url":"https://127.0.0.1:63912/solr",
   [junit4]   2>   "type":"TLOG",
   [junit4]   2>   "waitForFinalState":"false"} 
   [junit4]   2> 2768896 DEBUG (OverseerStateUpdate-72277272206245892-127.0.0.1:63911_solr-n_0000000000) [n:127.0.0.1:63911_solr    ] o.a.s.c.Overseer processMessage: queueSize: 2, message = {
   [junit4]   2>   "operation":"ADDREPLICA",
   [junit4]   2>   "collection":"tlog_replica_test_basic_leader_election",
   [junit4]   2>   "shard":"shard1",
   [junit4]   2>   "core":"tlog_replica_test_basic_leader_election_shard1_replica_t2",
   [junit4]   2>   "state":"down",
   [junit4]   2>   "base_url":"https://127.0.0.1:63911/solr",
   [junit4]   2>   "type":"TLOG",
   [junit4]   2>   "waitForFinalState":"false"} current state version: 0
   [junit4]   2> 2768896 INFO  (OverseerStateUpdate-72277272206245892-127.0.0.1:63911_solr-n_0000000000) [n:127.0.0.1:63911_solr    ] o.a.s.c.o.SliceMutator createReplica() {
   [junit4]   2>   "operation":"ADDREPLICA",
   [junit4]   2>   "collection":"tlog_replica_test_basic_leader_election",
   [junit4]   2>   "shard":"shard1",
   [junit4]   2>   "core":"tlog_replica_test_basic_leader_election_shard1_replica_t2",
   [junit4]   2>   "state":"down",
   [junit4]   2>   "base_url":"https://127.0.0.1:63911/solr",
   [junit4]   2>   "type":"TLOG",
   [junit4]   2>   "waitForFinalState":"false"} 
   [junit4]   2> 2769116 INFO  (qtp959088588-31534) [n:127.0.0.1:63911_solr    x:tlog_replica_test_basic_leader_election_shard1_replica_t2] o.a.s.h.a.CoreAdminOperation core create command qt=/admin/cores&coreNodeName=core_node4&collection.configName=conf&newCollection=true&name=tlog_replica_test_basic_leader_election_shard1_replica_t2&action=CREATE&numShards=1&collection=tlog_replica_test_basic_leader_election&shard=shard1&wt=javabin&version=2&replicaType=TLOG
   [junit4]   2> 2769116 INFO  (qtp216526097-31535) [n:127.0.0.1:63912_solr    x:tlog_replica_test_basic_leader_election_shard1_replica_t1] o.a.s.h.a.CoreAdminOperation core create command qt=/admin/cores&coreNodeName=core_node3&collection.configName=conf&newCollection=true&name=tlog_replica_test_basic_leader_election_shard1_replica_t1&action=CREATE&numShards=1&collection=tlog_replica_test_basic_leader_election&shard=shard1&wt=javabin&version=2&replicaType=TLOG
   [junit4]   2> 2769117 INFO  (qtp959088588-31534) [n:127.0.0.1:63911_solr    x:tlog_replica_test_basic_leader_election_shard1_replica_t2] o.a.s.c.TransientSolrCoreCacheDefault Allocating transient cache for 2147483647 transient cores
   [junit4]   2> 2769122 DEBUG (OverseerStateUpdate-72277272206245892-127.0.0.1:63911_solr-n_0000000000) [n:127.0.0.1:63911_solr    ] o.a.s.c.Overseer processMessage: queueSize: 2, message = {
   [junit4]   2>   "core":"tlog_replica_test_basic_leader_election_shard1_replica_t2",
   [junit4]   2>   "core_node_name":"core_node4",
   [junit4]   2>   "roles":null,
   [junit4]   2>   "base_url":"https://127.0.0.1:63911/solr",
   [junit4]   2>   "node_name":"127.0.0.1:63911_solr",
   [junit4]   2>   "numShards":"1",
   [junit4]   2>   "state":"down",
   [junit4]   2>   "shard":"shard1",
   [junit4]   2>   "collection":"tlog_replica_test_basic_leader_election",
   [junit4]   2>   "type":"TLOG",
   [junit4]   2>   "force_set_state":"false",
   [junit4]   2>   "operation":"state"} current state version: 0
   [junit4]   2> 2769122 DEBUG (OverseerStateUpdate-72277272206245892-127.0.0.1:63911_solr-n_0000000000) [n:127.0.0.1:63911_solr    ] o.a.s.c.Overseer processMessage: queueSize: 2, message = {
   [junit4]   2>   "core":"tlog_replica_test_basic_leader_election_shard1_replica_t1",
   [junit4]   2>   "core_node_name":"core_node3",
   [junit4]   2>   "roles":null,
   [junit4]   2>   "base_url":"https://127.0.0.1:63912/solr",
   [junit4]   2>   "node_name":"127.0.0.1:63912_solr",
   [junit4]   2>   "numShards":"1",
   [junit4]   2>   "state":"down",
   [junit4]   2>   "shard":"shard1",
   [junit4]   2>   "collection":"tlog_replica_test_basic_leader_election",
   [junit4]   2>   "type":"TLOG",
   [junit4]   2>   "force_set_state":"false",
   [junit4]   2>   "operation":"state"} current state version: 0
   [junit4]   2> 2769534 DEBUG (ScheduledTrigger-12483-thread-2) [    ] o.a.s.c.a.NodeLostTrigger Running NodeLostTrigger: .auto_add_replicas with currently live nodes: 2
   [junit4]   2> 2770142 INFO  (qtp959088588-31534) [n:127.0.0.1:63911_solr c:tlog_replica_test_basic_leader_election s:shard1 r:core_node4 x:tlog_replica_test_basic_leader_election_shard1_replica_t2] o.a.s.c.SolrConfig Using Lucene MatchVersion: 8.0.0
   [junit4]   2> 2770142 INFO  (qtp216526097-31535) [n:127.0.0.1:63912_solr c:tlog_replica_test_basic_leader_election s:shard1 r:core_node3 x:tlog_replica_test_basic_leader_election_shard1_replica_t1] o.a.s.c.SolrConfig Using Lucene MatchVersion: 8.0.0
   [junit4]   2> 2770157 INFO  (qtp216526097-31535) [n:127.0.0.1:63912_solr c:tlog_replica_test_basic_leader_election s:shard1 r:core_node3 x:tlog_replica_test_basic_leader_election_shard1_replica_t1] o.a.s.s.IndexSchema [tlog_replica_test_basic_leader_election_shard1_replica_t1] Schema name=minimal
   [junit4]   2> 2770157 INFO  (qtp959088588-31534) [n:127.0.0.1:63911_solr c:tlog_replica_test_basic_leader_election s:shard1 r:core_node4 x:tlog_replica_test_basic_leader_election_shard1_replica_t2] o.a.s.s.IndexSchema [tlog_replica_test_basic_leader_election_shard1_replica_t2] Schema name=minimal
   [junit4]   2> 2770159 INFO  (qtp216526097-31535) [n:127.0.0.1:63912_solr c:tlog_replica_test_basic_leader_election s:shard1 r:core_node3 x:tlog_replica_test_basic_leader_election_shard1_replica_t1] o.a.s.s.IndexSchema Loaded schema minimal/1.1 with uniqueid field id
   [junit4]   2> 2770159 INFO  (qtp216526097-31535) [n:127.0.0.1:63912_solr c:tlog_replica_test_basic_leader_election s:shard1 r:core_node3 x:tlog_replica_test_basic_leader_election_shard1_replica_t1] o.a.s.c.CoreContainer Creating SolrCore 'tlog_replica_test_basic_leader_election_shard1_replica_t1' using configuration from collection tlog_replica_test_basic_leader_election, trusted=true
   [junit4]   2> 2770159 INFO  (qtp959088588-31534) [n:127.0.0.1:63911_solr c:tlog_replica_test_basic_leader_election s:shard1 r:core_node4 x:tlog_replica_test_basic_leader_election_shard1_replica_t2] o.a.s.s.IndexSchema Loaded schema minimal/1.1 with uniqueid field id
   [junit4]   2> 2770159 INFO  (qtp959088588-31534) [n:127.0.0.1:63911_solr c:tlog_replica_test_basic_leader_election s:shard1 r:core_node4 x:tlog_replica_test_basic_leader_election_shard1_replica_t2] o.a.s.c.CoreContainer Creating SolrCore 'tlog_replica_test_basic_leader_election_shard1_replica_t2' using configuration from collection tlog_replica_test_basic_leader_election, trusted=true
   [junit4]   2> 2770160 INFO  (qtp216526097-31535) [n:127.0.0.1:63912_solr c:tlog_replica_test_basic_leader_election s:shard1 r:core_node3 x:tlog_replica_test_basic_leader_election_shard1_replica_t1] o.a.s.m.r.SolrJmxReporter JMX monitoring for 'solr_63912.solr.core.tlog_replica_test_basic_leader_election.shard1.replica_t1' (registry 'solr.core.tlog_replica_test_basic_leader_election.shard1.replica_t1') enabled at server: com.sun.jmx.mbeanserver.JmxMBeanServer@2e5de21c
   [junit4]   2> 2770160 INFO  (qtp959088588-31534) [n:127.0.0.1:63911_solr c:tlog_replica_test_basic_leader_election s:shard1 r:core_node4 x:tlog_replica_test_basic_leader_election_shard1_replica_t2] o.a.s.m.r.SolrJmxReporter JMX monitoring for 'solr_63911.solr.core.tlog_replica_test_basic_leader_election.shard1.replica_t2' (registry 'solr.core.tlog_replica_test_basic_leader_election.shard1.replica_t2') enabled at server: com.sun.jmx.mbeanserver.JmxMBeanServer@2e5de21c
   [junit4]   2> 2770160 INFO  (qtp216526097-31535) [n:127.0.0.1:63912_solr c:tlog_replica_test_basic_leader_election s:shard1 r:core_node3 x:tlog_replica_test_basic_leader_election_shard1_replica_t1] o.a.s.c.SolrCore [[tlog_replica_test_basic_leader_election_shard1_replica_t1] ] Opening new SolrCore at [/Users/jenkins/workspace/Lucene-Solr-master-MacOSX/solr/build/solr-core/test/J1/temp/solr.cloud.TestTlogReplica_120442557453C590-001/tempDir-001/node1/tlog_replica_test_basic_leader_election_shard1_replica_t1], dataDir=[/Users/jenkins/workspace/Lucene-Solr-master-MacOSX/solr/build/solr-core/test/J1/temp/solr.cloud.TestTlogReplica_120442557453C590-001/tempDir-001/node1/./tlog_replica_test_basic_leader_election_shard1_replica_t1/data/]
   [junit4]   2> 2770160 INFO  (qtp959088588-31534) [n:127.0.0.1:63911_solr c:tlog_replica_test_basic_leader_election s:shard1 r:core_node4 x:tlog_replica_test_basic_leader_election_shard1_replica_t2] o.a.s.c.SolrCore [[tlog_replica_test_basic_leader_election_shard1_replica_t2] ] Opening new SolrCore at [/Users/jenkins/workspace/Lucene-Solr-master-MacOSX/solr/build/solr-core/test/J1/temp/solr.cloud.TestTlogReplica_120442557453C590-001/tempDir-001/node2/tlog_replica_test_basic_leader_election_shard1_replica_t2], dataDir=[/Users/jenkins/workspace/Lucene-Solr-master-MacOSX/solr/build/solr-core/test/J1/temp/solr.cloud.TestTlogReplica_120442557453C590-001/tempDir-001/node2/./tlog_replica_test_basic_leader_election_shard1_replica_t2/data/]
   [junit4]   2> 2770206 INFO  (qtp216526097-31535) [n:127.0.0.1:63912_solr c:tlog_replica_test_basic_leader_election s:shard1 r:core_node3 x:tlog_replica_test_basic_leader_election_shard1_replica_t1] o.a.s.u.UpdateHandler Using UpdateLog implementation: org.apache.solr.update.UpdateLog
   [junit4]   2> 2770206 INFO  (qtp216526097-31535) [n:127.0.0.1:63912_solr c:tlog_replica_test_basic_leader_election s:shard1 r:core_node3 x:tlog_replica_test_basic_leader_election_shard1_replica_t1] o.a.s.u.UpdateLog Initializing UpdateLog: dataDir=null defaultSyncLevel=FLUSH numRecordsToKeep=100 maxNumLogsToKeep=10 numVersionBuckets=65536
   [junit4]   2> 2770206 INFO  (qtp959088588-31534) [n:127.0.0.1:63911_solr c:tlog_replica_test_basic_leader_election s:shard1 r:core_node4 x:tlog_replica_test_basic_leader_election_shard1_replica_t2] o.a.s.u.UpdateHandler Using UpdateLog implementation: org.apache.solr.update.UpdateLog
   [junit4]   2> 2770206 INFO  (qtp959088588-31534) [n:127.0.0.1:63911_solr c:tlog_replica_test_basic_leader_election s:shard1 r:core_node4 x:tlog_replica_test_basic_leader_election_shard1_replica_t2] o.a.s.u.UpdateLog Initializing UpdateLog: dataDir=null defaultSyncLevel=FLUSH numRecordsToKeep=100 maxNumLogsToKeep=10 numVersionBuckets=65536
   [junit4]   2> 2770218 INFO  (qtp216526097-31535) [n:127.0.0.1:63912_solr c:tlog_replica_test_basic_leader_election s:shard1 r:core_node3 x:tlog_replica_test_basic_leader_election_shard1_replica_t1] o.a.s.u.CommitTracker Hard AutoCommit: disabled
   [junit4]   2> 2770218 INFO  (qtp216526097-31535) [n:127.0.0.1:63912_solr c:tlog_replica_test_basic_leader_election s:shard1 r:core_node3 x:tlog_replica_test_basic_leader_election_shard1_replica_t1] o.a.s.u.CommitTracker Soft AutoCommit: disabled
   [junit4]   2> 2770218 INFO  (qtp959088588-31534) [n:127.0.0.1:63911_solr c:tlog_replica_test_basic_leader_election s:shard1 r:core_node4 x:tlog_replica_test_basic_leader_election_shard1_replica_t2] o.a.s.u.CommitTracker Hard AutoCommit: disabled
   [junit4]   2> 2770218 INFO  (qtp959088588-31534) [n:127.0.0.1:63911_solr c:tlog_replica_test_basic_leader_election s:shard1 r:core_node4 x:tlog_replica_test_basic_leader_election_shard1_replica_t2] o.a.s.u.CommitTracker Soft AutoCommit: disabled
   [junit4]   2> 2770219 INFO  (qtp216526097-31535) [n:127.0.0.1:63912_solr c:tlog_replica_test_basic_leader_election s:shard1 r:core_node3 x:tlog_replica_test_basic_leader_election_shard1_replica_t1] o.a.s.s.SolrIndexSearcher Opening [Searcher@59a3cea5[tlog_replica_test_basic_leader_election_shard1_replica_t1] main]
   [junit4]   2> 2770219 INFO  (qtp959088588-31534) [n:127.0.0.1:63911_solr c:tlog_replica_test_basic_leader_election s:shard1 r:core_node4 x:tlog_replica_test_basic_leader_election_shard1_replica_t2] o.a.s.s.SolrIndexSearcher Opening [Searcher@1b649130[tlog_replica_test_basic_leader_election_shard1_replica_t2] main]
   [junit4]   2> 2770220 INFO  (qtp216526097-31535) [n:127.0.0.1:63912_solr c:tlog_replica_test_basic_leader_election s:shard1 r:core_node3 x:tlog_replica_test_basic_leader_election_shard1_replica_t1] o.a.s.r.ManagedResourceStorage Configured ZooKeeperStorageIO with znodeBase: /configs/conf
   [junit4]   2> 2770220 INFO  (qtp959088588-31534) [n:127.0.0.1:63911_solr c:tlog_replica_test_basic_leader_election s:shard1 r:core_node4 x:tlog_replica_test_basic_leader_election_shard1_replica_t2] o.a.s.r.ManagedResourceStorage Configured ZooKeeperStorageIO with znodeBase: /configs/conf
   [junit4]   2> 2770221 INFO  (qtp959088588-31534) [n:127.0.0.1:63911_solr c:tlog_replica_test_basic_leader_election s:shard1 r:core_node4 x:tlog_replica_test_basic_leader_election_shard1_replica_t2] o.a.s.r.ManagedResourceStorage Loaded null at path _rest_managed.json using ZooKeeperStorageIO:path=/configs/conf
   [junit4]   2> 2770221 INFO  (qtp216526097-31535) [n:127.0.0.1:63912_solr c:tlog_replica_test_basic_leader_election s:shard1 r:core_node3 x:tlog_replica_test_basic_leader_election_shard1_replica_t1] o.a.s.r.ManagedResourceStorage Loaded null at path _rest_managed.json using ZooKeeperStorageIO:path=/configs/conf
   [junit4]   2> 2770221 INFO  (qtp959088588-31534) [n:127.0.0.1:63911_solr c:tlog_replica_test_basic_leader_election s:shard1 r:core_node4 x:tlog_replica_test_basic_leader_election_shard1_replica_t2] o.a.s.h.ReplicationHandler Commits will be reserved for 10000ms.
   [junit4]   2> 2770221 INFO  (qtp216526097-31535) [n:127.0.0.1:63912_solr c:tlog_replica_test_basic_leader_election s:shard1 r:core_node3 x:tlog_replica_test_basic_leader_election_shard1_replica_t1] o.a.s.h.ReplicationHandler Commits will be reserved for 10000ms.
   [junit4]   2> 2770221 INFO  (qtp959088588-31534) [n:127.0.0.1:63911_solr c:tlog_replica_test_basic_leader_election s:shard1 r:core_node4 x:tlog_replica_test_basic_leader_election_shard1_replica_t2] o.a.s.u.UpdateLog Could not find max version in index or recent updates, using new clock 1615938346271375360
   [junit4]   2> 2770221 INFO  (qtp216526097-31535) [n:127.0.0.1:63912_solr c:tlog_replica_test_basic_leader_election s:shard1 r:core_node3 x:tlog_replica_test_basic_leader_election_shard1_replica_t1] o.a.s.u.UpdateLog Could not find max version in index or recent updates, using new clock 1615938346271375360
   [junit4]   2> 2770222 INFO  (searcherExecutor-12498-thread-1-processing-n:127.0.0.1:63911_solr x:tlog_replica_test_basic_leader_election_shard1_replica_t2 c:tlog_replica_test_basic_leader_election s:shard1 r:core_node4) [n:127.0.0.1:63911_solr c:tlog_replica_test_basic_leader_election s:shard1 r:core_node4 x:tlog_replica_test_basic_leader_election_shard1_replica_t2] o.a.s.c.SolrCore [tlog_replica_test_basic_leader_election_shard1_replica_t2] Registered new searcher Searcher@1b649130[tlog_replica_test_basic_leader_election_shard1_replica_t2] main{ExitableDirectoryReader(UninvertingDirectoryReader())}
   [junit4]   2> 2770222 INFO  (searcherExecutor-12497-thread-1-processing-n:127.0.0.1:63912_solr x:tlog_replica_test_basic_leader_election_shard1_replica_t1 c:tlog_replica_test_basic_leader_election s:shard1 r:core_node3) [n:127.0.0.1:63912_solr c:tlog_replica_test_basic_leader_election s:shard1 r:core_node3 x:tlog_replica_test_basic_leader_election_shard1_replica_t1] o.a.s.c.SolrCore [tlog_replica_test_basic_leader_election_shard1_replica_t1] Registered new searcher Searcher@59a3cea5[tlog_replica_test_basic_leader_election_shard1_replica_t1] main{ExitableDirectoryReader(UninvertingDirectoryReader())}
   [junit4]   2> 2770230 INFO  (qtp959088588-31534) [n:127.0.0.1:63911_solr c:tlog_replica_test_basic_leader_election s:shard1 r:core_node4 x:tlog_replica_test_basic_leader_election_shard1_replica_t2] o.a.s.c.ZkShardTerms Successful update of terms at /collections/tlog_replica_test_basic_leader_election/terms/shard1 to Terms{values={core_node4=0}, version=0}
   [junit4]   2> 2770230 INFO  (qtp216526097-31535) [n:127.0.0.1:63912_solr c:tlog_replica_test_basic_leader_election s:shard1 r:core_node3 x:tlog_replica_test_basic_leader_election_shard1_replica_t1] o.a.s.c.ZkShardTerms Failed to save terms, version is not a match, retrying
   [junit4]   2> 2770231 INFO  (qtp216526097-31535) [n:127.0.0.1:63912_solr c:tlog_replica_test_basic_leader_election s:shard1 r:core_node3 x:tlog_replica_test_basic_leader_election_shard1_replica_t1] o.a.s.c.ZkShardTerms Successful update of terms at /collections/tlog_replica_test_basic_leader_election/terms/shard1 to Terms{values={core_node3=0, core_node4=0}, version=1}
   [junit4]   2> 2770238 INFO  (qtp959088588-31534) [n:127.0.0.1:63911_solr c:tlog_replica_test_basic_leader_election s:shard1 r:core_node4 x:tlog_replica_test_basic_leader_election_shard1_replica_t2] o.a.s.c.ShardLeaderElectionContext Enough replicas found to continue.
   [junit4]   2> 2770238 INFO  (qtp959088588-31534) [n:127.0.0.1:63911_solr c:tlog_replica_test_basic_leader_election s:shard1 r:core_node4 x:tlog_replica_test_basic_leader_election_shard1_replica_t2] o.a.s.c.ShardLeaderElectionContext I may be the new leader - try and sync
   [junit4]   2> 2770238 INFO  (qtp959088588-31534) [n:127.0.0.1:63911_solr c:tlog_replica_test_basic_leader_election s:shard1 r:core_node4 x:tlog_replica_test_basic_leader_election_shard1_replica_t2] o.a.s.c.SyncStrategy Sync replicas to https://127.0.0.1:63911/solr/tlog_replica_test_basic_leader_election_shard1_replica_t2/
   [junit4]   2> 2770238 DEBUG (OverseerStateUpdate-72277272206245892-127.0.0.1:63911_solr-n_0000000000) [n:127.0.0.1:63911_solr    ] o.a.s.c.Overseer processMessage: queueSize: 1, message = {
   [junit4]   2>   "operation":"leader",
   [junit4]   2>   "shard":"shard1",
   [junit4]   2>   "collection":"tlog_replica_test_basic_leader_election"} current state version: 0
   [junit4]   2> 2770238 INFO  (qtp959088588-31534) [n:127.0.0.1:63911_solr c:tlog_replica_test_basic_leader_election s:shard1 r:core_node4 x:tlog_replica_test_basic_leader_election_shard1_replica_t2] o.a.s.u.PeerSync PeerSync: core=tlog_replica_test_basic_leader_election_shard1_replica_t2 url=https://127.0.0.1:63911/solr START replicas=[https://127.0.0.1:63912/solr/tlog_replica_test_basic_leader_election_shard1_replica_t1/] nUpdates=100
   [junit4]   2> 2770239 INFO  (qtp959088588-31534) [n:127.0.0.1:63911_solr c:tlog_replica_test_basic_leader_election s:shard1 r:core_node4 x:tlog_replica_test_basic_leader_election_shard1_replica_t2] o.a.s.u.PeerSync PeerSync: core=tlog_replica_test_basic_leader_election_shard1_replica_t2 url=https://127.0.0.1:63911/solr DONE.  We have no versions.  sync failed.
   [junit4]   2> 2770241 INFO  (qtp216526097-31528) [n:127.0.0.1:63912_solr c:tlog_replica_test_basic_leader_election s:shard1 r:core_node3 x:tlog_replica_test_basic_leader_election_shard1_replica_t1] o.a.s.c.S.Request [tlog_replica_test_basic_leader_election_shard1_replica_t1]  webapp=/solr path=/get params={distrib=false&qt=/get&fingerprint=false&getVersions=100&wt=javabin&version=2} status=0 QTime=0
   [junit4]   2> 2770241 INFO  (qtp959088588-31534) [n:127.0.0.1:63911_solr c:tlog_replica_test_basic_leader_election s:shard1 r:core_node4 x:tlog_replica_test_basic_leader_election_shard1_replica_t2] o.a.s.c.SyncStrategy Leader's attempt to sync with shard failed, moving to the next candidate
   [junit4]   2> 2770241 INFO  (qtp959088588-31534) [n:127.0.0.1:63911_solr c:tlog_replica_test_basic_leader_election s:shard1 r:core_node4 x:tlog_replica_test_basic_leader_election_shard1_replica_t2] o.a.s.c.ShardLeaderElectionContext We failed sync, but we have no versions - we can't sync in that case - we were active before, so become leader anyway
   [junit4]   2> 2770241 INFO  (qtp959088588-31534) [n:127.0.0.1:63911_solr c:tlog_replica_test_basic_leader_election s:shard1 r:core_node4 x:tlog_replica_test_basic_leader_election_shard1_replica_t2] o.a.s.c.ZkController tlog_replica_test_basic_leader_election_shard1_replica_t2 stopping background replication from leader
   [junit4]   2> 2770247 INFO  (qtp959088588-31534) [n:127.0.0.1:63911_solr c:tlog_replica_test_basic_leader_election s:shard1 r:core_node4 x:tlog_replica_test_basic_leader_election_shard1_replica_t2] o.a.s.c.ShardLeaderElectionContext I a

[...truncated too long message...]

FO  (zkCallback-392-thread-1) [    ] o.a.s.c.c.ZkStateReader Updated live nodes from ZooKeeper... (2) -> (1)
   [junit4]   2> 335470 INFO  (jetty-closer-266-thread-2) [    ] o.a.s.m.SolrMetricManager Closing metric reporters for registry=solr.cluster, tag=null
   [junit4]   2> 335470 INFO  (zkCallback-334-thread-3) [    ] o.a.s.c.c.ZkStateReader Updated live nodes from ZooKeeper... (2) -> (0)
   [junit4]   2> 335474 INFO  (zkCallback-341-thread-1) [    ] o.a.s.c.c.ZkStateReader Updated live nodes from ZooKeeper... (1) -> (0)
   [junit4]   2> 335475 INFO  (zkCallback-385-thread-4) [    ] o.a.s.c.c.ZkStateReader Updated live nodes from ZooKeeper... (1) -> (0)
   [junit4]   2> 335476 INFO  (zkCallback-392-thread-2) [    ] o.a.s.c.c.ZkStateReader Updated live nodes from ZooKeeper... (1) -> (0)
   [junit4]   2> 335478 INFO  (jetty-closer-266-thread-2) [    ] o.a.s.c.Overseer Overseer (id=72277426128683025-127.0.0.1:56264_solr-n_0000000003) closing
   [junit4]   2> 335479 INFO  (OverseerStateUpdate-72277426128683025-127.0.0.1:56264_solr-n_0000000003) [n:127.0.0.1:56264_solr    ] o.a.s.c.Overseer Overseer Loop exiting : 127.0.0.1:56264_solr
   [junit4]   2> 335480 WARN  (OverseerAutoScalingTriggerThread-72277426128683025-127.0.0.1:56264_solr-n_0000000003) [    ] o.a.s.c.a.OverseerTriggerThread OverseerTriggerThread woken up but we are closed, exiting.
   [junit4]   2> 335484 INFO  (jetty-closer-266-thread-1) [    ] o.e.j.s.h.ContextHandler Stopped o.e.j.s.ServletContextHandler@54861c71{/solr,null,UNAVAILABLE}
   [junit4]   2> 335484 INFO  (jetty-closer-266-thread-1) [    ] o.e.j.s.session node0 Stopped scavenging
   [junit4]   2> 335487 INFO  (jetty-closer-266-thread-2) [    ] o.e.j.s.h.ContextHandler Stopped o.e.j.s.ServletContextHandler@7f87dea7{/solr,null,UNAVAILABLE}
   [junit4]   2> 335487 INFO  (jetty-closer-266-thread-2) [    ] o.e.j.s.session node0 Stopped scavenging
   [junit4]   2> 335488 ERROR (SUITE-TestTlogReplica-seed#[120442557453C590]-worker) [    ] o.a.z.s.ZooKeeperServer ZKShutdownHandler is not registered, so ZooKeeper server won't take any action on ERROR or SHUTDOWN server state changes
   [junit4]   2> 335489 INFO  (SUITE-TestTlogReplica-seed#[120442557453C590]-worker) [    ] o.a.s.c.ZkTestServer connecting to 127.0.0.1:56261 56261
   [junit4]   2> 335510 INFO  (Thread-152) [    ] o.a.s.c.ZkTestServer connecting to 127.0.0.1:56261 56261
   [junit4]   2> 335729 WARN  (Thread-152) [    ] o.a.s.c.ZkTestServer Watch limit violations: 
   [junit4]   2> Maximum concurrent create/delete watches above limit:
   [junit4]   2> 
   [junit4]   2> 	31	/solr/configs/conf
   [junit4]   2> 	31	/solr/collections/tlog_replica_test_create_delete/terms/shard2
   [junit4]   2> 	31	/solr/collections/tlog_replica_test_create_delete/terms/shard1
   [junit4]   2> 	19	/solr/collections/tlog_replica_test_remove_leader/terms/shard1
   [junit4]   2> 	18	/solr/collections/tlog_replica_test_recovery/terms/shard1
   [junit4]   2> 	16	/solr/collections/tlog_replica_test_kill_leader/terms/shard1
   [junit4]   2> 	16	/solr/collections/tlog_replica_test_kill_tlog_replica/terms/shard1
   [junit4]   2> 	15	/solr/aliases.json
   [junit4]   2> 	15	/solr/collections/tlog_replica_test_basic_leader_election/terms/shard1
   [junit4]   2> 	11	/solr/collections/tlog_replica_test_real_time_get/terms/shard1
   [junit4]   2> 	10	/solr/collections/tlog_replica_test_out_of_order_db_qwith_in_place_updates/terms/shard1
   [junit4]   2> 	10	/solr/collections/tlog_replica_test_delete_by_id/terms/shard1
   [junit4]   2> 	9	/solr/collections/tlog_replica_test_only_leader_indexes/terms/shard1
   [junit4]   2> 	7	/solr/security.json
   [junit4]   2> 	6	/solr/collections/tlog_replica_test_add_remove_tlog_replica/terms/shard2
   [junit4]   2> 	5	/solr/collections/tlog_replica_test_add_remove_tlog_replica/terms/shard1
   [junit4]   2> 	4	/solr/collections/tlog_replica_test_add_docs/terms/shard1
   [junit4]   2> 
   [junit4]   2> Maximum concurrent data watches above limit:
   [junit4]   2> 
   [junit4]   2> 	24	/solr/collections/tlog_replica_test_create_delete/state.json
   [junit4]   2> 	16	/solr/collections/tlog_replica_test_out_of_order_db_qwith_in_place_updates/state.json
   [junit4]   2> 	15	/solr/clusterprops.json
   [junit4]   2> 	15	/solr/clusterstate.json
   [junit4]   2> 	11	/solr/collections/tlog_replica_test_recovery/state.json
   [junit4]   2> 	8	/solr/collections/tlog_replica_test_kill_leader/state.json
   [junit4]   2> 	8	/solr/collections/tlog_replica_test_basic_leader_election/state.json
   [junit4]   2> 	7	/solr/collections/tlog_replica_test_kill_tlog_replica/state.json
   [junit4]   2> 	6	/solr/collections/tlog_replica_test_remove_leader/state.json
   [junit4]   2> 	5	/solr/collections/tlog_replica_test_real_time_get/state.json
   [junit4]   2> 	3	/solr/overseer_elect/election/72277426128683014-127.0.0.1:56263_solr-n_0000000000
   [junit4]   2> 	3	/solr/overseer_elect/election/72277426128683025-127.0.0.1:56264_solr-n_0000000003
   [junit4]   2> 	3	/solr/collections/tlog_replica_test_add_remove_tlog_replica/state.json
   [junit4]   2> 	3	/solr/collections/tlog_replica_test_create_delete/leader_elect/shard2/election/72277426128683037-core_node11-n_0000000001
   [junit4]   2> 	3	/solr/collections/tlog_replica_test_only_leader_indexes/state.json
   [junit4]   2> 	3	/solr/collections/tlog_replica_test_delete_by_id/state.json
   [junit4]   2> 	2	/solr/collections/tlog_replica_test_kill_tlog_replica/leader_elect/shard1/election/72277426128683025-core_node4-n_0000000000
   [junit4]   2> 	2	/solr/collections/tlog_replica_test_create_delete/leader_elect/shard2/election/72277426128683025-core_node13-n_0000000000
   [junit4]   2> 	2	/solr/collections/tlog_replica_test_add_docs/state.json
   [junit4]   2> 	2	/solr/autoscaling.json
   [junit4]   2> 	2	/solr/collections/tlog_replica_test_recovery/leader_elect/shard1/election/72277426128683014-core_node3-n_0000000000
   [junit4]   2> 	2	/solr/collections/tlog_replica_test_create_delete/leader_elect/shard1/election/72277426128683037-core_node9-n_0000000001
   [junit4]   2> 
   [junit4]   2> Maximum concurrent children watches above limit:
   [junit4]   2> 
   [junit4]   2> 	15	/solr/live_nodes
   [junit4]   2> 	15	/solr/collections
   [junit4]   2> 	2	/solr/overseer/queue
   [junit4]   2> 	2	/solr/autoscaling/events/.scheduled_maintenance
   [junit4]   2> 	2	/solr/autoscaling/events/.auto_add_replicas
   [junit4]   2> 	2	/solr/overseer/queue-work
   [junit4]   2> 	2	/solr/overseer/collection-queue-work
   [junit4]   2> 
   [junit4]   2> NOTE: leaving temporary files on disk at: /Users/jenkins/workspace/Lucene-Solr-master-MacOSX/solr/build/solr-core/test/J0/temp/solr.cloud.TestTlogReplica_120442557453C590-003
   [junit4]   2> NOTE: test params are: codec=Asserting(Lucene80): {foo=PostingsFormat(name=MockRandom), title_s=PostingsFormat(name=MockRandom), id=Lucene50(blocksize=128), foo_s=PostingsFormat(name=MockRandom)}, docValues:{_version_=DocValuesFormat(name=Lucene70), id=DocValuesFormat(name=Direct), inplace_updatable_int=DocValuesFormat(name=Asserting)}, maxPointsInLeafNode=459, maxMBSortInHeap=5.537521586034842, sim=Asserting(org.apache.lucene.search.similarities.AssertingSimilarity@4e27162d), locale=fr-DZ, timezone=Europe/Vienna
   [junit4]   2> NOTE: Mac OS X 10.11.6 x86_64/Oracle Corporation 9 (64-bit)/cpus=3,threads=1,free=70160792,total=162590720
   [junit4]   2> NOTE: All tests run in this JVM: [TestTlogReplica, TestTlogReplica, TestTlogReplica]
   [junit4] Completed [5/5 (5!)] on J0 in 106.57s, 13 tests, 1 failure <<< FAILURES!

[...truncated 1 lines...]
   [junit4] JVM J0: stderr was not empty, see: /Users/jenkins/workspace/Lucene-Solr-master-MacOSX/solr/build/solr-core/test/temp/junit4-J0-20181101_140334_98214614333591355277399.syserr
   [junit4] >>> JVM J0 emitted unexpected output (verbatim) ----
   [junit4] Java HotSpot(TM) 64-Bit Server VM warning: Option UseConcMarkSweepGC was deprecated in version 9.0 and will likely be removed in a future release.
   [junit4] <<< JVM J0: EOF ----

[...truncated 13 lines...]
BUILD FAILED
/Users/jenkins/workspace/Lucene-Solr-master-MacOSX/lucene/common-build.xml:1567: The following error occurred while executing this line:
/Users/jenkins/workspace/Lucene-Solr-master-MacOSX/lucene/common-build.xml:1092: There were test failures: 5 suites, 65 tests, 5 failures [seed: 120442557453C590]

Total time: 5 minutes 39 seconds

[repro] Setting last failure code to 256

[repro] Failures:
[repro]   5/5 failed: org.apache.solr.cloud.TestTlogReplica
[repro] Exiting with code 256
+ mv lucene/build lucene/build.repro
+ mv solr/build solr/build.repro
+ mv lucene/build.orig lucene/build
+ mv solr/build.orig solr/build
Archiving artifacts
Setting ANT_1_8_2_HOME=/Users/jenkins/tools/hudson.tasks.Ant_AntInstallation/ANT_1.8.2
[WARNINGS] Parsing warnings in console log with parser Java Compiler (javac)
Setting ANT_1_8_2_HOME=/Users/jenkins/tools/hudson.tasks.Ant_AntInstallation/ANT_1.8.2
Setting ANT_1_8_2_HOME=/Users/jenkins/tools/hudson.tasks.Ant_AntInstallation/ANT_1.8.2
<Git Blamer> Using GitBlamer to create author and commit information for all warnings.
<Git Blamer> GIT_COMMIT=05f72a77efb13517885618597f14cf0d76bd31f7, workspace=/Users/jenkins/workspace/Lucene-Solr-master-MacOSX
[WARNINGS] Computing warning deltas based on reference build #4905
Recording test results
Setting ANT_1_8_2_HOME=/Users/jenkins/tools/hudson.tasks.Ant_AntInstallation/ANT_1.8.2
Build step 'Publish JUnit test result report' changed build result to UNSTABLE
Email was triggered for: Unstable (Test Failures)
Sending email for trigger: Unstable (Test Failures)
Setting ANT_1_8_2_HOME=/Users/jenkins/tools/hudson.tasks.Ant_AntInstallation/ANT_1.8.2
Setting ANT_1_8_2_HOME=/Users/jenkins/tools/hudson.tasks.Ant_AntInstallation/ANT_1.8.2
Setting ANT_1_8_2_HOME=/Users/jenkins/tools/hudson.tasks.Ant_AntInstallation/ANT_1.8.2
Setting ANT_1_8_2_HOME=/Users/jenkins/tools/hudson.tasks.Ant_AntInstallation/ANT_1.8.2

Mime
View raw message