lucene-dev mailing list archives

Site index · List index
Message view « Date » · « Thread »
Top « Date » · « Thread »
From Policeman Jenkins Server <jenk...@thetaphi.de>
Subject [JENKINS] Lucene-Solr-master-Windows (32bit/jdk1.8.0_172) - Build # 7599 - Still Unstable!
Date Thu, 01 Nov 2018 10:18:57 GMT
Build: https://jenkins.thetaphi.de/job/Lucene-Solr-master-Windows/7599/
Java: 32bit/jdk1.8.0_172 -server -XX:+UseConcMarkSweepGC

9 tests failed.
FAILED:  junit.framework.TestSuite.org.apache.solr.handler.extraction.ExtractingRequestHandlerTest

Error Message:
Is some other JVM affected?  Or bad regex? TzDisplayName: ChST

Stack Trace:
java.lang.AssertionError: Is some other JVM affected?  Or bad regex? TzDisplayName: ChST
	at __randomizedtesting.SeedInfo.seed([7A748D374035423E]:0)
	at org.junit.Assert.fail(Assert.java:93)
	at org.junit.Assert.assertTrue(Assert.java:43)
	at org.apache.solr.handler.extraction.ExtractingRequestHandlerTest.beforeClass(ExtractingRequestHandlerTest.java:50)
	at sun.reflect.NativeMethodAccessorImpl.invoke0(Native Method)
	at sun.reflect.NativeMethodAccessorImpl.invoke(NativeMethodAccessorImpl.java:62)
	at sun.reflect.DelegatingMethodAccessorImpl.invoke(DelegatingMethodAccessorImpl.java:43)
	at java.lang.reflect.Method.invoke(Method.java:498)
	at com.carrotsearch.randomizedtesting.RandomizedRunner.invoke(RandomizedRunner.java:1742)
	at com.carrotsearch.randomizedtesting.RandomizedRunner$6.evaluate(RandomizedRunner.java:875)
	at com.carrotsearch.randomizedtesting.RandomizedRunner$7.evaluate(RandomizedRunner.java:891)
	at com.carrotsearch.randomizedtesting.rules.StatementAdapter.evaluate(StatementAdapter.java:36)
	at com.carrotsearch.randomizedtesting.rules.SystemPropertiesRestoreRule$1.evaluate(SystemPropertiesRestoreRule.java:57)
	at org.apache.lucene.util.AbstractBeforeAfterRule$1.evaluate(AbstractBeforeAfterRule.java:45)
	at com.carrotsearch.randomizedtesting.rules.StatementAdapter.evaluate(StatementAdapter.java:36)
	at org.apache.lucene.util.TestRuleStoreClassName$1.evaluate(TestRuleStoreClassName.java:41)
	at com.carrotsearch.randomizedtesting.rules.NoShadowingOrOverridesOnMethodsRule$1.evaluate(NoShadowingOrOverridesOnMethodsRule.java:40)
	at com.carrotsearch.randomizedtesting.rules.NoShadowingOrOverridesOnMethodsRule$1.evaluate(NoShadowingOrOverridesOnMethodsRule.java:40)
	at com.carrotsearch.randomizedtesting.rules.StatementAdapter.evaluate(StatementAdapter.java:36)
	at com.carrotsearch.randomizedtesting.rules.StatementAdapter.evaluate(StatementAdapter.java:36)
	at com.carrotsearch.randomizedtesting.rules.StatementAdapter.evaluate(StatementAdapter.java:36)
	at org.apache.lucene.util.TestRuleAssertionsRequired$1.evaluate(TestRuleAssertionsRequired.java:53)
	at org.apache.lucene.util.TestRuleMarkFailure$1.evaluate(TestRuleMarkFailure.java:47)
	at org.apache.lucene.util.TestRuleIgnoreAfterMaxFailures$1.evaluate(TestRuleIgnoreAfterMaxFailures.java:64)
	at org.apache.lucene.util.TestRuleIgnoreTestSuites$1.evaluate(TestRuleIgnoreTestSuites.java:54)
	at com.carrotsearch.randomizedtesting.rules.StatementAdapter.evaluate(StatementAdapter.java:36)
	at com.carrotsearch.randomizedtesting.ThreadLeakControl$StatementRunner.run(ThreadLeakControl.java:368)
	at java.lang.Thread.run(Thread.java:748)


FAILED:  junit.framework.TestSuite.org.apache.solr.handler.extraction.ExtractingRequestHandlerTest

Error Message:
Is some other JVM affected?  Or bad regex? TzDisplayName: ChST

Stack Trace:
java.lang.AssertionError: Is some other JVM affected?  Or bad regex? TzDisplayName: ChST
	at __randomizedtesting.SeedInfo.seed([7A748D374035423E]:0)
	at org.junit.Assert.fail(Assert.java:93)
	at org.junit.Assert.assertTrue(Assert.java:43)
	at org.apache.solr.handler.extraction.ExtractingRequestHandlerTest.beforeClass(ExtractingRequestHandlerTest.java:50)
	at sun.reflect.NativeMethodAccessorImpl.invoke0(Native Method)
	at sun.reflect.NativeMethodAccessorImpl.invoke(NativeMethodAccessorImpl.java:62)
	at sun.reflect.DelegatingMethodAccessorImpl.invoke(DelegatingMethodAccessorImpl.java:43)
	at java.lang.reflect.Method.invoke(Method.java:498)
	at com.carrotsearch.randomizedtesting.RandomizedRunner.invoke(RandomizedRunner.java:1742)
	at com.carrotsearch.randomizedtesting.RandomizedRunner$6.evaluate(RandomizedRunner.java:875)
	at com.carrotsearch.randomizedtesting.RandomizedRunner$7.evaluate(RandomizedRunner.java:891)
	at com.carrotsearch.randomizedtesting.rules.StatementAdapter.evaluate(StatementAdapter.java:36)
	at com.carrotsearch.randomizedtesting.rules.SystemPropertiesRestoreRule$1.evaluate(SystemPropertiesRestoreRule.java:57)
	at org.apache.lucene.util.AbstractBeforeAfterRule$1.evaluate(AbstractBeforeAfterRule.java:45)
	at com.carrotsearch.randomizedtesting.rules.StatementAdapter.evaluate(StatementAdapter.java:36)
	at org.apache.lucene.util.TestRuleStoreClassName$1.evaluate(TestRuleStoreClassName.java:41)
	at com.carrotsearch.randomizedtesting.rules.NoShadowingOrOverridesOnMethodsRule$1.evaluate(NoShadowingOrOverridesOnMethodsRule.java:40)
	at com.carrotsearch.randomizedtesting.rules.NoShadowingOrOverridesOnMethodsRule$1.evaluate(NoShadowingOrOverridesOnMethodsRule.java:40)
	at com.carrotsearch.randomizedtesting.rules.StatementAdapter.evaluate(StatementAdapter.java:36)
	at com.carrotsearch.randomizedtesting.rules.StatementAdapter.evaluate(StatementAdapter.java:36)
	at com.carrotsearch.randomizedtesting.rules.StatementAdapter.evaluate(StatementAdapter.java:36)
	at org.apache.lucene.util.TestRuleAssertionsRequired$1.evaluate(TestRuleAssertionsRequired.java:53)
	at org.apache.lucene.util.TestRuleMarkFailure$1.evaluate(TestRuleMarkFailure.java:47)
	at org.apache.lucene.util.TestRuleIgnoreAfterMaxFailures$1.evaluate(TestRuleIgnoreAfterMaxFailures.java:64)
	at org.apache.lucene.util.TestRuleIgnoreTestSuites$1.evaluate(TestRuleIgnoreTestSuites.java:54)
	at com.carrotsearch.randomizedtesting.rules.StatementAdapter.evaluate(StatementAdapter.java:36)
	at com.carrotsearch.randomizedtesting.ThreadLeakControl$StatementRunner.run(ThreadLeakControl.java:368)
	at java.lang.Thread.run(Thread.java:748)


FAILED:  junit.framework.TestSuite.org.apache.solr.handler.extraction.ExtractingRequestHandlerTest

Error Message:
Is some other JVM affected?  Or bad regex? TzDisplayName: ChST

Stack Trace:
java.lang.AssertionError: Is some other JVM affected?  Or bad regex? TzDisplayName: ChST
	at __randomizedtesting.SeedInfo.seed([7A748D374035423E]:0)
	at org.junit.Assert.fail(Assert.java:93)
	at org.junit.Assert.assertTrue(Assert.java:43)
	at org.apache.solr.handler.extraction.ExtractingRequestHandlerTest.beforeClass(ExtractingRequestHandlerTest.java:50)
	at sun.reflect.NativeMethodAccessorImpl.invoke0(Native Method)
	at sun.reflect.NativeMethodAccessorImpl.invoke(NativeMethodAccessorImpl.java:62)
	at sun.reflect.DelegatingMethodAccessorImpl.invoke(DelegatingMethodAccessorImpl.java:43)
	at java.lang.reflect.Method.invoke(Method.java:498)
	at com.carrotsearch.randomizedtesting.RandomizedRunner.invoke(RandomizedRunner.java:1742)
	at com.carrotsearch.randomizedtesting.RandomizedRunner$6.evaluate(RandomizedRunner.java:875)
	at com.carrotsearch.randomizedtesting.RandomizedRunner$7.evaluate(RandomizedRunner.java:891)
	at com.carrotsearch.randomizedtesting.rules.StatementAdapter.evaluate(StatementAdapter.java:36)
	at com.carrotsearch.randomizedtesting.rules.SystemPropertiesRestoreRule$1.evaluate(SystemPropertiesRestoreRule.java:57)
	at org.apache.lucene.util.AbstractBeforeAfterRule$1.evaluate(AbstractBeforeAfterRule.java:45)
	at com.carrotsearch.randomizedtesting.rules.StatementAdapter.evaluate(StatementAdapter.java:36)
	at org.apache.lucene.util.TestRuleStoreClassName$1.evaluate(TestRuleStoreClassName.java:41)
	at com.carrotsearch.randomizedtesting.rules.NoShadowingOrOverridesOnMethodsRule$1.evaluate(NoShadowingOrOverridesOnMethodsRule.java:40)
	at com.carrotsearch.randomizedtesting.rules.NoShadowingOrOverridesOnMethodsRule$1.evaluate(NoShadowingOrOverridesOnMethodsRule.java:40)
	at com.carrotsearch.randomizedtesting.rules.StatementAdapter.evaluate(StatementAdapter.java:36)
	at com.carrotsearch.randomizedtesting.rules.StatementAdapter.evaluate(StatementAdapter.java:36)
	at com.carrotsearch.randomizedtesting.rules.StatementAdapter.evaluate(StatementAdapter.java:36)
	at org.apache.lucene.util.TestRuleAssertionsRequired$1.evaluate(TestRuleAssertionsRequired.java:53)
	at org.apache.lucene.util.TestRuleMarkFailure$1.evaluate(TestRuleMarkFailure.java:47)
	at org.apache.lucene.util.TestRuleIgnoreAfterMaxFailures$1.evaluate(TestRuleIgnoreAfterMaxFailures.java:64)
	at org.apache.lucene.util.TestRuleIgnoreTestSuites$1.evaluate(TestRuleIgnoreTestSuites.java:54)
	at com.carrotsearch.randomizedtesting.rules.StatementAdapter.evaluate(StatementAdapter.java:36)
	at com.carrotsearch.randomizedtesting.ThreadLeakControl$StatementRunner.run(ThreadLeakControl.java:368)
	at java.lang.Thread.run(Thread.java:748)


FAILED:  junit.framework.TestSuite.org.apache.solr.handler.extraction.ExtractingRequestHandlerTest

Error Message:
Is some other JVM affected?  Or bad regex? TzDisplayName: ChST

Stack Trace:
java.lang.AssertionError: Is some other JVM affected?  Or bad regex? TzDisplayName: ChST
	at __randomizedtesting.SeedInfo.seed([7A748D374035423E]:0)
	at org.junit.Assert.fail(Assert.java:93)
	at org.junit.Assert.assertTrue(Assert.java:43)
	at org.apache.solr.handler.extraction.ExtractingRequestHandlerTest.beforeClass(ExtractingRequestHandlerTest.java:50)
	at sun.reflect.NativeMethodAccessorImpl.invoke0(Native Method)
	at sun.reflect.NativeMethodAccessorImpl.invoke(NativeMethodAccessorImpl.java:62)
	at sun.reflect.DelegatingMethodAccessorImpl.invoke(DelegatingMethodAccessorImpl.java:43)
	at java.lang.reflect.Method.invoke(Method.java:498)
	at com.carrotsearch.randomizedtesting.RandomizedRunner.invoke(RandomizedRunner.java:1742)
	at com.carrotsearch.randomizedtesting.RandomizedRunner$6.evaluate(RandomizedRunner.java:875)
	at com.carrotsearch.randomizedtesting.RandomizedRunner$7.evaluate(RandomizedRunner.java:891)
	at com.carrotsearch.randomizedtesting.rules.StatementAdapter.evaluate(StatementAdapter.java:36)
	at com.carrotsearch.randomizedtesting.rules.SystemPropertiesRestoreRule$1.evaluate(SystemPropertiesRestoreRule.java:57)
	at org.apache.lucene.util.AbstractBeforeAfterRule$1.evaluate(AbstractBeforeAfterRule.java:45)
	at com.carrotsearch.randomizedtesting.rules.StatementAdapter.evaluate(StatementAdapter.java:36)
	at org.apache.lucene.util.TestRuleStoreClassName$1.evaluate(TestRuleStoreClassName.java:41)
	at com.carrotsearch.randomizedtesting.rules.NoShadowingOrOverridesOnMethodsRule$1.evaluate(NoShadowingOrOverridesOnMethodsRule.java:40)
	at com.carrotsearch.randomizedtesting.rules.NoShadowingOrOverridesOnMethodsRule$1.evaluate(NoShadowingOrOverridesOnMethodsRule.java:40)
	at com.carrotsearch.randomizedtesting.rules.StatementAdapter.evaluate(StatementAdapter.java:36)
	at com.carrotsearch.randomizedtesting.rules.StatementAdapter.evaluate(StatementAdapter.java:36)
	at com.carrotsearch.randomizedtesting.rules.StatementAdapter.evaluate(StatementAdapter.java:36)
	at org.apache.lucene.util.TestRuleAssertionsRequired$1.evaluate(TestRuleAssertionsRequired.java:53)
	at org.apache.lucene.util.TestRuleMarkFailure$1.evaluate(TestRuleMarkFailure.java:47)
	at org.apache.lucene.util.TestRuleIgnoreAfterMaxFailures$1.evaluate(TestRuleIgnoreAfterMaxFailures.java:64)
	at org.apache.lucene.util.TestRuleIgnoreTestSuites$1.evaluate(TestRuleIgnoreTestSuites.java:54)
	at com.carrotsearch.randomizedtesting.rules.StatementAdapter.evaluate(StatementAdapter.java:36)
	at com.carrotsearch.randomizedtesting.ThreadLeakControl$StatementRunner.run(ThreadLeakControl.java:368)
	at java.lang.Thread.run(Thread.java:748)


FAILED:  junit.framework.TestSuite.org.apache.solr.handler.extraction.ExtractingRequestHandlerTest

Error Message:
Is some other JVM affected?  Or bad regex? TzDisplayName: ChST

Stack Trace:
java.lang.AssertionError: Is some other JVM affected?  Or bad regex? TzDisplayName: ChST
	at __randomizedtesting.SeedInfo.seed([7A748D374035423E]:0)
	at org.junit.Assert.fail(Assert.java:93)
	at org.junit.Assert.assertTrue(Assert.java:43)
	at org.apache.solr.handler.extraction.ExtractingRequestHandlerTest.beforeClass(ExtractingRequestHandlerTest.java:50)
	at sun.reflect.NativeMethodAccessorImpl.invoke0(Native Method)
	at sun.reflect.NativeMethodAccessorImpl.invoke(NativeMethodAccessorImpl.java:62)
	at sun.reflect.DelegatingMethodAccessorImpl.invoke(DelegatingMethodAccessorImpl.java:43)
	at java.lang.reflect.Method.invoke(Method.java:498)
	at com.carrotsearch.randomizedtesting.RandomizedRunner.invoke(RandomizedRunner.java:1742)
	at com.carrotsearch.randomizedtesting.RandomizedRunner$6.evaluate(RandomizedRunner.java:875)
	at com.carrotsearch.randomizedtesting.RandomizedRunner$7.evaluate(RandomizedRunner.java:891)
	at com.carrotsearch.randomizedtesting.rules.StatementAdapter.evaluate(StatementAdapter.java:36)
	at com.carrotsearch.randomizedtesting.rules.SystemPropertiesRestoreRule$1.evaluate(SystemPropertiesRestoreRule.java:57)
	at org.apache.lucene.util.AbstractBeforeAfterRule$1.evaluate(AbstractBeforeAfterRule.java:45)
	at com.carrotsearch.randomizedtesting.rules.StatementAdapter.evaluate(StatementAdapter.java:36)
	at org.apache.lucene.util.TestRuleStoreClassName$1.evaluate(TestRuleStoreClassName.java:41)
	at com.carrotsearch.randomizedtesting.rules.NoShadowingOrOverridesOnMethodsRule$1.evaluate(NoShadowingOrOverridesOnMethodsRule.java:40)
	at com.carrotsearch.randomizedtesting.rules.NoShadowingOrOverridesOnMethodsRule$1.evaluate(NoShadowingOrOverridesOnMethodsRule.java:40)
	at com.carrotsearch.randomizedtesting.rules.StatementAdapter.evaluate(StatementAdapter.java:36)
	at com.carrotsearch.randomizedtesting.rules.StatementAdapter.evaluate(StatementAdapter.java:36)
	at com.carrotsearch.randomizedtesting.rules.StatementAdapter.evaluate(StatementAdapter.java:36)
	at org.apache.lucene.util.TestRuleAssertionsRequired$1.evaluate(TestRuleAssertionsRequired.java:53)
	at org.apache.lucene.util.TestRuleMarkFailure$1.evaluate(TestRuleMarkFailure.java:47)
	at org.apache.lucene.util.TestRuleIgnoreAfterMaxFailures$1.evaluate(TestRuleIgnoreAfterMaxFailures.java:64)
	at org.apache.lucene.util.TestRuleIgnoreTestSuites$1.evaluate(TestRuleIgnoreTestSuites.java:54)
	at com.carrotsearch.randomizedtesting.rules.StatementAdapter.evaluate(StatementAdapter.java:36)
	at com.carrotsearch.randomizedtesting.ThreadLeakControl$StatementRunner.run(ThreadLeakControl.java:368)
	at java.lang.Thread.run(Thread.java:748)


FAILED:  junit.framework.TestSuite.org.apache.solr.handler.extraction.ExtractingRequestHandlerTest

Error Message:
Is some other JVM affected?  Or bad regex? TzDisplayName: ChST

Stack Trace:
java.lang.AssertionError: Is some other JVM affected?  Or bad regex? TzDisplayName: ChST
	at __randomizedtesting.SeedInfo.seed([7A748D374035423E]:0)
	at org.junit.Assert.fail(Assert.java:93)
	at org.junit.Assert.assertTrue(Assert.java:43)
	at org.apache.solr.handler.extraction.ExtractingRequestHandlerTest.beforeClass(ExtractingRequestHandlerTest.java:50)
	at sun.reflect.NativeMethodAccessorImpl.invoke0(Native Method)
	at sun.reflect.NativeMethodAccessorImpl.invoke(NativeMethodAccessorImpl.java:62)
	at sun.reflect.DelegatingMethodAccessorImpl.invoke(DelegatingMethodAccessorImpl.java:43)
	at java.lang.reflect.Method.invoke(Method.java:498)
	at com.carrotsearch.randomizedtesting.RandomizedRunner.invoke(RandomizedRunner.java:1742)
	at com.carrotsearch.randomizedtesting.RandomizedRunner$6.evaluate(RandomizedRunner.java:875)
	at com.carrotsearch.randomizedtesting.RandomizedRunner$7.evaluate(RandomizedRunner.java:891)
	at com.carrotsearch.randomizedtesting.rules.StatementAdapter.evaluate(StatementAdapter.java:36)
	at com.carrotsearch.randomizedtesting.rules.SystemPropertiesRestoreRule$1.evaluate(SystemPropertiesRestoreRule.java:57)
	at org.apache.lucene.util.AbstractBeforeAfterRule$1.evaluate(AbstractBeforeAfterRule.java:45)
	at com.carrotsearch.randomizedtesting.rules.StatementAdapter.evaluate(StatementAdapter.java:36)
	at org.apache.lucene.util.TestRuleStoreClassName$1.evaluate(TestRuleStoreClassName.java:41)
	at com.carrotsearch.randomizedtesting.rules.NoShadowingOrOverridesOnMethodsRule$1.evaluate(NoShadowingOrOverridesOnMethodsRule.java:40)
	at com.carrotsearch.randomizedtesting.rules.NoShadowingOrOverridesOnMethodsRule$1.evaluate(NoShadowingOrOverridesOnMethodsRule.java:40)
	at com.carrotsearch.randomizedtesting.rules.StatementAdapter.evaluate(StatementAdapter.java:36)
	at com.carrotsearch.randomizedtesting.rules.StatementAdapter.evaluate(StatementAdapter.java:36)
	at com.carrotsearch.randomizedtesting.rules.StatementAdapter.evaluate(StatementAdapter.java:36)
	at org.apache.lucene.util.TestRuleAssertionsRequired$1.evaluate(TestRuleAssertionsRequired.java:53)
	at org.apache.lucene.util.TestRuleMarkFailure$1.evaluate(TestRuleMarkFailure.java:47)
	at org.apache.lucene.util.TestRuleIgnoreAfterMaxFailures$1.evaluate(TestRuleIgnoreAfterMaxFailures.java:64)
	at org.apache.lucene.util.TestRuleIgnoreTestSuites$1.evaluate(TestRuleIgnoreTestSuites.java:54)
	at com.carrotsearch.randomizedtesting.rules.StatementAdapter.evaluate(StatementAdapter.java:36)
	at com.carrotsearch.randomizedtesting.ThreadLeakControl$StatementRunner.run(ThreadLeakControl.java:368)
	at java.lang.Thread.run(Thread.java:748)


FAILED:  junit.framework.TestSuite.org.apache.solr.client.solrj.impl.CloudSolrClientTest

Error Message:
ObjectTracker found 5 object(s) that were not released!!! [MockDirectoryWrapper, MockDirectoryWrapper, SolrCore, MockDirectoryWrapper, MockDirectoryWrapper] org.apache.solr.common.util.ObjectReleaseTracker$ObjectTrackerException: org.apache.lucene.store.MockDirectoryWrapper  at org.apache.solr.common.util.ObjectReleaseTracker.track(ObjectReleaseTracker.java:42)  at org.apache.solr.core.CachingDirectoryFactory.get(CachingDirectoryFactory.java:348)  at org.apache.solr.handler.IndexFetcher.fetchLatestIndex(IndexFetcher.java:504)  at org.apache.solr.handler.IndexFetcher.fetchLatestIndex(IndexFetcher.java:347)  at org.apache.solr.handler.ReplicationHandler.doFetch(ReplicationHandler.java:421)  at org.apache.solr.handler.ReplicationHandler.lambda$setupPolling$13(ReplicationHandler.java:1156)  at java.util.concurrent.Executors$RunnableAdapter.call(Executors.java:511)  at java.util.concurrent.FutureTask.runAndReset(FutureTask.java:308)  at java.util.concurrent.ScheduledThreadPoolExecutor$ScheduledFutureTask.access$301(ScheduledThreadPoolExecutor.java:180)  at java.util.concurrent.ScheduledThreadPoolExecutor$ScheduledFutureTask.run(ScheduledThreadPoolExecutor.java:294)  at java.util.concurrent.ThreadPoolExecutor.runWorker(ThreadPoolExecutor.java:1149)  at java.util.concurrent.ThreadPoolExecutor$Worker.run(ThreadPoolExecutor.java:624)  at java.lang.Thread.run(Thread.java:748)  org.apache.solr.common.util.ObjectReleaseTracker$ObjectTrackerException: org.apache.lucene.store.MockDirectoryWrapper  at org.apache.solr.common.util.ObjectReleaseTracker.track(ObjectReleaseTracker.java:42)  at org.apache.solr.core.CachingDirectoryFactory.get(CachingDirectoryFactory.java:348)  at org.apache.solr.core.SolrCore.getNewIndexDir(SolrCore.java:358)  at org.apache.solr.core.SolrCore.initIndex(SolrCore.java:737)  at org.apache.solr.core.SolrCore.<init>(SolrCore.java:960)  at org.apache.solr.core.SolrCore.<init>(SolrCore.java:869)  at org.apache.solr.core.CoreContainer.createFromDescriptor(CoreContainer.java:1143)  at org.apache.solr.core.CoreContainer.create(CoreContainer.java:1053)  at org.apache.solr.handler.admin.CoreAdminOperation.lambda$static$0(CoreAdminOperation.java:92)  at org.apache.solr.handler.admin.CoreAdminOperation.execute(CoreAdminOperation.java:360)  at org.apache.solr.handler.admin.CoreAdminHandler$CallInfo.call(CoreAdminHandler.java:395)  at org.apache.solr.handler.admin.CoreAdminHandler.lambda$handleRequestBody$0(CoreAdminHandler.java:188)  at com.codahale.metrics.InstrumentedExecutorService$InstrumentedRunnable.run(InstrumentedExecutorService.java:176)  at org.apache.solr.common.util.ExecutorUtil$MDCAwareThreadPoolExecutor.lambda$execute$0(ExecutorUtil.java:209)  at java.util.concurrent.ThreadPoolExecutor.runWorker(ThreadPoolExecutor.java:1149)  at java.util.concurrent.ThreadPoolExecutor$Worker.run(ThreadPoolExecutor.java:624)  at java.lang.Thread.run(Thread.java:748)  org.apache.solr.common.util.ObjectReleaseTracker$ObjectTrackerException: org.apache.solr.core.SolrCore  at org.apache.solr.common.util.ObjectReleaseTracker.track(ObjectReleaseTracker.java:42)  at org.apache.solr.core.SolrCore.<init>(SolrCore.java:1045)  at org.apache.solr.core.SolrCore.<init>(SolrCore.java:869)  at org.apache.solr.core.CoreContainer.createFromDescriptor(CoreContainer.java:1143)  at org.apache.solr.core.CoreContainer.create(CoreContainer.java:1053)  at org.apache.solr.handler.admin.CoreAdminOperation.lambda$static$0(CoreAdminOperation.java:92)  at org.apache.solr.handler.admin.CoreAdminOperation.execute(CoreAdminOperation.java:360)  at org.apache.solr.handler.admin.CoreAdminHandler$CallInfo.call(CoreAdminHandler.java:395)  at org.apache.solr.handler.admin.CoreAdminHandler.lambda$handleRequestBody$0(CoreAdminHandler.java:188)  at com.codahale.metrics.InstrumentedExecutorService$InstrumentedRunnable.run(InstrumentedExecutorService.java:176)  at org.apache.solr.common.util.ExecutorUtil$MDCAwareThreadPoolExecutor.lambda$execute$0(ExecutorUtil.java:209)  at java.util.concurrent.ThreadPoolExecutor.runWorker(ThreadPoolExecutor.java:1149)  at java.util.concurrent.ThreadPoolExecutor$Worker.run(ThreadPoolExecutor.java:624)  at java.lang.Thread.run(Thread.java:748)  org.apache.solr.common.util.ObjectReleaseTracker$ObjectTrackerException: org.apache.lucene.store.MockDirectoryWrapper  at org.apache.solr.common.util.ObjectReleaseTracker.track(ObjectReleaseTracker.java:42)  at org.apache.solr.core.CachingDirectoryFactory.get(CachingDirectoryFactory.java:348)  at org.apache.solr.core.SolrCore.initSnapshotMetaDataManager(SolrCore.java:507)  at org.apache.solr.core.SolrCore.<init>(SolrCore.java:954)  at org.apache.solr.core.SolrCore.<init>(SolrCore.java:869)  at org.apache.solr.core.CoreContainer.createFromDescriptor(CoreContainer.java:1143)  at org.apache.solr.core.CoreContainer.create(CoreContainer.java:1053)  at org.apache.solr.handler.admin.CoreAdminOperation.lambda$static$0(CoreAdminOperation.java:92)  at org.apache.solr.handler.admin.CoreAdminOperation.execute(CoreAdminOperation.java:360)  at org.apache.solr.handler.admin.CoreAdminHandler$CallInfo.call(CoreAdminHandler.java:395)  at org.apache.solr.handler.admin.CoreAdminHandler.lambda$handleRequestBody$0(CoreAdminHandler.java:188)  at com.codahale.metrics.InstrumentedExecutorService$InstrumentedRunnable.run(InstrumentedExecutorService.java:176)  at org.apache.solr.common.util.ExecutorUtil$MDCAwareThreadPoolExecutor.lambda$execute$0(ExecutorUtil.java:209)  at java.util.concurrent.ThreadPoolExecutor.runWorker(ThreadPoolExecutor.java:1149)  at java.util.concurrent.ThreadPoolExecutor$Worker.run(ThreadPoolExecutor.java:624)  at java.lang.Thread.run(Thread.java:748)  org.apache.solr.common.util.ObjectReleaseTracker$ObjectTrackerException: org.apache.lucene.store.MockDirectoryWrapper  at org.apache.solr.common.util.ObjectReleaseTracker.track(ObjectReleaseTracker.java:42)  at org.apache.solr.core.CachingDirectoryFactory.get(CachingDirectoryFactory.java:348)  at org.apache.solr.update.SolrIndexWriter.create(SolrIndexWriter.java:95)  at org.apache.solr.core.SolrCore.initIndex(SolrCore.java:768)  at org.apache.solr.core.SolrCore.<init>(SolrCore.java:960)  at org.apache.solr.core.SolrCore.<init>(SolrCore.java:869)  at org.apache.solr.core.CoreContainer.createFromDescriptor(CoreContainer.java:1143)  at org.apache.solr.core.CoreContainer.create(CoreContainer.java:1053)  at org.apache.solr.handler.admin.CoreAdminOperation.lambda$static$0(CoreAdminOperation.java:92)  at org.apache.solr.handler.admin.CoreAdminOperation.execute(CoreAdminOperation.java:360)  at org.apache.solr.handler.admin.CoreAdminHandler$CallInfo.call(CoreAdminHandler.java:395)  at org.apache.solr.handler.admin.CoreAdminHandler.lambda$handleRequestBody$0(CoreAdminHandler.java:188)  at com.codahale.metrics.InstrumentedExecutorService$InstrumentedRunnable.run(InstrumentedExecutorService.java:176)  at org.apache.solr.common.util.ExecutorUtil$MDCAwareThreadPoolExecutor.lambda$execute$0(ExecutorUtil.java:209)  at java.util.concurrent.ThreadPoolExecutor.runWorker(ThreadPoolExecutor.java:1149)  at java.util.concurrent.ThreadPoolExecutor$Worker.run(ThreadPoolExecutor.java:624)  at java.lang.Thread.run(Thread.java:748)  

Stack Trace:
java.lang.AssertionError: ObjectTracker found 5 object(s) that were not released!!! [MockDirectoryWrapper, MockDirectoryWrapper, SolrCore, MockDirectoryWrapper, MockDirectoryWrapper]
org.apache.solr.common.util.ObjectReleaseTracker$ObjectTrackerException: org.apache.lucene.store.MockDirectoryWrapper
	at org.apache.solr.common.util.ObjectReleaseTracker.track(ObjectReleaseTracker.java:42)
	at org.apache.solr.core.CachingDirectoryFactory.get(CachingDirectoryFactory.java:348)
	at org.apache.solr.handler.IndexFetcher.fetchLatestIndex(IndexFetcher.java:504)
	at org.apache.solr.handler.IndexFetcher.fetchLatestIndex(IndexFetcher.java:347)
	at org.apache.solr.handler.ReplicationHandler.doFetch(ReplicationHandler.java:421)
	at org.apache.solr.handler.ReplicationHandler.lambda$setupPolling$13(ReplicationHandler.java:1156)
	at java.util.concurrent.Executors$RunnableAdapter.call(Executors.java:511)
	at java.util.concurrent.FutureTask.runAndReset(FutureTask.java:308)
	at java.util.concurrent.ScheduledThreadPoolExecutor$ScheduledFutureTask.access$301(ScheduledThreadPoolExecutor.java:180)
	at java.util.concurrent.ScheduledThreadPoolExecutor$ScheduledFutureTask.run(ScheduledThreadPoolExecutor.java:294)
	at java.util.concurrent.ThreadPoolExecutor.runWorker(ThreadPoolExecutor.java:1149)
	at java.util.concurrent.ThreadPoolExecutor$Worker.run(ThreadPoolExecutor.java:624)
	at java.lang.Thread.run(Thread.java:748)

org.apache.solr.common.util.ObjectReleaseTracker$ObjectTrackerException: org.apache.lucene.store.MockDirectoryWrapper
	at org.apache.solr.common.util.ObjectReleaseTracker.track(ObjectReleaseTracker.java:42)
	at org.apache.solr.core.CachingDirectoryFactory.get(CachingDirectoryFactory.java:348)
	at org.apache.solr.core.SolrCore.getNewIndexDir(SolrCore.java:358)
	at org.apache.solr.core.SolrCore.initIndex(SolrCore.java:737)
	at org.apache.solr.core.SolrCore.<init>(SolrCore.java:960)
	at org.apache.solr.core.SolrCore.<init>(SolrCore.java:869)
	at org.apache.solr.core.CoreContainer.createFromDescriptor(CoreContainer.java:1143)
	at org.apache.solr.core.CoreContainer.create(CoreContainer.java:1053)
	at org.apache.solr.handler.admin.CoreAdminOperation.lambda$static$0(CoreAdminOperation.java:92)
	at org.apache.solr.handler.admin.CoreAdminOperation.execute(CoreAdminOperation.java:360)
	at org.apache.solr.handler.admin.CoreAdminHandler$CallInfo.call(CoreAdminHandler.java:395)
	at org.apache.solr.handler.admin.CoreAdminHandler.lambda$handleRequestBody$0(CoreAdminHandler.java:188)
	at com.codahale.metrics.InstrumentedExecutorService$InstrumentedRunnable.run(InstrumentedExecutorService.java:176)
	at org.apache.solr.common.util.ExecutorUtil$MDCAwareThreadPoolExecutor.lambda$execute$0(ExecutorUtil.java:209)
	at java.util.concurrent.ThreadPoolExecutor.runWorker(ThreadPoolExecutor.java:1149)
	at java.util.concurrent.ThreadPoolExecutor$Worker.run(ThreadPoolExecutor.java:624)
	at java.lang.Thread.run(Thread.java:748)

org.apache.solr.common.util.ObjectReleaseTracker$ObjectTrackerException: org.apache.solr.core.SolrCore
	at org.apache.solr.common.util.ObjectReleaseTracker.track(ObjectReleaseTracker.java:42)
	at org.apache.solr.core.SolrCore.<init>(SolrCore.java:1045)
	at org.apache.solr.core.SolrCore.<init>(SolrCore.java:869)
	at org.apache.solr.core.CoreContainer.createFromDescriptor(CoreContainer.java:1143)
	at org.apache.solr.core.CoreContainer.create(CoreContainer.java:1053)
	at org.apache.solr.handler.admin.CoreAdminOperation.lambda$static$0(CoreAdminOperation.java:92)
	at org.apache.solr.handler.admin.CoreAdminOperation.execute(CoreAdminOperation.java:360)
	at org.apache.solr.handler.admin.CoreAdminHandler$CallInfo.call(CoreAdminHandler.java:395)
	at org.apache.solr.handler.admin.CoreAdminHandler.lambda$handleRequestBody$0(CoreAdminHandler.java:188)
	at com.codahale.metrics.InstrumentedExecutorService$InstrumentedRunnable.run(InstrumentedExecutorService.java:176)
	at org.apache.solr.common.util.ExecutorUtil$MDCAwareThreadPoolExecutor.lambda$execute$0(ExecutorUtil.java:209)
	at java.util.concurrent.ThreadPoolExecutor.runWorker(ThreadPoolExecutor.java:1149)
	at java.util.concurrent.ThreadPoolExecutor$Worker.run(ThreadPoolExecutor.java:624)
	at java.lang.Thread.run(Thread.java:748)

org.apache.solr.common.util.ObjectReleaseTracker$ObjectTrackerException: org.apache.lucene.store.MockDirectoryWrapper
	at org.apache.solr.common.util.ObjectReleaseTracker.track(ObjectReleaseTracker.java:42)
	at org.apache.solr.core.CachingDirectoryFactory.get(CachingDirectoryFactory.java:348)
	at org.apache.solr.core.SolrCore.initSnapshotMetaDataManager(SolrCore.java:507)
	at org.apache.solr.core.SolrCore.<init>(SolrCore.java:954)
	at org.apache.solr.core.SolrCore.<init>(SolrCore.java:869)
	at org.apache.solr.core.CoreContainer.createFromDescriptor(CoreContainer.java:1143)
	at org.apache.solr.core.CoreContainer.create(CoreContainer.java:1053)
	at org.apache.solr.handler.admin.CoreAdminOperation.lambda$static$0(CoreAdminOperation.java:92)
	at org.apache.solr.handler.admin.CoreAdminOperation.execute(CoreAdminOperation.java:360)
	at org.apache.solr.handler.admin.CoreAdminHandler$CallInfo.call(CoreAdminHandler.java:395)
	at org.apache.solr.handler.admin.CoreAdminHandler.lambda$handleRequestBody$0(CoreAdminHandler.java:188)
	at com.codahale.metrics.InstrumentedExecutorService$InstrumentedRunnable.run(InstrumentedExecutorService.java:176)
	at org.apache.solr.common.util.ExecutorUtil$MDCAwareThreadPoolExecutor.lambda$execute$0(ExecutorUtil.java:209)
	at java.util.concurrent.ThreadPoolExecutor.runWorker(ThreadPoolExecutor.java:1149)
	at java.util.concurrent.ThreadPoolExecutor$Worker.run(ThreadPoolExecutor.java:624)
	at java.lang.Thread.run(Thread.java:748)

org.apache.solr.common.util.ObjectReleaseTracker$ObjectTrackerException: org.apache.lucene.store.MockDirectoryWrapper
	at org.apache.solr.common.util.ObjectReleaseTracker.track(ObjectReleaseTracker.java:42)
	at org.apache.solr.core.CachingDirectoryFactory.get(CachingDirectoryFactory.java:348)
	at org.apache.solr.update.SolrIndexWriter.create(SolrIndexWriter.java:95)
	at org.apache.solr.core.SolrCore.initIndex(SolrCore.java:768)
	at org.apache.solr.core.SolrCore.<init>(SolrCore.java:960)
	at org.apache.solr.core.SolrCore.<init>(SolrCore.java:869)
	at org.apache.solr.core.CoreContainer.createFromDescriptor(CoreContainer.java:1143)
	at org.apache.solr.core.CoreContainer.create(CoreContainer.java:1053)
	at org.apache.solr.handler.admin.CoreAdminOperation.lambda$static$0(CoreAdminOperation.java:92)
	at org.apache.solr.handler.admin.CoreAdminOperation.execute(CoreAdminOperation.java:360)
	at org.apache.solr.handler.admin.CoreAdminHandler$CallInfo.call(CoreAdminHandler.java:395)
	at org.apache.solr.handler.admin.CoreAdminHandler.lambda$handleRequestBody$0(CoreAdminHandler.java:188)
	at com.codahale.metrics.InstrumentedExecutorService$InstrumentedRunnable.run(InstrumentedExecutorService.java:176)
	at org.apache.solr.common.util.ExecutorUtil$MDCAwareThreadPoolExecutor.lambda$execute$0(ExecutorUtil.java:209)
	at java.util.concurrent.ThreadPoolExecutor.runWorker(ThreadPoolExecutor.java:1149)
	at java.util.concurrent.ThreadPoolExecutor$Worker.run(ThreadPoolExecutor.java:624)
	at java.lang.Thread.run(Thread.java:748)


	at __randomizedtesting.SeedInfo.seed([6423B26535671939]:0)
	at org.junit.Assert.fail(Assert.java:93)
	at org.junit.Assert.assertTrue(Assert.java:43)
	at org.junit.Assert.assertNull(Assert.java:551)
	at org.apache.solr.SolrTestCaseJ4.teardownTestCases(SolrTestCaseJ4.java:304)
	at sun.reflect.NativeMethodAccessorImpl.invoke0(Native Method)
	at sun.reflect.NativeMethodAccessorImpl.invoke(NativeMethodAccessorImpl.java:62)
	at sun.reflect.DelegatingMethodAccessorImpl.invoke(DelegatingMethodAccessorImpl.java:43)
	at java.lang.reflect.Method.invoke(Method.java:498)
	at com.carrotsearch.randomizedtesting.RandomizedRunner.invoke(RandomizedRunner.java:1742)
	at com.carrotsearch.randomizedtesting.RandomizedRunner$7.evaluate(RandomizedRunner.java:898)
	at com.carrotsearch.randomizedtesting.rules.StatementAdapter.evaluate(StatementAdapter.java:36)
	at com.carrotsearch.randomizedtesting.rules.SystemPropertiesRestoreRule$1.evaluate(SystemPropertiesRestoreRule.java:57)
	at org.apache.lucene.util.AbstractBeforeAfterRule$1.evaluate(AbstractBeforeAfterRule.java:45)
	at com.carrotsearch.randomizedtesting.rules.StatementAdapter.evaluate(StatementAdapter.java:36)
	at org.apache.lucene.util.TestRuleStoreClassName$1.evaluate(TestRuleStoreClassName.java:41)
	at com.carrotsearch.randomizedtesting.rules.NoShadowingOrOverridesOnMethodsRule$1.evaluate(NoShadowingOrOverridesOnMethodsRule.java:40)
	at com.carrotsearch.randomizedtesting.rules.NoShadowingOrOverridesOnMethodsRule$1.evaluate(NoShadowingOrOverridesOnMethodsRule.java:40)
	at com.carrotsearch.randomizedtesting.rules.StatementAdapter.evaluate(StatementAdapter.java:36)
	at com.carrotsearch.randomizedtesting.rules.StatementAdapter.evaluate(StatementAdapter.java:36)
	at com.carrotsearch.randomizedtesting.rules.StatementAdapter.evaluate(StatementAdapter.java:36)
	at org.apache.lucene.util.TestRuleAssertionsRequired$1.evaluate(TestRuleAssertionsRequired.java:53)
	at org.apache.lucene.util.TestRuleMarkFailure$1.evaluate(TestRuleMarkFailure.java:47)
	at org.apache.lucene.util.TestRuleIgnoreAfterMaxFailures$1.evaluate(TestRuleIgnoreAfterMaxFailures.java:64)
	at org.apache.lucene.util.TestRuleIgnoreTestSuites$1.evaluate(TestRuleIgnoreTestSuites.java:54)
	at com.carrotsearch.randomizedtesting.rules.StatementAdapter.evaluate(StatementAdapter.java:36)
	at com.carrotsearch.randomizedtesting.ThreadLeakControl$StatementRunner.run(ThreadLeakControl.java:368)
	at java.lang.Thread.run(Thread.java:748)


FAILED:  org.apache.solr.cloud.autoscaling.TriggerIntegrationTest.testTriggerThrottling

Error Message:
Both triggers should have fired by now

Stack Trace:
java.lang.AssertionError: Both triggers should have fired by now
	at __randomizedtesting.SeedInfo.seed([45EC44B211448503:BECEEC97C3EE6691]:0)
	at org.junit.Assert.fail(Assert.java:93)
	at org.apache.solr.cloud.autoscaling.TriggerIntegrationTest.testTriggerThrottling(TriggerIntegrationTest.java:222)
	at sun.reflect.NativeMethodAccessorImpl.invoke0(Native Method)
	at sun.reflect.NativeMethodAccessorImpl.invoke(NativeMethodAccessorImpl.java:62)
	at sun.reflect.DelegatingMethodAccessorImpl.invoke(DelegatingMethodAccessorImpl.java:43)
	at java.lang.reflect.Method.invoke(Method.java:498)
	at com.carrotsearch.randomizedtesting.RandomizedRunner.invoke(RandomizedRunner.java:1742)
	at com.carrotsearch.randomizedtesting.RandomizedRunner$8.evaluate(RandomizedRunner.java:935)
	at com.carrotsearch.randomizedtesting.RandomizedRunner$9.evaluate(RandomizedRunner.java:971)
	at com.carrotsearch.randomizedtesting.RandomizedRunner$10.evaluate(RandomizedRunner.java:985)
	at com.carrotsearch.randomizedtesting.rules.SystemPropertiesRestoreRule$1.evaluate(SystemPropertiesRestoreRule.java:57)
	at org.apache.lucene.util.TestRuleSetupTeardownChained$1.evaluate(TestRuleSetupTeardownChained.java:49)
	at org.apache.lucene.util.AbstractBeforeAfterRule$1.evaluate(AbstractBeforeAfterRule.java:45)
	at org.apache.lucene.util.TestRuleThreadAndTestName$1.evaluate(TestRuleThreadAndTestName.java:48)
	at org.apache.lucene.util.TestRuleIgnoreAfterMaxFailures$1.evaluate(TestRuleIgnoreAfterMaxFailures.java:64)
	at org.apache.lucene.util.TestRuleMarkFailure$1.evaluate(TestRuleMarkFailure.java:47)
	at com.carrotsearch.randomizedtesting.rules.StatementAdapter.evaluate(StatementAdapter.java:36)
	at com.carrotsearch.randomizedtesting.ThreadLeakControl$StatementRunner.run(ThreadLeakControl.java:368)
	at com.carrotsearch.randomizedtesting.ThreadLeakControl.forkTimeoutingTask(ThreadLeakControl.java:817)
	at com.carrotsearch.randomizedtesting.ThreadLeakControl$3.evaluate(ThreadLeakControl.java:468)
	at com.carrotsearch.randomizedtesting.RandomizedRunner.runSingleTest(RandomizedRunner.java:944)
	at com.carrotsearch.randomizedtesting.RandomizedRunner$5.evaluate(RandomizedRunner.java:830)
	at com.carrotsearch.randomizedtesting.RandomizedRunner$6.evaluate(RandomizedRunner.java:880)
	at com.carrotsearch.randomizedtesting.RandomizedRunner$7.evaluate(RandomizedRunner.java:891)
	at com.carrotsearch.randomizedtesting.rules.StatementAdapter.evaluate(StatementAdapter.java:36)
	at com.carrotsearch.randomizedtesting.rules.SystemPropertiesRestoreRule$1.evaluate(SystemPropertiesRestoreRule.java:57)
	at org.apache.lucene.util.AbstractBeforeAfterRule$1.evaluate(AbstractBeforeAfterRule.java:45)
	at com.carrotsearch.randomizedtesting.rules.StatementAdapter.evaluate(StatementAdapter.java:36)
	at org.apache.lucene.util.TestRuleStoreClassName$1.evaluate(TestRuleStoreClassName.java:41)
	at com.carrotsearch.randomizedtesting.rules.NoShadowingOrOverridesOnMethodsRule$1.evaluate(NoShadowingOrOverridesOnMethodsRule.java:40)
	at com.carrotsearch.randomizedtesting.rules.NoShadowingOrOverridesOnMethodsRule$1.evaluate(NoShadowingOrOverridesOnMethodsRule.java:40)
	at com.carrotsearch.randomizedtesting.rules.StatementAdapter.evaluate(StatementAdapter.java:36)
	at com.carrotsearch.randomizedtesting.rules.StatementAdapter.evaluate(StatementAdapter.java:36)
	at com.carrotsearch.randomizedtesting.rules.StatementAdapter.evaluate(StatementAdapter.java:36)
	at org.apache.lucene.util.TestRuleAssertionsRequired$1.evaluate(TestRuleAssertionsRequired.java:53)
	at org.apache.lucene.util.TestRuleMarkFailure$1.evaluate(TestRuleMarkFailure.java:47)
	at org.apache.lucene.util.TestRuleIgnoreAfterMaxFailures$1.evaluate(TestRuleIgnoreAfterMaxFailures.java:64)
	at org.apache.lucene.util.TestRuleIgnoreTestSuites$1.evaluate(TestRuleIgnoreTestSuites.java:54)
	at com.carrotsearch.randomizedtesting.rules.StatementAdapter.evaluate(StatementAdapter.java:36)
	at com.carrotsearch.randomizedtesting.ThreadLeakControl$StatementRunner.run(ThreadLeakControl.java:368)
	at java.lang.Thread.run(Thread.java:748)


FAILED:  org.apache.solr.cloud.autoscaling.TriggerIntegrationTest.testTriggerThrottling

Error Message:
Both triggers should have fired by now

Stack Trace:
java.lang.AssertionError: Both triggers should have fired by now
	at __randomizedtesting.SeedInfo.seed([45EC44B211448503:BECEEC97C3EE6691]:0)
	at org.junit.Assert.fail(Assert.java:93)
	at org.apache.solr.cloud.autoscaling.TriggerIntegrationTest.testTriggerThrottling(TriggerIntegrationTest.java:270)
	at sun.reflect.NativeMethodAccessorImpl.invoke0(Native Method)
	at sun.reflect.NativeMethodAccessorImpl.invoke(NativeMethodAccessorImpl.java:62)
	at sun.reflect.DelegatingMethodAccessorImpl.invoke(DelegatingMethodAccessorImpl.java:43)
	at java.lang.reflect.Method.invoke(Method.java:498)
	at com.carrotsearch.randomizedtesting.RandomizedRunner.invoke(RandomizedRunner.java:1742)
	at com.carrotsearch.randomizedtesting.RandomizedRunner$8.evaluate(RandomizedRunner.java:935)
	at com.carrotsearch.randomizedtesting.RandomizedRunner$9.evaluate(RandomizedRunner.java:971)
	at com.carrotsearch.randomizedtesting.RandomizedRunner$10.evaluate(RandomizedRunner.java:985)
	at com.carrotsearch.randomizedtesting.rules.SystemPropertiesRestoreRule$1.evaluate(SystemPropertiesRestoreRule.java:57)
	at org.apache.lucene.util.TestRuleSetupTeardownChained$1.evaluate(TestRuleSetupTeardownChained.java:49)
	at org.apache.lucene.util.AbstractBeforeAfterRule$1.evaluate(AbstractBeforeAfterRule.java:45)
	at org.apache.lucene.util.TestRuleThreadAndTestName$1.evaluate(TestRuleThreadAndTestName.java:48)
	at org.apache.lucene.util.TestRuleIgnoreAfterMaxFailures$1.evaluate(TestRuleIgnoreAfterMaxFailures.java:64)
	at org.apache.lucene.util.TestRuleMarkFailure$1.evaluate(TestRuleMarkFailure.java:47)
	at com.carrotsearch.randomizedtesting.rules.StatementAdapter.evaluate(StatementAdapter.java:36)
	at com.carrotsearch.randomizedtesting.ThreadLeakControl$StatementRunner.run(ThreadLeakControl.java:368)
	at com.carrotsearch.randomizedtesting.ThreadLeakControl.forkTimeoutingTask(ThreadLeakControl.java:817)
	at com.carrotsearch.randomizedtesting.ThreadLeakControl$3.evaluate(ThreadLeakControl.java:468)
	at com.carrotsearch.randomizedtesting.RandomizedRunner.runSingleTest(RandomizedRunner.java:944)
	at com.carrotsearch.randomizedtesting.RandomizedRunner$5.evaluate(RandomizedRunner.java:830)
	at com.carrotsearch.randomizedtesting.RandomizedRunner$6.evaluate(RandomizedRunner.java:880)
	at com.carrotsearch.randomizedtesting.RandomizedRunner$7.evaluate(RandomizedRunner.java:891)
	at com.carrotsearch.randomizedtesting.rules.StatementAdapter.evaluate(StatementAdapter.java:36)
	at com.carrotsearch.randomizedtesting.rules.SystemPropertiesRestoreRule$1.evaluate(SystemPropertiesRestoreRule.java:57)
	at org.apache.lucene.util.AbstractBeforeAfterRule$1.evaluate(AbstractBeforeAfterRule.java:45)
	at com.carrotsearch.randomizedtesting.rules.StatementAdapter.evaluate(StatementAdapter.java:36)
	at org.apache.lucene.util.TestRuleStoreClassName$1.evaluate(TestRuleStoreClassName.java:41)
	at com.carrotsearch.randomizedtesting.rules.NoShadowingOrOverridesOnMethodsRule$1.evaluate(NoShadowingOrOverridesOnMethodsRule.java:40)
	at com.carrotsearch.randomizedtesting.rules.NoShadowingOrOverridesOnMethodsRule$1.evaluate(NoShadowingOrOverridesOnMethodsRule.java:40)
	at com.carrotsearch.randomizedtesting.rules.StatementAdapter.evaluate(StatementAdapter.java:36)
	at com.carrotsearch.randomizedtesting.rules.StatementAdapter.evaluate(StatementAdapter.java:36)
	at com.carrotsearch.randomizedtesting.rules.StatementAdapter.evaluate(StatementAdapter.java:36)
	at org.apache.lucene.util.TestRuleAssertionsRequired$1.evaluate(TestRuleAssertionsRequired.java:53)
	at org.apache.lucene.util.TestRuleMarkFailure$1.evaluate(TestRuleMarkFailure.java:47)
	at org.apache.lucene.util.TestRuleIgnoreAfterMaxFailures$1.evaluate(TestRuleIgnoreAfterMaxFailures.java:64)
	at org.apache.lucene.util.TestRuleIgnoreTestSuites$1.evaluate(TestRuleIgnoreTestSuites.java:54)
	at com.carrotsearch.randomizedtesting.rules.StatementAdapter.evaluate(StatementAdapter.java:36)
	at com.carrotsearch.randomizedtesting.ThreadLeakControl$StatementRunner.run(ThreadLeakControl.java:368)
	at java.lang.Thread.run(Thread.java:748)




Build Log:
[...truncated 12644 lines...]
   [junit4] Suite: org.apache.solr.cloud.autoscaling.TriggerIntegrationTest
   [junit4]   2> Creating dataDir: C:\Users\jenkins\workspace\Lucene-Solr-master-Windows\solr\build\solr-core\test\J1\temp\solr.cloud.autoscaling.TriggerIntegrationTest_45EC44B211448503-001\init-core-data-001
   [junit4]   2> 136365 WARN  (SUITE-TriggerIntegrationTest-seed#[45EC44B211448503]-worker) [    ] o.a.s.SolrTestCaseJ4 startTrackingSearchers: numOpens=4 numCloses=4
   [junit4]   2> 136365 INFO  (SUITE-TriggerIntegrationTest-seed#[45EC44B211448503]-worker) [    ] o.a.s.SolrTestCaseJ4 Using PointFields (NUMERIC_POINTS_SYSPROP=true) w/NUMERIC_DOCVALUES_SYSPROP=true
   [junit4]   2> 136370 INFO  (SUITE-TriggerIntegrationTest-seed#[45EC44B211448503]-worker) [    ] o.a.s.SolrTestCaseJ4 Randomized ssl (false) and clientAuth (false) via: @org.apache.solr.util.RandomizeSSL(reason=, value=NaN, ssl=NaN, clientAuth=NaN)
   [junit4]   2> 136370 INFO  (SUITE-TriggerIntegrationTest-seed#[45EC44B211448503]-worker) [    ] o.a.s.SolrTestCaseJ4 SecureRandom sanity checks: test.solr.allowed.securerandom=null & java.security.egd=file:/dev/./urandom
   [junit4]   2> 136371 INFO  (SUITE-TriggerIntegrationTest-seed#[45EC44B211448503]-worker) [    ] o.a.s.c.MiniSolrCloudCluster Starting cluster of 2 servers in C:\Users\jenkins\workspace\Lucene-Solr-master-Windows\solr\build\solr-core\test\J1\temp\solr.cloud.autoscaling.TriggerIntegrationTest_45EC44B211448503-001\tempDir-001
   [junit4]   2> 136371 INFO  (SUITE-TriggerIntegrationTest-seed#[45EC44B211448503]-worker) [    ] o.a.s.c.ZkTestServer STARTING ZK TEST SERVER
   [junit4]   2> 136372 INFO  (Thread-221) [    ] o.a.s.c.ZkTestServer client port:0.0.0.0/0.0.0.0:0
   [junit4]   2> 136372 INFO  (Thread-221) [    ] o.a.s.c.ZkTestServer Starting server
   [junit4]   2> 136375 ERROR (Thread-221) [    ] o.a.z.s.ZooKeeperServer ZKShutdownHandler is not registered, so ZooKeeper server won't take any action on ERROR or SHUTDOWN server state changes
   [junit4]   2> 136478 INFO  (SUITE-TriggerIntegrationTest-seed#[45EC44B211448503]-worker) [    ] o.a.s.c.ZkTestServer start zk server on port:56912
   [junit4]   2> 136483 INFO  (zkConnectionManagerCallback-398-thread-1) [    ] o.a.s.c.c.ConnectionManager zkClient has connected
   [junit4]   2> 136490 INFO  (jetty-launcher-395-thread-1) [    ] o.e.j.s.Server jetty-9.4.11.v20180605; built: 2018-06-05T18:24:03.829Z; git: d5fc0523cfa96bfebfbda19606cad384d772f04c; jvm 1.8.0_172-b11
   [junit4]   2> 136490 INFO  (jetty-launcher-395-thread-2) [    ] o.e.j.s.Server jetty-9.4.11.v20180605; built: 2018-06-05T18:24:03.829Z; git: d5fc0523cfa96bfebfbda19606cad384d772f04c; jvm 1.8.0_172-b11
   [junit4]   2> 136490 INFO  (jetty-launcher-395-thread-2) [    ] o.e.j.s.session DefaultSessionIdManager workerName=node0
   [junit4]   2> 136490 INFO  (jetty-launcher-395-thread-2) [    ] o.e.j.s.session No SessionScavenger set, using defaults
   [junit4]   2> 136490 INFO  (jetty-launcher-395-thread-2) [    ] o.e.j.s.session node0 Scavenging every 660000ms
   [junit4]   2> 136491 INFO  (jetty-launcher-395-thread-1) [    ] o.e.j.s.session DefaultSessionIdManager workerName=node0
   [junit4]   2> 136491 INFO  (jetty-launcher-395-thread-1) [    ] o.e.j.s.session No SessionScavenger set, using defaults
   [junit4]   2> 136491 INFO  (jetty-launcher-395-thread-1) [    ] o.e.j.s.session node0 Scavenging every 600000ms
   [junit4]   2> 136491 INFO  (jetty-launcher-395-thread-2) [    ] o.e.j.s.h.ContextHandler Started o.e.j.s.ServletContextHandler@1505308{/solr,null,AVAILABLE}
   [junit4]   2> 136491 INFO  (jetty-launcher-395-thread-1) [    ] o.e.j.s.h.ContextHandler Started o.e.j.s.ServletContextHandler@d5dbc9{/solr,null,AVAILABLE}
   [junit4]   2> 136493 INFO  (jetty-launcher-395-thread-2) [    ] o.e.j.s.AbstractConnector Started ServerConnector@4bacd7{HTTP/1.1,[http/1.1]}{127.0.0.1:56916}
   [junit4]   2> 136493 INFO  (jetty-launcher-395-thread-2) [    ] o.e.j.s.Server Started @133256ms
   [junit4]   2> 136493 INFO  (jetty-launcher-395-thread-1) [    ] o.e.j.s.AbstractConnector Started ServerConnector@1778c49{HTTP/1.1,[http/1.1]}{127.0.0.1:56917}
   [junit4]   2> 136493 INFO  (jetty-launcher-395-thread-2) [    ] o.a.s.c.s.e.JettySolrRunner Jetty properties: {hostContext=/solr, hostPort=56916}
   [junit4]   2> 136493 INFO  (jetty-launcher-395-thread-1) [    ] o.e.j.s.Server Started @133256ms
   [junit4]   2> 136493 INFO  (jetty-launcher-395-thread-1) [    ] o.a.s.c.s.e.JettySolrRunner Jetty properties: {hostContext=/solr, hostPort=56917}
   [junit4]   2> 136493 ERROR (jetty-launcher-395-thread-2) [    ] o.a.s.u.StartupLoggingUtils Missing Java Option solr.log.dir. Logging may be missing or incomplete.
   [junit4]   2> 136493 ERROR (jetty-launcher-395-thread-1) [    ] o.a.s.u.StartupLoggingUtils Missing Java Option solr.log.dir. Logging may be missing or incomplete.
   [junit4]   2> 136493 INFO  (jetty-launcher-395-thread-2) [    ] o.a.s.s.SolrDispatchFilter Using logger factory org.apache.logging.slf4j.Log4jLoggerFactory
   [junit4]   2> 136493 INFO  (jetty-launcher-395-thread-1) [    ] o.a.s.s.SolrDispatchFilter Using logger factory org.apache.logging.slf4j.Log4jLoggerFactory
   [junit4]   2> 136493 INFO  (jetty-launcher-395-thread-2) [    ] o.a.s.s.SolrDispatchFilter  ___      _       Welcome to Apache Solr™ version 8.0.0
   [junit4]   2> 136493 INFO  (jetty-launcher-395-thread-1) [    ] o.a.s.s.SolrDispatchFilter  ___      _       Welcome to Apache Solr™ version 8.0.0
   [junit4]   2> 136493 INFO  (jetty-launcher-395-thread-2) [    ] o.a.s.s.SolrDispatchFilter / __| ___| |_ _   Starting in cloud mode on port null
   [junit4]   2> 136493 INFO  (jetty-launcher-395-thread-1) [    ] o.a.s.s.SolrDispatchFilter / __| ___| |_ _   Starting in cloud mode on port null
   [junit4]   2> 136493 INFO  (jetty-launcher-395-thread-2) [    ] o.a.s.s.SolrDispatchFilter \__ \/ _ \ | '_|  Install dir: null
   [junit4]   2> 136493 INFO  (jetty-launcher-395-thread-1) [    ] o.a.s.s.SolrDispatchFilter \__ \/ _ \ | '_|  Install dir: null
   [junit4]   2> 136493 INFO  (jetty-launcher-395-thread-2) [    ] o.a.s.s.SolrDispatchFilter |___/\___/_|_|    Start time: 2018-11-01T08:34:17.373Z
   [junit4]   2> 136493 INFO  (jetty-launcher-395-thread-1) [    ] o.a.s.s.SolrDispatchFilter |___/\___/_|_|    Start time: 2018-11-01T08:34:17.373Z
   [junit4]   2> 136497 INFO  (zkConnectionManagerCallback-402-thread-1) [    ] o.a.s.c.c.ConnectionManager zkClient has connected
   [junit4]   2> 136497 INFO  (zkConnectionManagerCallback-400-thread-1) [    ] o.a.s.c.c.ConnectionManager zkClient has connected
   [junit4]   2> 136498 INFO  (jetty-launcher-395-thread-2) [    ] o.a.s.s.SolrDispatchFilter solr.xml found in ZooKeeper. Loading...
   [junit4]   2> 136498 INFO  (jetty-launcher-395-thread-1) [    ] o.a.s.s.SolrDispatchFilter solr.xml found in ZooKeeper. Loading...
   [junit4]   2> 136509 WARN  (NIOServerCxn.Factory:0.0.0.0/0.0.0.0:0) [    ] o.a.z.s.NIOServerCnxn Unable to read additional data from client sessionid 0x100145f22ad0002, likely client has closed socket
   [junit4]   2> 137360 INFO  (jetty-launcher-395-thread-2) [    ] o.a.s.c.ZkContainer Zookeeper client=127.0.0.1:56912/solr
   [junit4]   2> 137383 INFO  (zkConnectionManagerCallback-406-thread-1) [    ] o.a.s.c.c.ConnectionManager zkClient has connected
   [junit4]   2> 137421 INFO  (zkConnectionManagerCallback-408-thread-1) [    ] o.a.s.c.c.ConnectionManager zkClient has connected
   [junit4]   2> 137625 INFO  (jetty-launcher-395-thread-2) [n:127.0.0.1:56916_solr    ] o.a.s.c.OverseerElectionContext I am going to be the leader 127.0.0.1:56916_solr
   [junit4]   2> 137626 INFO  (jetty-launcher-395-thread-2) [n:127.0.0.1:56916_solr    ] o.a.s.c.Overseer Overseer (id=72079992874139652-127.0.0.1:56916_solr-n_0000000000) starting
   [junit4]   2> 137634 INFO  (zkConnectionManagerCallback-415-thread-1) [    ] o.a.s.c.c.ConnectionManager zkClient has connected
   [junit4]   2> 137638 INFO  (jetty-launcher-395-thread-2) [n:127.0.0.1:56916_solr    ] o.a.s.c.s.i.ZkClientClusterStateProvider Cluster at 127.0.0.1:56912/solr ready
   [junit4]   2> 137638 INFO  (jetty-launcher-395-thread-2) [n:127.0.0.1:56916_solr    ] o.a.s.c.ZkController Register node as live in ZooKeeper:/live_nodes/127.0.0.1:56916_solr
   [junit4]   2> 137696 INFO  (jetty-launcher-395-thread-2) [n:127.0.0.1:56916_solr    ] o.a.s.h.a.MetricsHistoryHandler No .system collection, keeping metrics history in memory.
   [junit4]   2> 137753 INFO  (jetty-launcher-395-thread-2) [n:127.0.0.1:56916_solr    ] o.a.s.m.r.SolrJmxReporter JMX monitoring for 'solr_56916.solr.node' (registry 'solr.node') enabled at server: com.sun.jmx.mbeanserver.JmxMBeanServer@d1912f
   [junit4]   2> 137758 INFO  (jetty-launcher-395-thread-2) [n:127.0.0.1:56916_solr    ] o.a.s.m.r.SolrJmxReporter JMX monitoring for 'solr_56916.solr.jvm' (registry 'solr.jvm') enabled at server: com.sun.jmx.mbeanserver.JmxMBeanServer@d1912f
   [junit4]   2> 137758 INFO  (jetty-launcher-395-thread-2) [n:127.0.0.1:56916_solr    ] o.a.s.m.r.SolrJmxReporter JMX monitoring for 'solr_56916.solr.jetty' (registry 'solr.jetty') enabled at server: com.sun.jmx.mbeanserver.JmxMBeanServer@d1912f
   [junit4]   2> 137759 INFO  (jetty-launcher-395-thread-2) [n:127.0.0.1:56916_solr    ] o.a.s.c.CorePropertiesLocator Found 0 core definitions underneath C:\Users\jenkins\workspace\Lucene-Solr-master-Windows\solr\build\solr-core\test\J1\temp\solr.cloud.autoscaling.TriggerIntegrationTest_45EC44B211448503-001\tempDir-001\node2\.
   [junit4]   2> 137781 INFO  (zkCallback-407-thread-1) [    ] o.a.s.c.c.ZkStateReader Updated live nodes from ZooKeeper... (0) -> (1)
   [junit4]   2> 137781 INFO  (zkCallback-414-thread-1) [    ] o.a.s.c.c.ZkStateReader Updated live nodes from ZooKeeper... (0) -> (1)
   [junit4]   2> 137792 DEBUG (OverseerAutoScalingTriggerThread-72079992874139652-127.0.0.1:56916_solr-n_0000000000) [    ] o.a.s.c.a.OverseerTriggerThread Adding .auto_add_replicas and .scheduled_maintenance triggers
   [junit4]   2> 137793 INFO  (OverseerStateUpdate-72079992874139652-127.0.0.1:56916_solr-n_0000000000) [n:127.0.0.1:56916_solr    ] o.a.s.c.Overseer Starting to work on the main queue : 127.0.0.1:56916_solr
   [junit4]   2> 137794 DEBUG (OverseerAutoScalingTriggerThread-72079992874139652-127.0.0.1:56916_solr-n_0000000000) [    ] o.a.s.c.a.OverseerTriggerThread Refreshing /autoscaling.json with znode version 1
   [junit4]   2> 137795 DEBUG (OverseerAutoScalingTriggerThread-72079992874139652-127.0.0.1:56916_solr-n_0000000000) [    ] o.a.s.c.a.OverseerTriggerThread Current znodeVersion 1, lastZnodeVersion -1
   [junit4]   2> 137795 DEBUG (OverseerAutoScalingTriggerThread-72079992874139652-127.0.0.1:56916_solr-n_0000000000) [    ] o.a.s.c.a.OverseerTriggerThread Processed trigger updates upto znodeVersion 1
   [junit4]   2> 137798 DEBUG (OverseerAutoScalingTriggerThread-72079992874139652-127.0.0.1:56916_solr-n_0000000000) [    ] o.a.s.c.a.NodeLostTrigger NodeLostTrigger .auto_add_replicas - Initial livenodes: [127.0.0.1:56916_solr]
   [junit4]   2> 137799 DEBUG (OverseerAutoScalingTriggerThread-72079992874139652-127.0.0.1:56916_solr-n_0000000000) [    ] o.a.s.c.a.OverseerTriggerThread -- clean old nodeAdded markers
   [junit4]   2> 137799 DEBUG (OverseerAutoScalingTriggerThread-72079992874139652-127.0.0.1:56916_solr-n_0000000000) [    ] o.a.s.c.a.OverseerTriggerThread Current znodeVersion 1, lastZnodeVersion 1
   [junit4]   2> 137801 DEBUG (ScheduledTrigger-452-thread-1) [    ] o.a.s.c.a.NodeLostTrigger Running NodeLostTrigger: .auto_add_replicas with currently live nodes: 1
   [junit4]   2> 138155 INFO  (jetty-launcher-395-thread-1) [    ] o.a.s.c.ZkContainer Zookeeper client=127.0.0.1:56912/solr
   [junit4]   2> 138159 INFO  (zkConnectionManagerCallback-420-thread-1) [    ] o.a.s.c.c.ConnectionManager zkClient has connected
   [junit4]   2> 138164 INFO  (zkConnectionManagerCallback-422-thread-1) [    ] o.a.s.c.c.ConnectionManager zkClient has connected
   [junit4]   2> 138171 INFO  (jetty-launcher-395-thread-1) [n:127.0.0.1:56917_solr    ] o.a.s.c.c.ZkStateReader Updated live nodes from ZooKeeper... (0) -> (1)
   [junit4]   2> 138175 INFO  (jetty-launcher-395-thread-1) [n:127.0.0.1:56917_solr    ] o.a.s.c.TransientSolrCoreCacheDefault Allocating transient cache for 2147483647 transient cores
   [junit4]   2> 138175 INFO  (jetty-launcher-395-thread-1) [n:127.0.0.1:56917_solr    ] o.a.s.c.ZkController Register node as live in ZooKeeper:/live_nodes/127.0.0.1:56917_solr
   [junit4]   2> 138176 INFO  (zkCallback-414-thread-1) [    ] o.a.s.c.c.ZkStateReader Updated live nodes from ZooKeeper... (1) -> (2)
   [junit4]   2> 138176 INFO  (zkCallback-407-thread-1) [    ] o.a.s.c.c.ZkStateReader Updated live nodes from ZooKeeper... (1) -> (2)
   [junit4]   2> 138177 INFO  (zkCallback-421-thread-1) [    ] o.a.s.c.c.ZkStateReader Updated live nodes from ZooKeeper... (1) -> (2)
   [junit4]   2> 138229 INFO  (zkConnectionManagerCallback-429-thread-1) [    ] o.a.s.c.c.ConnectionManager zkClient has connected
   [junit4]   2> 138231 INFO  (jetty-launcher-395-thread-1) [n:127.0.0.1:56917_solr    ] o.a.s.c.c.ZkStateReader Updated live nodes from ZooKeeper... (0) -> (2)
   [junit4]   2> 138232 INFO  (jetty-launcher-395-thread-1) [n:127.0.0.1:56917_solr    ] o.a.s.c.s.i.ZkClientClusterStateProvider Cluster at 127.0.0.1:56912/solr ready
   [junit4]   2> 138233 INFO  (jetty-launcher-395-thread-1) [n:127.0.0.1:56917_solr    ] o.a.s.h.a.MetricsHistoryHandler No .system collection, keeping metrics history in memory.
   [junit4]   2> 138260 INFO  (jetty-launcher-395-thread-1) [n:127.0.0.1:56917_solr    ] o.a.s.m.r.SolrJmxReporter JMX monitoring for 'solr_56917.solr.node' (registry 'solr.node') enabled at server: com.sun.jmx.mbeanserver.JmxMBeanServer@d1912f
   [junit4]   2> 138264 INFO  (jetty-launcher-395-thread-1) [n:127.0.0.1:56917_solr    ] o.a.s.m.r.SolrJmxReporter JMX monitoring for 'solr_56917.solr.jvm' (registry 'solr.jvm') enabled at server: com.sun.jmx.mbeanserver.JmxMBeanServer@d1912f
   [junit4]   2> 138266 INFO  (jetty-launcher-395-thread-1) [n:127.0.0.1:56917_solr    ] o.a.s.m.r.SolrJmxReporter JMX monitoring for 'solr_56917.solr.jetty' (registry 'solr.jetty') enabled at server: com.sun.jmx.mbeanserver.JmxMBeanServer@d1912f
   [junit4]   2> 138267 INFO  (jetty-launcher-395-thread-1) [n:127.0.0.1:56917_solr    ] o.a.s.c.CorePropertiesLocator Found 0 core definitions underneath C:\Users\jenkins\workspace\Lucene-Solr-master-Windows\solr\build\solr-core\test\J1\temp\solr.cloud.autoscaling.TriggerIntegrationTest_45EC44B211448503-001\tempDir-001\node1\.
   [junit4]   2> 138307 INFO  (zkConnectionManagerCallback-432-thread-1) [    ] o.a.s.c.c.ConnectionManager zkClient has connected
   [junit4]   2> 138318 INFO  (zkConnectionManagerCallback-437-thread-1) [    ] o.a.s.c.c.ConnectionManager zkClient has connected
   [junit4]   2> 138320 INFO  (SUITE-TriggerIntegrationTest-seed#[45EC44B211448503]-worker) [    ] o.a.s.c.c.ZkStateReader Updated live nodes from ZooKeeper... (0) -> (2)
   [junit4]   2> 138321 INFO  (SUITE-TriggerIntegrationTest-seed#[45EC44B211448503]-worker) [    ] o.a.s.c.s.i.ZkClientClusterStateProvider Cluster at 127.0.0.1:56912/solr ready
   [junit4]   2> 138336 INFO  (qtp2620851-1224) [n:127.0.0.1:56916_solr    ] o.a.s.s.HttpSolrCall [admin] webapp=null path=/admin/metrics params={prefix=CONTAINER.fs.usableSpace,CONTAINER.fs.totalSpace,CORE.coreName&wt=javabin&version=2&group=solr.node,solr.core} status=0 QTime=3
   [junit4]   2> 138351 INFO  (qtp4384976-1230) [n:127.0.0.1:56917_solr    ] o.a.s.s.HttpSolrCall [admin] webapp=null path=/admin/metrics params={prefix=CONTAINER.fs.usableSpace,CONTAINER.fs.totalSpace,CORE.coreName&wt=javabin&version=2&group=solr.node,solr.core} status=0 QTime=4
   [junit4]   2> 138351 DEBUG (qtp2620851-1232) [n:127.0.0.1:56916_solr    ] o.a.s.c.a.AutoScalingHandler Verified autoscaling configuration
   [junit4]   2> 138352 INFO  (qtp2620851-1232) [n:127.0.0.1:56916_solr    ] o.a.s.s.HttpSolrCall [admin] webapp=null path=/admin/autoscaling params={wt=javabin&version=2} status=0 QTime=21
   [junit4]   2> 138355 DEBUG (zkCallback-414-thread-1) [    ] o.a.s.c.a.OverseerTriggerThread Refreshing /autoscaling.json with znode version 2
   [junit4]   2> 138374 DEBUG (OverseerAutoScalingTriggerThread-72079992874139652-127.0.0.1:56916_solr-n_0000000000) [    ] o.a.s.c.a.OverseerTriggerThread Processed trigger updates upto znodeVersion 2
   [junit4]   2> 138400 DEBUG (OverseerAutoScalingTriggerThread-72079992874139652-127.0.0.1:56916_solr-n_0000000000) [    ] o.a.s.c.a.OverseerTriggerThread -- clean old nodeAdded markers
   [junit4]   2> 138400 INFO  (TEST-TriggerIntegrationTest.testContinueTriggersOnOverseerRestart-seed#[45EC44B211448503]) [    ] o.a.s.SolrTestCaseJ4 ###Starting testContinueTriggersOnOverseerRestart
   [junit4]   2> 138400 DEBUG (OverseerAutoScalingTriggerThread-72079992874139652-127.0.0.1:56916_solr-n_0000000000) [    ] o.a.s.c.a.OverseerTriggerThread Current znodeVersion 2, lastZnodeVersion 2
   [junit4]   2> 138402 INFO  (zkConnectionManagerCallback-439-thread-1) [    ] o.a.s.c.c.ConnectionManager zkClient has connected
   [junit4]   2> 138404 WARN  (NIOServerCxn.Factory:0.0.0.0/0.0.0.0:0) [    ] o.a.z.s.NIOServerCnxn Unable to read additional data from client sessionid 0x100145f22ad000b, likely client has closed socket
   [junit4]   2> 138405 INFO  (qtp2620851-1233) [n:127.0.0.1:56916_solr    ] o.a.s.h.a.CollectionsHandler Invoked Collection Action :overseerstatus with params action=OVERSEERSTATUS&wt=javabin&version=2 and sendToOCPQueue=true
   [junit4]   2> 138411 INFO  (qtp2620851-1233) [n:127.0.0.1:56916_solr    ] o.a.s.s.HttpSolrCall [admin] webapp=null path=/admin/collections params={action=OVERSEERSTATUS&wt=javabin&version=2} status=0 QTime=5
   [junit4]   2> 138412 INFO  (TEST-TriggerIntegrationTest.testContinueTriggersOnOverseerRestart-seed#[45EC44B211448503]) [    ] o.a.s.c.a.ScheduledTriggers -- removing trigger: .auto_add_replicas
   [junit4]   2> 138413 INFO  (TEST-TriggerIntegrationTest.testContinueTriggersOnOverseerRestart-seed#[45EC44B211448503]) [    ] o.a.s.c.a.TriggerIntegrationTest /autoscaling.json reset, new znode version 3
   [junit4]   2> 138414 DEBUG (zkCallback-414-thread-1) [    ] o.a.s.c.a.OverseerTriggerThread Refreshing /autoscaling.json with znode version 3
   [junit4]   2> 138414 DEBUG (OverseerAutoScalingTriggerThread-72079992874139652-127.0.0.1:56916_solr-n_0000000000) [    ] o.a.s.c.a.OverseerTriggerThread Processed trigger updates upto znodeVersion 3
   [junit4]   2> 138414 DEBUG (OverseerAutoScalingTriggerThread-72079992874139652-127.0.0.1:56916_solr-n_0000000000) [    ] o.a.s.c.a.OverseerTriggerThread -- clean old nodeLost markers
   [junit4]   2> 138414 INFO  (TEST-TriggerIntegrationTest.testContinueTriggersOnOverseerRestart-seed#[45EC44B211448503]) [    ] o.a.s.c.c.ZkStateReader Updated live nodes from ZooKeeper... (0) -> (2)
   [junit4]   2> 138414 DEBUG (OverseerAutoScalingTriggerThread-72079992874139652-127.0.0.1:56916_solr-n_0000000000) [    ] o.a.s.c.a.OverseerTriggerThread -- clean old nodeAdded markers
   [junit4]   2> 138415 DEBUG (OverseerAutoScalingTriggerThread-72079992874139652-127.0.0.1:56916_solr-n_0000000000) [    ] o.a.s.c.a.OverseerTriggerThread Current znodeVersion 3, lastZnodeVersion 3
   [junit4]   2> 138418 INFO  (TEST-TriggerIntegrationTest.testContinueTriggersOnOverseerRestart-seed#[45EC44B211448503]) [    ] o.e.j.s.AbstractConnector Stopped ServerConnector@4bacd7{HTTP/1.1,[http/1.1]}{127.0.0.1:0}
   [junit4]   2> 138418 INFO  (TEST-TriggerIntegrationTest.testContinueTriggersOnOverseerRestart-seed#[45EC44B211448503]) [    ] o.a.s.c.CoreContainer Shutting down CoreContainer instance=22850459
   [junit4]   2> 138418 INFO  (TEST-TriggerIntegrationTest.testContinueTriggersOnOverseerRestart-seed#[45EC44B211448503]) [    ] o.a.s.m.SolrMetricManager Closing metric reporters for registry=solr.node, tag=null
   [junit4]   2> 138419 INFO  (TEST-TriggerIntegrationTest.testContinueTriggersOnOverseerRestart-seed#[45EC44B211448503]) [    ] o.a.s.m.r.SolrJmxReporter Closing reporter [org.apache.solr.metrics.reporters.SolrJmxReporter@d4e4e0: rootName = solr_56916, domain = solr.node, service url = null, agent id = null] for registry solr.node / com.codahale.metrics.MetricRegistry@1cf4983
   [junit4]   2> 138423 INFO  (TEST-TriggerIntegrationTest.testContinueTriggersOnOverseerRestart-seed#[45EC44B211448503]) [    ] o.a.s.m.SolrMetricManager Closing metric reporters for registry=solr.jvm, tag=null
   [junit4]   2> 138423 INFO  (TEST-TriggerIntegrationTest.testContinueTriggersOnOverseerRestart-seed#[45EC44B211448503]) [    ] o.a.s.m.r.SolrJmxReporter Closing reporter [org.apache.solr.metrics.reporters.SolrJmxReporter@adc1a3: rootName = solr_56916, domain = solr.jvm, service url = null, agent id = null] for registry solr.jvm / com.codahale.metrics.MetricRegistry@10ca3e3
   [junit4]   2> 138427 INFO  (TEST-TriggerIntegrationTest.testContinueTriggersOnOverseerRestart-seed#[45EC44B211448503]) [    ] o.a.s.m.SolrMetricManager Closing metric reporters for registry=solr.jetty, tag=null
   [junit4]   2> 138427 INFO  (TEST-TriggerIntegrationTest.testContinueTriggersOnOverseerRestart-seed#[45EC44B211448503]) [    ] o.a.s.m.r.SolrJmxReporter Closing reporter [org.apache.solr.metrics.reporters.SolrJmxReporter@12832aa: rootName = solr_56916, domain = solr.jetty, service url = null, agent id = null] for registry solr.jetty / com.codahale.metrics.MetricRegistry@87dcdb
   [junit4]   2> 138429 INFO  (TEST-TriggerIntegrationTest.testContinueTriggersOnOverseerRestart-seed#[45EC44B211448503]) [    ] o.a.s.c.ZkController Remove node as live in ZooKeeper:/live_nodes/127.0.0.1:56916_solr
   [junit4]   2> 138429 INFO  (TEST-TriggerIntegrationTest.testContinueTriggersOnOverseerRestart-seed#[45EC44B211448503]) [    ] o.a.s.m.SolrMetricManager Closing metric reporters for registry=solr.cluster, tag=null
   [junit4]   2> 138430 INFO  (TEST-TriggerIntegrationTest.testContinueTriggersOnOverseerRestart-seed#[45EC44B211448503]) [    ] o.a.s.c.TransientSolrCoreCacheDefault Allocating transient cache for 2147483647 transient cores
   [junit4]   2> 138430 INFO  (zkCallback-436-thread-1) [    ] o.a.s.c.c.ZkStateReader Updated live nodes from ZooKeeper... (2) -> (1)
   [junit4]   2> 138430 INFO  (TEST-TriggerIntegrationTest.testContinueTriggersOnOverseerRestart-seed#[45EC44B211448503]) [    ] o.a.s.c.Overseer Overseer (id=72079992874139652-127.0.0.1:56916_solr-n_0000000000) closing
   [junit4]   2> 138431 INFO  (OverseerStateUpdate-72079992874139652-127.0.0.1:56916_solr-n_0000000000) [n:127.0.0.1:56916_solr    ] o.a.s.c.Overseer Overseer Loop exiting : 127.0.0.1:56916_solr
   [junit4]   2> 138431 INFO  (zkCallback-421-thread-1) [    ] o.a.s.c.c.ZkStateReader Updated live nodes from ZooKeeper... (2) -> (1)
   [junit4]   2> 138431 INFO  (zkCallback-414-thread-1) [    ] o.a.s.c.c.ZkStateReader Updated live nodes from ZooKeeper... (2) -> (1)
   [junit4]   2> 138431 INFO  (zkCallback-436-thread-2) [    ] o.a.s.c.c.ZkStateReader Updated live nodes from ZooKeeper... (2) -> (1)
   [junit4]   2> 138432 DEBUG (TEST-TriggerIntegrationTest.testContinueTriggersOnOverseerRestart-seed#[45EC44B211448503]) [    ] o.a.s.c.a.ScheduledTriggers Shutting down scheduled thread pool executor now
   [junit4]   2> 138432 DEBUG (TEST-TriggerIntegrationTest.testContinueTriggersOnOverseerRestart-seed#[45EC44B211448503]) [    ] o.a.s.c.a.ScheduledTriggers Shutting down action executor now
   [junit4]   2> 138432 DEBUG (TEST-TriggerIntegrationTest.testContinueTriggersOnOverseerRestart-seed#[45EC44B211448503]) [    ] o.a.s.c.a.ScheduledTriggers Awaiting termination for action executor
   [junit4]   2> 138432 DEBUG (TEST-TriggerIntegrationTest.testContinueTriggersOnOverseerRestart-seed#[45EC44B211448503]) [    ] o.a.s.c.a.ScheduledTriggers Awaiting termination for scheduled thread pool executor
   [junit4]   2> 138432 WARN  (OverseerAutoScalingTriggerThread-72079992874139652-127.0.0.1:56916_solr-n_0000000000) [    ] o.a.s.c.a.OverseerTriggerThread OverseerTriggerThread woken up but we are closed, exiting.
   [junit4]   2> 138432 INFO  (zkCallback-407-thread-1) [    ] o.a.s.c.c.ZkStateReader Updated live nodes from ZooKeeper... (2) -> (1)
   [junit4]   2> 138433 DEBUG (TEST-TriggerIntegrationTest.testContinueTriggersOnOverseerRestart-seed#[45EC44B211448503]) [    ] o.a.s.c.a.ScheduledTriggers ScheduledTriggers closed completely
   [junit4]   2> 138433 DEBUG (TEST-TriggerIntegrationTest.testContinueTriggersOnOverseerRestart-seed#[45EC44B211448503]) [    ] o.a.s.c.a.OverseerTriggerThread OverseerTriggerThread has been closed explicitly
   [junit4]   2> 138433 INFO  (zkCallback-428-thread-1) [    ] o.a.s.c.c.ZkStateReader Updated live nodes from ZooKeeper... (2) -> (1)
   [junit4]   2> 138434 WARN  (NIOServerCxn.Factory:0.0.0.0/0.0.0.0:0) [    ] o.a.z.s.NIOServerCnxn Unable to read additional data from client sessionid 0x100145f22ad0005, likely client has closed socket
   [junit4]   2> 138434 WARN  (NIOServerCxn.Factory:0.0.0.0/0.0.0.0:0) [    ] o.a.z.s.NIOServerCnxn Unable to read additional data from client sessionid 0x100145f22ad0004, likely client has closed socket
   [junit4]   2> 138436 INFO  (TEST-TriggerIntegrationTest.testContinueTriggersOnOverseerRestart-seed#[45EC44B211448503]) [    ] o.e.j.s.h.ContextHandler Stopped o.e.j.s.ServletContextHandler@1505308{/solr,null,UNAVAILABLE}
   [junit4]   2> 138436 INFO  (TEST-TriggerIntegrationTest.testContinueTriggersOnOverseerRestart-seed#[45EC44B211448503]) [    ] o.e.j.s.session node0 Stopped scavenging
   [junit4]   2> 138437 INFO  (zkCallback-421-thread-1) [    ] o.a.s.c.OverseerElectionContext I am going to be the leader 127.0.0.1:56917_solr
   [junit4]   2> 138439 INFO  (zkCallback-421-thread-1) [n:127.0.0.1:56917_solr    ] o.a.s.c.Overseer Overseer (id=72079992874139655-127.0.0.1:56917_solr-n_0000000001) starting
   [junit4]   2> 138442 INFO  (OverseerStateUpdate-72079992874139655-127.0.0.1:56917_solr-n_0000000001) [n:127.0.0.1:56917_solr    ] o.a.s.c.Overseer Starting to work on the main queue : 127.0.0.1:56917_solr
   [junit4]   2> 138442 DEBUG (OverseerAutoScalingTriggerThread-72079992874139655-127.0.0.1:56917_solr-n_0000000001) [    ] o.a.s.c.a.OverseerTriggerThread Adding .auto_add_replicas and .scheduled_maintenance triggers
   [junit4]   2> 138442 DEBUG (OverseerAutoScalingTriggerThread-72079992874139655-127.0.0.1:56917_solr-n_0000000001) [    ] o.a.s.c.a.OverseerTriggerThread Refreshing /autoscaling.json with znode version 4
   [junit4]   2> 138447 DEBUG (OverseerAutoScalingTriggerThread-72079992874139655-127.0.0.1:56917_solr-n_0000000001) [    ] o.a.s.c.a.OverseerTriggerThread Current znodeVersion 4, lastZnodeVersion -1
   [junit4]   2> 138447 DEBUG (OverseerAutoScalingTriggerThread-72079992874139655-127.0.0.1:56917_solr-n_0000000001) [    ] o.a.s.c.a.OverseerTriggerThread Processed trigger updates upto znodeVersion 4
   [junit4]   2> 138450 DEBUG (OverseerAutoScalingTriggerThread-72079992874139655-127.0.0.1:56917_solr-n_0000000001) [    ] o.a.s.c.a.NodeLostTrigger NodeLostTrigger .auto_add_replicas - Initial livenodes: [127.0.0.1:56917_solr]
   [junit4]   2> 138451 DEBUG (OverseerAutoScalingTriggerThread-72079992874139655-127.0.0.1:56917_solr-n_0000000001) [    ] o.a.s.c.a.OverseerTriggerThread -- clean old nodeAdded markers
   [junit4]   2> 138451 DEBUG (OverseerAutoScalingTriggerThread-72079992874139655-127.0.0.1:56917_solr-n_0000000001) [    ] o.a.s.c.a.OverseerTriggerThread Current znodeVersion 4, lastZnodeVersion 4
   [junit4]   2> 138451 DEBUG (ScheduledTrigger-468-thread-1) [    ] o.a.s.c.a.NodeLostTrigger Running NodeLostTrigger: .auto_add_replicas with currently live nodes: 1
   [junit4]   2> 139521 DEBUG (ScheduledTrigger-468-thread-3) [    ] o.a.s.c.a.NodeLostTrigger Running NodeLostTrigger: .auto_add_replicas with currently live nodes: 1
   [junit4]   2> 140588 DEBUG (ScheduledTrigger-468-thread-1) [    ] o.a.s.c.a.NodeLostTrigger Running NodeLostTrigger: .auto_add_replicas with currently live nodes: 1
   [junit4]   2> 141656 DEBUG (ScheduledTrigger-468-thread-2) [    ] o.a.s.c.a.NodeLostTrigger Running NodeLostTrigger: .auto_add_replicas with currently live nodes: 1
   [junit4]   2> 142725 DEBUG (ScheduledTrigger-468-thread-2) [    ] o.a.s.c.a.NodeLostTrigger Running NodeLostTrigger: .auto_add_replicas with currently live nodes: 1
   [junit4]   2> 143775 INFO  (TEST-TriggerIntegrationTest.testContinueTriggersOnOverseerRestart-seed#[45EC44B211448503]) [    ] o.e.j.s.Server jetty-9.4.11.v20180605; built: 2018-06-05T18:24:03.829Z; git: d5fc0523cfa96bfebfbda19606cad384d772f04c; jvm 1.8.0_172-b11
   [junit4]   2> 143776 INFO  (TEST-TriggerIntegrationTest.testContinueTriggersOnOverseerRestart-seed#[45EC44B211448503]) [    ] o.e.j.s.session DefaultSessionIdManager workerName=node0
   [junit4]   2> 143776 INFO  (TEST-TriggerIntegrationTest.testContinueTriggersOnOverseerRestart-seed#[45EC44B211448503]) [    ] o.e.j.s.session No SessionScavenger set, using defaults
   [junit4]   2> 143776 INFO  (TEST-TriggerIntegrationTest.testContinueTriggersOnOverseerRestart-seed#[45EC44B211448503]) [    ] o.e.j.s.session node0 Scavenging every 660000ms
   [junit4]   2> 143776 INFO  (TEST-TriggerIntegrationTest.testContinueTriggersOnOverseerRestart-seed#[45EC44B211448503]) [    ] o.e.j.s.h.ContextHandler Started o.e.j.s.ServletContextHandler@67af93{/solr,null,AVAILABLE}
   [junit4]   2> 143778 INFO  (TEST-TriggerIntegrationTest.testContinueTriggersOnOverseerRestart-seed#[45EC44B211448503]) [    ] o.e.j.s.AbstractConnector Started ServerConnector@bdc6d4{HTTP/1.1,[http/1.1]}{127.0.0.1:56986}
   [junit4]   2> 143778 INFO  (TEST-TriggerIntegrationTest.testContinueTriggersOnOverseerRestart-seed#[45EC44B211448503]) [    ] o.e.j.s.Server Started @140082ms
   [junit4]   2> 143778 INFO  (TEST-TriggerIntegrationTest.testContinueTriggersOnOverseerRestart-seed#[45EC44B211448503]) [    ] o.a.s.c.s.e.JettySolrRunner Jetty properties: {hostContext=/solr, hostPort=56986}
   [junit4]   2> 143778 ERROR (TEST-TriggerIntegrationTest.testContinueTriggersOnOverseerRestart-seed#[45EC44B211448503]) [    ] o.a.s.u.StartupLoggingUtils Missing Java Option solr.log.dir. Logging may be missing or incomplete.
   [junit4]   2> 143778 INFO  (TEST-TriggerIntegrationTest.testContinueTriggersOnOverseerRestart-seed#[45EC44B211448503]) [    ] o.a.s.s.SolrDispatchFilter Using logger factory org.apache.logging.slf4j.Log4jLoggerFactory
   [junit4]   2> 143778 INFO  (TEST-TriggerIntegrationTest.testContinueTriggersOnOverseerRestart-seed#[45EC44B211448503]) [    ] o.a.s.s.SolrDispatchFilter  ___      _       Welcome to Apache Solr™ version 8.0.0
   [junit4]   2> 143779 INFO  (TEST-TriggerIntegrationTest.testContinueTriggersOnOverseerRestart-seed#[45EC44B211448503]) [    ] o.a.s.s.SolrDispatchFilter / __| ___| |_ _   Starting in cloud mode on port null
   [junit4]   2> 143779 INFO  (TEST-TriggerIntegrationTest.testContinueTriggersOnOverseerRestart-seed#[45EC44B211448503]) [    ] o.a.s.s.SolrDispatchFilter \__ \/ _ \ | '_|  Install dir: null
   [junit4]   2> 143779 INFO  (TEST-TriggerIntegrationTest.testContinueTriggersOnOverseerRestart-seed#[45EC44B211448503]) [    ] o.a.s.s.SolrDispatchFilter |___/\___/_|_|    Start time: 2018-11-01T08:34:24.659Z
   [junit4]   2> 143782 INFO  (zkConnectionManagerCallback-443-thread-1) [    ] o.a.s.c.c.ConnectionManager zkClient has connected
   [junit4]   2> 143782 INFO  (TEST-TriggerIntegrationTest.testContinueTriggersOnOverseerRestart-seed#[45EC44B211448503]) [    ] o.a.s.s.SolrDispatchFilter solr.xml found in ZooKeeper. Loading...
   [junit4]   2> 143793 DEBUG (ScheduledTrigger-468-thread-2) [    ] o.a.s.c.a.NodeLostTrigger Running NodeLostTrigger: .auto_add_replicas with currently live nodes: 1
   [junit4]   2> 144035 INFO  (TEST-TriggerIntegrationTest.testContinueTriggersOnOverseerRestart-seed#[45EC44B211448503]) [    ] o.a.s.c.ZkContainer Zookeeper client=127.0.0.1:56912/solr
   [junit4]   2> 144037 INFO  (zkConnectionManagerCallback-447-thread-1) [    ] o.a.s.c.c.ConnectionManager zkClient has connected
   [junit4]   2> 144038 WARN  (NIOServerCxn.Factory:0.0.0.0/0.0.0.0:0) [    ] o.a.z.s.NIOServerCnxn Unable to read additional data from client sessionid 0x100145f22ad000d, likely client has closed socket
   [junit4]   2> 144041 INFO  (zkConnectionManagerCallback-449-thread-1) [    ] o.a.s.c.c.ConnectionManager zkClient has connected
   [junit4]   2> 144049 INFO  (TEST-TriggerIntegrationTest.testContinueTriggersOnOverseerRestart-seed#[45EC44B211448503]) [n:127.0.0.1:56986_solr    ] o.a.s.c.c.ZkStateReader Updated live nodes from ZooKeeper... (0) -> (1)
   [junit4]   2> 144053 INFO  (TEST-TriggerIntegrationTest.testContinueTriggersOnOverseerRestart-seed#[45EC44B211448503]) [n:127.0.0.1:56986_solr    ] o.a.s.c.TransientSolrCoreCacheDefault Allocating transient cache for 2147483647 transient cores
   [junit4]   2> 144053 INFO  (TEST-TriggerIntegrationTest.testContinueTriggersOnOverseerRestart-seed#[45EC44B211448503]) [n:127.0.0.1:56986_solr    ] o.a.s.c.ZkController Register node as live in ZooKeeper:/live_nodes/127.0.0.1:56986_solr
   [junit4]   2> 144057 INFO  (zkCallback-436-thread-2) [    ] o.a.s.c.c.ZkStateReader Updated live nodes from ZooKeeper... (1) -> (2)
   [junit4]   2> 144057 INFO  (zkCallback-436-thread-1) [    ] o.a.s.c.c.ZkStateReader Updated live nodes from ZooKeeper... (1) -> (2)
   [junit4]   2> 144057 INFO  (zkCallback-421-thread-1) [    ] o.a.s.c.c.ZkStateReader Updated live nodes from ZooKeeper... (1) -> (2)
   [junit4]   2> 144057 INFO  (zkCallback-428-thread-1) [    ] o.a.s.c.c.ZkStateReader Updated live nodes from ZooKeeper... (1) -> (2)
   [junit4]   2> 144058 INFO  (zkCallback-448-thread-1) [    ] o.a.s.c.c.ZkStateReader Updated live nodes from ZooKeeper... (1) -> (2)
   [junit4]   2> 144111 INFO  (zkConnectionManagerCallback-456-thread-1) [    ] o.a.s.c.c.ConnectionManager zkClient has connected
   [junit4]   2> 144113 INFO  (TEST-TriggerIntegrationTest.testContinueTriggersOnOverseerRestart-seed#[45EC44B211448503]) [n:127.0.0.1:56986_solr    ] o.a.s.c.c.ZkStateReader Updated live nodes from ZooKeeper... (0) -> (2)
   [junit4]   2> 144115 INFO  (TEST-TriggerIntegrationTest.testContinueTriggersOnOverseerRestart-seed#[45EC44B211448503]) [n:127.0.0.1:56986_solr    ] o.a.s.c.s.i.ZkClientClusterStateProvider Cluster at 127.0.0.1:56912/solr ready
   [junit4]   2> 144115 INFO  (TEST-TriggerIntegrationTest.testContinueTriggersOnOverseerRestart-seed#[45EC44B211448503]) [n:127.0.0.1:56986_solr    ] o.a.s.h.a.MetricsHistoryHandler No .system collection, keeping metrics history in memory.
   [junit4]   2> 144144 INFO  (TEST-TriggerIntegrationTest.testContinueTriggersOnOverseerRestart-seed#[45EC44B211448503]) [n:127.0.0.1:56986_solr    ] o.a.s.m.r.SolrJmxReporter JMX monitoring for 'solr_56986.solr.node' (registry 'solr.node') enabled at server: com.sun.jmx.mbeanserver.JmxMBeanServer@d1912f
   [junit4]   2> 144150 INFO  (TEST-TriggerIntegrationTest.testContinueTriggersOnOverseerRestart-seed#[45EC44B211448503]) [n:127.0.0.1:56986_solr    ] o.a.s.m.r.SolrJmxReporter JMX monitoring for 'solr_56986.solr.jvm' (registry 'solr.jvm') enabled at server: com.sun.jmx.mbeanserver.JmxMBeanServer@d1912f
   [junit4]   2> 144150 INFO  (TEST-TriggerIntegrationTest.testContinueTriggersOnOverseerRestart-seed#[45EC44B211448503]) [n:127.0.0.1:56986_solr    ] o.a.s.m.r.SolrJmxReporter JMX monitoring for 'solr_56986.solr.jetty' (registry 'solr.jetty') enabled at server: com.sun.jmx.mbeanserver.JmxMBeanServer@d1912f
   [junit4]   2> 144151 INFO  (TEST-TriggerIntegrationTest.testContinueTriggersOnOverseerRestart-seed#[45EC44B211448503]) [n:127.0.0.1:56986_solr    ] o.a.s.c.CorePropertiesLocator Found 0 core definitions underneath C:\Users\jenkins\workspace\Lucene-Solr-master-Windows\solr\build\solr-core\test\J1\temp\solr.cloud.autoscaling.TriggerIntegrationTest_45EC44B211448503-001\tempDir-001\node3\.
   [junit4]   2> 144197 INFO  (qtp4384976-1239) [n:127.0.0.1:56917_solr    ] o.a.s.h.a.CollectionsHandler Invoked Collection Action :overseerstatus with params action=OVERSEERSTATUS&wt=javabin&version=2 and sendToOCPQueue=true
   [junit4]   2> 144204 INFO  (qtp4384976-1239) [n:127.0.0.1:56917_solr    ] o.a.s.s.HttpSolrCall [admin] webapp=null path=/admin/collections params={action=OVERSEERSTATUS&wt=javabin&version=2} status=0 QTime=6
   [junit4]   2> 144212 INFO  (qtp12996709-1315) [n:127.0.0.1:56986_solr    ] o.a.s.s.HttpSolrCall [admin] webapp=null path=/admin/metrics params={prefix=CONTAINER.fs.usableSpace,CONTAINER.fs.totalSpace,CORE.coreName&wt=javabin&version=2&group=solr.node,solr.core} status=0 QTime=2
   [junit4]   2> 144218 INFO  (qtp4384976-1228) [n:127.0.0.1:56917_solr    ] o.a.s.s.HttpSolrCall [admin] webapp=null path=/admin/metrics params={prefix=CONTAINER.fs.usableSpace,CONTAINER.fs.totalSpace,CORE.coreName&wt=javabin&version=2&group=solr.node,solr.core} status=0 QTime=2
   [junit4]   2> 144218 DEBUG (qtp12996709-1318) [n:127.0.0.1:56986_solr    ] o.a.s.c.a.AutoScalingHandler Verified autoscaling configuration
   [junit4]   2> 144219 INFO  (qtp12996709-1318) [n:127.0.0.1:56986_solr    ] o.a.s.s.HttpSolrCall [admin] webapp=null path=/cluster/autoscaling params={wt=javabin&version=2} status=0 QTime=10
   [junit4]   2> 144219 DEBUG (zkCallback-428-thread-1) [    ] o.a.s.c.a.OverseerTriggerThread Refreshing /autoscaling.json with znode version 5
   [junit4]   2> 144220 DEBUG (OverseerAutoScalingTriggerThread-72079992874139655-127.0.0.1:56917_solr-n_0000000001) [    ] o.a.s.c.a.OverseerTriggerThread Processed trigger updates upto znodeVersion 5
   [junit4]   2> 144223 INFO  (OverseerAutoScalingTriggerThread-72079992874139655-127.0.0.1:56917_solr-n_0000000001) [    ] o.a.s.c.a.TriggerIntegrationTest TestTriggerAction init
   [junit4]   2> 144223 DEBUG (OverseerAutoScalingTriggerThread-72079992874139655-127.0.0.1:56917_solr-n_0000000001) [    ] o.a.s.c.a.NodeAddedTrigger NodeAddedTrigger node_added_triggerCTOOR - Initial livenodes: [127.0.0.1:56986_solr, 127.0.0.1:56917_solr]
   [junit4]   2> 144223 DEBUG (OverseerAutoScalingTriggerThread-72079992874139655-127.0.0.1:56917_solr-n_0000000001) [    ] o.a.s.c.a.NodeAddedTrigger NodeAddedTrigger node_added_triggerCTOOR instantiated with properties: {event=nodeAdded, waitFor=2, actions=[{name=test, class=org.apache.solr.cloud.autoscaling.TriggerIntegrationTest$TestTriggerAction}], enabled=true}
   [junit4]   2> 144225 INFO  (TEST-TriggerIntegrationTest.testContinueTriggersOnOverseerRestart-seed#[45EC44B211448503]) [    ] o.e.j.s.AbstractConnector Stopped ServerConnector@1778c49{HTTP/1.1,[http/1.1]}{127.0.0.1:0}
   [junit4]   2> 144226 INFO  (TEST-TriggerIntegrationTest.testContinueTriggersOnOverseerRestart-seed#[45EC44B211448503]) [    ] o.a.s.c.CoreContainer Shutting down CoreContainer instance=25573947
   [junit4]   2> 144226 INFO  (TEST-TriggerIntegrationTest.testContinueTriggersOnOverseerRestart-seed#[45EC44B211448503]) [    ] o.a.s.m.SolrMetricManager Closing metric reporters for registry=solr.node, tag=null
   [junit4]   2> 144226 INFO  (TEST-TriggerIntegrationTest.testContinueTriggersOnOverseerRestart-seed#[45EC44B211448503]) [    ] o.a.s.m.r.SolrJmxReporter Closing reporter [org.apache.solr.metrics.reporters.SolrJmxReporter@1c2ad5c: rootName = solr_56917, domain = solr.node, service url = null, agent id = null] for registry solr.node / com.codahale.metrics.MetricRegistry@5ed419
   [junit4]   2> 144227 DEBUG (ScheduledTrigger-468-thread-4) [    ] o.a.s.c.a.NodeAddedTrigger Running NodeAddedTrigger node_added_triggerCTOOR
   [junit4]   2> 144228 DEBUG (ScheduledTrigger-468-thread-4) [    ] o.a.s.c.a.NodeAddedTrigger Found livenodes: 2
   [junit4]   2> 144229 DEBUG (OverseerAutoScalingTriggerThread-72079992874139655-127.0.0.1:56917_solr-n_0000000001) [    ] o.a.s.c.a.OverseerTriggerThread Current znodeVersion 5, lastZnodeVersion 5
   [junit4]   2> 144230 INFO  (TEST-TriggerIntegrationTest.testContinueTriggersOnOverseerRestart-seed#[45EC44B211448503]) [    ] o.a.s.m.SolrMetricManager Closing metric reporters for registry=solr.jvm, tag=null
   [junit4]   2> 144231 INFO  (TEST-TriggerIntegrationTest.testContinueTriggersOnOverseerRestart-seed#[45EC44B211448503]) [    ] o.a.s.m.r.SolrJmxReporter Closing reporter [org.apache.solr.metrics.reporters.SolrJmxReporter@76ba5c: rootName = solr_56917, domain = solr.jvm, service url = null, agent id = null] for registry solr.jvm / com.codahale.metrics.MetricRegistry@10ca3e3
   [junit4]   2> 144233 INFO  (TEST-TriggerIntegrationTest.testContinueTriggersOnOverseerRestart-seed#[45EC44B211448503]) [    ] o.a.s.m.SolrMetricManager Closing metric reporters for registry=solr.jetty, tag=null
   [junit4]   2> 144233 INFO  (TEST-TriggerIntegrationTest.testContinueTriggersOnOverseerRestart-seed#[45EC44B211448503]) [    ] o.a.s.m.r.SolrJmxReporter Closing reporter [org.apache.solr.metrics.reporters.SolrJmxReporter@fa62c3: rootName = solr_56917, domain = solr.jetty, service url = null, agent id = null] for registry solr.jetty / com.codahale.metrics.MetricRegistry@87dcdb
   [junit4]   2> 144236 INFO  (TEST-TriggerIntegrationTest.testContinueTriggersOnOverseerRestart-seed#[45EC44B211448503]) [    ] o.a.s.c.ZkController Remove node as live in ZooKeeper:/live_nodes/127.0.0.1:56917_solr
   [junit4]   2> 144237 INFO  (TEST-TriggerIntegrationTest.testContinueTriggersOnOverseerRestart-seed#[45EC44B211448503]) [    ] o.a.s.m.SolrMetricManager Closing metric reporters for registry=solr.cluster, tag=null
   [junit4]   2> 144237 INFO  (zkCallback-436-thread-1) [    ] o.a.s.c.c.ZkStateReader Updated live nodes from ZooKeeper... (2) -> (1)
   [junit4]   2> 144237 INFO  (zkCallback-436-thread-2) [    ] o.a.s.c.c.ZkStateReader Updated live nodes from ZooKeeper... (2) -> (1)
   [junit4]   2> 144238 INFO  (TEST-TriggerIntegrationTest.testContinueTriggersOnOverseerRestart-seed#[45EC44B211448503]) [    ] o.a.s.c.Overseer Overseer (id=72079992874139655-127.0.0.1:56917_solr-n_0000000001) closing
   [junit4]   2> 144238 INFO  (zkCallback-448-thread-1) [    ] o.a.s.c.c.ZkStateReader Updated live nodes from ZooKeeper... (2) -> (1)
   [junit4]   2> 144238 INFO  (zkCallback-421-thread-1) [    ] o.a.s.c.c.ZkStateReader Updated live nodes from ZooKeeper... (2) -> (1)
   [junit4]   2> 144238 INFO  (OverseerStateUpdate-72079992874139655-127.0.0.1:56917_solr-n_0000000001) [n:127.0.0.1:56917_solr    ] o.a.s.c.Overseer Overseer Loop exiting : 127.0.0.1:56917_solr
   [junit4]   2> 144239 INFO  (zkCallback-428-thread-1) [    ] o.a.s.c.c.ZkStateReader Updated live nodes from ZooKeeper... (2) -> (1)
   [junit4]   2> 144239 WARN  (OverseerAutoScalingTriggerThread-72079992874139655-127.0.0.1:56917_solr-n_0000000001) [    ] o.a.s.c.a.OverseerTriggerThread OverseerTriggerThread woken up but we are closed, exiting.
   [junit4]   2> 144242 DEBUG (TEST-TriggerIntegrationTest.testContinueTriggersOnOverseerRestart-seed#[45EC44B211448503]) [    ] o.a.s.c.a.ScheduledTriggers Shutting down scheduled thread pool executor now
   [junit4]   2> 144242 INFO  (zkCallback-455-thread-1) [    ] o.a.s.c.c.ZkStateReader Updated live nodes from ZooKeeper... (2) -> (1)
   [junit4]   2> 144242 DEBUG (TEST-TriggerIntegrationTest.testContinueTriggersOnOverseerRestart-seed#[45EC44B211448503]) [    ] o.a.s.c.a.ScheduledTriggers Shutting down action executor now
   [junit4]   2> 144242 DEBUG (TEST-TriggerIntegrationTest.testContinueTriggersOnOverseerRestart-seed#[45EC44B211448503]) [    ] o.a.s.c.a.ScheduledTriggers Awaiting termination for action executor
   [junit4]   2> 144242 DEBUG (TEST-TriggerIntegrationTest.testContinueTriggersOnOverseerRestart-seed#[45EC44B211448503]) [    ] o.a.s.c.a.ScheduledTriggers Awaiting termination for scheduled thread pool executor
   [junit4]   2> 144242 DEBUG (TEST-TriggerIntegrationTest.testContinueTriggersOnOverseerRestart-seed#[45EC44B211448503]) [    ] o.a.s.c.a.ScheduledTriggers ScheduledTriggers closed completely
   [junit4]   2> 144242 DEBUG (TEST-TriggerIntegrationTest.testContinueTriggersOnOverseerRestart-seed#[45EC44B211448503]) [    ] o.a.s.c.a.OverseerTriggerThread OverseerTriggerThread has been closed explicitly
   [junit4]   2> 144243 WARN  (NIOServerCxn.Factory:0.0.0.0/0.0.0.0:0) [    ] o.a.z.s.NIOServerCnxn Unable to read additional data from client sessionid 0x100145f22ad0008, likely client has closed socket
   [junit4]   2> 144244 WARN  (NIOServerCxn.Factory:0.0.0.0/0.0.0.0:0) [    ] o.a.z.s.NIOServerCnxn Unable to read additional data from client sessionid 0x100145f22ad0007, likely client has closed socket
   [junit4]   2> 144245 INFO  (TEST-TriggerIntegrationTest.testContinueTriggersOnOverseerRestart-seed#[45EC44B211448503]) [    ] o.e.j.s.h.ContextHandler Stopped o.e.j.s.ServletContextHandler@d5dbc9{/solr,null,UNAVAILABLE}
   [junit4]   2> 144246 INFO  (TEST-TriggerIntegrationTest.testContinueTriggersOnOverseerRestart-seed#[45EC44B211448503]) [    ] o.e.j.s.session node0 Stopped scavenging
   [junit4]   2> 144246 INFO  (zkCallback-448-thread-1) [    ] o.a.s.c.OverseerElectionContext I am going to be the leader 127.0.0.1:56986_solr
   [junit4]   2> 144247 INFO  (zkCallback-448-thread-1) [n:127.0.0.1:56986_solr    ] o.a.s.c.Overseer Overseer (id=72079992874139662-127.0.0.1:56986_solr-n_0000000002) starting
   [junit4]   2> 144253 INFO  (OverseerStateUpdate-72079992874139662-127.0.0.1:56986_solr-n_0000000002) [n:127.0.0.1:56986_solr    ] o.a.s.c.Overseer Starting to work on the main queue : 127.0.0.1:56986_solr
   [junit4]   2> 144253 DEBUG (OverseerAutoScalingTriggerThread-72079992874139662-127.0.0.1:56986_solr-n_0000000002) [    ] o.a.s.c.a.OverseerTriggerThread Refreshing /autoscaling.json with znode version 5
   [junit4]   2> 144253 DEBUG (OverseerAutoScalingTriggerThread-72079992874139662-127.0.0.1:56986_solr-n_0000000002) [    ] o.a.s.c.a.OverseerTriggerThread Current znodeVersion 5, lastZnodeVersion -1
   [junit4]   2> 144253 DEBUG (OverseerAutoScalingTriggerThread-72079992874139662-127.0.0.1:56986_solr-n_0000000002) [    ] o.a.s.c.a.OverseerTriggerThread Processed trigger updates upto znodeVersion 5
   [junit4]   2> 144255 INFO  (OverseerAutoScalingTriggerThread-72079992874139662-127.0.0.1:56986_solr-n_0000000002) [    ] o.a.s.c.a.TriggerIntegrationTest TestTriggerAction init
   [junit4]   2> 144255 DEBUG (OverseerAutoScalingTriggerThread-72079992874139662-127.0.0.1:56986_solr-n_0000000002) [    ] o.a.s.c.a.NodeAddedTrigger NodeAddedTrigger node_added_triggerCTOOR - Initial livenodes: [127.0.0.1:56986_solr]
   [junit4]   2> 144255 DEBUG (OverseerAutoScalingTriggerThread-72079992874139662-127.0.0.1:56986_solr-n_0000000002) [    ] o.a.s.c.a.NodeAddedTrigger NodeAddedTrigger node_added_triggerCTOOR instantiated with properties: {event=nodeAdded, waitFor=2, actions=[{name=test, class=org.apache.solr.cloud.autoscaling.TriggerIntegrationTest$TestTriggerAction}], enabled=true}
   [junit4]   2> 144257 DEBUG (OverseerAutoScalingTriggerThread-72079992874139662-127.0.0.1:56986_solr-n_0

[...truncated too long message...]

dSolrClientTest.testNonRetryableRequests
   [junit4] OK      0.84s J0 | CloudSolrClientTest.customHttpClientTest
   [junit4] OK      7.58s J0 | CloudSolrClientTest.preferReplicaTypesTest
   [junit4] OK      6.27s J0 | CloudSolrClientTest.preferLocalShardsTest
   [junit4] OK      4.15s J0 | CloudSolrClientTest.testRouting
   [junit4] OK      8.82s J0 | CloudSolrClientTest.testRetryUpdatesWhenClusterStateIsStale
   [junit4] OK      2.29s J0 | CloudSolrClientTest.testShutdown
   [junit4] OK      3.46s J0 | CloudSolrClientTest.testInitializationWithSolrUrls
   [junit4] OK      0.94s J0 | CloudSolrClientTest.testWrongZkChrootTest
   [junit4] OK      3.41s J0 | CloudSolrClientTest.stateVersionParamTest
   [junit4] OK      3.98s J0 | CloudSolrClientTest.testOverwriteOption
   [junit4] Completed [1/5] on J0 in 105.08s, 16 tests
   [junit4] 
   [junit4] Suite: org.apache.solr.client.solrj.impl.CloudSolrClientTest
   [junit4] OK      16.6s J1 | CloudSolrClientTest.checkCollectionParameters
   [junit4] OK      5.28s J1 | CloudSolrClientTest.testParallelUpdateQTime
   [junit4] OK      8.16s J1 | CloudSolrClientTest.testAliasHandling
   [junit4] OK      4.35s J1 | CloudSolrClientTest.testVersionsAreReturned
   [junit4] OK      0.77s J1 | CloudSolrClientTest.testCollectionDoesntExist
   [junit4] OK      5.15s J1 | CloudSolrClientTest.testNonRetryableRequests
   [junit4] OK      0.82s J1 | CloudSolrClientTest.customHttpClientTest
   [junit4] OK      8.14s J1 | CloudSolrClientTest.preferReplicaTypesTest
   [junit4] OK      6.29s J1 | CloudSolrClientTest.preferLocalShardsTest
   [junit4] OK      4.13s J1 | CloudSolrClientTest.testRouting
   [junit4] OK      8.84s J1 | CloudSolrClientTest.testRetryUpdatesWhenClusterStateIsStale
   [junit4] OK      2.33s J1 | CloudSolrClientTest.testShutdown
   [junit4] OK      3.31s J1 | CloudSolrClientTest.testInitializationWithSolrUrls
   [junit4] OK      1.15s J1 | CloudSolrClientTest.testWrongZkChrootTest
   [junit4] OK      3.37s J1 | CloudSolrClientTest.stateVersionParamTest
   [junit4] OK      3.96s J1 | CloudSolrClientTest.testOverwriteOption
   [junit4] Completed [2/5] on J1 in 107.05s, 16 tests
   [junit4] 
   [junit4] Duplicate suite name used with XML reports: org.apache.solr.client.solrj.impl.CloudSolrClientTest. This may confuse tools that process XML reports. Set 'ignoreDuplicateSuites' to true to skip this message.
   [junit4] Suite: org.apache.solr.client.solrj.impl.CloudSolrClientTest
   [junit4] OK      4.53s J0 | CloudSolrClientTest.checkCollectionParameters
   [junit4] OK      4.41s J0 | CloudSolrClientTest.testParallelUpdateQTime
   [junit4] OK      6.56s J0 | CloudSolrClientTest.testAliasHandling
   [junit4] OK      4.47s J0 | CloudSolrClientTest.testVersionsAreReturned
   [junit4] OK      0.85s J0 | CloudSolrClientTest.testCollectionDoesntExist
   [junit4] OK      4.39s J0 | CloudSolrClientTest.testNonRetryableRequests
   [junit4] OK      0.90s J0 | CloudSolrClientTest.customHttpClientTest
   [junit4] OK      4.62s J0 | CloudSolrClientTest.preferReplicaTypesTest
   [junit4] OK      6.03s J0 | CloudSolrClientTest.preferLocalShardsTest
   [junit4] OK      5.29s J0 | CloudSolrClientTest.testRouting
   [junit4] OK      9.72s J0 | CloudSolrClientTest.testRetryUpdatesWhenClusterStateIsStale
   [junit4] OK      2.23s J0 | CloudSolrClientTest.testShutdown
   [junit4] OK      3.21s J0 | CloudSolrClientTest.testInitializationWithSolrUrls
   [junit4] OK      0.89s J0 | CloudSolrClientTest.testWrongZkChrootTest
   [junit4] OK      2.95s J0 | CloudSolrClientTest.stateVersionParamTest
   [junit4] OK      3.79s J0 | CloudSolrClientTest.testOverwriteOption
   [junit4] Completed [3/5] on J0 in 68.12s, 16 tests
   [junit4] 
   [junit4] Suite: org.apache.solr.client.solrj.impl.CloudSolrClientTest
   [junit4] OK      3.02s J1 | CloudSolrClientTest.checkCollectionParameters
   [junit4] OK      4.37s J1 | CloudSolrClientTest.testParallelUpdateQTime
   [junit4] OK      6.97s J1 | CloudSolrClientTest.testAliasHandling
   [junit4] OK      4.92s J1 | CloudSolrClientTest.testVersionsAreReturned
   [junit4] OK      0.92s J1 | CloudSolrClientTest.testCollectionDoesntExist
   [junit4] OK      4.59s J1 | CloudSolrClientTest.testNonRetryableRequests
   [junit4] OK      1.21s J1 | CloudSolrClientTest.customHttpClientTest
   [junit4] OK      8.61s J1 | CloudSolrClientTest.preferReplicaTypesTest
   [junit4] OK      7.16s J1 | CloudSolrClientTest.preferLocalShardsTest
   [junit4] OK      4.22s J1 | CloudSolrClientTest.testRouting
   [junit4] OK      9.22s J1 | CloudSolrClientTest.testRetryUpdatesWhenClusterStateIsStale
   [junit4] OK      2.02s J1 | CloudSolrClientTest.testShutdown
   [junit4] OK      3.00s J1 | CloudSolrClientTest.testInitializationWithSolrUrls
   [junit4] OK      0.80s J1 | CloudSolrClientTest.testWrongZkChrootTest
   [junit4] OK      2.93s J1 | CloudSolrClientTest.stateVersionParamTest
   [junit4] OK      3.43s J1 | CloudSolrClientTest.testOverwriteOption
   [junit4] Completed [4/5] on J1 in 71.14s, 16 tests
   [junit4] 
   [junit4] Suite: org.apache.solr.client.solrj.impl.CloudSolrClientTest
   [junit4] OK      2.75s J0 | CloudSolrClientTest.checkCollectionParameters
   [junit4] OK      4.08s J0 | CloudSolrClientTest.testParallelUpdateQTime
   [junit4] OK      7.04s J0 | CloudSolrClientTest.testAliasHandling
   [junit4] OK      4.48s J0 | CloudSolrClientTest.testVersionsAreReturned
   [junit4] OK      0.82s J0 | CloudSolrClientTest.testCollectionDoesntExist
   [junit4] OK      4.13s J0 | CloudSolrClientTest.testNonRetryableRequests
   [junit4] OK      0.81s J0 | CloudSolrClientTest.customHttpClientTest
   [junit4] OK      7.35s J0 | CloudSolrClientTest.preferReplicaTypesTest
   [junit4] OK      5.49s J0 | CloudSolrClientTest.preferLocalShardsTest
   [junit4] OK      3.87s J0 | CloudSolrClientTest.testRouting
   [junit4] OK      8.23s J0 | CloudSolrClientTest.testRetryUpdatesWhenClusterStateIsStale
   [junit4] OK      1.78s J0 | CloudSolrClientTest.testShutdown
   [junit4] OK      2.63s J0 | CloudSolrClientTest.testInitializationWithSolrUrls
   [junit4] OK      0.74s J0 | CloudSolrClientTest.testWrongZkChrootTest
   [junit4] OK      2.80s J0 | CloudSolrClientTest.stateVersionParamTest
   [junit4] OK      3.90s J0 | CloudSolrClientTest.testOverwriteOption
   [junit4] Completed [5/5] on J0 in 62.53s, 16 tests
   [junit4] 
   [junit4] JVM J0:     0.66 ..   237.69 =   237.03s
   [junit4] JVM J1:     0.66 ..   180.27 =   179.61s
   [junit4] Execution time total: 3 minutes 57 seconds
   [junit4] Tests summary: 5 suites, 80 tests
   [junit4] Could not remove temporary path: C:\Users\jenkins\workspace\Lucene-Solr-master-Windows\solr\build\solr-solrj\test\J0 (java.nio.file.DirectoryNotEmptyException: Remaining files: [C:\Users\jenkins\workspace\Lucene-Solr-master-Windows\solr\build\solr-solrj\test\J0\temp])
   [junit4] Could not remove temporary path: C:\Users\jenkins\workspace\Lucene-Solr-master-Windows\solr\build\solr-solrj\test\J1 (java.nio.file.DirectoryNotEmptyException: Remaining files: [C:\Users\jenkins\workspace\Lucene-Solr-master-Windows\solr\build\solr-solrj\test\J1\temp])
     [echo] 5 slowest tests:
[junit4:tophints]  85.00s | org.apache.solr.client.solrj.impl.CloudSolrClientTest
[junit4:tophints]  63.56s | org.apache.solr.client.solrj.io.stream.StreamDecoratorTest
[junit4:tophints]  59.42s | org.apache.solr.client.solrj.request.SchemaTest
[junit4:tophints]  35.42s | org.apache.solr.common.cloud.TestCollectionStateWatchers
[junit4:tophints]  33.65s | org.apache.solr.client.solrj.io.stream.MathExpressionTest

-check-totals:

test-nocompile:

BUILD SUCCESSFUL
Total time: 3 minutes 59 seconds
[repro] Failures:
[repro]   0/5 failed: org.apache.solr.client.solrj.impl.CloudSolrClientTest
[repro]   1/5 failed: org.apache.solr.cloud.autoscaling.TriggerIntegrationTest
[repro]   5/5 failed: org.apache.solr.handler.extraction.ExtractingRequestHandlerTest
[repro] Exiting with code 1

C:\Users\jenkins\workspace\Lucene-Solr-master-Windows>IF EXIST lucene\build move /y lucene\build lucene\build.repro 
        1 dir(s) moved.

C:\Users\jenkins\workspace\Lucene-Solr-master-Windows>IF EXIST solr\build move /y solr\build solr\build.repro 
        1 dir(s) moved.

C:\Users\jenkins\workspace\Lucene-Solr-master-Windows>IF EXIST lucene\build.orig move /y lucene\build.orig lucene\build 
        1 dir(s) moved.

C:\Users\jenkins\workspace\Lucene-Solr-master-Windows>IF EXIST solr\build.orig move /y solr\build.orig solr\build 
        1 dir(s) moved.

C:\Users\jenkins\workspace\Lucene-Solr-master-Windows>exit 0 
Archiving artifacts
Setting ANT_1_8_2_HOME=C:\Users\jenkins\tools\hudson.tasks.Ant_AntInstallation\ANT_1.8.2
[WARNINGS] Parsing warnings in console log with parser Java Compiler (javac)
Setting ANT_1_8_2_HOME=C:\Users\jenkins\tools\hudson.tasks.Ant_AntInstallation\ANT_1.8.2
Setting ANT_1_8_2_HOME=C:\Users\jenkins\tools\hudson.tasks.Ant_AntInstallation\ANT_1.8.2
<Git Blamer> Using GitBlamer to create author and commit information for all warnings.
<Git Blamer> GIT_COMMIT=05f72a77efb13517885618597f14cf0d76bd31f7, workspace=C:\Users\jenkins\workspace\Lucene-Solr-master-Windows
[WARNINGS] Computing warning deltas based on reference build #7598
Recording test results
Setting ANT_1_8_2_HOME=C:\Users\jenkins\tools\hudson.tasks.Ant_AntInstallation\ANT_1.8.2
Build step 'Publish JUnit test result report' changed build result to UNSTABLE
Email was triggered for: Unstable (Test Failures)
Sending email for trigger: Unstable (Test Failures)
Setting ANT_1_8_2_HOME=C:\Users\jenkins\tools\hudson.tasks.Ant_AntInstallation\ANT_1.8.2
Setting ANT_1_8_2_HOME=C:\Users\jenkins\tools\hudson.tasks.Ant_AntInstallation\ANT_1.8.2
Setting ANT_1_8_2_HOME=C:\Users\jenkins\tools\hudson.tasks.Ant_AntInstallation\ANT_1.8.2
Setting ANT_1_8_2_HOME=C:\Users\jenkins\tools\hudson.tasks.Ant_AntInstallation\ANT_1.8.2

Mime
View raw message