lucene-dev mailing list archives

Site index · List index
Message view « Date » · « Thread »
Top « Date » · « Thread »
From Apache Jenkins Server <jenk...@builds.apache.org>
Subject [JENKINS] Lucene-Solr-Tests-master - Build # 2920 - Still Unstable
Date Thu, 01 Nov 2018 15:57:16 GMT
Build: https://builds.apache.org/job/Lucene-Solr-Tests-master/2920/

4 tests failed.
FAILED:  org.apache.solr.cloud.MoveReplicaTest.test

Error Message:


Stack Trace:
java.lang.AssertionError
	at __randomizedtesting.SeedInfo.seed([6F193DD831F942D6:E74D02029F052F2E]:0)
	at org.junit.Assert.fail(Assert.java:92)
	at org.junit.Assert.assertTrue(Assert.java:43)
	at org.junit.Assert.assertFalse(Assert.java:68)
	at org.junit.Assert.assertFalse(Assert.java:79)
	at org.apache.solr.cloud.MoveReplicaTest.test(MoveReplicaTest.java:148)
	at sun.reflect.NativeMethodAccessorImpl.invoke0(Native Method)
	at sun.reflect.NativeMethodAccessorImpl.invoke(NativeMethodAccessorImpl.java:62)
	at sun.reflect.DelegatingMethodAccessorImpl.invoke(DelegatingMethodAccessorImpl.java:43)
	at java.lang.reflect.Method.invoke(Method.java:498)
	at com.carrotsearch.randomizedtesting.RandomizedRunner.invoke(RandomizedRunner.java:1742)
	at com.carrotsearch.randomizedtesting.RandomizedRunner$8.evaluate(RandomizedRunner.java:935)
	at com.carrotsearch.randomizedtesting.RandomizedRunner$9.evaluate(RandomizedRunner.java:971)
	at com.carrotsearch.randomizedtesting.RandomizedRunner$10.evaluate(RandomizedRunner.java:985)
	at com.carrotsearch.randomizedtesting.rules.SystemPropertiesRestoreRule$1.evaluate(SystemPropertiesRestoreRule.java:57)
	at org.apache.lucene.util.TestRuleSetupTeardownChained$1.evaluate(TestRuleSetupTeardownChained.java:49)
	at org.apache.lucene.util.AbstractBeforeAfterRule$1.evaluate(AbstractBeforeAfterRule.java:45)
	at org.apache.lucene.util.TestRuleThreadAndTestName$1.evaluate(TestRuleThreadAndTestName.java:48)
	at org.apache.lucene.util.TestRuleIgnoreAfterMaxFailures$1.evaluate(TestRuleIgnoreAfterMaxFailures.java:64)
	at org.apache.lucene.util.TestRuleMarkFailure$1.evaluate(TestRuleMarkFailure.java:47)
	at com.carrotsearch.randomizedtesting.rules.StatementAdapter.evaluate(StatementAdapter.java:36)
	at com.carrotsearch.randomizedtesting.ThreadLeakControl$StatementRunner.run(ThreadLeakControl.java:368)
	at com.carrotsearch.randomizedtesting.ThreadLeakControl.forkTimeoutingTask(ThreadLeakControl.java:817)
	at com.carrotsearch.randomizedtesting.ThreadLeakControl$3.evaluate(ThreadLeakControl.java:468)
	at com.carrotsearch.randomizedtesting.RandomizedRunner.runSingleTest(RandomizedRunner.java:944)
	at com.carrotsearch.randomizedtesting.RandomizedRunner$5.evaluate(RandomizedRunner.java:830)
	at com.carrotsearch.randomizedtesting.RandomizedRunner$6.evaluate(RandomizedRunner.java:880)
	at com.carrotsearch.randomizedtesting.RandomizedRunner$7.evaluate(RandomizedRunner.java:891)
	at com.carrotsearch.randomizedtesting.rules.StatementAdapter.evaluate(StatementAdapter.java:36)
	at com.carrotsearch.randomizedtesting.rules.SystemPropertiesRestoreRule$1.evaluate(SystemPropertiesRestoreRule.java:57)
	at org.apache.lucene.util.AbstractBeforeAfterRule$1.evaluate(AbstractBeforeAfterRule.java:45)
	at com.carrotsearch.randomizedtesting.rules.StatementAdapter.evaluate(StatementAdapter.java:36)
	at org.apache.lucene.util.TestRuleStoreClassName$1.evaluate(TestRuleStoreClassName.java:41)
	at com.carrotsearch.randomizedtesting.rules.NoShadowingOrOverridesOnMethodsRule$1.evaluate(NoShadowingOrOverridesOnMethodsRule.java:40)
	at com.carrotsearch.randomizedtesting.rules.NoShadowingOrOverridesOnMethodsRule$1.evaluate(NoShadowingOrOverridesOnMethodsRule.java:40)
	at com.carrotsearch.randomizedtesting.rules.StatementAdapter.evaluate(StatementAdapter.java:36)
	at com.carrotsearch.randomizedtesting.rules.StatementAdapter.evaluate(StatementAdapter.java:36)
	at com.carrotsearch.randomizedtesting.rules.StatementAdapter.evaluate(StatementAdapter.java:36)
	at org.apache.lucene.util.TestRuleAssertionsRequired$1.evaluate(TestRuleAssertionsRequired.java:53)
	at org.apache.lucene.util.TestRuleMarkFailure$1.evaluate(TestRuleMarkFailure.java:47)
	at org.apache.lucene.util.TestRuleIgnoreAfterMaxFailures$1.evaluate(TestRuleIgnoreAfterMaxFailures.java:64)
	at org.apache.lucene.util.TestRuleIgnoreTestSuites$1.evaluate(TestRuleIgnoreTestSuites.java:54)
	at com.carrotsearch.randomizedtesting.rules.StatementAdapter.evaluate(StatementAdapter.java:36)
	at com.carrotsearch.randomizedtesting.ThreadLeakControl$StatementRunner.run(ThreadLeakControl.java:368)
	at java.lang.Thread.run(Thread.java:748)


FAILED:  org.apache.solr.cloud.autoscaling.sim.TestSimPolicyCloud.testCreateCollectionAddReplica

Error Message:
Timeout waiting for collection to become active Live Nodes: [127.0.0.1:10224_solr, 127.0.0.1:10220_solr, 127.0.0.1:10222_solr, 127.0.0.1:10221_solr, 127.0.0.1:10223_solr] Last available state: DocCollection(testCreateCollectionAddReplica//clusterstate.json/39)={   "replicationFactor":"1",   "pullReplicas":"0",   "router":{"name":"compositeId"},   "maxShardsPerNode":"1",   "autoAddReplicas":"false",   "nrtReplicas":"1",   "tlogReplicas":"0",   "autoCreated":"true",   "policy":"c1",   "shards":{"shard1":{       "replicas":{"core_node1":{           "core":"testCreateCollectionAddReplica_shard1_replica_n1",           "SEARCHER.searcher.maxDoc":0,           "SEARCHER.searcher.deletedDocs":0,           "INDEX.sizeInBytes":10240,           "node_name":"127.0.0.1:10220_solr",           "state":"active",           "type":"NRT",           "INDEX.sizeInGB":9.5367431640625E-6,           "SEARCHER.searcher.numDocs":0}},       "range":"80000000-7fffffff",       "state":"active"}}}

Stack Trace:
java.lang.AssertionError: Timeout waiting for collection to become active
Live Nodes: [127.0.0.1:10224_solr, 127.0.0.1:10220_solr, 127.0.0.1:10222_solr, 127.0.0.1:10221_solr, 127.0.0.1:10223_solr]
Last available state: DocCollection(testCreateCollectionAddReplica//clusterstate.json/39)={
  "replicationFactor":"1",
  "pullReplicas":"0",
  "router":{"name":"compositeId"},
  "maxShardsPerNode":"1",
  "autoAddReplicas":"false",
  "nrtReplicas":"1",
  "tlogReplicas":"0",
  "autoCreated":"true",
  "policy":"c1",
  "shards":{"shard1":{
      "replicas":{"core_node1":{
          "core":"testCreateCollectionAddReplica_shard1_replica_n1",
          "SEARCHER.searcher.maxDoc":0,
          "SEARCHER.searcher.deletedDocs":0,
          "INDEX.sizeInBytes":10240,
          "node_name":"127.0.0.1:10220_solr",
          "state":"active",
          "type":"NRT",
          "INDEX.sizeInGB":9.5367431640625E-6,
          "SEARCHER.searcher.numDocs":0}},
      "range":"80000000-7fffffff",
      "state":"active"}}}
	at __randomizedtesting.SeedInfo.seed([6F193DD831F942D6:EF3958F620BAAA70]:0)
	at org.apache.solr.cloud.CloudTestUtils.waitForState(CloudTestUtils.java:70)
	at org.apache.solr.cloud.autoscaling.sim.TestSimPolicyCloud.testCreateCollectionAddReplica(TestSimPolicyCloud.java:123)
	at sun.reflect.NativeMethodAccessorImpl.invoke0(Native Method)
	at sun.reflect.NativeMethodAccessorImpl.invoke(NativeMethodAccessorImpl.java:62)
	at sun.reflect.DelegatingMethodAccessorImpl.invoke(DelegatingMethodAccessorImpl.java:43)
	at java.lang.reflect.Method.invoke(Method.java:498)
	at com.carrotsearch.randomizedtesting.RandomizedRunner.invoke(RandomizedRunner.java:1742)
	at com.carrotsearch.randomizedtesting.RandomizedRunner$8.evaluate(RandomizedRunner.java:935)
	at com.carrotsearch.randomizedtesting.RandomizedRunner$9.evaluate(RandomizedRunner.java:971)
	at com.carrotsearch.randomizedtesting.RandomizedRunner$10.evaluate(RandomizedRunner.java:985)
	at org.junit.rules.ExpectedException$ExpectedExceptionStatement.evaluate(ExpectedException.java:110)
	at com.carrotsearch.randomizedtesting.rules.SystemPropertiesRestoreRule$1.evaluate(SystemPropertiesRestoreRule.java:57)
	at org.apache.lucene.util.TestRuleSetupTeardownChained$1.evaluate(TestRuleSetupTeardownChained.java:49)
	at org.apache.lucene.util.AbstractBeforeAfterRule$1.evaluate(AbstractBeforeAfterRule.java:45)
	at org.apache.lucene.util.TestRuleThreadAndTestName$1.evaluate(TestRuleThreadAndTestName.java:48)
	at org.apache.lucene.util.TestRuleIgnoreAfterMaxFailures$1.evaluate(TestRuleIgnoreAfterMaxFailures.java:64)
	at org.apache.lucene.util.TestRuleMarkFailure$1.evaluate(TestRuleMarkFailure.java:47)
	at com.carrotsearch.randomizedtesting.rules.StatementAdapter.evaluate(StatementAdapter.java:36)
	at com.carrotsearch.randomizedtesting.ThreadLeakControl$StatementRunner.run(ThreadLeakControl.java:368)
	at com.carrotsearch.randomizedtesting.ThreadLeakControl.forkTimeoutingTask(ThreadLeakControl.java:817)
	at com.carrotsearch.randomizedtesting.ThreadLeakControl$3.evaluate(ThreadLeakControl.java:468)
	at com.carrotsearch.randomizedtesting.RandomizedRunner.runSingleTest(RandomizedRunner.java:944)
	at com.carrotsearch.randomizedtesting.RandomizedRunner$5.evaluate(RandomizedRunner.java:830)
	at com.carrotsearch.randomizedtesting.RandomizedRunner$6.evaluate(RandomizedRunner.java:880)
	at com.carrotsearch.randomizedtesting.RandomizedRunner$7.evaluate(RandomizedRunner.java:891)
	at com.carrotsearch.randomizedtesting.rules.StatementAdapter.evaluate(StatementAdapter.java:36)
	at com.carrotsearch.randomizedtesting.rules.SystemPropertiesRestoreRule$1.evaluate(SystemPropertiesRestoreRule.java:57)
	at org.apache.lucene.util.AbstractBeforeAfterRule$1.evaluate(AbstractBeforeAfterRule.java:45)
	at com.carrotsearch.randomizedtesting.rules.StatementAdapter.evaluate(StatementAdapter.java:36)
	at org.apache.lucene.util.TestRuleStoreClassName$1.evaluate(TestRuleStoreClassName.java:41)
	at com.carrotsearch.randomizedtesting.rules.NoShadowingOrOverridesOnMethodsRule$1.evaluate(NoShadowingOrOverridesOnMethodsRule.java:40)
	at com.carrotsearch.randomizedtesting.rules.NoShadowingOrOverridesOnMethodsRule$1.evaluate(NoShadowingOrOverridesOnMethodsRule.java:40)
	at com.carrotsearch.randomizedtesting.rules.StatementAdapter.evaluate(StatementAdapter.java:36)
	at com.carrotsearch.randomizedtesting.rules.StatementAdapter.evaluate(StatementAdapter.java:36)
	at com.carrotsearch.randomizedtesting.rules.StatementAdapter.evaluate(StatementAdapter.java:36)
	at org.apache.lucene.util.TestRuleAssertionsRequired$1.evaluate(TestRuleAssertionsRequired.java:53)
	at org.apache.lucene.util.TestRuleMarkFailure$1.evaluate(TestRuleMarkFailure.java:47)
	at org.apache.lucene.util.TestRuleIgnoreAfterMaxFailures$1.evaluate(TestRuleIgnoreAfterMaxFailures.java:64)
	at org.apache.lucene.util.TestRuleIgnoreTestSuites$1.evaluate(TestRuleIgnoreTestSuites.java:54)
	at com.carrotsearch.randomizedtesting.rules.StatementAdapter.evaluate(StatementAdapter.java:36)
	at com.carrotsearch.randomizedtesting.ThreadLeakControl$StatementRunner.run(ThreadLeakControl.java:368)
	at java.lang.Thread.run(Thread.java:748)
Caused by: java.util.concurrent.TimeoutException: last ClusterState: znodeVersion: 40
live nodes:[127.0.0.1:10224_solr, 127.0.0.1:10220_solr, 127.0.0.1:10222_solr, 127.0.0.1:10221_solr, 127.0.0.1:10223_solr]
collections:{testCreateCollectionAddReplica=DocCollection(testCreateCollectionAddReplica//clusterstate.json/39)={
  "replicationFactor":"1",
  "pullReplicas":"0",
  "router":{"name":"compositeId"},
  "maxShardsPerNode":"1",
  "autoAddReplicas":"false",
  "nrtReplicas":"1",
  "tlogReplicas":"0",
  "autoCreated":"true",
  "policy":"c1",
  "shards":{"shard1":{
      "replicas":{"core_node1":{
          "core":"testCreateCollectionAddReplica_shard1_replica_n1",
          "SEARCHER.searcher.maxDoc":0,
          "SEARCHER.searcher.deletedDocs":0,
          "INDEX.sizeInBytes":10240,
          "node_name":"127.0.0.1:10220_solr",
          "state":"active",
          "type":"NRT",
          "INDEX.sizeInGB":9.5367431640625E-6,
          "SEARCHER.searcher.numDocs":0}},
      "range":"80000000-7fffffff",
      "state":"active"}}}}, last coll state: DocCollection(testCreateCollectionAddReplica//clusterstate.json/39)={
  "replicationFactor":"1",
  "pullReplicas":"0",
  "router":{"name":"compositeId"},
  "maxShardsPerNode":"1",
  "autoAddReplicas":"false",
  "nrtReplicas":"1",
  "tlogReplicas":"0",
  "autoCreated":"true",
  "policy":"c1",
  "shards":{"shard1":{
      "replicas":{"core_node1":{
          "core":"testCreateCollectionAddReplica_shard1_replica_n1",
          "SEARCHER.searcher.maxDoc":0,
          "SEARCHER.searcher.deletedDocs":0,
          "INDEX.sizeInBytes":10240,
          "node_name":"127.0.0.1:10220_solr",
          "state":"active",
          "type":"NRT",
          "INDEX.sizeInGB":9.5367431640625E-6,
          "SEARCHER.searcher.numDocs":0}},
      "range":"80000000-7fffffff",
      "state":"active"}}}
	at org.apache.solr.cloud.CloudTestUtils.waitForState(CloudTestUtils.java:112)
	at org.apache.solr.cloud.CloudTestUtils.waitForState(CloudTestUtils.java:64)
	... 41 more


FAILED:  org.apache.solr.security.TestPKIAuthenticationPlugin.test

Error Message:


Stack Trace:
java.lang.NullPointerException
	at __randomizedtesting.SeedInfo.seed([6F193DD831F942D6:E74D02029F052F2E]:0)
	at org.apache.solr.security.TestPKIAuthenticationPlugin.test(TestPKIAuthenticationPlugin.java:105)
	at sun.reflect.NativeMethodAccessorImpl.invoke0(Native Method)
	at sun.reflect.NativeMethodAccessorImpl.invoke(NativeMethodAccessorImpl.java:62)
	at sun.reflect.DelegatingMethodAccessorImpl.invoke(DelegatingMethodAccessorImpl.java:43)
	at java.lang.reflect.Method.invoke(Method.java:498)
	at com.carrotsearch.randomizedtesting.RandomizedRunner.invoke(RandomizedRunner.java:1742)
	at com.carrotsearch.randomizedtesting.RandomizedRunner$8.evaluate(RandomizedRunner.java:935)
	at com.carrotsearch.randomizedtesting.RandomizedRunner$9.evaluate(RandomizedRunner.java:971)
	at com.carrotsearch.randomizedtesting.RandomizedRunner$10.evaluate(RandomizedRunner.java:985)
	at com.carrotsearch.randomizedtesting.rules.SystemPropertiesRestoreRule$1.evaluate(SystemPropertiesRestoreRule.java:57)
	at org.apache.lucene.util.TestRuleSetupTeardownChained$1.evaluate(TestRuleSetupTeardownChained.java:49)
	at org.apache.lucene.util.AbstractBeforeAfterRule$1.evaluate(AbstractBeforeAfterRule.java:45)
	at org.apache.lucene.util.TestRuleThreadAndTestName$1.evaluate(TestRuleThreadAndTestName.java:48)
	at org.apache.lucene.util.TestRuleIgnoreAfterMaxFailures$1.evaluate(TestRuleIgnoreAfterMaxFailures.java:64)
	at org.apache.lucene.util.TestRuleMarkFailure$1.evaluate(TestRuleMarkFailure.java:47)
	at com.carrotsearch.randomizedtesting.rules.StatementAdapter.evaluate(StatementAdapter.java:36)
	at com.carrotsearch.randomizedtesting.ThreadLeakControl$StatementRunner.run(ThreadLeakControl.java:368)
	at com.carrotsearch.randomizedtesting.ThreadLeakControl.forkTimeoutingTask(ThreadLeakControl.java:817)
	at com.carrotsearch.randomizedtesting.ThreadLeakControl$3.evaluate(ThreadLeakControl.java:468)
	at com.carrotsearch.randomizedtesting.RandomizedRunner.runSingleTest(RandomizedRunner.java:944)
	at com.carrotsearch.randomizedtesting.RandomizedRunner$5.evaluate(RandomizedRunner.java:830)
	at com.carrotsearch.randomizedtesting.RandomizedRunner$6.evaluate(RandomizedRunner.java:880)
	at com.carrotsearch.randomizedtesting.RandomizedRunner$7.evaluate(RandomizedRunner.java:891)
	at com.carrotsearch.randomizedtesting.rules.StatementAdapter.evaluate(StatementAdapter.java:36)
	at com.carrotsearch.randomizedtesting.rules.SystemPropertiesRestoreRule$1.evaluate(SystemPropertiesRestoreRule.java:57)
	at org.apache.lucene.util.AbstractBeforeAfterRule$1.evaluate(AbstractBeforeAfterRule.java:45)
	at com.carrotsearch.randomizedtesting.rules.StatementAdapter.evaluate(StatementAdapter.java:36)
	at org.apache.lucene.util.TestRuleStoreClassName$1.evaluate(TestRuleStoreClassName.java:41)
	at com.carrotsearch.randomizedtesting.rules.NoShadowingOrOverridesOnMethodsRule$1.evaluate(NoShadowingOrOverridesOnMethodsRule.java:40)
	at com.carrotsearch.randomizedtesting.rules.NoShadowingOrOverridesOnMethodsRule$1.evaluate(NoShadowingOrOverridesOnMethodsRule.java:40)
	at com.carrotsearch.randomizedtesting.rules.StatementAdapter.evaluate(StatementAdapter.java:36)
	at com.carrotsearch.randomizedtesting.rules.StatementAdapter.evaluate(StatementAdapter.java:36)
	at com.carrotsearch.randomizedtesting.rules.StatementAdapter.evaluate(StatementAdapter.java:36)
	at org.apache.lucene.util.TestRuleAssertionsRequired$1.evaluate(TestRuleAssertionsRequired.java:53)
	at org.apache.lucene.util.TestRuleMarkFailure$1.evaluate(TestRuleMarkFailure.java:47)
	at org.apache.lucene.util.TestRuleIgnoreAfterMaxFailures$1.evaluate(TestRuleIgnoreAfterMaxFailures.java:64)
	at org.apache.lucene.util.TestRuleIgnoreTestSuites$1.evaluate(TestRuleIgnoreTestSuites.java:54)
	at com.carrotsearch.randomizedtesting.rules.StatementAdapter.evaluate(StatementAdapter.java:36)
	at com.carrotsearch.randomizedtesting.ThreadLeakControl$StatementRunner.run(ThreadLeakControl.java:368)
	at java.lang.Thread.run(Thread.java:748)


FAILED:  org.apache.solr.client.solrj.impl.CloudSolrClientTest.testVersionsAreReturned

Error Message:
Error from server at http://127.0.0.1:38466/solr/collection1_shard2_replica_n2: Expected mime type application/octet-stream but got text/html. <html> <head> <meta http-equiv="Content-Type" content="text/html;charset=utf-8"/> <title>Error 404 Can not find: /solr/collection1_shard2_replica_n2/update</title> </head> <body><h2>HTTP ERROR 404</h2> <p>Problem accessing /solr/collection1_shard2_replica_n2/update. Reason: <pre>    Can not find: /solr/collection1_shard2_replica_n2/update</pre></p><hr><a href="http://eclipse.org/jetty">Powered by Jetty:// 9.4.11.v20180605</a><hr/>  </body> </html> 

Stack Trace:
org.apache.solr.client.solrj.impl.CloudSolrClient$RouteException: Error from server at http://127.0.0.1:38466/solr/collection1_shard2_replica_n2: Expected mime type application/octet-stream but got text/html. <html>
<head>
<meta http-equiv="Content-Type" content="text/html;charset=utf-8"/>
<title>Error 404 Can not find: /solr/collection1_shard2_replica_n2/update</title>
</head>
<body><h2>HTTP ERROR 404</h2>
<p>Problem accessing /solr/collection1_shard2_replica_n2/update. Reason:
<pre>    Can not find: /solr/collection1_shard2_replica_n2/update</pre></p><hr><a href="http://eclipse.org/jetty">Powered by Jetty:// 9.4.11.v20180605</a><hr/>

</body>
</html>

	at __randomizedtesting.SeedInfo.seed([89E94DFDE8896361:712FB4C87B90FBA9]:0)
	at org.apache.solr.client.solrj.impl.CloudSolrClient.directUpdate(CloudSolrClient.java:551)
	at org.apache.solr.client.solrj.impl.CloudSolrClient.sendRequest(CloudSolrClient.java:1016)
	at org.apache.solr.client.solrj.impl.CloudSolrClient.requestWithRetryOnStaleState(CloudSolrClient.java:884)
	at org.apache.solr.client.solrj.impl.CloudSolrClient.requestWithRetryOnStaleState(CloudSolrClient.java:949)
	at org.apache.solr.client.solrj.impl.CloudSolrClient.requestWithRetryOnStaleState(CloudSolrClient.java:949)
	at org.apache.solr.client.solrj.impl.CloudSolrClient.requestWithRetryOnStaleState(CloudSolrClient.java:949)
	at org.apache.solr.client.solrj.impl.CloudSolrClient.requestWithRetryOnStaleState(CloudSolrClient.java:949)
	at org.apache.solr.client.solrj.impl.CloudSolrClient.requestWithRetryOnStaleState(CloudSolrClient.java:949)
	at org.apache.solr.client.solrj.impl.CloudSolrClient.request(CloudSolrClient.java:817)
	at org.apache.solr.client.solrj.SolrRequest.process(SolrRequest.java:194)
	at org.apache.solr.client.solrj.request.UpdateRequest.commit(UpdateRequest.java:237)
	at org.apache.solr.client.solrj.impl.CloudSolrClientTest.testVersionsAreReturned(CloudSolrClientTest.java:725)
	at sun.reflect.NativeMethodAccessorImpl.invoke0(Native Method)
	at sun.reflect.NativeMethodAccessorImpl.invoke(NativeMethodAccessorImpl.java:62)
	at sun.reflect.DelegatingMethodAccessorImpl.invoke(DelegatingMethodAccessorImpl.java:43)
	at java.lang.reflect.Method.invoke(Method.java:498)
	at com.carrotsearch.randomizedtesting.RandomizedRunner.invoke(RandomizedRunner.java:1742)
	at com.carrotsearch.randomizedtesting.RandomizedRunner$8.evaluate(RandomizedRunner.java:935)
	at com.carrotsearch.randomizedtesting.RandomizedRunner$9.evaluate(RandomizedRunner.java:971)
	at com.carrotsearch.randomizedtesting.RandomizedRunner$10.evaluate(RandomizedRunner.java:985)
	at org.junit.rules.ExpectedException$ExpectedExceptionStatement.evaluate(ExpectedException.java:110)
	at com.carrotsearch.randomizedtesting.rules.SystemPropertiesRestoreRule$1.evaluate(SystemPropertiesRestoreRule.java:57)
	at org.apache.lucene.util.TestRuleSetupTeardownChained$1.evaluate(TestRuleSetupTeardownChained.java:49)
	at org.apache.lucene.util.AbstractBeforeAfterRule$1.evaluate(AbstractBeforeAfterRule.java:45)
	at org.apache.lucene.util.TestRuleThreadAndTestName$1.evaluate(TestRuleThreadAndTestName.java:48)
	at org.apache.lucene.util.TestRuleIgnoreAfterMaxFailures$1.evaluate(TestRuleIgnoreAfterMaxFailures.java:64)
	at org.apache.lucene.util.TestRuleMarkFailure$1.evaluate(TestRuleMarkFailure.java:47)
	at com.carrotsearch.randomizedtesting.rules.StatementAdapter.evaluate(StatementAdapter.java:36)
	at com.carrotsearch.randomizedtesting.ThreadLeakControl$StatementRunner.run(ThreadLeakControl.java:368)
	at com.carrotsearch.randomizedtesting.ThreadLeakControl.forkTimeoutingTask(ThreadLeakControl.java:817)
	at com.carrotsearch.randomizedtesting.ThreadLeakControl$3.evaluate(ThreadLeakControl.java:468)
	at com.carrotsearch.randomizedtesting.RandomizedRunner.runSingleTest(RandomizedRunner.java:944)
	at com.carrotsearch.randomizedtesting.RandomizedRunner$5.evaluate(RandomizedRunner.java:830)
	at com.carrotsearch.randomizedtesting.RandomizedRunner$6.evaluate(RandomizedRunner.java:880)
	at com.carrotsearch.randomizedtesting.RandomizedRunner$7.evaluate(RandomizedRunner.java:891)
	at com.carrotsearch.randomizedtesting.rules.StatementAdapter.evaluate(StatementAdapter.java:36)
	at com.carrotsearch.randomizedtesting.rules.SystemPropertiesRestoreRule$1.evaluate(SystemPropertiesRestoreRule.java:57)
	at org.apache.lucene.util.AbstractBeforeAfterRule$1.evaluate(AbstractBeforeAfterRule.java:45)
	at com.carrotsearch.randomizedtesting.rules.StatementAdapter.evaluate(StatementAdapter.java:36)
	at org.apache.lucene.util.TestRuleStoreClassName$1.evaluate(TestRuleStoreClassName.java:41)
	at com.carrotsearch.randomizedtesting.rules.NoShadowingOrOverridesOnMethodsRule$1.evaluate(NoShadowingOrOverridesOnMethodsRule.java:40)
	at com.carrotsearch.randomizedtesting.rules.NoShadowingOrOverridesOnMethodsRule$1.evaluate(NoShadowingOrOverridesOnMethodsRule.java:40)
	at com.carrotsearch.randomizedtesting.rules.StatementAdapter.evaluate(StatementAdapter.java:36)
	at com.carrotsearch.randomizedtesting.rules.StatementAdapter.evaluate(StatementAdapter.java:36)
	at com.carrotsearch.randomizedtesting.rules.StatementAdapter.evaluate(StatementAdapter.java:36)
	at org.apache.lucene.util.TestRuleAssertionsRequired$1.evaluate(TestRuleAssertionsRequired.java:53)
	at org.apache.lucene.util.TestRuleMarkFailure$1.evaluate(TestRuleMarkFailure.java:47)
	at org.apache.lucene.util.TestRuleIgnoreAfterMaxFailures$1.evaluate(TestRuleIgnoreAfterMaxFailures.java:64)
	at org.apache.lucene.util.TestRuleIgnoreTestSuites$1.evaluate(TestRuleIgnoreTestSuites.java:54)
	at com.carrotsearch.randomizedtesting.rules.StatementAdapter.evaluate(StatementAdapter.java:36)
	at com.carrotsearch.randomizedtesting.ThreadLeakControl$StatementRunner.run(ThreadLeakControl.java:368)
	at java.lang.Thread.run(Thread.java:748)
Caused by: org.apache.solr.client.solrj.impl.HttpSolrClient$RemoteSolrException: Error from server at http://127.0.0.1:38466/solr/collection1_shard2_replica_n2: Expected mime type application/octet-stream but got text/html. <html>
<head>
<meta http-equiv="Content-Type" content="text/html;charset=utf-8"/>
<title>Error 404 Can not find: /solr/collection1_shard2_replica_n2/update</title>
</head>
<body><h2>HTTP ERROR 404</h2>
<p>Problem accessing /solr/collection1_shard2_replica_n2/update. Reason:
<pre>    Can not find: /solr/collection1_shard2_replica_n2/update</pre></p><hr><a href="http://eclipse.org/jetty">Powered by Jetty:// 9.4.11.v20180605</a><hr/>

</body>
</html>

	at org.apache.solr.client.solrj.impl.HttpSolrClient.executeMethod(HttpSolrClient.java:607)
	at org.apache.solr.client.solrj.impl.HttpSolrClient.request(HttpSolrClient.java:255)
	at org.apache.solr.client.solrj.impl.HttpSolrClient.request(HttpSolrClient.java:244)
	at org.apache.solr.client.solrj.impl.LBHttpSolrClient.doRequest(LBHttpSolrClient.java:483)
	at org.apache.solr.client.solrj.impl.LBHttpSolrClient.request(LBHttpSolrClient.java:413)
	at org.apache.solr.client.solrj.impl.CloudSolrClient.lambda$directUpdate$0(CloudSolrClient.java:528)
	at java.util.concurrent.FutureTask.run(FutureTask.java:266)
	at org.apache.solr.common.util.ExecutorUtil$MDCAwareThreadPoolExecutor.lambda$execute$0(ExecutorUtil.java:209)
	at java.util.concurrent.ThreadPoolExecutor.runWorker(ThreadPoolExecutor.java:1149)
	at java.util.concurrent.ThreadPoolExecutor$Worker.run(ThreadPoolExecutor.java:624)
	... 1 more




Build Log:
[...truncated 12588 lines...]
   [junit4] Suite: org.apache.solr.security.TestPKIAuthenticationPlugin
   [junit4]   2> 114103 INFO  (SUITE-TestPKIAuthenticationPlugin-seed#[6F193DD831F942D6]-worker) [    ] o.a.s.SolrTestCaseJ4 SecureRandom sanity checks: test.solr.allowed.securerandom=null & java.security.egd=file:/dev/./urandom
   [junit4]   2> Creating dataDir: /home/jenkins/jenkins-slave/workspace/Lucene-Solr-Tests-master/solr/build/solr-core/test/J2/temp/solr.security.TestPKIAuthenticationPlugin_6F193DD831F942D6-001/init-core-data-001
   [junit4]   2> 114153 WARN  (SUITE-TestPKIAuthenticationPlugin-seed#[6F193DD831F942D6]-worker) [    ] o.a.s.SolrTestCaseJ4 startTrackingSearchers: numOpens=3 numCloses=3
   [junit4]   2> 114168 INFO  (SUITE-TestPKIAuthenticationPlugin-seed#[6F193DD831F942D6]-worker) [    ] o.a.s.SolrTestCaseJ4 Using TrieFields (NUMERIC_POINTS_SYSPROP=false) w/NUMERIC_DOCVALUES_SYSPROP=false
   [junit4]   2> 114171 INFO  (SUITE-TestPKIAuthenticationPlugin-seed#[6F193DD831F942D6]-worker) [    ] o.a.s.SolrTestCaseJ4 Randomized ssl (false) and clientAuth (true) via: @org.apache.solr.util.RandomizeSSL(reason=, ssl=NaN, value=NaN, clientAuth=NaN)
   [junit4]   2> 114189 INFO  (TEST-TestPKIAuthenticationPlugin.test-seed#[6F193DD831F942D6]) [    ] o.a.s.SolrTestCaseJ4 ###Starting test
   [junit4]   2> 128608 ERROR (TEST-TestPKIAuthenticationPlugin.test-seed#[6F193DD831F942D6]) [    ] o.a.s.s.PKIAuthenticationPlugin Invalid key request timestamp: 1541080662246 , received timestamp: 1541080674883 , TTL: 10000
   [junit4]   2> 128609 INFO  (TEST-TestPKIAuthenticationPlugin.test-seed#[6F193DD831F942D6]) [    ] o.a.s.SolrTestCaseJ4 ###Ending test
   [junit4]   2> NOTE: reproduce with: ant test  -Dtestcase=TestPKIAuthenticationPlugin -Dtests.method=test -Dtests.seed=6F193DD831F942D6 -Dtests.multiplier=2 -Dtests.slow=true -Dtests.locale=ko-KR -Dtests.timezone=Africa/Lubumbashi -Dtests.asserts=true -Dtests.file.encoding=UTF-8
   [junit4] ERROR   14.5s J2 | TestPKIAuthenticationPlugin.test <<<
   [junit4]    > Throwable #1: java.lang.NullPointerException
   [junit4]    > 	at __randomizedtesting.SeedInfo.seed([6F193DD831F942D6:E74D02029F052F2E]:0)
   [junit4]    > 	at org.apache.solr.security.TestPKIAuthenticationPlugin.test(TestPKIAuthenticationPlugin.java:105)
   [junit4]    > 	at java.lang.Thread.run(Thread.java:748)
   [junit4]   2> NOTE: leaving temporary files on disk at: /home/jenkins/jenkins-slave/workspace/Lucene-Solr-Tests-master/solr/build/solr-core/test/J2/temp/solr.security.TestPKIAuthenticationPlugin_6F193DD831F942D6-001
   [junit4]   2> NOTE: test params are: codec=FastDecompressionCompressingStoredFields(storedFieldsFormat=CompressingStoredFieldsFormat(compressionMode=FAST_DECOMPRESSION, chunkSize=1, maxDocsPerChunk=805, blockSize=594), termVectorsFormat=CompressingTermVectorsFormat(compressionMode=FAST_DECOMPRESSION, chunkSize=1, blockSize=594)), sim=Asserting(org.apache.lucene.search.similarities.AssertingSimilarity@506cdd7f), locale=ko-KR, timezone=Africa/Lubumbashi
   [junit4]   2> NOTE: Linux 4.4.0-112-generic amd64/Oracle Corporation 1.8.0_172 (64-bit)/cpus=4,threads=1,free=199011536,total=339214336
   [junit4]   2> NOTE: All tests run in this JVM: [TestSimComputePlanAction, InfoHandlerTest, TestSortableTextField, CustomHighlightComponentTest, TlogReplayBufferedWhileIndexingTest, HdfsBasicDistributedZkTest, NotRequiredUniqueKeyTest, TestDelegationWithHadoopAuth, PrimitiveFieldTypeTest, TestNoOpRegenerator, TestPKIAuthenticationPlugin]
   [junit4] Completed [21/835 (1!)] on J2 in 14.82s, 1 test, 1 error <<< FAILURES!

[...truncated 588 lines...]
   [junit4] Suite: org.apache.solr.cloud.MoveReplicaTest
   [junit4]   2> 1138036 INFO  (SUITE-MoveReplicaTest-seed#[6F193DD831F942D6]-worker) [    ] o.a.s.SolrTestCaseJ4 SecureRandom sanity checks: test.solr.allowed.securerandom=null & java.security.egd=file:/dev/./urandom
   [junit4]   2> Creating dataDir: /home/jenkins/jenkins-slave/workspace/Lucene-Solr-Tests-master/solr/build/solr-core/test/J2/temp/solr.cloud.MoveReplicaTest_6F193DD831F942D6-001/init-core-data-001
   [junit4]   2> 1138069 WARN  (SUITE-MoveReplicaTest-seed#[6F193DD831F942D6]-worker) [    ] o.a.s.SolrTestCaseJ4 startTrackingSearchers: numOpens=7 numCloses=7
   [junit4]   2> 1138070 INFO  (SUITE-MoveReplicaTest-seed#[6F193DD831F942D6]-worker) [    ] o.a.s.SolrTestCaseJ4 Using PointFields (NUMERIC_POINTS_SYSPROP=true) w/NUMERIC_DOCVALUES_SYSPROP=true
   [junit4]   2> 1138071 INFO  (SUITE-MoveReplicaTest-seed#[6F193DD831F942D6]-worker) [    ] o.a.s.SolrTestCaseJ4 Randomized ssl (false) and clientAuth (true) via: @org.apache.solr.util.RandomizeSSL(reason=, ssl=NaN, value=NaN, clientAuth=NaN)
   [junit4]   2> 1138072 INFO  (SUITE-MoveReplicaTest-seed#[6F193DD831F942D6]-worker) [    ] o.a.s.c.MiniSolrCloudCluster Starting cluster of 4 servers in /home/jenkins/jenkins-slave/workspace/Lucene-Solr-Tests-master/solr/build/solr-core/test/J2/temp/solr.cloud.MoveReplicaTest_6F193DD831F942D6-001/tempDir-001
   [junit4]   2> 1138072 INFO  (SUITE-MoveReplicaTest-seed#[6F193DD831F942D6]-worker) [    ] o.a.s.c.ZkTestServer STARTING ZK TEST SERVER
   [junit4]   2> 1138072 INFO  (Thread-908) [    ] o.a.s.c.ZkTestServer client port:0.0.0.0/0.0.0.0:0
   [junit4]   2> 1138072 INFO  (Thread-908) [    ] o.a.s.c.ZkTestServer Starting server
   [junit4]   2> 1138099 ERROR (Thread-908) [    ] o.a.z.s.ZooKeeperServer ZKShutdownHandler is not registered, so ZooKeeper server won't take any action on ERROR or SHUTDOWN server state changes
   [junit4]   2> 1138175 INFO  (SUITE-MoveReplicaTest-seed#[6F193DD831F942D6]-worker) [    ] o.a.s.c.ZkTestServer start zk server on port:45878
   [junit4]   2> 1138205 INFO  (zkConnectionManagerCallback-2052-thread-1) [    ] o.a.s.c.c.ConnectionManager zkClient has connected
   [junit4]   2> 1138326 INFO  (jetty-launcher-2049-thread-1) [    ] o.e.j.s.Server jetty-9.4.11.v20180605; built: 2018-06-05T18:24:03.829Z; git: d5fc0523cfa96bfebfbda19606cad384d772f04c; jvm 1.8.0_172-b11
   [junit4]   2> 1138326 INFO  (jetty-launcher-2049-thread-2) [    ] o.e.j.s.Server jetty-9.4.11.v20180605; built: 2018-06-05T18:24:03.829Z; git: d5fc0523cfa96bfebfbda19606cad384d772f04c; jvm 1.8.0_172-b11
   [junit4]   2> 1138329 INFO  (jetty-launcher-2049-thread-3) [    ] o.e.j.s.Server jetty-9.4.11.v20180605; built: 2018-06-05T18:24:03.829Z; git: d5fc0523cfa96bfebfbda19606cad384d772f04c; jvm 1.8.0_172-b11
   [junit4]   2> 1138354 INFO  (jetty-launcher-2049-thread-1) [    ] o.e.j.s.session DefaultSessionIdManager workerName=node0
   [junit4]   2> 1138354 INFO  (jetty-launcher-2049-thread-1) [    ] o.e.j.s.session No SessionScavenger set, using defaults
   [junit4]   2> 1138354 INFO  (jetty-launcher-2049-thread-1) [    ] o.e.j.s.session node0 Scavenging every 600000ms
   [junit4]   2> 1138354 INFO  (jetty-launcher-2049-thread-1) [    ] o.e.j.s.h.ContextHandler Started o.e.j.s.ServletContextHandler@89d2e07{/solr,null,AVAILABLE}
   [junit4]   2> 1138355 INFO  (jetty-launcher-2049-thread-1) [    ] o.e.j.s.AbstractConnector Started ServerConnector@1fe8a1d1{HTTP/1.1,[http/1.1]}{127.0.0.1:43506}
   [junit4]   2> 1138355 INFO  (jetty-launcher-2049-thread-1) [    ] o.e.j.s.Server Started @1138399ms
   [junit4]   2> 1138355 INFO  (jetty-launcher-2049-thread-1) [    ] o.a.s.c.s.e.JettySolrRunner Jetty properties: {hostContext=/solr, hostPort=43506}
   [junit4]   2> 1138355 ERROR (jetty-launcher-2049-thread-1) [    ] o.a.s.u.StartupLoggingUtils Missing Java Option solr.log.dir. Logging may be missing or incomplete.
   [junit4]   2> 1138355 INFO  (jetty-launcher-2049-thread-1) [    ] o.a.s.s.SolrDispatchFilter Using logger factory org.apache.logging.slf4j.Log4jLoggerFactory
   [junit4]   2> 1138382 INFO  (jetty-launcher-2049-thread-1) [    ] o.a.s.s.SolrDispatchFilter  ___      _       Welcome to Apache Solr™ version 8.0.0
   [junit4]   2> 1138382 INFO  (jetty-launcher-2049-thread-1) [    ] o.a.s.s.SolrDispatchFilter / __| ___| |_ _   Starting in cloud mode on port null
   [junit4]   2> 1138382 INFO  (jetty-launcher-2049-thread-1) [    ] o.a.s.s.SolrDispatchFilter \__ \/ _ \ | '_|  Install dir: null
   [junit4]   2> 1138382 INFO  (jetty-launcher-2049-thread-1) [    ] o.a.s.s.SolrDispatchFilter |___/\___/_|_|    Start time: 2018-11-01T14:14:44.751Z
   [junit4]   2> 1138447 INFO  (jetty-launcher-2049-thread-3) [    ] o.e.j.s.session DefaultSessionIdManager workerName=node0
   [junit4]   2> 1138447 INFO  (jetty-launcher-2049-thread-3) [    ] o.e.j.s.session No SessionScavenger set, using defaults
   [junit4]   2> 1138447 INFO  (jetty-launcher-2049-thread-3) [    ] o.e.j.s.session node0 Scavenging every 660000ms
   [junit4]   2> 1138464 INFO  (jetty-launcher-2049-thread-3) [    ] o.e.j.s.h.ContextHandler Started o.e.j.s.ServletContextHandler@27a6d2f4{/solr,null,AVAILABLE}
   [junit4]   2> 1138464 INFO  (jetty-launcher-2049-thread-3) [    ] o.e.j.s.AbstractConnector Started ServerConnector@5a962e90{HTTP/1.1,[http/1.1]}{127.0.0.1:42676}
   [junit4]   2> 1138464 INFO  (jetty-launcher-2049-thread-3) [    ] o.e.j.s.Server Started @1138508ms
   [junit4]   2> 1138464 INFO  (jetty-launcher-2049-thread-3) [    ] o.a.s.c.s.e.JettySolrRunner Jetty properties: {hostContext=/solr, hostPort=42676}
   [junit4]   2> 1138464 ERROR (jetty-launcher-2049-thread-3) [    ] o.a.s.u.StartupLoggingUtils Missing Java Option solr.log.dir. Logging may be missing or incomplete.
   [junit4]   2> 1138464 INFO  (jetty-launcher-2049-thread-3) [    ] o.a.s.s.SolrDispatchFilter Using logger factory org.apache.logging.slf4j.Log4jLoggerFactory
   [junit4]   2> 1138464 INFO  (jetty-launcher-2049-thread-3) [    ] o.a.s.s.SolrDispatchFilter  ___      _       Welcome to Apache Solr™ version 8.0.0
   [junit4]   2> 1138464 INFO  (jetty-launcher-2049-thread-3) [    ] o.a.s.s.SolrDispatchFilter / __| ___| |_ _   Starting in cloud mode on port null
   [junit4]   2> 1138464 INFO  (jetty-launcher-2049-thread-3) [    ] o.a.s.s.SolrDispatchFilter \__ \/ _ \ | '_|  Install dir: null
   [junit4]   2> 1138464 INFO  (jetty-launcher-2049-thread-3) [    ] o.a.s.s.SolrDispatchFilter |___/\___/_|_|    Start time: 2018-11-01T14:14:44.833Z
   [junit4]   2> 1138508 INFO  (jetty-launcher-2049-thread-4) [    ] o.e.j.s.Server jetty-9.4.11.v20180605; built: 2018-06-05T18:24:03.829Z; git: d5fc0523cfa96bfebfbda19606cad384d772f04c; jvm 1.8.0_172-b11
   [junit4]   2> 1138530 INFO  (jetty-launcher-2049-thread-2) [    ] o.e.j.s.session DefaultSessionIdManager workerName=node0
   [junit4]   2> 1138530 INFO  (jetty-launcher-2049-thread-2) [    ] o.e.j.s.session No SessionScavenger set, using defaults
   [junit4]   2> 1138530 INFO  (jetty-launcher-2049-thread-2) [    ] o.e.j.s.session node0 Scavenging every 600000ms
   [junit4]   2> 1138530 INFO  (jetty-launcher-2049-thread-2) [    ] o.e.j.s.h.ContextHandler Started o.e.j.s.ServletContextHandler@7caedc35{/solr,null,AVAILABLE}
   [junit4]   2> 1138531 INFO  (jetty-launcher-2049-thread-2) [    ] o.e.j.s.AbstractConnector Started ServerConnector@2e62daa9{HTTP/1.1,[http/1.1]}{127.0.0.1:38373}
   [junit4]   2> 1138531 INFO  (jetty-launcher-2049-thread-2) [    ] o.e.j.s.Server Started @1138575ms
   [junit4]   2> 1138531 INFO  (jetty-launcher-2049-thread-2) [    ] o.a.s.c.s.e.JettySolrRunner Jetty properties: {hostContext=/solr, hostPort=38373}
   [junit4]   2> 1138531 ERROR (jetty-launcher-2049-thread-2) [    ] o.a.s.u.StartupLoggingUtils Missing Java Option solr.log.dir. Logging may be missing or incomplete.
   [junit4]   2> 1138531 INFO  (jetty-launcher-2049-thread-2) [    ] o.a.s.s.SolrDispatchFilter Using logger factory org.apache.logging.slf4j.Log4jLoggerFactory
   [junit4]   2> 1138531 INFO  (jetty-launcher-2049-thread-2) [    ] o.a.s.s.SolrDispatchFilter  ___      _       Welcome to Apache Solr™ version 8.0.0
   [junit4]   2> 1138531 INFO  (jetty-launcher-2049-thread-2) [    ] o.a.s.s.SolrDispatchFilter / __| ___| |_ _   Starting in cloud mode on port null
   [junit4]   2> 1138531 INFO  (jetty-launcher-2049-thread-2) [    ] o.a.s.s.SolrDispatchFilter \__ \/ _ \ | '_|  Install dir: null
   [junit4]   2> 1138531 INFO  (jetty-launcher-2049-thread-2) [    ] o.a.s.s.SolrDispatchFilter |___/\___/_|_|    Start time: 2018-11-01T14:14:44.900Z
   [junit4]   2> 1138573 INFO  (zkConnectionManagerCallback-2054-thread-1) [    ] o.a.s.c.c.ConnectionManager zkClient has connected
   [junit4]   2> 1138573 INFO  (jetty-launcher-2049-thread-1) [    ] o.a.s.s.SolrDispatchFilter solr.xml found in ZooKeeper. Loading...
   [junit4]   2> 1138638 INFO  (jetty-launcher-2049-thread-4) [    ] o.e.j.s.session DefaultSessionIdManager workerName=node0
   [junit4]   2> 1138638 INFO  (jetty-launcher-2049-thread-4) [    ] o.e.j.s.session No SessionScavenger set, using defaults
   [junit4]   2> 1138638 INFO  (jetty-launcher-2049-thread-4) [    ] o.e.j.s.session node0 Scavenging every 600000ms
   [junit4]   2> 1138639 INFO  (jetty-launcher-2049-thread-4) [    ] o.e.j.s.h.ContextHandler Started o.e.j.s.ServletContextHandler@357d80e1{/solr,null,AVAILABLE}
   [junit4]   2> 1138639 INFO  (jetty-launcher-2049-thread-4) [    ] o.e.j.s.AbstractConnector Started ServerConnector@11997632{HTTP/1.1,[http/1.1]}{127.0.0.1:45766}
   [junit4]   2> 1138639 INFO  (jetty-launcher-2049-thread-4) [    ] o.e.j.s.Server Started @1138683ms
   [junit4]   2> 1138639 INFO  (jetty-launcher-2049-thread-4) [    ] o.a.s.c.s.e.JettySolrRunner Jetty properties: {hostContext=/solr, hostPort=45766}
   [junit4]   2> 1138639 ERROR (jetty-launcher-2049-thread-4) [    ] o.a.s.u.StartupLoggingUtils Missing Java Option solr.log.dir. Logging may be missing or incomplete.
   [junit4]   2> 1138639 INFO  (jetty-launcher-2049-thread-4) [    ] o.a.s.s.SolrDispatchFilter Using logger factory org.apache.logging.slf4j.Log4jLoggerFactory
   [junit4]   2> 1138639 INFO  (jetty-launcher-2049-thread-4) [    ] o.a.s.s.SolrDispatchFilter  ___      _       Welcome to Apache Solr™ version 8.0.0
   [junit4]   2> 1138639 INFO  (jetty-launcher-2049-thread-4) [    ] o.a.s.s.SolrDispatchFilter / __| ___| |_ _   Starting in cloud mode on port null
   [junit4]   2> 1138639 INFO  (jetty-launcher-2049-thread-4) [    ] o.a.s.s.SolrDispatchFilter \__ \/ _ \ | '_|  Install dir: null
   [junit4]   2> 1138640 INFO  (jetty-launcher-2049-thread-4) [    ] o.a.s.s.SolrDispatchFilter |___/\___/_|_|    Start time: 2018-11-01T14:14:45.008Z
   [junit4]   2> 1138759 INFO  (zkConnectionManagerCallback-2056-thread-1) [    ] o.a.s.c.c.ConnectionManager zkClient has connected
   [junit4]   2> 1138869 INFO  (zkConnectionManagerCallback-2058-thread-1) [    ] o.a.s.c.c.ConnectionManager zkClient has connected
   [junit4]   2> 1138869 INFO  (jetty-launcher-2049-thread-2) [    ] o.a.s.s.SolrDispatchFilter solr.xml found in ZooKeeper. Loading...
   [junit4]   2> 1138894 INFO  (jetty-launcher-2049-thread-3) [    ] o.a.s.s.SolrDispatchFilter solr.xml found in ZooKeeper. Loading...
   [junit4]   2> 1138922 INFO  (zkConnectionManagerCallback-2060-thread-1) [    ] o.a.s.c.c.ConnectionManager zkClient has connected
   [junit4]   2> 1138922 INFO  (jetty-launcher-2049-thread-4) [    ] o.a.s.s.SolrDispatchFilter solr.xml found in ZooKeeper. Loading...
   [junit4]   2> 1139345 INFO  (jetty-launcher-2049-thread-4) [    ] o.a.s.c.ZkContainer Zookeeper client=127.0.0.1:45878/solr
   [junit4]   2> 1139409 INFO  (zkConnectionManagerCallback-2064-thread-1) [    ] o.a.s.c.c.ConnectionManager zkClient has connected
   [junit4]   2> 1139446 DEBUG (jetty-launcher-2049-thread-4) [n:127.0.0.1:45766_solr    ] o.a.s.c.ZkController Added new OnReconnect listener org.apache.solr.cloud.ZkController$$Lambda$526/1209621938@6a2a6cbb
   [junit4]   2> 1139523 INFO  (zkConnectionManagerCallback-2066-thread-1) [    ] o.a.s.c.c.ConnectionManager zkClient has connected
   [junit4]   2> 1139771 INFO  (jetty-launcher-2049-thread-2) [    ] o.a.s.c.ZkContainer Zookeeper client=127.0.0.1:45878/solr
   [junit4]   2> 1139816 INFO  (zkConnectionManagerCallback-2072-thread-1) [    ] o.a.s.c.c.ConnectionManager zkClient has connected
   [junit4]   2> 1139917 DEBUG (jetty-launcher-2049-thread-2) [n:127.0.0.1:38373_solr    ] o.a.s.c.ZkController Added new OnReconnect listener org.apache.solr.cloud.ZkController$$Lambda$526/1209621938@11000439
   [junit4]   2> 1139994 INFO  (zkConnectionManagerCallback-2074-thread-1) [    ] o.a.s.c.c.ConnectionManager zkClient has connected
   [junit4]   2> 1140139 DEBUG (SyncThread:0) [    ] o.a.s.c.ZkTestServer Watch added: create/delete: /solr/clusterprops.json
   [junit4]   2> 1140139 DEBUG (SyncThread:0) [    ] o.a.s.c.ZkTestServer Watch added: children: /solr/live_nodes
   [junit4]   2> 1140139 DEBUG (SyncThread:0) [    ] o.a.s.c.ZkTestServer Watch added: data: /solr/clusterstate.json
   [junit4]   2> 1140139 DEBUG (SyncThread:0) [    ] o.a.s.c.ZkTestServer Watch added: children: /solr/collections
   [junit4]   2> 1140140 DEBUG (SyncThread:0) [    ] o.a.s.c.ZkTestServer Watch added: create/delete: /solr/aliases.json
   [junit4]   2> 1140152 DEBUG (SyncThread:0) [    ] o.a.s.c.ZkTestServer Watch added: create/delete: /solr/security.json
   [junit4]   2> 1140157 INFO  (jetty-launcher-2049-thread-3) [    ] o.a.s.c.ZkContainer Zookeeper client=127.0.0.1:45878/solr
   [junit4]   2> 1140175 DEBUG (jetty-launcher-2049-thread-2) [n:127.0.0.1:38373_solr    ] o.a.s.c.LeaderElector Joined leadership election with path: /overseer_elect/election/73592387217326088-127.0.0.1:38373_solr-n_0000000000
   [junit4]   2> 1140175 INFO  (jetty-launcher-2049-thread-2) [n:127.0.0.1:38373_solr    ] o.a.s.c.OverseerElectionContext I am going to be the leader 127.0.0.1:38373_solr
   [junit4]   2> 1140175 INFO  (jetty-launcher-2049-thread-2) [n:127.0.0.1:38373_solr    ] o.a.s.c.Overseer Overseer (id=73592387217326088-127.0.0.1:38373_solr-n_0000000000) starting
   [junit4]   2> 1140250 INFO  (zkConnectionManagerCallback-2080-thread-1) [    ] o.a.s.c.c.ConnectionManager zkClient has connected
   [junit4]   2> 1140283 INFO  (jetty-launcher-2049-thread-1) [    ] o.a.s.c.ZkContainer Zookeeper client=127.0.0.1:45878/solr
   [junit4]   2> 1140284 DEBUG (SyncThread:0) [    ] o.a.s.c.ZkTestServer Watch added: create/delete: /solr/clusterprops.json
   [junit4]   2> 1140284 DEBUG (SyncThread:0) [    ] o.a.s.c.ZkTestServer Watch added: children: /solr/live_nodes
   [junit4]   2> 1140284 DEBUG (SyncThread:0) [    ] o.a.s.c.ZkTestServer Watch added: data: /solr/clusterstate.json
   [junit4]   2> 1140284 DEBUG (SyncThread:0) [    ] o.a.s.c.ZkTestServer Watch added: children: /solr/collections
   [junit4]   2> 1140285 DEBUG (SyncThread:0) [    ] o.a.s.c.ZkTestServer Watch added: create/delete: /solr/aliases.json
   [junit4]   2> 1140285 DEBUG (SyncThread:0) [    ] o.a.s.c.ZkTestServer Watch added: create/delete: /solr/security.json
   [junit4]   2> 1140286 DEBUG (jetty-launcher-2049-thread-4) [n:127.0.0.1:45766_solr    ] o.a.s.c.LeaderElector Joined leadership election with path: /overseer_elect/election/73592387217326086-127.0.0.1:45766_solr-n_0000000001
   [junit4]   2> 1140286 DEBUG (SyncThread:0) [    ] o.a.s.c.ZkTestServer Watch added: data: /solr/overseer_elect/election/73592387217326088-127.0.0.1:38373_solr-n_0000000000
   [junit4]   2> 1140299 DEBUG (jetty-launcher-2049-thread-4) [n:127.0.0.1:45766_solr    ] o.a.s.c.LeaderElector Watching path /overseer_elect/election/73592387217326088-127.0.0.1:38373_solr-n_0000000000 to know if I could be the leader
   [junit4]   2> 1140299 INFO  (jetty-launcher-2049-thread-4) [n:127.0.0.1:45766_solr    ] o.a.s.c.ZkController Register node as live in ZooKeeper:/live_nodes/127.0.0.1:45766_solr
   [junit4]   2> 1140299 DEBUG (SyncThread:0) [    ] o.a.s.c.ZkTestServer Watch fired: children: /solr/live_nodes
   [junit4]   2> 1140299 DEBUG (SyncThread:0) [    ] o.a.s.c.ZkTestServer Watch fired: children: /solr/live_nodes
   [junit4]   2> 1140373 DEBUG (SyncThread:0) [    ] o.a.s.c.ZkTestServer Watch added: children: /solr/live_nodes
   [junit4]   2> 1140374 DEBUG (jetty-launcher-2049-thread-3) [n:127.0.0.1:42676_solr    ] o.a.s.c.ZkController Added new OnReconnect listener org.apache.solr.cloud.ZkController$$Lambda$526/1209621938@1b54446c
   [junit4]   2> 1140375 INFO  (zkConnectionManagerCallback-2089-thread-1) [    ] o.a.s.c.c.ConnectionManager zkClient has connected
   [junit4]   2> 1140388 DEBUG (SyncThread:0) [    ] o.a.s.c.ZkTestServer Watch added: create/delete: /solr/clusterprops.json
   [junit4]   2> 1140388 DEBUG (SyncThread:0) [    ] o.a.s.c.ZkTestServer Watch added: children: /solr/live_nodes
   [junit4]   2> 1140388 INFO  (jetty-launcher-2049-thread-2) [n:127.0.0.1:38373_solr    ] o.a.s.c.c.ZkStateReader Updated live nodes from ZooKeeper... (0) -> (1)
   [junit4]   2> 1140389 DEBUG (SyncThread:0) [    ] o.a.s.c.ZkTestServer Watch added: data: /solr/clusterstate.json
   [junit4]   2> 1140389 DEBUG (SyncThread:0) [    ] o.a.s.c.ZkTestServer Watch added: children: /solr/collections
   [junit4]   2> 1140389 INFO  (zkConnectionManagerCallback-2094-thread-1) [    ] o.a.s.c.c.ConnectionManager zkClient has connected
   [junit4]   2> 1140389 DEBUG (SyncThread:0) [    ] o.a.s.c.ZkTestServer Watch added: create/delete: /solr/aliases.json
   [junit4]   2> 1140390 INFO  (jetty-launcher-2049-thread-2) [n:127.0.0.1:38373_solr    ] o.a.s.c.s.i.ZkClientClusterStateProvider Cluster at 127.0.0.1:45878/solr ready
   [junit4]   2> 1140390 DEBUG (SyncThread:0) [    ] o.a.s.c.ZkTestServer Watch added: create/delete: /solr/clusterprops.json
   [junit4]   2> 1140390 DEBUG (SyncThread:0) [    ] o.a.s.c.ZkTestServer Watch added: children: /solr/live_nodes
   [junit4]   2> 1140390 INFO  (jetty-launcher-2049-thread-4) [n:127.0.0.1:45766_solr    ] o.a.s.c.c.ZkStateReader Updated live nodes from ZooKeeper... (0) -> (1)
   [junit4]   2> 1140390 DEBUG (SyncThread:0) [    ] o.a.s.c.ZkTestServer Watch added: data: /solr/clusterstate.json
   [junit4]   2> 1140391 DEBUG (SyncThread:0) [    ] o.a.s.c.ZkTestServer Watch added: children: /solr/collections
   [junit4]   2> 1140391 INFO  (OverseerStateUpdate-73592387217326088-127.0.0.1:38373_solr-n_0000000000) [n:127.0.0.1:38373_solr    ] o.a.s.c.Overseer Starting to work on the main queue : 127.0.0.1:38373_solr
   [junit4]   2> 1140391 DEBUG (SyncThread:0) [    ] o.a.s.c.ZkTestServer Watch added: create/delete: /solr/aliases.json
   [junit4]   2> 1140391 INFO  (jetty-launcher-2049-thread-4) [n:127.0.0.1:45766_solr    ] o.a.s.c.s.i.ZkClientClusterStateProvider Cluster at 127.0.0.1:45878/solr ready
   [junit4]   2> 1140391 DEBUG (OverseerCollectionConfigSetProcessor-73592387217326088-127.0.0.1:38373_solr-n_0000000000) [n:127.0.0.1:38373_solr    ] o.a.s.c.OverseerTaskProcessor Process current queue of overseer operations
   [junit4]   2> 1140400 INFO  (zkConnectionManagerCallback-2084-thread-1) [    ] o.a.s.c.c.ConnectionManager zkClient has connected
   [junit4]   2> 1140408 DEBUG (SyncThread:0) [    ] o.a.s.c.ZkTestServer Watch added: children: /solr/live_nodes
   [junit4]   2> 1140409 DEBUG (OverseerAutoScalingTriggerThread-73592387217326088-127.0.0.1:38373_solr-n_0000000000) [    ] o.a.s.c.a.OverseerTriggerThread Adding .auto_add_replicas and .scheduled_maintenance triggers
   [junit4]   2> 1140409 DEBUG (SyncThread:0) [    ] o.a.s.c.ZkTestServer Watch added: data: /solr/autoscaling.json
   [junit4]   2> 1140409 DEBUG (jetty-launcher-2049-thread-2) [n:127.0.0.1:38373_solr    ] o.a.s.c.ZkController Publish node=127.0.0.1:38373_solr as DOWN
   [junit4]   2> 1140409 DEBUG (OverseerAutoScalingTriggerThread-73592387217326088-127.0.0.1:38373_solr-n_0000000000) [    ] o.a.s.c.a.OverseerTriggerThread Refreshing /autoscaling.json with znode version 1
   [junit4]   2> 1140410 DEBUG (OverseerAutoScalingTriggerThread-73592387217326088-127.0.0.1:38373_solr-n_0000000000) [    ] o.a.s.c.a.OverseerTriggerThread Current znodeVersion 1, lastZnodeVersion -1
   [junit4]   2> 1140410 DEBUG (OverseerAutoScalingTriggerThread-73592387217326088-127.0.0.1:38373_solr-n_0000000000) [    ] o.a.s.c.a.OverseerTriggerThread Processed trigger updates upto znodeVersion 1
   [junit4]   2> 1140409 DEBUG (OverseerCollectionConfigSetProcessor-73592387217326088-127.0.0.1:38373_solr-n_0000000000) [n:127.0.0.1:38373_solr    ] o.a.s.c.OverseerTaskProcessor Cleaning up work-queue. #Running tasks: 0
   [junit4]   2> 1140410 DEBUG (OverseerCollectionConfigSetProcessor-73592387217326088-127.0.0.1:38373_solr-n_0000000000) [n:127.0.0.1:38373_solr    ] o.a.s.c.OverseerTaskProcessor RunningTasks: []
   [junit4]   2> 1140411 DEBUG (OverseerCollectionConfigSetProcessor-73592387217326088-127.0.0.1:38373_solr-n_0000000000) [n:127.0.0.1:38373_solr    ] o.a.s.c.OverseerTaskProcessor BlockedTasks: []
   [junit4]   2> 1140411 DEBUG (OverseerCollectionConfigSetProcessor-73592387217326088-127.0.0.1:38373_solr-n_0000000000) [n:127.0.0.1:38373_solr    ] o.a.s.c.OverseerTaskProcessor CompletedTasks: []
   [junit4]   2> 1140411 DEBUG (OverseerCollectionConfigSetProcessor-73592387217326088-127.0.0.1:38373_solr-n_0000000000) [n:127.0.0.1:38373_solr    ] o.a.s.c.OverseerTaskProcessor RunningZKTasks: []
   [junit4]   2> 1140411 DEBUG (OverseerCollectionConfigSetProcessor-73592387217326088-127.0.0.1:38373_solr-n_0000000000) [n:127.0.0.1:38373_solr    ] o.a.s.c.OverseerTaskQueue Peeking for top 100 elements. ExcludeSet: []
   [junit4]   2> 1140412 DEBUG (SyncThread:0) [    ] o.a.s.c.ZkTestServer Watch added: children: /solr/overseer/collection-queue-work
   [junit4]   2> 1140424 INFO  (jetty-launcher-2049-thread-4) [n:127.0.0.1:45766_solr    ] o.a.s.h.a.MetricsHistoryHandler No .system collection, keeping metrics history in memory.
   [junit4]   2> 1140436 WARN  (NIOServerCxn.Factory:0.0.0.0/0.0.0.0:0) [    ] o.a.z.s.NIOServerCnxn Unable to read additional data from client sessionid 0x10573e2e243000a, likely client has closed socket
   [junit4]   2> 1140510 INFO  (zkCallback-2065-thread-1) [    ] o.a.s.c.c.ZkStateReader Updated live nodes from ZooKeeper... (0) -> (1)
   [junit4]   2> 1140550 INFO  (jetty-launcher-2049-thread-2) [n:127.0.0.1:38373_solr    ] o.a.s.c.TransientSolrCoreCacheDefault Allocating transient cache for 2147483647 transient cores
   [junit4]   2> 1140550 INFO  (jetty-launcher-2049-thread-2) [n:127.0.0.1:38373_solr    ] o.a.s.c.ZkController Register node as live in ZooKeeper:/live_nodes/127.0.0.1:38373_solr
   [junit4]   2> 1140552 INFO  (jetty-launcher-2049-thread-4) [n:127.0.0.1:45766_solr    ] o.a.s.m.r.SolrJmxReporter JMX monitoring for 'solr_45766.solr.node' (registry 'solr.node') enabled at server: com.sun.jmx.mbeanserver.JmxMBeanServer@29e094d2
   [junit4]   2> 1140583 INFO  (OverseerStateUpdate-73592387217326088-127.0.0.1:38373_solr-n_0000000000) [n:127.0.0.1:38373_solr    ] o.a.s.c.c.ZkStateReader Updated live nodes from ZooKeeper... (0) -> (1)
   [junit4]   2> 1140583 INFO  (zkConnectionManagerCallback-2096-thread-1) [    ] o.a.s.c.c.ConnectionManager zkClient has connected
   [junit4]   2> 1140583 DEBUG (SyncThread:0) [    ] o.a.s.c.ZkTestServer Watch fired: children: /solr/live_nodes
   [junit4]   2> 1140583 DEBUG (SyncThread:0) [    ] o.a.s.c.ZkTestServer Watch fired: children: /solr/live_nodes
   [junit4]   2> 1140583 DEBUG (SyncThread:0) [    ] o.a.s.c.ZkTestServer Watch fired: children: /solr/live_nodes
   [junit4]   2> 1140583 DEBUG (SyncThread:0) [    ] o.a.s.c.ZkTestServer Watch fired: children: /solr/live_nodes
   [junit4]   2> 1140587 DEBUG (jetty-launcher-2049-thread-1) [n:127.0.0.1:43506_solr    ] o.a.s.c.ZkController Added new OnReconnect listener org.apache.solr.cloud.ZkController$$Lambda$526/1209621938@14aa4b4
   [junit4]   2> 1140608 INFO  (jetty-launcher-2049-thread-4) [n:127.0.0.1:45766_solr    ] o.a.s.m.r.SolrJmxReporter JMX monitoring for 'solr_45766.solr.jvm' (registry 'solr.jvm') enabled at server: com.sun.jmx.mbeanserver.JmxMBeanServer@29e094d2
   [junit4]   2> 1140608 INFO  (jetty-launcher-2049-thread-4) [n:127.0.0.1:45766_solr    ] o.a.s.m.r.SolrJmxReporter JMX monitoring for 'solr_45766.solr.jetty' (registry 'solr.jetty') enabled at server: com.sun.jmx.mbeanserver.JmxMBeanServer@29e094d2
   [junit4]   2> 1140623 INFO  (jetty-launcher-2049-thread-4) [n:127.0.0.1:45766_solr    ] o.a.s.c.CorePropertiesLocator Found 0 core definitions underneath /home/jenkins/jenkins-slave/workspace/Lucene-Solr-Tests-master/solr/build/solr-core/test/J2/temp/solr.cloud.MoveReplicaTest_6F193DD831F942D6-001/tempDir-001/node4/.
   [junit4]   2> 1140638 DEBUG (SyncThread:0) [    ] o.a.s.c.ZkTestServer Watch added: children: /solr/overseer/queue-work
   [junit4]   2> 1140882 DEBUG (SyncThread:0) [    ] o.a.s.c.ZkTestServer Watch added: children: /solr/overseer/queue
   [junit4]   2> 1140882 DEBUG (SyncThread:0) [    ] o.a.s.c.ZkTestServer Watch added: children: /solr/live_nodes
   [junit4]   2> 1140882 INFO  (zkCallback-2065-thread-1) [    ] o.a.s.c.c.ZkStateReader Updated live nodes from ZooKeeper... (1) -> (2)
   [junit4]   2> 1140895 DEBUG (SyncThread:0) [    ] o.a.s.c.ZkTestServer Watch added: children: /solr/live_nodes
   [junit4]   2> 1141037 INFO  (zkCallback-2088-thread-1) [    ] o.a.s.c.c.ZkStateReader Updated live nodes from ZooKeeper... (1) -> (2)
   [junit4]   2> 1141070 INFO  (zkConnectionManagerCallback-2099-thread-1) [    ] o.a.s.c.c.ConnectionManager zkClient has connected
   [junit4]   2> 1141074 DEBUG (SyncThread:0) [    ] o.a.s.c.ZkTestServer Watch added: children: /solr/live_nodes
   [junit4]   2> 1141074 DEBUG (SyncThread:0) [    ] o.a.s.c.ZkTestServer Watch added: children: /solr/live_nodes
   [junit4]   2> 1141085 INFO  (zkCallback-2073-thread-2) [    ] o.a.s.c.c.ZkStateReader Updated live nodes from ZooKeeper... (1) -> (2)
   [junit4]   2> 1141090 DEBUG (SyncThread:0) [    ] o.a.s.c.ZkTestServer Watch added: children: /solr/autoscaling/events/.scheduled_maintenance
   [junit4]   2> 1141094 INFO  (jetty-launcher-2049-thread-2) [n:127.0.0.1:38373_solr    ] o.a.s.h.a.MetricsHistoryHandler No .system collection, keeping metrics history in memory.
   [junit4]   2> 1141204 INFO  (zkCallback-2093-thread-1) [    ] o.a.s.c.c.ZkStateReader Updated live nodes from ZooKeeper... (1) -> (2)
   [junit4]   2> 1141273 INFO  (jetty-launcher-2049-thread-2) [n:127.0.0.1:38373_solr    ] o.a.s.m.r.SolrJmxReporter JMX monitoring for 'solr_38373.solr.node' (registry 'solr.node') enabled at server: com.sun.jmx.mbeanserver.JmxMBeanServer@29e094d2
   [junit4]   2> 1141289 DEBUG (SyncThread:0) [    ] o.a.s.c.ZkTestServer Watch fired: children: /solr/overseer/queue
   [junit4]   2> 1141292 INFO  (jetty-launcher-2049-thread-2) [n:127.0.0.1:38373_solr    ] o.a.s.m.r.SolrJmxReporter JMX monitoring for 'solr_38373.solr.jvm' (registry 'solr.jvm') enabled at server: com.sun.jmx.mbeanserver.JmxMBeanServer@29e094d2
   [junit4]   2> 1141293 INFO  (jetty-launcher-2049-thread-2) [n:127.0.0.1:38373_solr    ] o.a.s.m.r.SolrJmxReporter JMX monitoring for 'solr_38373.solr.jetty' (registry 'solr.jetty') enabled at server: com.sun.jmx.mbeanserver.JmxMBeanServer@29e094d2
   [junit4]   2> 1141309 DEBUG (SyncThread:0) [    ] o.a.s.c.ZkTestServer Watch added: create/delete: /solr/clusterprops.json
   [junit4]   2> 1141310 INFO  (jetty-launcher-2049-thread-2) [n:127.0.0.1:38373_solr    ] o.a.s.c.CorePropertiesLocator Found 0 core definitions underneath /home/jenkins/jenkins-slave/workspace/Lucene-Solr-Tests-master/solr/build/solr-core/test/J2/temp/solr.cloud.MoveReplicaTest_6F193DD831F942D6-001/tempDir-001/node2/.
   [junit4]   2> 1141326 DEBUG (SyncThread:0) [    ] o.a.s.c.ZkTestServer Watch added: children: /solr/live_nodes
   [junit4]   2> 1141326 INFO  (jetty-launcher-2049-thread-3) [n:127.0.0.1:42676_solr    ] o.a.s.c.c.ZkStateReader Updated live nodes from ZooKeeper... (0) -> (2)
   [junit4]   2> 1141338 DEBUG (SyncThread:0) [    ] o.a.s.c.ZkTestServer Watch added: data: /solr/clusterstate.json
   [junit4]   2> 1141338 DEBUG (SyncThread:0) [    ] o.a.s.c.ZkTestServer Watch added: children: /solr/overseer/queue
   [junit4]   2> 1141346 DEBUG (SyncThread:0) [    ] o.a.s.c.ZkTestServer Watch added: children: /solr/collections
   [junit4]   2> 1141346 DEBUG (SyncThread:0) [    ] o.a.s.c.ZkTestServer Watch added: create/delete: /solr/aliases.json
   [junit4]   2> 1141347 DEBUG (SyncThread:0) [    ] o.a.s.c.ZkTestServer Watch added: create/delete: /solr/security.json
   [junit4]   2> 1141348 DEBUG (jetty-launcher-2049-thread-3) [n:127.0.0.1:42676_solr    ] o.a.s.c.LeaderElector Joined leadership election with path: /overseer_elect/election/73592387217326093-127.0.0.1:42676_solr-n_0000000002
   [junit4]   2> 1141348 DEBUG (SyncThread:0) [    ] o.a.s.c.ZkTestServer Watch added: data: /solr/overseer_elect/election/73592387217326086-127.0.0.1:45766_solr-n_0000000001
   [junit4]   2> 1141348 DEBUG (jetty-launcher-2049-thread-3) [n:127.0.0.1:42676_solr    ] o.a.s.c.LeaderElector Watching path /overseer_elect/election/73592387217326086-127.0.0.1:45766_solr-n_0000000001 to know if I could be the leader
   [junit4]   2> 1141348 DEBUG (jetty-launcher-2049-thread-3) [n:127.0.0.1:42676_solr    ] o.a.s.c.ZkController Publish node=127.0.0.1:42676_solr as DOWN
   [junit4]   2> 1141349 DEBUG (SyncThread:0) [    ] o.a.s.c.ZkTestServer Watch fired: children: /solr/overseer/queue
   [junit4]   2> 1141349 DEBUG (SyncThread:0) [    ] o.a.s.c.ZkTestServer Watch added: children: /solr/overseer/queue
   [junit4]   2> 1141349 INFO  (jetty-launcher-2049-thread-3) [n:127.0.0.1:42676_solr    ] o.a.s.c.TransientSolrCoreCacheDefault Allocating transient cache for 2147483647 transient cores
   [junit4]   2> 1141349 INFO  (jetty-launcher-2049-thread-3) [n:127.0.0.1:42676_solr    ] o.a.s.c.ZkController Register node as live in ZooKeeper:/live_nodes/127.0.0.1:42676_solr
   [junit4]   2> 1141367 DEBUG (OverseerAutoScalingTriggerThread-73592387217326088-127.0.0.1:38373_solr-n_0000000000) [    ] o.a.s.c.a.NodeLostTrigger NodeLostTrigger .auto_add_replicas - Initial livenodes: [127.0.0.1:45766_solr, 127.0.0.1:38373_solr]
   [junit4]   2> 1141370 DEBUG (SyncThread:0) [    ] o.a.s.c.ZkTestServer Watch fired: children: /solr/live_nodes
   [junit4]   2> 1141370 DEBUG (SyncThread:0) [    ] o.a.s.c.ZkTestServer Watch fired: children: /solr/live_nodes
   [junit4]   2> 1141370 DEBUG (SyncThread:0) [    ] o.a.s.c.ZkTestServer Watch fired: children: /solr/live_nodes
   [junit4]   2> 1141370 DEBUG (SyncThread:0) [    ] o.a.s.c.ZkTestServer Watch fired: children: /solr/live_nodes
   [junit4]   2> 1141370 DEBUG (SyncThread:0) [    ] o.a.s.c.ZkTestServer Watch fired: children: /solr/live_nodes
   [junit4]   2> 1141370 DEBUG (SyncThread:0) [    ] o.a.s.c.ZkTestServer Watch added: children: /solr/live_nodes
   [junit4]   2> 1141370 INFO  (zkCallback-2073-thread-2) [    ] o.a.s.c.c.ZkStateReader Updated live nodes from ZooKeeper... (2) -> (3)
   [junit4]   2> 1141370 DEBUG (SyncThread:0) [    ] o.a.s.c.ZkTestServer Watch added: children: /solr/live_nodes
   [junit4]   2> 1141371 INFO  (zkCallback-2065-thread-1) [    ] o.a.s.c.c.ZkStateReader Updated live nodes from ZooKeeper... (2) -> (3)
   [junit4]   2> 1141371 DEBUG (SyncThread:0) [    ] o.a.s.c.ZkTestServer Watch added: create/delete: /solr/clusterprops.json
   [junit4]   2> 1141371 DEBUG (SyncThread:0) [    ] o.a.s.c.ZkTestServer Watch added: children: /solr/live_nodes
   [junit4]   2> 1141371 INFO  (jetty-launcher-2049-thread-1) [n:127.0.0.1:43506_solr    ] o.a.s.c.c.ZkStateReader Updated live nodes from ZooKeeper... (0) -> (3)
   [junit4]   2> 1141371 DEBUG (SyncThread:0) [    ] o.a.s.c.ZkTestServer Watch added: data: /solr/clusterstate.json
   [junit4]   2> 1141372 DEBUG (SyncThread:0) [    ] o.a.s.c.ZkTestServer Watch added: children: /solr/collections
   [junit4]   2> 1141372 DEBUG (SyncThread:0) [    ] o.a.s.c.ZkTestServer Watch added: create/delete: /solr/aliases.json
   [junit4]   2> 1141372 DEBUG (SyncThread:0) [    ] o.a.s.c.ZkTestServer Watch added: create/delete: /solr/security.json
   [junit4]   2> 1141373 DEBUG (jetty-launcher-2049-thread-1) [n:127.0.0.1:43506_solr    ] o.a.s.c.LeaderElector Joined leadership election with path: /overseer_elect/election/73592387217326094-127.0.0.1:43506_solr-n_0000000003
   [junit4]   2> 1141374 DEBUG (SyncThread:0) [    ] o.a.s.c.ZkTestServer Watch added: data: /solr/overseer_elect/election/73592387217326093-127.0.0.1:42676_solr-n_0000000002
   [junit4]   2> 1141374 DEBUG (jetty-launcher-2049-thread-1) [n:127.0.0.1:43506_solr    ] o.a.s.c.LeaderElector Watching path /overseer_elect/election/73592387217326093-127.0.0.1:42676_solr-n_0000000002 to know if I could be the leader
   [junit4]   2> 1141374 DEBUG (jetty-launcher-2049-thread-1) [n:127.0.0.1:43506_solr    ] o.a.s.c.ZkController Publish node=127.0.0.1:43506_solr as DOWN
   [junit4]   2> 1141387 DEBUG (OverseerAutoScalingTriggerThread-73592387217326088-127.0.0.1:38373_solr-n_0000000000) [    ] o.a.s.c.a.OverseerTriggerThread -- clean old nodeAdded markers
   [junit4]   2> 1141411 DEBUG (SyncThread:0) [    ] o.a.s.c.ZkTestServer Watch added: children: /solr/live_nodes
   [junit4]   2> 1141411 DEBUG (SyncThread:0) [    ] o.a.s.c.ZkTestServer Watch added: children: /solr/autoscaling/events/.auto_add_replicas
   [junit4]   2> 1141439 DEBUG (OverseerAutoScalingTriggerThread-73592387217326088-127.0.0.1:38373_solr-n_0000000000) [    ] o.a.s.c.a.OverseerTriggerThread Current znodeVersion 1, lastZnodeVersion 1
   [junit4]   2> 1141447 DEBUG (SyncThread:0) [    ] o.a.s.c.ZkTestServer Watch added: children: /solr/live_nodes
   [junit4]   2> 1141447 DEBUG (SyncThread:0) [    ] o.a.s.c.ZkTestServer Watch added: children: /solr/live_nodes
   [junit4]   2> 1141460 INFO  (zkCallback-2093-thread-1) [    ] o.a.s.c.c.ZkStateReader Updated live nodes from ZooKeeper... (2) -> (3)
   [junit4]   2> 1141460 DEBUG (ScheduledTrigger-2453-thread-1) [    ] o.a.s.c.a.NodeLostTrigger Running NodeLostTrigger: .auto_add_replicas with currently live nodes: 2
   [junit4]   2> 1141545 INFO  (zkCallback-2088-thread-1) [    ] o.a.s.c.c.ZkStateReader Updated live nodes from ZooKeeper... (2) -> (3)
   [junit4]   2> 1141577 DEBUG (SyncThread:0) [    ] o.a.s.c.ZkTestServer Watch fired: children: /solr/overseer/queue
   [junit4]   2> 1141589 INFO  (zkCallback-2095-thread-1) [    ] o.a.s.c.c.ZkStateReader Updated live nodes from ZooKeeper... (2) -> (3)
   [junit4]   2> 1141598 DEBUG (SyncThread:0) [    ] o.a.s.c.ZkTestServer Watch added: children: /solr/overseer/queue
   [junit4]   2> 1141600 INFO  (zkConnectionManagerCallback-2109-thread-1) [    ] o.a.s.c.c.ConnectionManager zkClient has connected
   [junit4]   2> 1141600 DEBUG (SyncThread:0) [    ] o.a.s.c.ZkTestServer Watch added: create/delete: /solr/clusterprops.json
   [junit4]   2> 1141600 DEBUG (SyncThread:0) [    ] o.a.s.c.ZkTestServer Watch added: children: /solr/live_nodes
   [junit4]   2> 1141600 INFO  (jetty-launcher-2049-thread-3) [n:127.0.0.1:42676_solr    ] o.a.s.c.c.ZkStateReader Updated live nodes from ZooKeeper... (0) -> (3)
   [junit4]   2> 1141601 DEBUG (SyncThread:0) [    ] o.a.s.c.ZkTestServer Watch added: data: /solr/clusterstate.json
   [junit4]   2> 1141601 DEBUG (SyncThread:0) [    ] o.a.s.c.ZkTestServer Watch added: children: /solr/collections
   [junit4]   2> 1141601 DEBUG (SyncThread:0) [    ] o.a.s.c.ZkTestServer Watch added: create/delete: /solr/aliases.json
   [junit4]   2> 1141601 INFO  (jetty-launcher-2049-thread-3) [n:127.0.0.1:42676_solr    ] o.a.s.c.s.i.ZkClientClusterStateProvider Cluster at 127.0.0.1:45878/solr ready
   [junit4]   2> 1141606 INFO  (jetty-launcher-2049-thread-1) [n:127.0.0.1:43506_solr    ] o.a.s.c.TransientSolrCoreCacheDefault Allocating transient cache for 2147483647 transient cores
   [junit4]   2> 1141606 INFO  (jetty-launcher-2049-thread-1) [n:127.0.0.1:43506_solr    ] o.a.s.c.ZkController Register node as live in ZooKeeper:/live_nodes/127.0.0.1:43506_solr
   [junit4]   2> 1141618 DEBUG (SyncThread:0) [    ] o.a.s.c.ZkTestServer Watch fired: children: /solr/live_nodes
   [junit4]   2> 1141618 DEBUG (SyncThread:0) [    ] o.a.s.c.ZkTestServer Watch fired: children: /solr/live_nodes
   [junit4]   2> 1141618 DEBUG (SyncThread:0) [    ] o.a.s.c.ZkTestServer Watch fired: children: /solr/live_nodes
   [junit4]   2> 1141619 DEBUG (SyncThread:0) [    ] o.a.s.c.ZkTestServer Watch fired: children: /solr/live_nodes
   [junit4]   2> 1141619 DEBUG (SyncThread:0) [    ] o.a.s.c.ZkTestServer Watch fired: children: /solr/live_nodes
   [junit4]   2> 1141619 DEBUG (SyncThread:0) [    ] o.a.s.c.ZkTestServer Watch fired: children: /solr/live_nodes
   [junit4]   2> 1141619 DEBUG (SyncThread:0) [    ] o.a.s.c.ZkTestServer Watch fired: children: /solr/live_nodes
   [junit4]   2> 1141634 DEBUG (SyncThread:0) [    ] o.a.s.c.ZkTestServer Watch added: children: /solr/live_nodes
   [junit4]   2> 1141634 DEBUG (SyncThread:0) [    ] o.a.s.c.ZkTestServer Watch added: children: /solr/live_nodes
   [junit4]   2> 1141634 DEBUG (SyncThread:0) [    ] o.a.s.c.ZkTestServer Watch added: children: /solr/live_nodes
   [junit4]   2> 1141638 INFO  (zkCallback-2093-thread-1) [    ] o.a.s.c.c.ZkStateReader Updated live nodes from ZooKeeper... (3) -> (4)
   [junit4]   2> 1141639 INFO  (jetty-launcher-2049-thread-3) [n:127.0.0.1:42676_solr    ] o.a.s.h.a.MetricsHistoryHandler No .system collection, keeping metrics history in memory.
   [junit4]   2> 1141642 INFO  (zkCallback-2088-thread-1) [    ] o.a.s.c.c.ZkStateReader Updated live nodes from ZooKeeper... (3) -> (4)
   [junit4]   2> 1141642 INFO  (zkCallback-2065-thread-1) [    ] o.a.s.c.c.ZkStateReader Updated live nodes from ZooKeeper... (3) -> (4)
   [junit4]   2> 1141654 DEBUG (SyncThread:0) [    ] o.a.s.c.ZkTestServer Watch added: children: /solr/live_nodes
   [junit4]   2> 1141655 DEBUG (SyncThread:0) [    ] o.a.s.c.ZkTestServer Watch added: children: /solr/live_nodes
   [junit4]   2> 1141663 INFO  (zkCallback-2095-thread-1) [    ] o.a.s.c.c.ZkStateReader Updated live nodes from ZooKeeper... (3) -> (4)
   [junit4]   2> 1141667 INFO  (zkCallback-2073-thread-2) [    ] o.a.s.c.c.ZkStateReader Updated live nodes from ZooKeeper... (3) -> (4)
   [junit4]   2> 1141671 DEBUG (SyncThread:0) [    ] o.a.s.c.ZkTestServer Watch added: children: /solr/live_nodes
   [junit4]   2> 1141691 DEBUG (SyncThread:0) [    ] o.a.s.c.ZkTestServer Watch added: children: /solr/live_nodes
   [junit4]   2> 1141749 INFO  (jetty-launcher-2049-thread-3) [n:127.0.0.1:42676_solr    ] o.a.s.m.r.SolrJmxReporter JMX monitoring for 'solr_42676.solr.node' (registry 'solr.node') enabled at server: com.sun.jmx.mbeanserver.JmxMBeanServer@29e094d2
   [junit4]   2> 1141772 INFO  (zkCallback-2098-thread-1) [    ] o.a.s.c.c.ZkStateReader Updated live nodes from ZooKeeper... (3) -> (4)
   [junit4]   2> 1141785 INFO  (jetty-launcher-2049-thread-3) [n:127.0.0.1:42676_solr    ] o.a.s.m.r.SolrJmxReporter JMX monitoring for 'solr_42676.solr.jvm' (registry 'solr.jvm') enabled at server: com.sun.jmx.mbeanserver.JmxMBeanServer@29e094d2
   [junit4]   2> 1141785 INFO  (jetty-launcher-2049-thread-3) [n:127.0.0.1:42676_solr    ] o.a.s.m.r.SolrJmxReporter JMX monitoring for 'solr_42676.solr.jetty' (registry 'solr.jetty') enabled at server: com.sun.jmx.mbeanserver.JmxMBeanServer@29e094d2
   [junit4]   2> 1141786 INFO  (jetty-launcher-2049-thread-3) [n:127.0.0.1:42676_solr    ] o.a.s.c.CorePropertiesLocator Found 0 core definitions underneath /home/jenkins/jenkins-slave/workspace/Lucene-Solr-Tests-master/solr/build/solr-core/test/J2/temp/solr.cloud.MoveReplicaTest_6F193DD831F942D6-001/tempDir-001/node3/.
   [junit4]   2> 1141789 INFO  (zkCallback-2108-thread-1) [    ] o.a.s.c.c.ZkStateReader Updated live nodes from ZooKeeper... (3) -> (4)
   [junit4]   2> 1141801 DEBUG (SyncThread:0) [    ] o.a.s.c.ZkTestServer Watch fired: children: /solr/overseer/queue
   [junit4]   2> 1141810 INFO  (zkConnectionManagerCallback-2115-thread-1) [    ] o.a.s.c.c.ConnectionManager zkClient has connected
   [junit4]   2> 1141817 DEBUG (SyncThread:0) [    ] o.a.s.c.ZkTestServer Watch added: children: /solr/overseer/queue
   [junit4]   2> 1141818 DEBUG (SyncThread:0) [    ] o.a.s.c.ZkTestServer Watch added: create/delete: /solr/clusterprops.json
   [junit4]   2> 1141818 DEBUG (SyncThread:0) [    ] o.a.s.c.ZkTestServer Watch added: children: /solr/live_nodes
   [junit4]   2> 1141818 INFO  (jetty-launcher-2049-thread-1) [n:127.0.0.1:43506_solr    ] o.a.s.c.c.ZkStateReader Updated live nodes from ZooKeeper... (0) -> (4)
   [junit4]   2> 1141818 DEBUG (SyncThread:0) [    ] o.a.s.c.ZkTestServer Watch added: data: /solr/clusterstate.json
   [junit4]   2> 1141818 DEBUG (SyncThread:0) [    ] o.a.s.c.ZkTestServer Watch added: children: /solr/collections
   [junit4]   2> 1141819 DEBUG (SyncThread:0) [    ] o.a.s.c.ZkTestServer Watch added: create/delete: /solr/aliases.json
   [junit4]   2> 1141819 INFO  (jetty-launcher-2049-thread-1) [n:127.0.0.1:43506_solr    ] o.a.s.c.s.i.ZkClientClusterStateProvider Cluster at 127.0.0.1:45878/solr ready
   [junit4]   2> 1141838 INFO  (jetty-launcher-2049-thread-1) [n:127.0.0.1:43506_solr    ] o.a.s.h.a.MetricsHistoryHandler No .system collection, keeping metrics history in memory.
   [junit4]   2> 1141909 INFO  (jetty-launcher-2049-thread-1) [n:127.0.0.1:43506_solr    ] o.a.s.m.r.SolrJmxReporter JMX monitoring for 'solr_43506.solr.node' (registry 'solr.node') enabled at server: com.sun.jmx.mbeanserver.JmxMBeanServer@29e094d2
   [junit4]   2> 1142002 INFO  (jetty-launcher-2049-thread-1) [n:127.0.0.1:43506_solr    ] o.a.s.m.r.SolrJmxReporter JMX monitoring for 'solr_43506.solr.jvm' (registry 'solr.jvm') enabled at server: com.sun.jmx.mbeanserver.JmxMBeanServer@29e094d2
   [junit4]   2> 1142002 INFO  (jetty-launcher-2049-thread-1) [n:127.0.0.1:43506_solr    ] o.a.s.m.r.SolrJmxReporter JMX monitoring for 'solr_43506.solr.jetty' (registry 'solr.jetty') enabled at server: com.sun.jmx.mbeanserver.JmxMBeanServer@29e094d2
   [junit4]   2> 1142003 INFO  (jetty-launcher-2049-thread-1) [n:127.0.0.1:43506_solr    ] o.a.s.c.CorePropertiesLocator Found 0 core definitions underneath /home/jenkins/jenkins-slave/workspace/Lucene-Solr-Tests-master/solr/build/solr-core/test/J2/temp/solr.cloud.MoveReplicaTest_6F193DD831F942D6-001/tempDir-001/node1/.
   [junit4]   2> 1142324 INFO  (zkConnectionManagerCallback-2118-thread-1) [    ] o.a.s.c.c.ConnectionManager zkClient has connected
   [junit4]   2> 1142352 INFO  (zkConnectionManagerCallback-2123-thread-1) [    ] o.a.s.c.c.ConnectionManager zkClient has connected
   [junit4]   2> 1142352 DEBUG (SyncThread:0) [    ] o.a.s.c.ZkTestServer Watch added: create/delete: /solr/clusterprops.json
   [junit4]   2> 1142353 DEBUG (SyncThread:0) [    ] o.a.s.c.ZkTestServer Watch added: children: /solr/live_nodes
   [junit4]   2> 1142353 INFO  (SUITE-MoveReplicaTest-seed#[6F193DD831F942D6]-worker) [    ] o.a.s.c.c.ZkStateReader Updated live nodes from ZooKeeper... (0) -> (4)
   [junit4]   2> 1142366 DEBUG (SyncThread:0) [    ] o.a.s.c.ZkTestServer Watch added: data: /solr/clusterstate.json
   [junit4]   2> 1142366 DEBUG (SyncThread:0) [    ] o.a.s.c.ZkTestServer Watch added: children: /solr/collections
   [junit4]   2> 1142367 DEBUG (SyncThread:0) [    ] o.a.s.c.ZkTestServer Watch added: create/delete: /solr/aliases.json
   [junit4]   2> 1142367 INFO  (SUITE-MoveReplicaTest-seed#[6F193DD831F942D6]-worker) [    ] o.a.s.c.s.i.ZkClientClusterStateProvider Cluster at 127.0.0.1:45878/solr ready
   [junit4]   2> 1142419 INFO  (qtp440348179-6126) [n:127.0.0.1:42676_solr    ] o.a.s.h.a.CollectionsHandler Invoked Collection Action :overseerstatus with params action=OVERSEERSTATUS&wt=javabin&version=2 and sendToOCPQueue=true
   [junit4]   2> 1142424 DEBUG (SyncThread:0) [    ] o.a.s.c.ZkTestServer Watch fired: children: /solr/overseer/collection-queue-work
   [junit4]   2> 1142438 DEBUG (SyncThread:0) [    ] o.a.s.c.ZkTestServer Watch added: create/delete: /solr/overseer/collection-queue-work/qnr-0000000000
   [junit4]   2> 1142439 DEBUG (SyncThread:0) [    ] o.a.s.c.ZkTestServer Watch added: children: /solr/overseer/collection-queue-work
   [junit4]   2> 1142439 DEBUG (OverseerCollectionConfigSetProcessor-73592387217326088-127.0.0.1:38373_solr-n_0000000000) [n:127.0.0.1:38373_solr    ] o.a.s.c.ZkDistributedQueue Found child node with improper name: qnr-0000000000
   [junit4]   2> 1142439 DEBUG (OverseerCollectionConfigSetProcessor-73592387217326088-127.0.0.1:38373_solr-n_0000000000) [n:127.0.0.1:38373_solr    ] o.a.s.c.OverseerTaskQueue Returning topN elements: [/overseer/collection-queue-work/qn-0000000000, ]
   [junit4]   2> 1142439 DEBUG (OverseerCollectionConfigSetProcessor-73592387217326088-127.0.0.1:38373_solr-n_0000000000) [n:127.0.0.1:38373_solr    ] o.a.s.c.OverseerTaskProcessor Got 1 tasks from work-queue : [[org.apache.solr.cloud.OverseerTaskQueue$QueueEvent@2e684ecf]]
   [junit4]   2> 1142439 DEBUG (OverseerCollectionConfigSetProcessor-73592387217326088-127.0.0.1:38373_solr-n_0000000000) [n:127.0.0.1:38373_solr    ] o.a.s.c.OverseerTaskProcessor Marked task [/overseer/collection-queue-work/qn-0000000000] as running
   [junit4]   2> 1142439 DEBUG (OverseerCollectionConfigSetProcessor-73592387217326088-127.0.0.1:38373_solr-n_0000000000) [n:127.0.0.1:38373_solr    ] o.a.s.c.OverseerTaskProcessor Overseer Collection Message Handler: Get the message id:/overseer/collection-queue-work/qn-0000000000 message:{"operation":"overseerstatus"}
   [junit4]   2> 1142585 DEBUG (OverseerThreadFactory-2456-thread-1-processing-n:127.0.0.1:38373_solr) [n:127.0.0.1:38373_solr    ] o.a.s.c.OverseerTaskProcessor Runner processing /overseer/collection-queue-work/qn-0000000000
   [junit4]   2> 1142585 DEBUG (OverseerThreadFactory-2456-thread-1-processing-n:127.0.0.1:38373_solr) [n:127.0.0.1:38373_solr    ] o.a.s.c.a.c.OverseerCollectionMessageHandler OverseerCollectionMessageHandler.processMessage : overseerstatus , {"operation":"overseerstatus"}
   [junit4]   2> 1142585 DEBUG (OverseerCollectionConfigSetProcessor-73592387217326088-127.0.0.1:38373_solr-n_0000000000) [n:127.0.0.1:38373_solr    ] o.a.s.c.OverseerTaskProcessor Cleaning up work-queue. #Running tasks: 1
   [junit4]   2> 1142585 DEBUG (OverseerCollectionConfigSetProcessor-73592387217326088-127.0.0.1:38373_solr-n_0000000000) [n:127.0.0.1:38373_solr    ] o.a.s.c.OverseerTaskProcessor RunningTasks: [/overseer/collection-queue-work/qn-0000000000]
   [junit4]   2> 1142585 DEBUG (OverseerCollectionConfigSetProcessor-73592387217326088-127.0.0.1:38373_solr-n_0000000000) [n:127.0.0.1:38373_solr    ] o.a.s.c.OverseerTaskProcessor BlockedTasks: []
   [junit4]   2> 1142585 DEBUG (OverseerCollectionConfigSetProcessor-73592387217326088-127.0.0.1:38373_solr-n_0000000000) [n:127.0.0.1:38373_solr    ] o.a.s.c.OverseerTaskProcessor CompletedTasks: []
   [junit4]   2> 1142585 DEBUG (OverseerCollectionConfigSetProcessor-73592387217326088-127.0.0.1:38373_solr-n_0000000000) [n:127.0.0.1:38373_solr    ] o.a.s.c.OverseerTaskProcessor RunningZKTasks: [/overseer/collection-queue-work/qn-0000000000]
   [junit4]   2> 1142585 DEBUG (OverseerCollectionConfigSetProcessor-73592387217326088-127.0.0.1:38373_solr-n_0000000000) [n:127.0.0.1:38373_solr    ] o.a.s.c.OverseerTaskQueue Peeking for top 99 elements. ExcludeSet: [/overseer/collection-queue-work/qn-0000000000],[]
   [junit4]   2> 1142586 DEBUG (ScheduledTrigger-2453-thread-2) [    ] o.a.s.c.a.NodeLostTrigger Running NodeLostTrigger: .auto_add_replicas with currently live nodes: 4
   [junit4]   2> 1142587 DEBUG (OverseerThreadFactory-2456-thread-1-processing-n:127.0.0.1:38373_solr) [n:127.0.0.1:38373_solr    ] o.a.s.c.OverseerTaskProcessor Completed task:[/overseer/collection-queue-work/qn-0000000000]
   [junit4]   2> 1142614 DEBUG (SyncThread:0) [    ] o.a.s.c.ZkTestServer Watch fired: data: /solr/overseer/collection-queue-work/qnr-0000000000
   [junit4]   2> 1142614 DEBUG (zkCallback-2095-thread-1) [    ] o.a.s.c.OverseerTaskQueue NodeDataChanged fired on path /overseer/collection-queue-work/qnr-0000000000 state SyncConnected latchEventType null
   [junit4]   2> 1142614 DEBUG (SyncThread:0) [    ] o.a.s.c.ZkTestServer Watch fired: children: /solr/overseer/collection-queue-work
   [junit4]   2> 1142615 DEBUG (OverseerThreadFactory-2456-thread-1-processing-n:127.0.0.1:38373_solr) [n:127.0.0.1:38373_solr    ] o.a.s.c.OverseerTaskProcessor Marked task [/overseer/collection-queue-work/qn-0000000000] as completed.
   [junit4]   2> 1142615 DEBUG (OverseerThreadFactory-2456-thread-1-processing-n:127.0.0.1:38373_solr) [n:127.0.0.1:38373_solr    ] o.a.s.c.OverseerTaskProcessor RunningTasks: []
   [junit4]   2> 1142615 DEBUG (OverseerThreadFactory-2456-thread-1-processing-n:127.0.0.1:38373_solr) [n:127.0.0.1:38373_solr    ] o.a.s.c.OverseerTaskProcessor BlockedTasks: []
   [junit4]   2> 1142615 DEBUG (OverseerThreadFactory-2456-thread-1-processing-n:127.0.0.1:38373_solr) [n:127.0.0.1:38373_solr    ] o.a.s.c.OverseerTaskProcessor CompletedTasks: [/overseer/collection-queue-work/qn-0000000000]
   [junit4]   2> 1142615 DEBUG (OverseerThreadFactory-2456-thread-1-processing-n:127.0.0.1:38373_solr) [n:127.0.0.1:38373_solr    ] o.a.s.c.OverseerTaskProcessor RunningZKTasks: [/overseer/collection-queue-work/qn-0000000000]
   [junit4]   2> 1142615 DEBUG (OverseerThreadFactory-2456-thread-1-processing-n:127.0.0.1:38373_solr) [n:127.0.0.1:38373_solr    ] o.a.s.c.OverseerTaskProcessor Overseer Collection Message Handler: Message id:/overseer/collection-queue-work/qn-0000000000 complete, response:{leader=127.0.0.1:38373_solr,overseer_queue_size=0,overseer_work_queue_size=0,overseer_collection_queue_size=2,overseer_operations={am_i_leader={requests=5,errors=0,avgRequestsPerSecond=2.2762687941493063,5minRateRequestsPerSecond=0.0,15minRateRequestsPerSecond=0.0,avgTimePerRequest=9.347607069390424,medianRequestTime=0.270343,75thPcRequestTime=16.798629,95thPcRequestTime=29.048057,99thPcRequestTime=29.048057,999thPcRequestTime=29.048057},downnode={requests=3,errors=0,avgRequestsPerSecond=1.988158992918262,5minRateRequestsPerSecond=0.0,15minRateRequestsPerSecond=0.0,avgTimePerRequest=0.017975,medianRequestTime=0.016669,75thPcRequestTime=0.022118,95thPcRequestTime=0.022118,99thPcRequestTime=0.022118,999thPcRequestTime=0.022118}},collection_operations={am_i_leader={requests=3,errors=0,avgRequestsPerSecond=1.3665039236714127,5minRateRequestsPerSecond=0.0,15minRateRequestsPerSecond=0.0,avgTimePerRequest=5.714942689375881,medianRequestTime=0.376725,75thPcRequestTime=16.718782,95thPcRequestTime=16.718782,99thPcRequestTime=16.718782,999thPcRequestTime=16.718782},overseerstatus={requests=0,errors=0,avgRequestsPerSecond=0.0,5minRateRequestsPerSecond=0.0,15minRateRequestsPerSecond=0.0,avgTimePerRequest=0.0,medianRequestTime=0.0,75thPcRequestTime=0.0,95thPcRequestTime=0.0,99thPcRequestTime=0.0,999thPcRequestTime=0.0}},overseer_queue={},overseer_internal_queue={peek={avgRequestsPerSecond=0.5081703372741774,5minRateRequestsPerSecond=0.0,15minRateRequestsPerSecond=0.0,avgTimePerRequest=20.250687,medianRequestTime=20.250687,75thPcRequestTime=20.250687,95thPcRequestTime=20.250687,99thPcRequestTime=20.250687,999thPcRequestTime=20.250687}},collection_queue={peektopn_wait2000={avgRequestsPerSecond=0.459529380916012,5minRateRequestsPerSecond=0.0,15minRateRequestsPerSecond=0.0,avgTimePerRequest=2028.479398,medianRequestTime=2028.479398,75thPcRequestTime=2028.479398,95thPcRequestTime=2028.479398,99thPcRequestTime=2028.479398,999thPcRequestTime=2028.479398}}}
   [junit4]   2> 1142615 INFO  (qtp440348179-6126) [n:127.0.0.1:42676_solr    ] o.a.s.s.HttpSolrCall [admin] webapp=null path=/admin/collections params={action=OVERSEERSTATUS&wt=javabin&version=2} status=0 QTime=196
   [junit4]   2> 1142616 DEBUG (SyncThread:0) [    ] o.a.s.c.ZkTestServer Watch added: children: /solr/overseer/collection-queue-work
   [junit4]   2> 1143018 INFO  (TEST-MoveReplicaTest.testFailedMove-seed#[6F193DD831F942D6]) [    ] o.a.s.SolrTestCaseJ4 ###Starting testFailedMove
   [junit4]   2> 1143031 DEBUG (SyncThread:0) [    ] o.a.s.c.ZkTestServer Watch added: create/delete: /solr/clusterprops.json
   [junit4]   2> 1143039 DEBUG (SyncThread:0) [    ] o.a.s.c.ZkTestServer Watch added: children: /solr/live_nodes
   [junit4]   2> 1143039 INFO  (TEST-MoveReplicaTest.testFailedMove-seed#[6F193DD831F942D6]) [    ] o.a.s.c.c.ZkStateReader Updated live nodes from ZooKeeper... (0) -> (4)
   [junit4]   2> 1143040 DEBUG (SyncThread:0) [    ] o.a.s.c.ZkTestServer Watch added: data: /solr/clusterstate.json
   [junit4]   2> 1143040 DEBUG (SyncThread:0) [    ] o.a.s.c.ZkTestServer Watch added: children: /solr/collections
   [junit4]   2> 1143040 DEBUG (SyncThread:0) [    ] o.a.s.c.ZkTestServer Watch added: create/delete: /solr/aliases.json
   [junit4]   2> 1143040 DEBUG (SyncThread:0) [    ] o.a.s.c.ZkTestServer Watch fired: data: /solr/aliases.json
   [junit4]   2> 1143041 DEBUG (SyncThread:0) [    ] o.a.s.c.ZkTestServer Watch fired: data: /solr/aliases.json
   [junit4]   2> 1143041 DEBUG (SyncThread:0) [    ] o.a.s.c.ZkTestServer Watch fired: data: /solr/aliases.json
   [junit4]   2> 1143041 DEBUG (SyncThread:0) [    ] o.a.s.c.ZkTestServer Watch fired: data: /solr/aliases.json
   [junit4]   2> 1143041 DEBUG (SyncThread:0) [    ] o.a.s.c.ZkTestServer Watch fired: data: /solr/aliases.json
   [junit4]   2> 1143041 DEBUG (SyncThread:0) [    ] o.a.s.c.ZkTestServer Watch fired: data: /solr/aliases.json
   [junit4]   2> 1143041 DEBUG (SyncThread:0) [    ] o.a.s.c.ZkTestServer Watch fired: data: /solr/aliases.json
   [junit4]   2> 1143041 DEBUG (SyncThread:0) [    ] o.a.s.c.ZkTestServer Watch fired: data: /solr/aliases.json
   [junit4]   2> 1143041 DEBUG (SyncThread:0) [    ] o.a.s.c.ZkTestServer Watch fired: data: /solr/aliases.json
   [junit4]   2> 1143042 INFO  (TEST-MoveReplicaTest.testFailedMove-seed#[6F193DD831F942D6]) [    ] o.e.j.s.Server jetty-9.4.11.v20180605; built: 2018-06-05T18:24:03.829Z; git: d5fc0523cfa96bfebfbda19606cad384d772f04c; jvm 1.8.0_172-b11
   [junit4]   2> 1143042 DEBUG (SyncThread:0) [    ] o.a.s.c.ZkTestServer Watch added: data: /solr/aliases.json
   [junit4]   2> 1143047 DEBUG (SyncThread:0) [    ] o.a.s.c.ZkTestServer Watch added: data: /solr/aliases.json
   [junit4]   2> 1143048 DEBUG (SyncThread:0) [    ] o.a.s.c.ZkTestServer Watch added: data: /solr/aliases.json
   [junit4]   2> 1143048 DEBUG (SyncThread:0) [    ] o.a.s.c.ZkTestServer Watch added: data: /solr/aliases.json
   [junit4]   2> 1143076 DEBUG (SyncThread:0) [    ] o.a.s.c.ZkTestServer Watch added: data: /solr/aliases.json
   [junit4]   2> 1143076 DEBUG (SyncThread:0) [    ] o.a.s.c.ZkTestServer Watch added: data: /solr/aliases.json
   [junit4]   2> 1143076 DEBUG (SyncThread:0) [    ] o.a.s.c.ZkTestServer Watch added: data: /solr/aliases.json
   [junit4]   2> 1143096 DEBUG (SyncThread:0) [    ] o.a.s.c.ZkTestServer Watch added: data: /solr/aliases.json
   [junit4]   2> 1143104 DEBUG (SyncThread:0) [    ] o.a.s.c.ZkTestServer Watch added: data: /solr/aliases.json
   [junit4]   2> 1143110 INFO  (TEST-MoveReplicaTest.testFailedMove-seed#[6F193DD831F942D6]) [    ] o.e.j.s.session DefaultSessionIdManager workerName=node0
   [junit4]   2> 1143110 INFO  (TEST-MoveReplicaTest.testFailedMove-seed#[6F193DD831F942D6]) [    ] o.e.j.s.session No SessionScavenger set, using defaults
   [junit4]   2> 1143110 INFO  (TEST-MoveReplicaTest.testFailedMove-seed#[6F193DD831F942D6]) [    ] o.e.j.s.session node0 Scavenging every 600000ms
   [junit4]   2> 1143111 INFO  (TEST-MoveReplicaTest.testFailedMove-seed#[6F193DD831F942D6]) [    ] o.e.j.s.h.ContextHandler Started o.e.j.s.ServletContextHandler@727510c8{/solr,null,AVAILABLE}
   [junit4]   2> 1143111 INFO  (TEST-MoveReplicaTest.testFailedMove-seed#[6F193DD831F942D6]) [    ] o.e.j.s.AbstractConnector Started ServerConnector@3dcb4315{HTTP/1.1,[http/1.1]}{127.0.0.1:33572}
   [junit4]   2> 1143111 INFO  (TEST-MoveReplicaTest.testFailedMove-seed#[6F193DD831F942D6]) [    ] o.e.j.s.Server Started @1143155ms
   [junit4]   2> 1143111 INFO  (TEST-MoveReplicaTest.testFailedMove-seed#[6F193DD831F942D6]) [    ] o.a.s.c.s.e.JettySolrRunner Jetty properties: {hostContext=/solr, hostPort=33572}
   [junit4]   2> 1143112 ERROR (TEST-MoveReplicaTest.testFailedMove-seed#[6F193DD831F942D6]) [    ] o.a.s.u.StartupLoggingUtils Missing Java Option solr.log.dir. Logging may be missing or incomplete.
   [junit4]   2> 1143153 DEBUG (SyncThread:0) [    ] o.a.s.c.ZkTestServer Watch added: data: /solr/aliases.json
   [junit4]   2> 1143154 INFO  (TEST-MoveReplicaTest.testFailedMove-seed#[6F193DD831F942D6]) [    ] o.a.s.s.SolrDispatchFilter Using logger factory org.apache.logging.slf4j.Log4jLoggerFactory
   [junit4]   2> 1143154 INFO  (TEST-MoveReplicaTest.testFailedMove-seed#[6F193DD831F942D6]) [    ] o.a.s.s.SolrDispatchFilter  ___      _       Welcome to Apache Solr™ version 8.0.0
   [junit4]   2> 1143154 INFO  (TEST-MoveReplicaTest.testFailedMove-seed#[6F193DD831F942D6]) [    ] o.a.s.s.SolrDispatchFilter / __| ___| |_ _   Starting in cloud mode on port null
   [junit4]   2> 1143154 INFO  (TEST-MoveReplicaTest.testFailedMove-seed#[6F193DD831F942D6]) [    ] o.a.s.s.SolrDispatchFilter \__ \/ _ \ | '_|  Install dir: null
   [junit4]   2> 1143154 INFO  (TEST-MoveReplicaTest.testFailedMove-seed#[6F193DD831F942D6]) [    ] o.a.s.s.SolrDispatchFilter |___/\___/_|_|    Start time: 2018-11-01T14:14:49.523Z
   [junit4]   2> 1143177 INFO  (zkConnectionManagerCallback-2127-thread-1) [    ] o.a.s.c.c.ConnectionManager zkClient has connected
   [junit4]   2> 1143182 INFO  (TEST-MoveReplicaTest.testFailedMove-seed#[6F193DD831F942D6]) [    ] o.a.s.s.SolrDispatchFilter solr.xml found in ZooKeeper. Loading...
   [junit4]   2> 1143587 DEBUG (ScheduledTrigger-2453-thread-1) [    ] o.a.s.c.a.NodeLostTrigger Running NodeLostTrigger: .auto_add_replicas with currently live nodes: 4
   [junit4]   2> 1144417 INFO  (TEST-MoveReplicaTest.testFailedMove-seed#[6F193DD831F942D6]) [    ] o.a.s.c.ZkContainer Zookeeper client=127.0.0.1:45878/solr
   [junit4]   2> 1144452 INFO  (zkConnectionManagerCallback-2131-thread-1) [    ] o.a.s.c.c.ConnectionManager zkClient has connected
   [junit4]   2> 1144469 DEBUG (TEST-MoveReplicaTest.testFailedMove-seed#[6F193DD831F942D6]) [n:127.0.0.1:33572_solr    ] o.a.s.c.ZkController Added new OnReconnect listener org.apache.solr.cloud.ZkController$$Lambda$526/1209621938@78f52786
   [junit4]   2> 1144505 INFO  (zkConnectionManagerCallback-2133-thread-1) [    ] o.a.s.c.c.ConnectionManager zkClient has connected
   [junit4]   2> 1144550 DEBUG (SyncThread:0) [    ] o.a.s.c.ZkTestServer Watch added: create/delete: /solr/clusterprops.json
   [junit4]   2> 1144550 DEBUG (SyncThread:0) [    ] o.a.s.c.ZkTestServer Watch added: children: /solr/live_nodes
   [junit4]   2> 1144551 INFO  (TEST-MoveReplicaTest.testFailedMove-seed#[6F193DD831F942D6]) [n:127.0.0.1:33572_solr    ] o.a.s.c.c.ZkStateReader Updated live nodes from ZooKeeper... (0) -> (4)
   [junit4]   2> 1144551 DEBUG (SyncThread:0) [    ] o.a.s.c.ZkTestServer Watch added: data: /solr/clusterstate.json
   [junit4]   2> 1144551 DEBUG (SyncThread:0) [    ] o.a.s.c.ZkTestServer Watch added: children: /solr/collections
   [junit4]   2> 1144551 DEBUG (SyncThread:0) [    ] o.a.s.c.ZkTestServer Watch added: create/delete: /solr/aliases.json
   [junit4]   2> 1144552 DEBUG (SyncThread:0) [    ] o.a.s.c.ZkTestServer Watch added: create/delete: /solr/security.json
   [junit4]   2> 1144553 DEBUG (TEST-MoveReplicaTest.testFailedMove-seed#[6F193DD831F942D6]) [n:127.0.0.1:33572_solr    ] o.a.s.c.LeaderElector Joined leadership election with path: /overseer_elect/election/73592387217326101-127.0.0.1:33572_solr-n_0000000004
   [junit4]   2> 1144553 DEBUG (SyncThread:0) [    ] o.a.s.c.ZkTestServer Watch added: data: /solr/overseer_elect/election/73592387217326094-127.0.0.1:43506_solr-n_0000000003
   [junit4]   2> 1144553 DEBUG (TEST-MoveReplicaTest.testFailedMove-seed#[6F193DD831F942D6]) [n:127.0.0.1:33572_solr    ] o.a.s.c.LeaderElector Watching path /overseer_elect/election/73592387217326094-127.0.0.1:43506_solr-n_0000000003 to know if I could be the leader
   [junit4]   2> 1144553 DEBUG (TEST-MoveReplicaTest.testFailedMove-seed#[6F193DD831F942D6]) [n:127.0.0.1:33572_solr    ] o.a.s.c.ZkController Publish node=127.0.0.1:33572_solr as DOWN
   [junit4]   2> 1144594 DEBUG (ScheduledTrigger-2453-thread-1) [    ] o.a.s.c.a.NodeLostTrigger Running NodeLostTrigger: .auto_add_replicas with currently live nodes: 4
   [junit4]   2> 1144598 DEBUG (OverseerCollectionConfigSetProcessor-73592387217326088-127.0.0.1:38373_solr-n_0000000000) [n:127.0.0.1:38373_solr    ] o.a.s.c.OverseerTaskProcessor Got 0 tasks from work-queue : [[]]
   [junit4]   2> 1144607 DEBUG (SyncThread:0) [    ] o.a.s.c.ZkTestServer Watch fired: children: /solr/overseer/queue
   [junit4]   2> 1144607 INFO  (TEST-MoveReplicaTest.testFailedMove-seed#[6F193DD831F942D6]) [n:127.0.0.1:33572_solr    ] o.a.s.c.TransientSolrCoreCacheDefault Allocating transient cache for 2147483647 transient cores
   [junit4]   2> 1144607 INFO  (TEST-MoveReplicaTest.testFailedMove-seed#[6F193DD831F942D6]) [n:127.0.0.1:33572_solr    ] o.a.s.c.ZkController Register node as live in ZooKeeper:/live_nodes/127.0.0.1:33572_solr
   [junit4]   2> 1144607 DEBUG (SyncThread:0) [    ] o.a.s.c.ZkTestServer Watch fired: childr

[...truncated too long message...]



-ivy-fail-disallowed-ivy-version:

ivy-fail:

ivy-fail:

ivy-configure:
[ivy:configure] :: loading settings :: file = /home/jenkins/jenkins-slave/workspace/Lucene-Solr-Tests-master/lucene/top-level-ivy-settings.xml

resolve:

ivy-availability-check:
[loadresource] Do not set property disallowed.ivy.jars.list as its length is 0.

-ivy-fail-disallowed-ivy-version:

ivy-fail:

ivy-configure:
[ivy:configure] :: loading settings :: file = /home/jenkins/jenkins-slave/workspace/Lucene-Solr-Tests-master/lucene/top-level-ivy-settings.xml

resolve:

ivy-availability-check:
[loadresource] Do not set property disallowed.ivy.jars.list as its length is 0.

-ivy-fail-disallowed-ivy-version:

ivy-fail:

ivy-fail:

ivy-configure:
[ivy:configure] :: loading settings :: file = /home/jenkins/jenkins-slave/workspace/Lucene-Solr-Tests-master/lucene/top-level-ivy-settings.xml

resolve:

ivy-availability-check:
[loadresource] Do not set property disallowed.ivy.jars.list as its length is 0.

-ivy-fail-disallowed-ivy-version:

ivy-fail:

ivy-configure:
[ivy:configure] :: loading settings :: file = /home/jenkins/jenkins-slave/workspace/Lucene-Solr-Tests-master/lucene/top-level-ivy-settings.xml

resolve:

ivy-availability-check:
[loadresource] Do not set property disallowed.ivy.jars.list as its length is 0.

-ivy-fail-disallowed-ivy-version:

ivy-fail:

ivy-fail:

ivy-configure:
[ivy:configure] :: loading settings :: file = /home/jenkins/jenkins-slave/workspace/Lucene-Solr-Tests-master/lucene/top-level-ivy-settings.xml

resolve:

ivy-availability-check:
[loadresource] Do not set property disallowed.ivy.jars.list as its length is 0.

-ivy-fail-disallowed-ivy-version:

ivy-fail:

ivy-fail:

ivy-configure:
[ivy:configure] :: loading settings :: file = /home/jenkins/jenkins-slave/workspace/Lucene-Solr-Tests-master/lucene/top-level-ivy-settings.xml

resolve:

ivy-availability-check:
[loadresource] Do not set property disallowed.ivy.jars.list as its length is 0.

-ivy-fail-disallowed-ivy-version:

ivy-fail:

ivy-fail:

ivy-configure:
[ivy:configure] :: loading settings :: file = /home/jenkins/jenkins-slave/workspace/Lucene-Solr-Tests-master/lucene/top-level-ivy-settings.xml

resolve:

ivy-availability-check:
[loadresource] Do not set property disallowed.ivy.jars.list as its length is 0.

-ivy-fail-disallowed-ivy-version:

ivy-fail:

ivy-fail:

ivy-configure:
[ivy:configure] :: loading settings :: file = /home/jenkins/jenkins-slave/workspace/Lucene-Solr-Tests-master/lucene/top-level-ivy-settings.xml

resolve:

ivy-availability-check:
[loadresource] Do not set property disallowed.ivy.jars.list as its length is 0.

-ivy-fail-disallowed-ivy-version:

ivy-fail:

ivy-fail:

ivy-configure:
[ivy:configure] :: loading settings :: file = /home/jenkins/jenkins-slave/workspace/Lucene-Solr-Tests-master/lucene/top-level-ivy-settings.xml

resolve:

ivy-availability-check:
[loadresource] Do not set property disallowed.ivy.jars.list as its length is 0.

-ivy-fail-disallowed-ivy-version:

ivy-fail:

ivy-fail:

ivy-configure:
[ivy:configure] :: loading settings :: file = /home/jenkins/jenkins-slave/workspace/Lucene-Solr-Tests-master/lucene/top-level-ivy-settings.xml

resolve:

ivy-availability-check:
[loadresource] Do not set property disallowed.ivy.jars.list as its length is 0.

-ivy-fail-disallowed-ivy-version:

ivy-fail:

ivy-fail:

ivy-configure:
[ivy:configure] :: loading settings :: file = /home/jenkins/jenkins-slave/workspace/Lucene-Solr-Tests-master/lucene/top-level-ivy-settings.xml

resolve:

ivy-availability-check:
[loadresource] Do not set property disallowed.ivy.jars.list as its length is 0.

-ivy-fail-disallowed-ivy-version:

ivy-fail:

ivy-fail:

ivy-configure:
[ivy:configure] :: loading settings :: file = /home/jenkins/jenkins-slave/workspace/Lucene-Solr-Tests-master/lucene/top-level-ivy-settings.xml

resolve:

ivy-availability-check:
[loadresource] Do not set property disallowed.ivy.jars.list as its length is 0.

-ivy-fail-disallowed-ivy-version:

ivy-fail:

ivy-fail:

ivy-configure:
[ivy:configure] :: loading settings :: file = /home/jenkins/jenkins-slave/workspace/Lucene-Solr-Tests-master/lucene/top-level-ivy-settings.xml

resolve:

ivy-availability-check:
[loadresource] Do not set property disallowed.ivy.jars.list as its length is 0.

-ivy-fail-disallowed-ivy-version:

ivy-fail:

ivy-fail:

ivy-configure:
[ivy:configure] :: loading settings :: file = /home/jenkins/jenkins-slave/workspace/Lucene-Solr-Tests-master/lucene/top-level-ivy-settings.xml

resolve:

jar-checksums:
    [mkdir] Created dir: /home/jenkins/jenkins-slave/workspace/Lucene-Solr-Tests-master/solr/null567635830
     [copy] Copying 240 files to /home/jenkins/jenkins-slave/workspace/Lucene-Solr-Tests-master/solr/null567635830
   [delete] Deleting directory /home/jenkins/jenkins-slave/workspace/Lucene-Solr-Tests-master/solr/null567635830

check-working-copy:
[ivy:cachepath] :: resolving dependencies :: org.eclipse.jgit#org.eclipse.jgit-caller;working
[ivy:cachepath] 	confs: [default]
[ivy:cachepath] 	found org.eclipse.jgit#org.eclipse.jgit;4.6.0.201612231935-r in public
[ivy:cachepath] 	found com.jcraft#jsch;0.1.53 in public
[ivy:cachepath] 	found com.googlecode.javaewah#JavaEWAH;1.1.6 in public
[ivy:cachepath] 	found org.apache.httpcomponents#httpclient;4.3.6 in public
[ivy:cachepath] 	found org.apache.httpcomponents#httpcore;4.3.3 in public
[ivy:cachepath] 	found commons-logging#commons-logging;1.1.3 in public
[ivy:cachepath] 	found commons-codec#commons-codec;1.6 in public
[ivy:cachepath] 	found org.slf4j#slf4j-api;1.7.2 in public
[ivy:cachepath] :: resolution report :: resolve 62ms :: artifacts dl 1ms
	---------------------------------------------------------------------
	|                  |            modules            ||   artifacts   |
	|       conf       | number| search|dwnlded|evicted|| number|dwnlded|
	---------------------------------------------------------------------
	|      default     |   8   |   0   |   0   |   0   ||   8   |   0   |
	---------------------------------------------------------------------
[wc-checker] Initializing working copy...
[wc-checker] SLF4J: Failed to load class "org.slf4j.impl.StaticLoggerBinder".
[wc-checker] SLF4J: Defaulting to no-operation (NOP) logger implementation
[wc-checker] SLF4J: See http://www.slf4j.org/codes.html#StaticLoggerBinder for further details.
[wc-checker] Checking working copy status...

-jenkins-base:

BUILD SUCCESSFUL
Total time: 201 minutes 52 seconds
Archiving artifacts
java.lang.InterruptedException: no matches found within 10000
	at hudson.FilePath$34.hasMatch(FilePath.java:2678)
	at hudson.FilePath$34.invoke(FilePath.java:2557)
	at hudson.FilePath$34.invoke(FilePath.java:2547)
	at hudson.FilePath$FileCallableWrapper.call(FilePath.java:2918)
Also:   hudson.remoting.Channel$CallSiteStackTrace: Remote call to lucene2
		at hudson.remoting.Channel.attachCallSiteStackTrace(Channel.java:1741)
		at hudson.remoting.UserRequest$ExceptionResponse.retrieve(UserRequest.java:357)
		at hudson.remoting.Channel.call(Channel.java:955)
		at hudson.FilePath.act(FilePath.java:1036)
		at hudson.FilePath.act(FilePath.java:1025)
		at hudson.FilePath.validateAntFileMask(FilePath.java:2547)
		at hudson.tasks.ArtifactArchiver.perform(ArtifactArchiver.java:243)
		at hudson.tasks.BuildStepCompatibilityLayer.perform(BuildStepCompatibilityLayer.java:81)
		at hudson.tasks.BuildStepMonitor$1.perform(BuildStepMonitor.java:20)
		at hudson.model.AbstractBuild$AbstractBuildExecution.perform(AbstractBuild.java:744)
		at hudson.model.AbstractBuild$AbstractBuildExecution.performAllBuildSteps(AbstractBuild.java:690)
		at hudson.model.Build$BuildExecution.post2(Build.java:186)
		at hudson.model.AbstractBuild$AbstractBuildExecution.post(AbstractBuild.java:635)
		at hudson.model.Run.execute(Run.java:1819)
		at hudson.model.FreeStyleBuild.run(FreeStyleBuild.java:43)
		at hudson.model.ResourceController.execute(ResourceController.java:97)
		at hudson.model.Executor.run(Executor.java:429)
Caused: hudson.FilePath$TunneledInterruptedException
	at hudson.FilePath$FileCallableWrapper.call(FilePath.java:2920)
	at hudson.remoting.UserRequest.perform(UserRequest.java:212)
	at hudson.remoting.UserRequest.perform(UserRequest.java:54)
	at hudson.remoting.Request$2.run(Request.java:369)
	at hudson.remoting.InterceptingExecutorService$1.call(InterceptingExecutorService.java:72)
	at java.util.concurrent.FutureTask.run(FutureTask.java:266)
	at java.util.concurrent.ThreadPoolExecutor.runWorker(ThreadPoolExecutor.java:1142)
	at java.util.concurrent.ThreadPoolExecutor$Worker.run(ThreadPoolExecutor.java:617)
	at java.lang.Thread.run(Thread.java:748)
Caused: java.lang.InterruptedException: java.lang.InterruptedException: no matches found within 10000
	at hudson.FilePath.act(FilePath.java:1038)
	at hudson.FilePath.act(FilePath.java:1025)
	at hudson.FilePath.validateAntFileMask(FilePath.java:2547)
	at hudson.tasks.ArtifactArchiver.perform(ArtifactArchiver.java:243)
	at hudson.tasks.BuildStepCompatibilityLayer.perform(BuildStepCompatibilityLayer.java:81)
	at hudson.tasks.BuildStepMonitor$1.perform(BuildStepMonitor.java:20)
	at hudson.model.AbstractBuild$AbstractBuildExecution.perform(AbstractBuild.java:744)
	at hudson.model.AbstractBuild$AbstractBuildExecution.performAllBuildSteps(AbstractBuild.java:690)
	at hudson.model.Build$BuildExecution.post2(Build.java:186)
	at hudson.model.AbstractBuild$AbstractBuildExecution.post(AbstractBuild.java:635)
	at hudson.model.Run.execute(Run.java:1819)
	at hudson.model.FreeStyleBuild.run(FreeStyleBuild.java:43)
	at hudson.model.ResourceController.execute(ResourceController.java:97)
	at hudson.model.Executor.run(Executor.java:429)
No artifacts found that match the file pattern "**/*.events,heapdumps/**,**/hs_err_pid*". Configuration error?
Recording test results
Build step 'Publish JUnit test result report' changed build result to UNSTABLE
Email was triggered for: Unstable (Test Failures)
Sending email for trigger: Unstable (Test Failures)

Mime
View raw message