lucene-dev mailing list archives

Site index · List index
Message view « Date » · « Thread »
Top « Date » · « Thread »
From Policeman Jenkins Server <jenk...@thetaphi.de>
Subject [JENKINS] Lucene-Solr-7.x-Windows (32bit/jdk1.8.0_172) - Build # 945 - Unstable!
Date Mon, 07 Jan 2019 12:30:08 GMT
Build: https://jenkins.thetaphi.de/job/Lucene-Solr-7.x-Windows/945/
Java: 32bit/jdk1.8.0_172 -client -XX:+UseConcMarkSweepGC

1 tests failed.
FAILED:  org.apache.solr.client.solrj.io.stream.StreamDecoratorTest.testClassifyStream

Error Message:
expected:<0.0> but was:<0.9998245650830389>

Stack Trace:
java.lang.AssertionError: expected:<0.0> but was:<0.9998245650830389>
	at __randomizedtesting.SeedInfo.seed([3BA709A3BE29CA1B:9EEF939B8771D38F]:0)
	at org.junit.Assert.fail(Assert.java:88)
	at org.junit.Assert.failNotEquals(Assert.java:834)
	at org.junit.Assert.assertEquals(Assert.java:553)
	at org.junit.Assert.assertEquals(Assert.java:683)
	at org.apache.solr.client.solrj.io.stream.StreamDecoratorTest.testClassifyStream(StreamDecoratorTest.java:3406)
	at sun.reflect.NativeMethodAccessorImpl.invoke0(Native Method)
	at sun.reflect.NativeMethodAccessorImpl.invoke(NativeMethodAccessorImpl.java:62)
	at sun.reflect.DelegatingMethodAccessorImpl.invoke(DelegatingMethodAccessorImpl.java:43)
	at java.lang.reflect.Method.invoke(Method.java:498)
	at com.carrotsearch.randomizedtesting.RandomizedRunner.invoke(RandomizedRunner.java:1750)
	at com.carrotsearch.randomizedtesting.RandomizedRunner$8.evaluate(RandomizedRunner.java:938)
	at com.carrotsearch.randomizedtesting.RandomizedRunner$9.evaluate(RandomizedRunner.java:974)
	at com.carrotsearch.randomizedtesting.RandomizedRunner$10.evaluate(RandomizedRunner.java:988)
	at com.carrotsearch.randomizedtesting.rules.SystemPropertiesRestoreRule$1.evaluate(SystemPropertiesRestoreRule.java:57)
	at org.apache.lucene.util.TestRuleSetupTeardownChained$1.evaluate(TestRuleSetupTeardownChained.java:49)
	at org.apache.lucene.util.AbstractBeforeAfterRule$1.evaluate(AbstractBeforeAfterRule.java:45)
	at org.apache.lucene.util.TestRuleThreadAndTestName$1.evaluate(TestRuleThreadAndTestName.java:48)
	at org.apache.lucene.util.TestRuleIgnoreAfterMaxFailures$1.evaluate(TestRuleIgnoreAfterMaxFailures.java:64)
	at org.apache.lucene.util.TestRuleMarkFailure$1.evaluate(TestRuleMarkFailure.java:47)
	at com.carrotsearch.randomizedtesting.rules.StatementAdapter.evaluate(StatementAdapter.java:36)
	at com.carrotsearch.randomizedtesting.ThreadLeakControl$StatementRunner.run(ThreadLeakControl.java:368)
	at com.carrotsearch.randomizedtesting.ThreadLeakControl.forkTimeoutingTask(ThreadLeakControl.java:817)
	at com.carrotsearch.randomizedtesting.ThreadLeakControl$3.evaluate(ThreadLeakControl.java:468)
	at com.carrotsearch.randomizedtesting.RandomizedRunner.runSingleTest(RandomizedRunner.java:947)
	at com.carrotsearch.randomizedtesting.RandomizedRunner$5.evaluate(RandomizedRunner.java:832)
	at com.carrotsearch.randomizedtesting.RandomizedRunner$6.evaluate(RandomizedRunner.java:883)
	at com.carrotsearch.randomizedtesting.RandomizedRunner$7.evaluate(RandomizedRunner.java:894)
	at com.carrotsearch.randomizedtesting.rules.StatementAdapter.evaluate(StatementAdapter.java:36)
	at com.carrotsearch.randomizedtesting.rules.SystemPropertiesRestoreRule$1.evaluate(SystemPropertiesRestoreRule.java:57)
	at org.apache.lucene.util.AbstractBeforeAfterRule$1.evaluate(AbstractBeforeAfterRule.java:45)
	at com.carrotsearch.randomizedtesting.rules.StatementAdapter.evaluate(StatementAdapter.java:36)
	at org.apache.lucene.util.TestRuleStoreClassName$1.evaluate(TestRuleStoreClassName.java:41)
	at com.carrotsearch.randomizedtesting.rules.NoShadowingOrOverridesOnMethodsRule$1.evaluate(NoShadowingOrOverridesOnMethodsRule.java:40)
	at com.carrotsearch.randomizedtesting.rules.NoShadowingOrOverridesOnMethodsRule$1.evaluate(NoShadowingOrOverridesOnMethodsRule.java:40)
	at com.carrotsearch.randomizedtesting.rules.StatementAdapter.evaluate(StatementAdapter.java:36)
	at com.carrotsearch.randomizedtesting.rules.StatementAdapter.evaluate(StatementAdapter.java:36)
	at com.carrotsearch.randomizedtesting.rules.StatementAdapter.evaluate(StatementAdapter.java:36)
	at org.apache.lucene.util.TestRuleAssertionsRequired$1.evaluate(TestRuleAssertionsRequired.java:53)
	at org.apache.lucene.util.TestRuleMarkFailure$1.evaluate(TestRuleMarkFailure.java:47)
	at org.apache.lucene.util.TestRuleIgnoreAfterMaxFailures$1.evaluate(TestRuleIgnoreAfterMaxFailures.java:64)
	at org.apache.lucene.util.TestRuleIgnoreTestSuites$1.evaluate(TestRuleIgnoreTestSuites.java:54)
	at com.carrotsearch.randomizedtesting.rules.StatementAdapter.evaluate(StatementAdapter.java:36)
	at com.carrotsearch.randomizedtesting.ThreadLeakControl$StatementRunner.run(ThreadLeakControl.java:368)
	at java.lang.Thread.run(Thread.java:748)




Build Log:
[...truncated 16554 lines...]
   [junit4] Suite: org.apache.solr.client.solrj.io.stream.StreamDecoratorTest
   [junit4]   2> Creating dataDir: C:\Users\jenkins\workspace\Lucene-Solr-7.x-Windows\solr\build\solr-solrj\test\J0\temp\solr.client.solrj.io.stream.StreamDecoratorTest_3BA709A3BE29CA1B-001\init-core-data-001
   [junit4]   1> 11:51:14.201 [jetty-launcher-2497-thread-3] ERROR org.apache.solr.util.StartupLoggingUtils
- Missing Java Option solr.log.dir. Logging may be missing or incomplete.
   [junit4]   1> 11:51:14.202 [jetty-launcher-2497-thread-2] ERROR org.apache.solr.util.StartupLoggingUtils
- Missing Java Option solr.log.dir. Logging may be missing or incomplete.
   [junit4]   1> 11:51:14.298 [jetty-launcher-2497-thread-1] ERROR org.apache.solr.util.StartupLoggingUtils
- Missing Java Option solr.log.dir. Logging may be missing or incomplete.
   [junit4]   1> 11:51:14.300 [jetty-launcher-2497-thread-4] ERROR org.apache.solr.util.StartupLoggingUtils
- Missing Java Option solr.log.dir. Logging may be missing or incomplete.
   [junit4]   2> NOTE: reproduce with: ant test  -Dtestcase=StreamDecoratorTest -Dtests.method=testClassifyStream
-Dtests.seed=3BA709A3BE29CA1B -Dtests.slow=true -Dtests.locale=lv -Dtests.timezone=America/Puerto_Rico
-Dtests.asserts=true -Dtests.file.encoding=ISO-8859-1
   [junit4] FAILURE 11.3s J0 | StreamDecoratorTest.testClassifyStream <<<
   [junit4]    > Throwable #1: java.lang.AssertionError: expected:<0.0> but was:<0.9998245650830389>
   [junit4]    > 	at __randomizedtesting.SeedInfo.seed([3BA709A3BE29CA1B:9EEF939B8771D38F]:0)
   [junit4]    > 	at org.apache.solr.client.solrj.io.stream.StreamDecoratorTest.testClassifyStream(StreamDecoratorTest.java:3406)
   [junit4]    > 	at java.lang.Thread.run(Thread.java:748)
   [junit4] IGNOR/A 0.00s J0 | StreamDecoratorTest.testParallelExecutorStream
   [junit4]    > Assumption #1: 'badapple' test group is disabled (@BadApple(bugUrl=https://issues.apache.org/jira/browse/SOLR-12028))
   [junit4] IGNOR/A 0.00s J0 | StreamDecoratorTest.testParallelCommitStream
   [junit4]    > Assumption #1: 'badapple' test group is disabled (@BadApple(bugUrl=https://issues.apache.org/jira/browse/SOLR-12028))
   [junit4]   2> NOTE: leaving temporary files on disk at: C:\Users\jenkins\workspace\Lucene-Solr-7.x-Windows\solr\build\solr-solrj\test\J0\temp\solr.client.solrj.io.stream.StreamDecoratorTest_3BA709A3BE29CA1B-001
   [junit4]   2> NOTE: test params are: codec=Asserting(Lucene70): {expr_s=PostingsFormat(name=LuceneVarGapFixedInterval),
name_s=PostingsFormat(name=Memory), terms_ss=Lucene50(blocksize=128), field_s=FSTOrd50, join2_s=Lucene50(blocksize=128),
multiDefault=Lucene50(blocksize=128), subject=Lucene50(blocksize=128), a1_s=FSTOrd50, a2_s=PostingsFormat(name=LuceneVarGapFixedInterval),
body_t=PostingsFormat(name=Memory), s_multi=PostingsFormat(name=LuceneVarGapFixedInterval),
a_ss=Lucene50(blocksize=128), a_s=PostingsFormat(name=LuceneVarGapFixedInterval), tv_text=FSTOrd50,
text_s=PostingsFormat(name=LuceneVarGapFixedInterval), id=PostingsFormat(name=Memory), text=PostingsFormat(name=LuceneVarGapFixedInterval),
bbid_s=PostingsFormat(name=Memory), type_s=FSTOrd50, checkpoint_ss=PostingsFormat(name=Memory),
test_t=PostingsFormat(name=Memory), ident_s=FSTOrd50, extra_s=Lucene50(blocksize=128), ykey_s=FSTOrd50,
side_s=PostingsFormat(name=Memory)}, docValues:{expr_s=DocValuesFormat(name=Direct), name_s=DocValuesFormat(name=Memory),
iteration_i=DocValuesFormat(name=Memory), terms_ss=DocValuesFormat(name=Lucene70), field_s=DocValuesFormat(name=Asserting),
join2_s=DocValuesFormat(name=Lucene70), multiDefault=DocValuesFormat(name=Lucene70), a1_s=DocValuesFormat(name=Asserting),
a_f=DocValuesFormat(name=Asserting), intDefault=DocValuesFormat(name=Asserting), falseNegative_i=DocValuesFormat(name=Asserting),
join1_i=DocValuesFormat(name=Direct), a2_s=DocValuesFormat(name=Direct), a_i=DocValuesFormat(name=Memory),
join3_i=DocValuesFormat(name=Memory), test_i=DocValuesFormat(name=Lucene70), falsePositive_i=DocValuesFormat(name=Asserting),
field_i=DocValuesFormat(name=Lucene70), s_multi=DocValuesFormat(name=Direct), a_ss=DocValuesFormat(name=Lucene70),
a_s=DocValuesFormat(name=Direct), text_s=DocValuesFormat(name=Direct), id=DocValuesFormat(name=Memory),
bbid_s=DocValuesFormat(name=Memory), timestamp=DocValuesFormat(name=Lucene70), type_s=DocValuesFormat(name=Asserting),
i_multi=DocValuesFormat(name=Memory), trueNegative_i=DocValuesFormat(name=Direct), b_ls=DocValuesFormat(name=Asserting),
out_i=DocValuesFormat(name=Asserting), checkpoint_ss=DocValuesFormat(name=Memory), ident_s=DocValuesFormat(name=Asserting),
_version_=DocValuesFormat(name=Asserting), extra_s=DocValuesFormat(name=Lucene70), ykey_s=DocValuesFormat(name=Asserting),
truePositive_i=DocValuesFormat(name=Direct), side_s=DocValuesFormat(name=Memory)}, maxPointsInLeafNode=1482,
maxMBSortInHeap=7.80030558311947, sim=RandomSimilarity(queryNorm=true): {}, locale=lv, timezone=America/Puerto_Rico
   [junit4]   2> NOTE: Windows 10 10.0 x86/Oracle Corporation 1.8.0_172 (32-bit)/cpus=3,threads=1,free=158938368,total=308961280
   [junit4]   2> NOTE: All tests run in this JVM: [CosineEvaluatorTest, SineEvaluatorTest,
UuidEvaluatorTest, CumulativeProbabilityEvaluatorTest, TestDelegationTokenResponse, TestLang,
ArcSineEvaluatorTest, CommonAdminParamsTest, AppendEvaluatorTest, MathExpressionTest, JsonValidatorTest,
SolrExampleXMLTest, SubtractEvaluatorTest, TestFastInputStream, TestSolrProperties, SolrExampleStreamingTest,
HttpSolrClientBuilderTest, JsonQueryRequestUnitTest, JdbcTest, SolrExampleJettyTest, StreamExpressionToExpessionTest,
ReverseEvaluatorTest, GreaterThanEvaluatorTest, FacetFieldTest, LBHttpSolrClientBuilderTest,
GraphTest, TestSuggesterResponse, TestCollectionAdminRequest, TestCollectionStateWatchers,
RecursiveEvaluatorTest, TestPathTrie, TestSolrJsonWriter, TestSolrJErrorHandling, StreamingTest,
SolrDocumentTest, NormalDistributionEvaluatorTest, TestValidatingJsonMap, TermsResponseTest,
CloudSolrClientRetryTest, CloudSolrClientBadInputTest, ArrayEvaluatorTest, JsonRequestApiTest,
UsingSolrJRefGuideExamplesTest, ZkConfigFilesTest, CollectionAdminRequestRequiredParamsTest,
GetByIdTest, SolrExampleBinaryTest, TestBatchUpdate, TestLBHttpSolrClient, SolrExampleEmbeddedTest,
ConcurrentUpdateSolrClientTest, LBHttpSolrClientBadInputTest, StreamDecoratorTest]
   [junit4] Completed [144/174 (1!)] on J0 in 73.47s, 47 tests, 1 failure, 2 skipped <<<
FAILURES!

[...truncated 44081 lines...]
[repro] Jenkins log URL: https://jenkins.thetaphi.de/job/Lucene-Solr-7.x-Windows/945/consoleText

[repro] Revision: ecd4a3b49c0eb51b688997654f345efe0d92c85c

[repro] Ant options: "-Dargs=-client -XX:+UseConcMarkSweepGC"

[repro] ant clean

[...truncated 6 lines...]
[repro] Test suites by module:
[repro]    solr\solrj
[repro]       StreamDecoratorTest
[repro] ant compile-test

[...truncated 2761 lines...]
[repro] ant test-nocompile -Dtests.dups=5 -Dtests.maxfailures=5 -Dtests.class="*.StreamDecoratorTest"
-Dtests.showOutput=onerror "-Dargs=-client -XX:+UseConcMarkSweepGC" -Dtests.seed=3BA709A3BE29CA1B
-Dtests.slow=true -Dtests.locale=lv -Dtests.timezone=America/Puerto_Rico -Dtests.asserts=true
-Dtests.file.encoding=ISO-8859-1

[...truncated 298 lines...]
[repro] Failures:
[repro]   0/5 failed: org.apache.solr.client.solrj.io.stream.StreamDecoratorTest
[repro] Exiting with code 0

[...truncated 75 lines...]

Mime
View raw message