lucene-dev mailing list archives

Site index · List index
Message view « Date » · « Thread »
Top « Date » · « Thread »
From Policeman Jenkins Server <jenk...@thetaphi.de>
Subject [JENKINS] Lucene-Solr-master-Linux (64bit/jdk-9.0.4) - Build # 23526 - Unstable!
Date Tue, 15 Jan 2019 17:55:19 GMT
Build: https://jenkins.thetaphi.de/job/Lucene-Solr-master-Linux/23526/
Java: 64bit/jdk-9.0.4 -XX:+UseCompressedOops -XX:+UseG1GC

4 tests failed.
FAILED:  org.apache.lucene.search.TermInSetQueryTest.testRamBytesUsed

Error Message:
expected:<237616.0> but was:<2944.0>

Stack Trace:
java.lang.AssertionError: expected:<237616.0> but was:<2944.0>
	at __randomizedtesting.SeedInfo.seed([39D1BD17CEFBFCB2:CB72AF570484E3E4]:0)
	at org.junit.Assert.fail(Assert.java:88)
	at org.junit.Assert.failNotEquals(Assert.java:834)
	at org.junit.Assert.assertEquals(Assert.java:575)
	at org.junit.Assert.assertEquals(Assert.java:700)
	at org.apache.lucene.search.TermInSetQueryTest.testRamBytesUsed(TermInSetQueryTest.java:186)
	at java.base/jdk.internal.reflect.NativeMethodAccessorImpl.invoke0(Native Method)
	at java.base/jdk.internal.reflect.NativeMethodAccessorImpl.invoke(NativeMethodAccessorImpl.java:62)
	at java.base/jdk.internal.reflect.DelegatingMethodAccessorImpl.invoke(DelegatingMethodAccessorImpl.java:43)
	at java.base/java.lang.reflect.Method.invoke(Method.java:564)
	at com.carrotsearch.randomizedtesting.RandomizedRunner.invoke(RandomizedRunner.java:1750)
	at com.carrotsearch.randomizedtesting.RandomizedRunner$8.evaluate(RandomizedRunner.java:938)
	at com.carrotsearch.randomizedtesting.RandomizedRunner$9.evaluate(RandomizedRunner.java:974)
	at com.carrotsearch.randomizedtesting.RandomizedRunner$10.evaluate(RandomizedRunner.java:988)
	at org.apache.lucene.util.TestRuleSetupTeardownChained$1.evaluate(TestRuleSetupTeardownChained.java:49)
	at org.apache.lucene.util.AbstractBeforeAfterRule$1.evaluate(AbstractBeforeAfterRule.java:45)
	at org.apache.lucene.util.TestRuleThreadAndTestName$1.evaluate(TestRuleThreadAndTestName.java:48)
	at org.apache.lucene.util.TestRuleIgnoreAfterMaxFailures$1.evaluate(TestRuleIgnoreAfterMaxFailures.java:64)
	at org.apache.lucene.util.TestRuleMarkFailure$1.evaluate(TestRuleMarkFailure.java:47)
	at com.carrotsearch.randomizedtesting.rules.StatementAdapter.evaluate(StatementAdapter.java:36)
	at com.carrotsearch.randomizedtesting.ThreadLeakControl$StatementRunner.run(ThreadLeakControl.java:368)
	at com.carrotsearch.randomizedtesting.ThreadLeakControl.forkTimeoutingTask(ThreadLeakControl.java:817)
	at com.carrotsearch.randomizedtesting.ThreadLeakControl$3.evaluate(ThreadLeakControl.java:468)
	at com.carrotsearch.randomizedtesting.RandomizedRunner.runSingleTest(RandomizedRunner.java:947)
	at com.carrotsearch.randomizedtesting.RandomizedRunner$5.evaluate(RandomizedRunner.java:832)
	at com.carrotsearch.randomizedtesting.RandomizedRunner$6.evaluate(RandomizedRunner.java:883)
	at com.carrotsearch.randomizedtesting.RandomizedRunner$7.evaluate(RandomizedRunner.java:894)
	at org.apache.lucene.util.AbstractBeforeAfterRule$1.evaluate(AbstractBeforeAfterRule.java:45)
	at com.carrotsearch.randomizedtesting.rules.StatementAdapter.evaluate(StatementAdapter.java:36)
	at org.apache.lucene.util.TestRuleStoreClassName$1.evaluate(TestRuleStoreClassName.java:41)
	at com.carrotsearch.randomizedtesting.rules.NoShadowingOrOverridesOnMethodsRule$1.evaluate(NoShadowingOrOverridesOnMethodsRule.java:40)
	at com.carrotsearch.randomizedtesting.rules.NoShadowingOrOverridesOnMethodsRule$1.evaluate(NoShadowingOrOverridesOnMethodsRule.java:40)
	at com.carrotsearch.randomizedtesting.rules.StatementAdapter.evaluate(StatementAdapter.java:36)
	at com.carrotsearch.randomizedtesting.rules.StatementAdapter.evaluate(StatementAdapter.java:36)
	at org.apache.lucene.util.TestRuleAssertionsRequired$1.evaluate(TestRuleAssertionsRequired.java:53)
	at org.apache.lucene.util.TestRuleMarkFailure$1.evaluate(TestRuleMarkFailure.java:47)
	at org.apache.lucene.util.TestRuleIgnoreAfterMaxFailures$1.evaluate(TestRuleIgnoreAfterMaxFailures.java:64)
	at org.apache.lucene.util.TestRuleIgnoreTestSuites$1.evaluate(TestRuleIgnoreTestSuites.java:54)
	at com.carrotsearch.randomizedtesting.rules.StatementAdapter.evaluate(StatementAdapter.java:36)
	at com.carrotsearch.randomizedtesting.ThreadLeakControl$StatementRunner.run(ThreadLeakControl.java:368)
	at java.base/java.lang.Thread.run(Thread.java:844)


FAILED:  org.apache.lucene.search.TermInSetQueryTest.testRamBytesUsed

Error Message:
expected:<237616.0> but was:<2944.0>

Stack Trace:
java.lang.AssertionError: expected:<237616.0> but was:<2944.0>
	at __randomizedtesting.SeedInfo.seed([39D1BD17CEFBFCB2:CB72AF570484E3E4]:0)
	at org.junit.Assert.fail(Assert.java:88)
	at org.junit.Assert.failNotEquals(Assert.java:834)
	at org.junit.Assert.assertEquals(Assert.java:575)
	at org.junit.Assert.assertEquals(Assert.java:700)
	at org.apache.lucene.search.TermInSetQueryTest.testRamBytesUsed(TermInSetQueryTest.java:186)
	at java.base/jdk.internal.reflect.NativeMethodAccessorImpl.invoke0(Native Method)
	at java.base/jdk.internal.reflect.NativeMethodAccessorImpl.invoke(NativeMethodAccessorImpl.java:62)
	at java.base/jdk.internal.reflect.DelegatingMethodAccessorImpl.invoke(DelegatingMethodAccessorImpl.java:43)
	at java.base/java.lang.reflect.Method.invoke(Method.java:564)
	at com.carrotsearch.randomizedtesting.RandomizedRunner.invoke(RandomizedRunner.java:1750)
	at com.carrotsearch.randomizedtesting.RandomizedRunner$8.evaluate(RandomizedRunner.java:938)
	at com.carrotsearch.randomizedtesting.RandomizedRunner$9.evaluate(RandomizedRunner.java:974)
	at com.carrotsearch.randomizedtesting.RandomizedRunner$10.evaluate(RandomizedRunner.java:988)
	at org.apache.lucene.util.TestRuleSetupTeardownChained$1.evaluate(TestRuleSetupTeardownChained.java:49)
	at org.apache.lucene.util.AbstractBeforeAfterRule$1.evaluate(AbstractBeforeAfterRule.java:45)
	at org.apache.lucene.util.TestRuleThreadAndTestName$1.evaluate(TestRuleThreadAndTestName.java:48)
	at org.apache.lucene.util.TestRuleIgnoreAfterMaxFailures$1.evaluate(TestRuleIgnoreAfterMaxFailures.java:64)
	at org.apache.lucene.util.TestRuleMarkFailure$1.evaluate(TestRuleMarkFailure.java:47)
	at com.carrotsearch.randomizedtesting.rules.StatementAdapter.evaluate(StatementAdapter.java:36)
	at com.carrotsearch.randomizedtesting.ThreadLeakControl$StatementRunner.run(ThreadLeakControl.java:368)
	at com.carrotsearch.randomizedtesting.ThreadLeakControl.forkTimeoutingTask(ThreadLeakControl.java:817)
	at com.carrotsearch.randomizedtesting.ThreadLeakControl$3.evaluate(ThreadLeakControl.java:468)
	at com.carrotsearch.randomizedtesting.RandomizedRunner.runSingleTest(RandomizedRunner.java:947)
	at com.carrotsearch.randomizedtesting.RandomizedRunner$5.evaluate(RandomizedRunner.java:832)
	at com.carrotsearch.randomizedtesting.RandomizedRunner$6.evaluate(RandomizedRunner.java:883)
	at com.carrotsearch.randomizedtesting.RandomizedRunner$7.evaluate(RandomizedRunner.java:894)
	at org.apache.lucene.util.AbstractBeforeAfterRule$1.evaluate(AbstractBeforeAfterRule.java:45)
	at com.carrotsearch.randomizedtesting.rules.StatementAdapter.evaluate(StatementAdapter.java:36)
	at org.apache.lucene.util.TestRuleStoreClassName$1.evaluate(TestRuleStoreClassName.java:41)
	at com.carrotsearch.randomizedtesting.rules.NoShadowingOrOverridesOnMethodsRule$1.evaluate(NoShadowingOrOverridesOnMethodsRule.java:40)
	at com.carrotsearch.randomizedtesting.rules.NoShadowingOrOverridesOnMethodsRule$1.evaluate(NoShadowingOrOverridesOnMethodsRule.java:40)
	at com.carrotsearch.randomizedtesting.rules.StatementAdapter.evaluate(StatementAdapter.java:36)
	at com.carrotsearch.randomizedtesting.rules.StatementAdapter.evaluate(StatementAdapter.java:36)
	at org.apache.lucene.util.TestRuleAssertionsRequired$1.evaluate(TestRuleAssertionsRequired.java:53)
	at org.apache.lucene.util.TestRuleMarkFailure$1.evaluate(TestRuleMarkFailure.java:47)
	at org.apache.lucene.util.TestRuleIgnoreAfterMaxFailures$1.evaluate(TestRuleIgnoreAfterMaxFailures.java:64)
	at org.apache.lucene.util.TestRuleIgnoreTestSuites$1.evaluate(TestRuleIgnoreTestSuites.java:54)
	at com.carrotsearch.randomizedtesting.rules.StatementAdapter.evaluate(StatementAdapter.java:36)
	at com.carrotsearch.randomizedtesting.ThreadLeakControl$StatementRunner.run(ThreadLeakControl.java:368)
	at java.base/java.lang.Thread.run(Thread.java:844)


FAILED:  org.apache.lucene.search.TermInSetQueryTest.testRamBytesUsed

Error Message:
expected:<237616.0> but was:<2944.0>

Stack Trace:
java.lang.AssertionError: expected:<237616.0> but was:<2944.0>
	at __randomizedtesting.SeedInfo.seed([39D1BD17CEFBFCB2:CB72AF570484E3E4]:0)
	at org.junit.Assert.fail(Assert.java:88)
	at org.junit.Assert.failNotEquals(Assert.java:834)
	at org.junit.Assert.assertEquals(Assert.java:575)
	at org.junit.Assert.assertEquals(Assert.java:700)
	at org.apache.lucene.search.TermInSetQueryTest.testRamBytesUsed(TermInSetQueryTest.java:186)
	at java.base/jdk.internal.reflect.NativeMethodAccessorImpl.invoke0(Native Method)
	at java.base/jdk.internal.reflect.NativeMethodAccessorImpl.invoke(NativeMethodAccessorImpl.java:62)
	at java.base/jdk.internal.reflect.DelegatingMethodAccessorImpl.invoke(DelegatingMethodAccessorImpl.java:43)
	at java.base/java.lang.reflect.Method.invoke(Method.java:564)
	at com.carrotsearch.randomizedtesting.RandomizedRunner.invoke(RandomizedRunner.java:1750)
	at com.carrotsearch.randomizedtesting.RandomizedRunner$8.evaluate(RandomizedRunner.java:938)
	at com.carrotsearch.randomizedtesting.RandomizedRunner$9.evaluate(RandomizedRunner.java:974)
	at com.carrotsearch.randomizedtesting.RandomizedRunner$10.evaluate(RandomizedRunner.java:988)
	at org.apache.lucene.util.TestRuleSetupTeardownChained$1.evaluate(TestRuleSetupTeardownChained.java:49)
	at org.apache.lucene.util.AbstractBeforeAfterRule$1.evaluate(AbstractBeforeAfterRule.java:45)
	at org.apache.lucene.util.TestRuleThreadAndTestName$1.evaluate(TestRuleThreadAndTestName.java:48)
	at org.apache.lucene.util.TestRuleIgnoreAfterMaxFailures$1.evaluate(TestRuleIgnoreAfterMaxFailures.java:64)
	at org.apache.lucene.util.TestRuleMarkFailure$1.evaluate(TestRuleMarkFailure.java:47)
	at com.carrotsearch.randomizedtesting.rules.StatementAdapter.evaluate(StatementAdapter.java:36)
	at com.carrotsearch.randomizedtesting.ThreadLeakControl$StatementRunner.run(ThreadLeakControl.java:368)
	at com.carrotsearch.randomizedtesting.ThreadLeakControl.forkTimeoutingTask(ThreadLeakControl.java:817)
	at com.carrotsearch.randomizedtesting.ThreadLeakControl$3.evaluate(ThreadLeakControl.java:468)
	at com.carrotsearch.randomizedtesting.RandomizedRunner.runSingleTest(RandomizedRunner.java:947)
	at com.carrotsearch.randomizedtesting.RandomizedRunner$5.evaluate(RandomizedRunner.java:832)
	at com.carrotsearch.randomizedtesting.RandomizedRunner$6.evaluate(RandomizedRunner.java:883)
	at com.carrotsearch.randomizedtesting.RandomizedRunner$7.evaluate(RandomizedRunner.java:894)
	at org.apache.lucene.util.AbstractBeforeAfterRule$1.evaluate(AbstractBeforeAfterRule.java:45)
	at com.carrotsearch.randomizedtesting.rules.StatementAdapter.evaluate(StatementAdapter.java:36)
	at org.apache.lucene.util.TestRuleStoreClassName$1.evaluate(TestRuleStoreClassName.java:41)
	at com.carrotsearch.randomizedtesting.rules.NoShadowingOrOverridesOnMethodsRule$1.evaluate(NoShadowingOrOverridesOnMethodsRule.java:40)
	at com.carrotsearch.randomizedtesting.rules.NoShadowingOrOverridesOnMethodsRule$1.evaluate(NoShadowingOrOverridesOnMethodsRule.java:40)
	at com.carrotsearch.randomizedtesting.rules.StatementAdapter.evaluate(StatementAdapter.java:36)
	at com.carrotsearch.randomizedtesting.rules.StatementAdapter.evaluate(StatementAdapter.java:36)
	at org.apache.lucene.util.TestRuleAssertionsRequired$1.evaluate(TestRuleAssertionsRequired.java:53)
	at org.apache.lucene.util.TestRuleMarkFailure$1.evaluate(TestRuleMarkFailure.java:47)
	at org.apache.lucene.util.TestRuleIgnoreAfterMaxFailures$1.evaluate(TestRuleIgnoreAfterMaxFailures.java:64)
	at org.apache.lucene.util.TestRuleIgnoreTestSuites$1.evaluate(TestRuleIgnoreTestSuites.java:54)
	at com.carrotsearch.randomizedtesting.rules.StatementAdapter.evaluate(StatementAdapter.java:36)
	at com.carrotsearch.randomizedtesting.ThreadLeakControl$StatementRunner.run(ThreadLeakControl.java:368)
	at java.base/java.lang.Thread.run(Thread.java:844)


FAILED:  org.apache.lucene.search.TermInSetQueryTest.testRamBytesUsed

Error Message:
expected:<237616.0> but was:<2944.0>

Stack Trace:
java.lang.AssertionError: expected:<237616.0> but was:<2944.0>
	at __randomizedtesting.SeedInfo.seed([39D1BD17CEFBFCB2:CB72AF570484E3E4]:0)
	at org.junit.Assert.fail(Assert.java:88)
	at org.junit.Assert.failNotEquals(Assert.java:834)
	at org.junit.Assert.assertEquals(Assert.java:575)
	at org.junit.Assert.assertEquals(Assert.java:700)
	at org.apache.lucene.search.TermInSetQueryTest.testRamBytesUsed(TermInSetQueryTest.java:186)
	at java.base/jdk.internal.reflect.NativeMethodAccessorImpl.invoke0(Native Method)
	at java.base/jdk.internal.reflect.NativeMethodAccessorImpl.invoke(NativeMethodAccessorImpl.java:62)
	at java.base/jdk.internal.reflect.DelegatingMethodAccessorImpl.invoke(DelegatingMethodAccessorImpl.java:43)
	at java.base/java.lang.reflect.Method.invoke(Method.java:564)
	at com.carrotsearch.randomizedtesting.RandomizedRunner.invoke(RandomizedRunner.java:1750)
	at com.carrotsearch.randomizedtesting.RandomizedRunner$8.evaluate(RandomizedRunner.java:938)
	at com.carrotsearch.randomizedtesting.RandomizedRunner$9.evaluate(RandomizedRunner.java:974)
	at com.carrotsearch.randomizedtesting.RandomizedRunner$10.evaluate(RandomizedRunner.java:988)
	at org.apache.lucene.util.TestRuleSetupTeardownChained$1.evaluate(TestRuleSetupTeardownChained.java:49)
	at org.apache.lucene.util.AbstractBeforeAfterRule$1.evaluate(AbstractBeforeAfterRule.java:45)
	at org.apache.lucene.util.TestRuleThreadAndTestName$1.evaluate(TestRuleThreadAndTestName.java:48)
	at org.apache.lucene.util.TestRuleIgnoreAfterMaxFailures$1.evaluate(TestRuleIgnoreAfterMaxFailures.java:64)
	at org.apache.lucene.util.TestRuleMarkFailure$1.evaluate(TestRuleMarkFailure.java:47)
	at com.carrotsearch.randomizedtesting.rules.StatementAdapter.evaluate(StatementAdapter.java:36)
	at com.carrotsearch.randomizedtesting.ThreadLeakControl$StatementRunner.run(ThreadLeakControl.java:368)
	at com.carrotsearch.randomizedtesting.ThreadLeakControl.forkTimeoutingTask(ThreadLeakControl.java:817)
	at com.carrotsearch.randomizedtesting.ThreadLeakControl$3.evaluate(ThreadLeakControl.java:468)
	at com.carrotsearch.randomizedtesting.RandomizedRunner.runSingleTest(RandomizedRunner.java:947)
	at com.carrotsearch.randomizedtesting.RandomizedRunner$5.evaluate(RandomizedRunner.java:832)
	at com.carrotsearch.randomizedtesting.RandomizedRunner$6.evaluate(RandomizedRunner.java:883)
	at com.carrotsearch.randomizedtesting.RandomizedRunner$7.evaluate(RandomizedRunner.java:894)
	at org.apache.lucene.util.AbstractBeforeAfterRule$1.evaluate(AbstractBeforeAfterRule.java:45)
	at com.carrotsearch.randomizedtesting.rules.StatementAdapter.evaluate(StatementAdapter.java:36)
	at org.apache.lucene.util.TestRuleStoreClassName$1.evaluate(TestRuleStoreClassName.java:41)
	at com.carrotsearch.randomizedtesting.rules.NoShadowingOrOverridesOnMethodsRule$1.evaluate(NoShadowingOrOverridesOnMethodsRule.java:40)
	at com.carrotsearch.randomizedtesting.rules.NoShadowingOrOverridesOnMethodsRule$1.evaluate(NoShadowingOrOverridesOnMethodsRule.java:40)
	at com.carrotsearch.randomizedtesting.rules.StatementAdapter.evaluate(StatementAdapter.java:36)
	at com.carrotsearch.randomizedtesting.rules.StatementAdapter.evaluate(StatementAdapter.java:36)
	at org.apache.lucene.util.TestRuleAssertionsRequired$1.evaluate(TestRuleAssertionsRequired.java:53)
	at org.apache.lucene.util.TestRuleMarkFailure$1.evaluate(TestRuleMarkFailure.java:47)
	at org.apache.lucene.util.TestRuleIgnoreAfterMaxFailures$1.evaluate(TestRuleIgnoreAfterMaxFailures.java:64)
	at org.apache.lucene.util.TestRuleIgnoreTestSuites$1.evaluate(TestRuleIgnoreTestSuites.java:54)
	at com.carrotsearch.randomizedtesting.rules.StatementAdapter.evaluate(StatementAdapter.java:36)
	at com.carrotsearch.randomizedtesting.ThreadLeakControl$StatementRunner.run(ThreadLeakControl.java:368)
	at java.base/java.lang.Thread.run(Thread.java:844)




Build Log:
[...truncated 1589 lines...]
   [junit4] Suite: org.apache.lucene.search.TermInSetQueryTest
   [junit4]   2> NOTE: reproduce with: ant test  -Dtestcase=TermInSetQueryTest -Dtests.method=testRamBytesUsed
-Dtests.seed=39D1BD17CEFBFCB2 -Dtests.multiplier=3 -Dtests.slow=true -Dtests.locale=kkj-CM
-Dtests.timezone=US/Pacific-New -Dtests.asserts=true -Dtests.file.encoding=ISO-8859-1
   [junit4] FAILURE 0.04s J2 | TermInSetQueryTest.testRamBytesUsed <<<
   [junit4]    > Throwable #1: java.lang.AssertionError: expected:<237616.0> but
was:<2944.0>
   [junit4]    > 	at __randomizedtesting.SeedInfo.seed([39D1BD17CEFBFCB2:CB72AF570484E3E4]:0)
   [junit4]    > 	at org.apache.lucene.search.TermInSetQueryTest.testRamBytesUsed(TermInSetQueryTest.java:186)
   [junit4]    > 	at java.base/jdk.internal.reflect.NativeMethodAccessorImpl.invoke0(Native
Method)
   [junit4]    > 	at java.base/jdk.internal.reflect.NativeMethodAccessorImpl.invoke(NativeMethodAccessorImpl.java:62)
   [junit4]    > 	at java.base/jdk.internal.reflect.DelegatingMethodAccessorImpl.invoke(DelegatingMethodAccessorImpl.java:43)
   [junit4]    > 	at java.base/java.lang.reflect.Method.invoke(Method.java:564)
   [junit4]    > 	at java.base/java.lang.Thread.run(Thread.java:844)
   [junit4]   2> NOTE: test params are: codec=Asserting(Lucene80), sim=Asserting(org.apache.lucene.search.similarities.AssertingSimilarity@5d097ddb),
locale=kkj-CM, timezone=US/Pacific-New
   [junit4]   2> NOTE: Linux 4.15.0-42-generic amd64/Oracle Corporation 9.0.4 (64-bit)/cpus=8,threads=1,free=290206512,total=536870912
   [junit4]   2> NOTE: All tests run in this JVM: [TestField, TestBufferedChecksum, TestMaxScoreSumPropagator,
TestParallelReaderEmptyIndex, TestCompetitiveFreqNormAccumulator, TestDirectoryReaderReopen,
TestIndexWriterReader, TestLevenshteinAutomata, TestTieredMergePolicy, TestAtomicUpdate, TestAxiomaticF3LOG,
TestAxiomaticF2EXP, TestSpanFirstQuery, TestTermStates, TestOmitPositions, TestExceedMaxTermLength,
TestMergedIterator, TestDocument, TestLongRange, TestRateLimiter, TestFutureObjects, TestNearSpansOrdered,
TestIndexWriterDelete, TestMergeRateLimiter, Test2BSortedDocValuesFixedSorted, TestCharacterUtils,
TestTransactions, TestSegmentInfos, TestCrashCausesCorruptIndex, TestSortRescorer, TestBKD,
TestLockFactory, Test2BDocs, TestConstantScoreQuery, Test2BPositions, TestSingleInstanceLockFactory,
TestRoaringDocIdSet, TestIndexWriterMerging, TestStressIndexing, TestIntRange, TestDocValuesFieldUpdates,
TestBytesRefHash, TestCustomSearcherSort, TestSimilarityProvider, TestFrozenBufferedUpdates,
TestUsageTrackingFilterCachingPolicy, TestFieldInvertState, TestPriorityQueue, TestMultiDocValues,
TestLRUQueryCache, TestSpanContainQuery, TestNGramPhraseQuery, TestNot, TestElevationComparator,
TestFilterLeafReader, TestRegexpRandom2, TestQueryRescorer, TestGraphTokenizers, TestFieldsReader,
TestSortedSetDocValues, TestBytesRefAttImpl, TestIntArrayDocIdSet, TestVirtualMethod, TestFlushByRamOrCountsPolicy,
TestSegmentCacheables, TestMultiTermQueryRewrites, TestDocIdSetIterator, TestNoDeletionPolicy,
TestCloseableThreadLocal, TestIndexOrDocValuesQuery, TestNIOFSDirectory, TestLMJelinekMercerSimilarity,
TestSloppyPhraseQuery2, TestLongsRef, TestAutomatonQuery, TestWildcardRandom, TestPolygon,
MultiCollectorTest, TestIndexWriter, TestTermsEnum, TestSegmentTermDocs, TestComplexExplanationsOfNonMatches,
TestRegExp, TestTermVectorsWriter, TestLucene70SegmentInfoFormat, TestPerFieldDocValuesFormat,
TestBagOfPostings, TestBinaryDocValuesUpdates, TestByteSlices, TestCheckIndex, TestCodecs,
TestConcurrentMergeScheduler, TestDocCount, TestDocIDMerger, TestDocInverterPerFieldErrorInfo,
TestDocsAndPositions, TestDocsWithFieldSet, TestDocumentsWriterStallControl, TestIndexWriterOnDiskFull,
TestIndexWriterOnJRECrash, TestIndexWriterOnVMError, TestIndexWriterUnicode, TestIndexableField,
TestIndexingSequenceNumbers, TestTwoPhaseCommitTool, TermInSetQueryTest]
   [junit4] Completed [378/511 (1!)] on J2 in 0.76s, 10 tests, 1 failure <<< FAILURES!

[...truncated 56400 lines...]
[repro] Jenkins log URL: https://jenkins.thetaphi.de/job/Lucene-Solr-master-Linux/23526/consoleText

[repro] Revision: b7f99fe55a6fb6e7b38828676750b3512d6899a1

[repro] Ant options: "-Dargs=-XX:+UseCompressedOops -XX:+UseG1GC"
[repro] Repro line:  ant test  -Dtestcase=TermInSetQueryTest -Dtests.method=testRamBytesUsed
-Dtests.seed=39D1BD17CEFBFCB2 -Dtests.multiplier=3 -Dtests.slow=true -Dtests.locale=kkj-CM
-Dtests.timezone=US/Pacific-New -Dtests.asserts=true -Dtests.file.encoding=ISO-8859-1

[repro] ant clean

[...truncated 6 lines...]
[repro] Test suites by module:
[repro]    lucene/core
[repro]       TermInSetQueryTest
[repro] ant compile-test

[...truncated 232 lines...]
[repro] ant test-nocompile -Dtests.dups=5 -Dtests.maxfailures=5 -Dtests.class="*.TermInSetQueryTest"
-Dtests.showOutput=onerror "-Dargs=-XX:+UseCompressedOops -XX:+UseG1GC" -Dtests.seed=39D1BD17CEFBFCB2
-Dtests.multiplier=3 -Dtests.slow=true -Dtests.locale=kkj-CM -Dtests.timezone=US/Pacific-New
-Dtests.asserts=true -Dtests.file.encoding=ISO-8859-1

[...truncated 32 lines...]
   [junit4] Suite: org.apache.lucene.search.TermInSetQueryTest
   [junit4] OK      2.65s J2 | TermInSetQueryTest.testDuel
   [junit4] OK      1.08s J2 | TermInSetQueryTest.testHashCodeAndEquals
   [junit4] OK      0.01s J2 | TermInSetQueryTest.testSimpleEquals
   [junit4] OK      0.01s J2 | TermInSetQueryTest.testIsConsideredCostlyByQueryCache
   [junit4] OK      0.02s J2 | TermInSetQueryTest.testToString
   [junit4]   2> NOTE: reproduce with: ant test  -Dtestcase=TermInSetQueryTest -Dtests.method=testRamBytesUsed
-Dtests.seed=39D1BD17CEFBFCB2 -Dtests.multiplier=3 -Dtests.slow=true -Dtests.badapples=true
-Dtests.locale=kkj-CM -Dtests.timezone=US/Pacific-New -Dtests.asserts=true -Dtests.file.encoding=ISO-8859-1
   [junit4] FAILURE 0.14s J2 | TermInSetQueryTest.testRamBytesUsed <<<
   [junit4]    > Throwable #1: java.lang.AssertionError: expected:<237616.0> but
was:<2944.0>
   [junit4]    > 	at __randomizedtesting.SeedInfo.seed([39D1BD17CEFBFCB2:CB72AF570484E3E4]:0)
   [junit4]    > 	at org.apache.lucene.search.TermInSetQueryTest.testRamBytesUsed(TermInSetQueryTest.java:186)
   [junit4]    > 	at java.base/jdk.internal.reflect.NativeMethodAccessorImpl.invoke0(Native
Method)
   [junit4]    > 	at java.base/jdk.internal.reflect.NativeMethodAccessorImpl.invoke(NativeMethodAccessorImpl.java:62)
   [junit4]    > 	at java.base/jdk.internal.reflect.DelegatingMethodAccessorImpl.invoke(DelegatingMethodAccessorImpl.java:43)
   [junit4]    > 	at java.base/java.lang.reflect.Method.invoke(Method.java:564)
   [junit4]    > 	at java.base/java.lang.Thread.run(Thread.java:844)
   [junit4] OK      0.03s J2 | TermInSetQueryTest.testBinaryToString
   [junit4] OK      0.04s J2 | TermInSetQueryTest.testPullOneTermsEnum
   [junit4] OK      0.01s J2 | TermInSetQueryTest.testDedup
   [junit4] OK      0.01s J2 | TermInSetQueryTest.testOrderDoesNotMatter
   [junit4]   2> NOTE: test params are: codec=Asserting(Lucene80), sim=Asserting(org.apache.lucene.search.similarities.AssertingSimilarity@b559ae0),
locale=kkj-CM, timezone=US/Pacific-New
   [junit4]   2> NOTE: Linux 4.15.0-42-generic amd64/Oracle Corporation 9.0.4 (64-bit)/cpus=8,threads=1,free=439580848,total=536870912
   [junit4]   2> NOTE: All tests run in this JVM: [TermInSetQueryTest]
   [junit4] Completed [1/5 (1!)] on J2 in 4.51s, 10 tests, 1 failure <<< FAILURES!

[...truncated 1 lines...]
   [junit4] Suite: org.apache.lucene.search.TermInSetQueryTest
   [junit4] OK      2.57s J0 | TermInSetQueryTest.testDuel
   [junit4] OK      1.14s J0 | TermInSetQueryTest.testHashCodeAndEquals
   [junit4] OK      0.02s J0 | TermInSetQueryTest.testSimpleEquals
   [junit4] OK      0.01s J0 | TermInSetQueryTest.testIsConsideredCostlyByQueryCache
   [junit4] OK      0.01s J0 | TermInSetQueryTest.testToString
   [junit4]   2> NOTE: reproduce with: ant test  -Dtestcase=TermInSetQueryTest -Dtests.method=testRamBytesUsed
-Dtests.seed=39D1BD17CEFBFCB2 -Dtests.multiplier=3 -Dtests.slow=true -Dtests.badapples=true
-Dtests.locale=kkj-CM -Dtests.timezone=US/Pacific-New -Dtests.asserts=true -Dtests.file.encoding=ISO-8859-1
   [junit4] FAILURE 0.19s J0 | TermInSetQueryTest.testRamBytesUsed <<<
   [junit4]    > Throwable #1: java.lang.AssertionError: expected:<237616.0> but
was:<2944.0>
   [junit4]    > 	at __randomizedtesting.SeedInfo.seed([39D1BD17CEFBFCB2:CB72AF570484E3E4]:0)
   [junit4]    > 	at org.apache.lucene.search.TermInSetQueryTest.testRamBytesUsed(TermInSetQueryTest.java:186)
   [junit4]    > 	at java.base/jdk.internal.reflect.NativeMethodAccessorImpl.invoke0(Native
Method)
   [junit4]    > 	at java.base/jdk.internal.reflect.NativeMethodAccessorImpl.invoke(NativeMethodAccessorImpl.java:62)
   [junit4]    > 	at java.base/jdk.internal.reflect.DelegatingMethodAccessorImpl.invoke(DelegatingMethodAccessorImpl.java:43)
   [junit4]    > 	at java.base/java.lang.reflect.Method.invoke(Method.java:564)
   [junit4]    > 	at java.base/java.lang.Thread.run(Thread.java:844)
   [junit4] OK      0.00s J0 | TermInSetQueryTest.testBinaryToString
   [junit4] OK      0.04s J0 | TermInSetQueryTest.testPullOneTermsEnum
   [junit4] OK      0.00s J0 | TermInSetQueryTest.testDedup
   [junit4] OK      0.00s J0 | TermInSetQueryTest.testOrderDoesNotMatter
   [junit4]   2> NOTE: test params are: codec=Asserting(Lucene80), sim=Asserting(org.apache.lucene.search.similarities.AssertingSimilarity@67bdb75),
locale=kkj-CM, timezone=US/Pacific-New
   [junit4]   2> NOTE: Linux 4.15.0-42-generic amd64/Oracle Corporation 9.0.4 (64-bit)/cpus=8,threads=1,free=437486344,total=536870912
   [junit4]   2> NOTE: All tests run in this JVM: [TermInSetQueryTest]
   [junit4] Completed [2/5 (2!)] on J0 in 4.77s, 10 tests, 1 failure <<< FAILURES!

[...truncated 1 lines...]
   [junit4] Suite: org.apache.lucene.search.TermInSetQueryTest
   [junit4] OK      3.05s J1 | TermInSetQueryTest.testDuel
   [junit4] OK      1.25s J1 | TermInSetQueryTest.testHashCodeAndEquals
   [junit4] OK      0.01s J1 | TermInSetQueryTest.testSimpleEquals
   [junit4] OK      0.01s J1 | TermInSetQueryTest.testIsConsideredCostlyByQueryCache
   [junit4] OK      0.04s J1 | TermInSetQueryTest.testToString
   [junit4]   2> NOTE: reproduce with: ant test  -Dtestcase=TermInSetQueryTest -Dtests.method=testRamBytesUsed
-Dtests.seed=39D1BD17CEFBFCB2 -Dtests.multiplier=3 -Dtests.slow=true -Dtests.badapples=true
-Dtests.locale=kkj-CM -Dtests.timezone=US/Pacific-New -Dtests.asserts=true -Dtests.file.encoding=ISO-8859-1
   [junit4] FAILURE 0.10s J1 | TermInSetQueryTest.testRamBytesUsed <<<
   [junit4]    > Throwable #1: java.lang.AssertionError: expected:<237616.0> but
was:<2944.0>
   [junit4]    > 	at __randomizedtesting.SeedInfo.seed([39D1BD17CEFBFCB2:CB72AF570484E3E4]:0)
   [junit4]    > 	at org.apache.lucene.search.TermInSetQueryTest.testRamBytesUsed(TermInSetQueryTest.java:186)
   [junit4]    > 	at java.base/jdk.internal.reflect.NativeMethodAccessorImpl.invoke0(Native
Method)
   [junit4]    > 	at java.base/jdk.internal.reflect.NativeMethodAccessorImpl.invoke(NativeMethodAccessorImpl.java:62)
   [junit4]    > 	at java.base/jdk.internal.reflect.DelegatingMethodAccessorImpl.invoke(DelegatingMethodAccessorImpl.java:43)
   [junit4]    > 	at java.base/java.lang.reflect.Method.invoke(Method.java:564)
   [junit4]    > 	at java.base/java.lang.Thread.run(Thread.java:844)
   [junit4] OK      0.00s J1 | TermInSetQueryTest.testBinaryToString
   [junit4] OK      0.06s J1 | TermInSetQueryTest.testPullOneTermsEnum
   [junit4] OK      0.00s J1 | TermInSetQueryTest.testDedup
   [junit4] OK      0.01s J1 | TermInSetQueryTest.testOrderDoesNotMatter
   [junit4]   2> NOTE: test params are: codec=Asserting(Lucene80), sim=Asserting(org.apache.lucene.search.similarities.AssertingSimilarity@b559ae0),
locale=kkj-CM, timezone=US/Pacific-New
   [junit4]   2> NOTE: Linux 4.15.0-42-generic amd64/Oracle Corporation 9.0.4 (64-bit)/cpus=8,threads=1,free=435038792,total=536870912
   [junit4]   2> NOTE: All tests run in this JVM: [TermInSetQueryTest]
   [junit4] Completed [3/5 (3!)] on J1 in 5.03s, 10 tests, 1 failure <<< FAILURES!

[...truncated 1 lines...]
   [junit4] Suite: org.apache.lucene.search.TermInSetQueryTest
   [junit4] OK      0.85s J2 | TermInSetQueryTest.testDuel
   [junit4] OK      0.39s J2 | TermInSetQueryTest.testHashCodeAndEquals
   [junit4] OK      0.00s J2 | TermInSetQueryTest.testSimpleEquals
   [junit4] OK      0.00s J2 | TermInSetQueryTest.testIsConsideredCostlyByQueryCache
   [junit4] OK      0.00s J2 | TermInSetQueryTest.testToString
   [junit4]   2> NOTE: reproduce with: ant test  -Dtestcase=TermInSetQueryTest -Dtests.method=testRamBytesUsed
-Dtests.seed=39D1BD17CEFBFCB2 -Dtests.multiplier=3 -Dtests.slow=true -Dtests.badapples=true
-Dtests.locale=kkj-CM -Dtests.timezone=US/Pacific-New -Dtests.asserts=true -Dtests.file.encoding=ISO-8859-1
   [junit4] FAILURE 0.03s J2 | TermInSetQueryTest.testRamBytesUsed <<<
   [junit4]    > Throwable #1: java.lang.AssertionError: expected:<237616.0> but
was:<2944.0>
   [junit4]    > 	at __randomizedtesting.SeedInfo.seed([39D1BD17CEFBFCB2:CB72AF570484E3E4]:0)
   [junit4]    > 	at org.apache.lucene.search.TermInSetQueryTest.testRamBytesUsed(TermInSetQueryTest.java:186)
   [junit4]    > 	at java.base/jdk.internal.reflect.NativeMethodAccessorImpl.invoke0(Native
Method)
   [junit4]    > 	at java.base/jdk.internal.reflect.NativeMethodAccessorImpl.invoke(NativeMethodAccessorImpl.java:62)
   [junit4]    > 	at java.base/jdk.internal.reflect.DelegatingMethodAccessorImpl.invoke(DelegatingMethodAccessorImpl.java:43)
   [junit4]    > 	at java.base/java.lang.reflect.Method.invoke(Method.java:564)
   [junit4]    > 	at java.base/java.lang.Thread.run(Thread.java:844)
   [junit4] OK      0.00s J2 | TermInSetQueryTest.testBinaryToString
   [junit4] OK      0.01s J2 | TermInSetQueryTest.testPullOneTermsEnum
   [junit4] OK      0.00s J2 | TermInSetQueryTest.testDedup
   [junit4] OK      0.00s J2 | TermInSetQueryTest.testOrderDoesNotMatter
   [junit4]   2> NOTE: test params are: codec=Asserting(Lucene80), sim=Asserting(org.apache.lucene.search.similarities.AssertingSimilarity@3ac809dd),
locale=kkj-CM, timezone=US/Pacific-New
   [junit4]   2> NOTE: Linux 4.15.0-42-generic amd64/Oracle Corporation 9.0.4 (64-bit)/cpus=8,threads=1,free=382805112,total=536870912
   [junit4]   2> NOTE: All tests run in this JVM: [TermInSetQueryTest, TermInSetQueryTest]
   [junit4] Completed [4/5 (4!)] on J2 in 1.53s, 10 tests, 1 failure <<< FAILURES!

[...truncated 1 lines...]
   [junit4] Suite: org.apache.lucene.search.TermInSetQueryTest
   [junit4] OK      0.84s J0 | TermInSetQueryTest.testDuel
   [junit4] OK      0.31s J0 | TermInSetQueryTest.testHashCodeAndEquals
   [junit4] OK      0.01s J0 | TermInSetQueryTest.testSimpleEquals
   [junit4] OK      0.02s J0 | TermInSetQueryTest.testIsConsideredCostlyByQueryCache
   [junit4] OK      0.00s J0 | TermInSetQueryTest.testToString
   [junit4]   2> NOTE: reproduce with: ant test  -Dtestcase=TermInSetQueryTest -Dtests.method=testRamBytesUsed
-Dtests.seed=39D1BD17CEFBFCB2 -Dtests.multiplier=3 -Dtests.slow=true -Dtests.badapples=true
-Dtests.locale=kkj-CM -Dtests.timezone=US/Pacific-New -Dtests.asserts=true -Dtests.file.encoding=ISO-8859-1
   [junit4] FAILURE 0.06s J0 | TermInSetQueryTest.testRamBytesUsed <<<
   [junit4]    > Throwable #1: java.lang.AssertionError: expected:<237616.0> but
was:<2944.0>
   [junit4]    > 	at __randomizedtesting.SeedInfo.seed([39D1BD17CEFBFCB2:CB72AF570484E3E4]:0)
   [junit4]    > 	at org.apache.lucene.search.TermInSetQueryTest.testRamBytesUsed(TermInSetQueryTest.java:186)
   [junit4]    > 	at java.base/jdk.internal.reflect.NativeMethodAccessorImpl.invoke0(Native
Method)
   [junit4]    > 	at java.base/jdk.internal.reflect.NativeMethodAccessorImpl.invoke(NativeMethodAccessorImpl.java:62)
   [junit4]    > 	at java.base/jdk.internal.reflect.DelegatingMethodAccessorImpl.invoke(DelegatingMethodAccessorImpl.java:43)
   [junit4]    > 	at java.base/java.lang.reflect.Method.invoke(Method.java:564)
   [junit4]    > 	at java.base/java.lang.Thread.run(Thread.java:844)
   [junit4] OK      0.00s J0 | TermInSetQueryTest.testBinaryToString
   [junit4] OK      0.04s J0 | TermInSetQueryTest.testPullOneTermsEnum
   [junit4] OK      0.00s J0 | TermInSetQueryTest.testDedup
   [junit4] OK      0.01s J0 | TermInSetQueryTest.testOrderDoesNotMatter
   [junit4]   2> NOTE: test params are: codec=Asserting(Lucene80), sim=Asserting(org.apache.lucene.search.similarities.AssertingSimilarity@3c60c261),
locale=kkj-CM, timezone=US/Pacific-New
   [junit4]   2> NOTE: Linux 4.15.0-42-generic amd64/Oracle Corporation 9.0.4 (64-bit)/cpus=8,threads=1,free=382188712,total=536870912
   [junit4]   2> NOTE: All tests run in this JVM: [TermInSetQueryTest, TermInSetQueryTest]
   [junit4] Completed [5/5 (5!)] on J0 in 1.53s, 10 tests, 1 failure <<< FAILURES!

[...truncated 15 lines...]
BUILD FAILED
/home/jenkins/workspace/Lucene-Solr-master-Linux/lucene/common-build.xml:1572: The following
error occurred while executing this line:
/home/jenkins/workspace/Lucene-Solr-master-Linux/lucene/common-build.xml:1099: There were
test failures: 5 suites, 50 tests, 5 failures [seed: 39D1BD17CEFBFCB2]

Total time: 10 seconds

[repro] Setting last failure code to 256

[repro] Failures:
[repro]   5/5 failed: org.apache.lucene.search.TermInSetQueryTest
[repro] Exiting with code 256
+ mv lucene/build lucene/build.repro
+ mv solr/build solr/build.repro
mv: cannot stat 'solr/build': No such file or directory
+ true
+ mv lucene/build.orig lucene/build
+ mv solr/build.orig solr/build
Archiving artifacts
Setting ANT_1_8_2_HOME=/home/jenkins/tools/hudson.tasks.Ant_AntInstallation/ANT_1.8.2
[WARNINGS] Parsing warnings in console log with parser Java Compiler (javac)
Setting ANT_1_8_2_HOME=/home/jenkins/tools/hudson.tasks.Ant_AntInstallation/ANT_1.8.2
Setting ANT_1_8_2_HOME=/home/jenkins/tools/hudson.tasks.Ant_AntInstallation/ANT_1.8.2
<Git Blamer> Using GitBlamer to create author and commit information for all warnings.
<Git Blamer> GIT_COMMIT=b7f99fe55a6fb6e7b38828676750b3512d6899a1, workspace=/home/jenkins/workspace/Lucene-Solr-master-Linux
[WARNINGS] Computing warning deltas based on reference build #23525
Recording test results
Setting ANT_1_8_2_HOME=/home/jenkins/tools/hudson.tasks.Ant_AntInstallation/ANT_1.8.2
Build step 'Publish JUnit test result report' changed build result to UNSTABLE
Email was triggered for: Unstable (Test Failures)
Sending email for trigger: Unstable (Test Failures)
Setting ANT_1_8_2_HOME=/home/jenkins/tools/hudson.tasks.Ant_AntInstallation/ANT_1.8.2
Setting ANT_1_8_2_HOME=/home/jenkins/tools/hudson.tasks.Ant_AntInstallation/ANT_1.8.2
Setting ANT_1_8_2_HOME=/home/jenkins/tools/hudson.tasks.Ant_AntInstallation/ANT_1.8.2
Setting ANT_1_8_2_HOME=/home/jenkins/tools/hudson.tasks.Ant_AntInstallation/ANT_1.8.2

Mime
View raw message