lucene-dev mailing list archives

Site index · List index
Message view « Date » · « Thread »
Top « Date » · « Thread »
From Apache Jenkins Server <jenk...@builds.apache.org>
Subject [JENKINS] Lucene-Solr-Tests-7.x - Build # 1206 - Unstable
Date Fri, 11 Jan 2019 15:39:40 GMT
Build: https://builds.apache.org/job/Lucene-Solr-Tests-7.x/1206/

1 tests failed.
FAILED:  org.apache.solr.client.solrj.TestLBHttpSolrClient.testReliability

Error Message:
No live SolrServers available to handle this request

Stack Trace:
org.apache.solr.client.solrj.SolrServerException: No live SolrServers available to handle
this request
	at __randomizedtesting.SeedInfo.seed([7D8F311E5634888C:BC47EC58F7525925]:0)
	at org.apache.solr.client.solrj.impl.LBHttpSolrClient.request(LBHttpSolrClient.java:731)
	at org.apache.solr.client.solrj.impl.LBHttpSolrClient.request(LBHttpSolrClient.java:643)
	at org.apache.solr.client.solrj.SolrRequest.process(SolrRequest.java:194)
	at org.apache.solr.client.solrj.SolrClient.query(SolrClient.java:983)
	at org.apache.solr.client.solrj.SolrClient.query(SolrClient.java:998)
	at org.apache.solr.client.solrj.TestLBHttpSolrClient.testReliability(TestLBHttpSolrClient.java:221)
	at sun.reflect.NativeMethodAccessorImpl.invoke0(Native Method)
	at sun.reflect.NativeMethodAccessorImpl.invoke(NativeMethodAccessorImpl.java:62)
	at sun.reflect.DelegatingMethodAccessorImpl.invoke(DelegatingMethodAccessorImpl.java:43)
	at java.lang.reflect.Method.invoke(Method.java:498)
	at com.carrotsearch.randomizedtesting.RandomizedRunner.invoke(RandomizedRunner.java:1750)
	at com.carrotsearch.randomizedtesting.RandomizedRunner$8.evaluate(RandomizedRunner.java:938)
	at com.carrotsearch.randomizedtesting.RandomizedRunner$9.evaluate(RandomizedRunner.java:974)
	at com.carrotsearch.randomizedtesting.RandomizedRunner$10.evaluate(RandomizedRunner.java:988)
	at com.carrotsearch.randomizedtesting.rules.SystemPropertiesRestoreRule$1.evaluate(SystemPropertiesRestoreRule.java:57)
	at org.apache.lucene.util.TestRuleSetupTeardownChained$1.evaluate(TestRuleSetupTeardownChained.java:49)
	at org.apache.lucene.util.AbstractBeforeAfterRule$1.evaluate(AbstractBeforeAfterRule.java:45)
	at org.apache.lucene.util.TestRuleThreadAndTestName$1.evaluate(TestRuleThreadAndTestName.java:48)
	at org.apache.lucene.util.TestRuleIgnoreAfterMaxFailures$1.evaluate(TestRuleIgnoreAfterMaxFailures.java:64)
	at org.apache.lucene.util.TestRuleMarkFailure$1.evaluate(TestRuleMarkFailure.java:47)
	at com.carrotsearch.randomizedtesting.rules.StatementAdapter.evaluate(StatementAdapter.java:36)
	at com.carrotsearch.randomizedtesting.ThreadLeakControl$StatementRunner.run(ThreadLeakControl.java:368)
	at com.carrotsearch.randomizedtesting.ThreadLeakControl.forkTimeoutingTask(ThreadLeakControl.java:817)
	at com.carrotsearch.randomizedtesting.ThreadLeakControl$3.evaluate(ThreadLeakControl.java:468)
	at com.carrotsearch.randomizedtesting.RandomizedRunner.runSingleTest(RandomizedRunner.java:947)
	at com.carrotsearch.randomizedtesting.RandomizedRunner$5.evaluate(RandomizedRunner.java:832)
	at com.carrotsearch.randomizedtesting.RandomizedRunner$6.evaluate(RandomizedRunner.java:883)
	at com.carrotsearch.randomizedtesting.RandomizedRunner$7.evaluate(RandomizedRunner.java:894)
	at com.carrotsearch.randomizedtesting.rules.StatementAdapter.evaluate(StatementAdapter.java:36)
	at com.carrotsearch.randomizedtesting.rules.SystemPropertiesRestoreRule$1.evaluate(SystemPropertiesRestoreRule.java:57)
	at org.apache.lucene.util.AbstractBeforeAfterRule$1.evaluate(AbstractBeforeAfterRule.java:45)
	at com.carrotsearch.randomizedtesting.rules.StatementAdapter.evaluate(StatementAdapter.java:36)
	at org.apache.lucene.util.TestRuleStoreClassName$1.evaluate(TestRuleStoreClassName.java:41)
	at com.carrotsearch.randomizedtesting.rules.NoShadowingOrOverridesOnMethodsRule$1.evaluate(NoShadowingOrOverridesOnMethodsRule.java:40)
	at com.carrotsearch.randomizedtesting.rules.NoShadowingOrOverridesOnMethodsRule$1.evaluate(NoShadowingOrOverridesOnMethodsRule.java:40)
	at com.carrotsearch.randomizedtesting.rules.StatementAdapter.evaluate(StatementAdapter.java:36)
	at com.carrotsearch.randomizedtesting.rules.StatementAdapter.evaluate(StatementAdapter.java:36)
	at com.carrotsearch.randomizedtesting.rules.StatementAdapter.evaluate(StatementAdapter.java:36)
	at org.apache.lucene.util.TestRuleAssertionsRequired$1.evaluate(TestRuleAssertionsRequired.java:53)
	at org.apache.lucene.util.TestRuleMarkFailure$1.evaluate(TestRuleMarkFailure.java:47)
	at org.apache.lucene.util.TestRuleIgnoreAfterMaxFailures$1.evaluate(TestRuleIgnoreAfterMaxFailures.java:64)
	at org.apache.lucene.util.TestRuleIgnoreTestSuites$1.evaluate(TestRuleIgnoreTestSuites.java:54)
	at com.carrotsearch.randomizedtesting.rules.StatementAdapter.evaluate(StatementAdapter.java:36)
	at com.carrotsearch.randomizedtesting.ThreadLeakControl$StatementRunner.run(ThreadLeakControl.java:368)
	at java.lang.Thread.run(Thread.java:748)
Caused by: org.apache.solr.client.solrj.SolrServerException: Timeout occured while waiting
response from server at: http://127.0.0.1:44756/solr/collection1
	at org.apache.solr.client.solrj.impl.HttpSolrClient.executeMethod(HttpSolrClient.java:654)
	at org.apache.solr.client.solrj.impl.HttpSolrClient.request(HttpSolrClient.java:255)
	at org.apache.solr.client.solrj.impl.HttpSolrClient.request(HttpSolrClient.java:244)
	at org.apache.solr.client.solrj.impl.LBHttpSolrClient.request(LBHttpSolrClient.java:668)
	... 44 more
Caused by: java.net.SocketTimeoutException: Read timed out
	at java.net.SocketInputStream.socketRead0(Native Method)
	at java.net.SocketInputStream.socketRead(SocketInputStream.java:116)
	at java.net.SocketInputStream.read(SocketInputStream.java:171)
	at java.net.SocketInputStream.read(SocketInputStream.java:141)
	at org.apache.http.impl.io.SessionInputBufferImpl.streamRead(SessionInputBufferImpl.java:137)
	at org.apache.http.impl.io.SessionInputBufferImpl.fillBuffer(SessionInputBufferImpl.java:153)
	at org.apache.http.impl.io.SessionInputBufferImpl.readLine(SessionInputBufferImpl.java:282)
	at org.apache.http.impl.conn.DefaultHttpResponseParser.parseHead(DefaultHttpResponseParser.java:138)
	at org.apache.http.impl.conn.DefaultHttpResponseParser.parseHead(DefaultHttpResponseParser.java:56)
	at org.apache.http.impl.io.AbstractMessageParser.parse(AbstractMessageParser.java:259)
	at org.apache.http.impl.DefaultBHttpClientConnection.receiveResponseHeader(DefaultBHttpClientConnection.java:163)
	at org.apache.http.impl.conn.CPoolProxy.receiveResponseHeader(CPoolProxy.java:165)
	at org.apache.http.protocol.HttpRequestExecutor.doReceiveResponse(HttpRequestExecutor.java:273)
	at org.apache.http.protocol.HttpRequestExecutor.execute(HttpRequestExecutor.java:125)
	at org.apache.http.impl.execchain.MainClientExec.execute(MainClientExec.java:272)
	at org.apache.http.impl.execchain.ProtocolExec.execute(ProtocolExec.java:185)
	at org.apache.http.impl.execchain.RetryExec.execute(RetryExec.java:89)
	at org.apache.http.impl.execchain.RedirectExec.execute(RedirectExec.java:110)
	at org.apache.http.impl.client.InternalHttpClient.doExecute(InternalHttpClient.java:185)
	at org.apache.http.impl.client.CloseableHttpClient.execute(CloseableHttpClient.java:83)
	at org.apache.http.impl.client.CloseableHttpClient.execute(CloseableHttpClient.java:56)
	at org.apache.solr.client.solrj.impl.HttpSolrClient.executeMethod(HttpSolrClient.java:542)
	... 47 more




Build Log:
[...truncated 16121 lines...]
   [junit4] Suite: org.apache.solr.client.solrj.TestLBHttpSolrClient
   [junit4]   2> ERROR StatusLogger No Log4j 2 configuration file found. Using default
configuration (logging only errors to the console), or user programmatically provided configurations.
Set system property 'log4j2.debug' to show Log4j 2 internal initialization logging. See https://logging.apache.org/log4j/2.x/manual/configuration.html
for instructions on how to configure Log4j 2
   [junit4]   2> Creating dataDir: /home/jenkins/jenkins-slave/workspace/Lucene-Solr-Tests-7.x/solr/build/solr-solrj/test/J2/temp/solr.client.solrj.TestLBHttpSolrClient_7D8F311E5634888C-001/init-core-data-001
   [junit4]   1> 14:48:07.109 [TEST-TestLBHttpSolrClient.testReliability-seed#[7D8F311E5634888C]]
ERROR org.apache.solr.util.StartupLoggingUtils - Missing Java Option solr.log.dir. Logging
may be missing or incomplete.
   [junit4]   1> 14:48:34.176 [TEST-TestLBHttpSolrClient.testReliability-seed#[7D8F311E5634888C]]
ERROR org.apache.solr.util.StartupLoggingUtils - Missing Java Option solr.log.dir. Logging
may be missing or incomplete.
   [junit4]   1> 14:48:39.701 [TEST-TestLBHttpSolrClient.testReliability-seed#[7D8F311E5634888C]]
ERROR org.apache.solr.util.StartupLoggingUtils - Missing Java Option solr.log.dir. Logging
may be missing or incomplete.
   [junit4]   2> NOTE: reproduce with: ant test  -Dtestcase=TestLBHttpSolrClient -Dtests.method=testReliability
-Dtests.seed=7D8F311E5634888C -Dtests.multiplier=2 -Dtests.slow=true -Dtests.locale=ko -Dtests.timezone=CNT
-Dtests.asserts=true -Dtests.file.encoding=US-ASCII
   [junit4] ERROR   48.3s J2 | TestLBHttpSolrClient.testReliability <<<
   [junit4]    > Throwable #1: org.apache.solr.client.solrj.SolrServerException: No live
SolrServers available to handle this request
   [junit4]    > 	at __randomizedtesting.SeedInfo.seed([7D8F311E5634888C:BC47EC58F7525925]:0)
   [junit4]    > 	at org.apache.solr.client.solrj.impl.LBHttpSolrClient.request(LBHttpSolrClient.java:731)
   [junit4]    > 	at org.apache.solr.client.solrj.impl.LBHttpSolrClient.request(LBHttpSolrClient.java:643)
   [junit4]    > 	at org.apache.solr.client.solrj.SolrRequest.process(SolrRequest.java:194)
   [junit4]    > 	at org.apache.solr.client.solrj.SolrClient.query(SolrClient.java:983)
   [junit4]    > 	at org.apache.solr.client.solrj.SolrClient.query(SolrClient.java:998)
   [junit4]    > 	at org.apache.solr.client.solrj.TestLBHttpSolrClient.testReliability(TestLBHttpSolrClient.java:221)
   [junit4]    > 	at java.lang.Thread.run(Thread.java:748)
   [junit4]    > Caused by: org.apache.solr.client.solrj.SolrServerException: Timeout occured
while waiting response from server at: http://127.0.0.1:44756/solr/collection1
   [junit4]    > 	at org.apache.solr.client.solrj.impl.HttpSolrClient.executeMethod(HttpSolrClient.java:654)
   [junit4]    > 	at org.apache.solr.client.solrj.impl.HttpSolrClient.request(HttpSolrClient.java:255)
   [junit4]    > 	at org.apache.solr.client.solrj.impl.HttpSolrClient.request(HttpSolrClient.java:244)
   [junit4]    > 	at org.apache.solr.client.solrj.impl.LBHttpSolrClient.request(LBHttpSolrClient.java:668)
   [junit4]    > 	... 44 more
   [junit4]    > Caused by: java.net.SocketTimeoutException: Read timed out
   [junit4]    > 	at java.net.SocketInputStream.socketRead0(Native Method)
   [junit4]    > 	at java.net.SocketInputStream.socketRead(SocketInputStream.java:116)
   [junit4]    > 	at java.net.SocketInputStream.read(SocketInputStream.java:171)
   [junit4]    > 	at java.net.SocketInputStream.read(SocketInputStream.java:141)
   [junit4]    > 	at org.apache.http.impl.io.SessionInputBufferImpl.streamRead(SessionInputBufferImpl.java:137)
   [junit4]    > 	at org.apache.http.impl.io.SessionInputBufferImpl.fillBuffer(SessionInputBufferImpl.java:153)
   [junit4]    > 	at org.apache.http.impl.io.SessionInputBufferImpl.readLine(SessionInputBufferImpl.java:282)
   [junit4]    > 	at org.apache.http.impl.conn.DefaultHttpResponseParser.parseHead(DefaultHttpResponseParser.java:138)
   [junit4]    > 	at org.apache.http.impl.conn.DefaultHttpResponseParser.parseHead(DefaultHttpResponseParser.java:56)
   [junit4]    > 	at org.apache.http.impl.io.AbstractMessageParser.parse(AbstractMessageParser.java:259)
   [junit4]    > 	at org.apache.http.impl.DefaultBHttpClientConnection.receiveResponseHeader(DefaultBHttpClientConnection.java:163)
   [junit4]    > 	at org.apache.http.impl.conn.CPoolProxy.receiveResponseHeader(CPoolProxy.java:165)
   [junit4]    > 	at org.apache.http.protocol.HttpRequestExecutor.doReceiveResponse(HttpRequestExecutor.java:273)
   [junit4]    > 	at org.apache.http.protocol.HttpRequestExecutor.execute(HttpRequestExecutor.java:125)
   [junit4]    > 	at org.apache.http.impl.execchain.MainClientExec.execute(MainClientExec.java:272)
   [junit4]    > 	at org.apache.http.impl.execchain.ProtocolExec.execute(ProtocolExec.java:185)
   [junit4]    > 	at org.apache.http.impl.execchain.RetryExec.execute(RetryExec.java:89)
   [junit4]    > 	at org.apache.http.impl.execchain.RedirectExec.execute(RedirectExec.java:110)
   [junit4]    > 	at org.apache.http.impl.client.InternalHttpClient.doExecute(InternalHttpClient.java:185)
   [junit4]    > 	at org.apache.http.impl.client.CloseableHttpClient.execute(CloseableHttpClient.java:83)
   [junit4]    > 	at org.apache.http.impl.client.CloseableHttpClient.execute(CloseableHttpClient.java:56)
   [junit4]    > 	at org.apache.solr.client.solrj.impl.HttpSolrClient.executeMethod(HttpSolrClient.java:542)
   [junit4]    > 	... 47 more
   [junit4]   1> 14:48:49.562 [TEST-TestLBHttpSolrClient.testSimple-seed#[7D8F311E5634888C]]
ERROR org.apache.solr.util.StartupLoggingUtils - Missing Java Option solr.log.dir. Logging
may be missing or incomplete.
   [junit4]   1> 14:48:55.427 [TEST-TestLBHttpSolrClient.testSimple-seed#[7D8F311E5634888C]]
ERROR org.apache.solr.util.StartupLoggingUtils - Missing Java Option solr.log.dir. Logging
may be missing or incomplete.
   [junit4]   1> 14:49:01.052 [TEST-TestLBHttpSolrClient.testSimple-seed#[7D8F311E5634888C]]
ERROR org.apache.solr.util.StartupLoggingUtils - Missing Java Option solr.log.dir. Logging
may be missing or incomplete.
   [junit4]   1> 14:49:06.376 [TEST-TestLBHttpSolrClient.testSimple-seed#[7D8F311E5634888C]]
ERROR org.apache.solr.util.StartupLoggingUtils - Missing Java Option solr.log.dir. Logging
may be missing or incomplete.
   [junit4]   1> 14:49:14.847 [TEST-TestLBHttpSolrClient.testTwoServers-seed#[7D8F311E5634888C]]
ERROR org.apache.solr.util.StartupLoggingUtils - Missing Java Option solr.log.dir. Logging
may be missing or incomplete.
   [junit4]   1> 14:49:19.631 [TEST-TestLBHttpSolrClient.testTwoServers-seed#[7D8F311E5634888C]]
ERROR org.apache.solr.util.StartupLoggingUtils - Missing Java Option solr.log.dir. Logging
may be missing or incomplete.
   [junit4]   1> 14:49:22.104 [TEST-TestLBHttpSolrClient.testTwoServers-seed#[7D8F311E5634888C]]
ERROR org.apache.solr.util.StartupLoggingUtils - Missing Java Option solr.log.dir. Logging
may be missing or incomplete.
   [junit4]   1> 14:49:26.907 [TEST-TestLBHttpSolrClient.testTwoServers-seed#[7D8F311E5634888C]]
ERROR org.apache.solr.util.StartupLoggingUtils - Missing Java Option solr.log.dir. Logging
may be missing or incomplete.
   [junit4]   2> NOTE: leaving temporary files on disk at: /home/jenkins/jenkins-slave/workspace/Lucene-Solr-Tests-7.x/solr/build/solr-solrj/test/J2/temp/solr.client.solrj.TestLBHttpSolrClient_7D8F311E5634888C-001
   [junit4]   2> NOTE: test params are: codec=Asserting(Lucene70), sim=RandomSimilarity(queryNorm=false):
{}, locale=ko, timezone=CNT
   [junit4]   2> NOTE: Linux 4.4.0-112-generic amd64/Oracle Corporation 1.8.0_191 (64-bit)/cpus=4,threads=1,free=168184872,total=282591232
   [junit4]   2> NOTE: All tests run in this JVM: [SineEvaluatorTest, TestLBHttpSolrClient]
   [junit4] Completed [8/174 (1!)] on J2 in 100.40s, 3 tests, 1 error <<< FAILURES!

[...truncated 48421 lines...]
[asciidoctor:convert] asciidoctor: ERROR: about-this-guide.adoc: line 1: invalid part, must
have at least one section (e.g., chapter, appendix, etc.)
[asciidoctor:convert] asciidoctor: ERROR: solr-glossary.adoc: line 1: invalid part, must have
at least one section (e.g., chapter, appendix, etc.)
     [java] Processed 2458 links (2009 relative) to 3223 anchors in 246 files
     [echo] Validated Links & Anchors via: /home/jenkins/jenkins-slave/workspace/Lucene-Solr-Tests-7.x/solr/build/solr-ref-guide/bare-bones-html/

-documentation-lint:
    [jtidy] Checking for broken html (such as invalid tags)...
   [delete] Deleting directory /home/jenkins/jenkins-slave/workspace/Lucene-Solr-Tests-7.x/lucene/build/jtidy_tmp
     [echo] Checking for broken links...
     [exec] 
     [exec] Crawl/parse...
     [exec] 
     [exec] Verify...
     [echo] Checking for malformed docs...

jar-checksums:

resolve:

ivy-availability-check:
[loadresource] Do not set property disallowed.ivy.jars.list as its length is 0.

-ivy-fail-disallowed-ivy-version:

ivy-fail:

ivy-configure:
[ivy:configure] :: loading settings :: file = /home/jenkins/jenkins-slave/workspace/Lucene-Solr-Tests-7.x/lucene/top-level-ivy-settings.xml

resolve:

ivy-availability-check:
[loadresource] Do not set property disallowed.ivy.jars.list as its length is 0.

-ivy-fail-disallowed-ivy-version:

ivy-fail:

ivy-configure:
[ivy:configure] :: loading settings :: file = /home/jenkins/jenkins-slave/workspace/Lucene-Solr-Tests-7.x/lucene/top-level-ivy-settings.xml

resolve:

resolve:

ivy-availability-check:
[loadresource] Do not set property disallowed.ivy.jars.list as its length is 0.

-ivy-fail-disallowed-ivy-version:

ivy-fail:

ivy-configure:
[ivy:configure] :: loading settings :: file = /home/jenkins/jenkins-slave/workspace/Lucene-Solr-Tests-7.x/lucene/top-level-ivy-settings.xml

resolve:

ivy-availability-check:
[loadresource] Do not set property disallowed.ivy.jars.list as its length is 0.

-ivy-fail-disallowed-ivy-version:

ivy-fail:

ivy-configure:
[ivy:configure] :: loading settings :: file = /home/jenkins/jenkins-slave/workspace/Lucene-Solr-Tests-7.x/lucene/top-level-ivy-settings.xml

resolve:

ivy-availability-check:
[loadresource] Do not set property disallowed.ivy.jars.list as its length is 0.

-ivy-fail-disallowed-ivy-version:

ivy-fail:

ivy-configure:
[ivy:configure] :: loading settings :: file = /home/jenkins/jenkins-slave/workspace/Lucene-Solr-Tests-7.x/lucene/top-level-ivy-settings.xml

resolve:

ivy-availability-check:
[loadresource] Do not set property disallowed.ivy.jars.list as its length is 0.

-ivy-fail-disallowed-ivy-version:

ivy-fail:

ivy-configure:
[ivy:configure] :: loading settings :: file = /home/jenkins/jenkins-slave/workspace/Lucene-Solr-Tests-7.x/lucene/top-level-ivy-settings.xml

resolve:

ivy-availability-check:
[loadresource] Do not set property disallowed.ivy.jars.list as its length is 0.

-ivy-fail-disallowed-ivy-version:

ivy-fail:

ivy-configure:
[ivy:configure] :: loading settings :: file = /home/jenkins/jenkins-slave/workspace/Lucene-Solr-Tests-7.x/lucene/top-level-ivy-settings.xml

resolve:

ivy-availability-check:
[loadresource] Do not set property disallowed.ivy.jars.list as its length is 0.

-ivy-fail-disallowed-ivy-version:

ivy-fail:

ivy-configure:
[ivy:configure] :: loading settings :: file = /home/jenkins/jenkins-slave/workspace/Lucene-Solr-Tests-7.x/lucene/top-level-ivy-settings.xml

resolve:

ivy-availability-check:
[loadresource] Do not set property disallowed.ivy.jars.list as its length is 0.

-ivy-fail-disallowed-ivy-version:

ivy-fail:

ivy-configure:
[ivy:configure] :: loading settings :: file = /home/jenkins/jenkins-slave/workspace/Lucene-Solr-Tests-7.x/lucene/top-level-ivy-settings.xml

resolve:

ivy-availability-check:
[loadresource] Do not set property disallowed.ivy.jars.list as its length is 0.

-ivy-fail-disallowed-ivy-version:

ivy-fail:

ivy-configure:
[ivy:configure] :: loading settings :: file = /home/jenkins/jenkins-slave/workspace/Lucene-Solr-Tests-7.x/lucene/top-level-ivy-settings.xml

resolve:

ivy-availability-check:
[loadresource] Do not set property disallowed.ivy.jars.list as its length is 0.

-ivy-fail-disallowed-ivy-version:

ivy-fail:

ivy-configure:
[ivy:configure] :: loading settings :: file = /home/jenkins/jenkins-slave/workspace/Lucene-Solr-Tests-7.x/lucene/top-level-ivy-settings.xml

resolve:

ivy-availability-check:
[loadresource] Do not set property disallowed.ivy.jars.list as its length is 0.

-ivy-fail-disallowed-ivy-version:

ivy-fail:

ivy-configure:
[ivy:configure] :: loading settings :: file = /home/jenkins/jenkins-slave/workspace/Lucene-Solr-Tests-7.x/lucene/top-level-ivy-settings.xml

resolve:

ivy-availability-check:
[loadresource] Do not set property disallowed.ivy.jars.list as its length is 0.

-ivy-fail-disallowed-ivy-version:

ivy-fail:

ivy-configure:
[ivy:configure] :: loading settings :: file = /home/jenkins/jenkins-slave/workspace/Lucene-Solr-Tests-7.x/lucene/top-level-ivy-settings.xml

resolve:

ivy-availability-check:
[loadresource] Do not set property disallowed.ivy.jars.list as its length is 0.

-ivy-fail-disallowed-ivy-version:

ivy-fail:

ivy-configure:
[ivy:configure] :: loading settings :: file = /home/jenkins/jenkins-slave/workspace/Lucene-Solr-Tests-7.x/lucene/top-level-ivy-settings.xml

resolve:

ivy-availability-check:
[loadresource] Do not set property disallowed.ivy.jars.list as its length is 0.

-ivy-fail-disallowed-ivy-version:

ivy-fail:

ivy-configure:
[ivy:configure] :: loading settings :: file = /home/jenkins/jenkins-slave/workspace/Lucene-Solr-Tests-7.x/lucene/top-level-ivy-settings.xml

resolve:

ivy-availability-check:
[loadresource] Do not set property disallowed.ivy.jars.list as its length is 0.

-ivy-fail-disallowed-ivy-version:

ivy-fail:

ivy-configure:
[ivy:configure] :: loading settings :: file = /home/jenkins/jenkins-slave/workspace/Lucene-Solr-Tests-7.x/lucene/top-level-ivy-settings.xml

resolve:

ivy-availability-check:
[loadresource] Do not set property disallowed.ivy.jars.list as its length is 0.

-ivy-fail-disallowed-ivy-version:

ivy-fail:

ivy-configure:
[ivy:configure] :: loading settings :: file = /home/jenkins/jenkins-slave/workspace/Lucene-Solr-Tests-7.x/lucene/top-level-ivy-settings.xml

resolve:

ivy-availability-check:
[loadresource] Do not set property disallowed.ivy.jars.list as its length is 0.

-ivy-fail-disallowed-ivy-version:

ivy-fail:

ivy-configure:
[ivy:configure] :: loading settings :: file = /home/jenkins/jenkins-slave/workspace/Lucene-Solr-Tests-7.x/lucene/top-level-ivy-settings.xml

resolve:

ivy-availability-check:
[loadresource] Do not set property disallowed.ivy.jars.list as its length is 0.

-ivy-fail-disallowed-ivy-version:

ivy-fail:

ivy-configure:
[ivy:configure] :: loading settings :: file = /home/jenkins/jenkins-slave/workspace/Lucene-Solr-Tests-7.x/lucene/top-level-ivy-settings.xml

resolve:

ivy-availability-check:
[loadresource] Do not set property disallowed.ivy.jars.list as its length is 0.

-ivy-fail-disallowed-ivy-version:

ivy-fail:

ivy-configure:
[ivy:configure] :: loading settings :: file = /home/jenkins/jenkins-slave/workspace/Lucene-Solr-Tests-7.x/lucene/top-level-ivy-settings.xml

resolve:

ivy-availability-check:
[loadresource] Do not set property disallowed.ivy.jars.list as its length is 0.

-ivy-fail-disallowed-ivy-version:

ivy-fail:

ivy-configure:
[ivy:configure] :: loading settings :: file = /home/jenkins/jenkins-slave/workspace/Lucene-Solr-Tests-7.x/lucene/top-level-ivy-settings.xml

resolve:

ivy-availability-check:
[loadresource] Do not set property disallowed.ivy.jars.list as its length is 0.

-ivy-fail-disallowed-ivy-version:

ivy-fail:

ivy-configure:
[ivy:configure] :: loading settings :: file = /home/jenkins/jenkins-slave/workspace/Lucene-Solr-Tests-7.x/lucene/top-level-ivy-settings.xml

resolve:

ivy-availability-check:
[loadresource] Do not set property disallowed.ivy.jars.list as its length is 0.

-ivy-fail-disallowed-ivy-version:

ivy-fail:

ivy-configure:
[ivy:configure] :: loading settings :: file = /home/jenkins/jenkins-slave/workspace/Lucene-Solr-Tests-7.x/lucene/top-level-ivy-settings.xml

resolve:

ivy-availability-check:
[loadresource] Do not set property disallowed.ivy.jars.list as its length is 0.

-ivy-fail-disallowed-ivy-version:

ivy-fail:

ivy-configure:
[ivy:configure] :: loading settings :: file = /home/jenkins/jenkins-slave/workspace/Lucene-Solr-Tests-7.x/lucene/top-level-ivy-settings.xml

resolve:

ivy-availability-check:
[loadresource] Do not set property disallowed.ivy.jars.list as its length is 0.

-ivy-fail-disallowed-ivy-version:

ivy-fail:

ivy-configure:
[ivy:configure] :: loading settings :: file = /home/jenkins/jenkins-slave/workspace/Lucene-Solr-Tests-7.x/lucene/top-level-ivy-settings.xml

resolve:

ivy-availability-check:
[loadresource] Do not set property disallowed.ivy.jars.list as its length is 0.

-ivy-fail-disallowed-ivy-version:

ivy-fail:

ivy-configure:
[ivy:configure] :: loading settings :: file = /home/jenkins/jenkins-slave/workspace/Lucene-Solr-Tests-7.x/lucene/top-level-ivy-settings.xml

common.resolve:

resolve:

ivy-availability-check:
[loadresource] Do not set property disallowed.ivy.jars.list as its length is 0.

-ivy-fail-disallowed-ivy-version:

ivy-fail:

ivy-configure:
[ivy:configure] :: loading settings :: file = /home/jenkins/jenkins-slave/workspace/Lucene-Solr-Tests-7.x/lucene/top-level-ivy-settings.xml

resolve:

ivy-availability-check:
[loadresource] Do not set property disallowed.ivy.jars.list as its length is 0.

-ivy-fail-disallowed-ivy-version:

ivy-fail:

ivy-configure:
[ivy:configure] :: loading settings :: file = /home/jenkins/jenkins-slave/workspace/Lucene-Solr-Tests-7.x/lucene/top-level-ivy-settings.xml

resolve:

ivy-availability-check:
[loadresource] Do not set property disallowed.ivy.jars.list as its length is 0.

-ivy-fail-disallowed-ivy-version:

ivy-fail:

ivy-configure:
[ivy:configure] :: loading settings :: file = /home/jenkins/jenkins-slave/workspace/Lucene-Solr-Tests-7.x/lucene/top-level-ivy-settings.xml

resolve:

ivy-availability-check:
[loadresource] Do not set property disallowed.ivy.jars.list as its length is 0.

-ivy-fail-disallowed-ivy-version:

ivy-fail:

ivy-configure:
[ivy:configure] :: loading settings :: file = /home/jenkins/jenkins-slave/workspace/Lucene-Solr-Tests-7.x/lucene/top-level-ivy-settings.xml

resolve:

ivy-availability-check:
[loadresource] Do not set property disallowed.ivy.jars.list as its length is 0.

-ivy-fail-disallowed-ivy-version:

ivy-fail:

ivy-configure:
[ivy:configure] :: loading settings :: file = /home/jenkins/jenkins-slave/workspace/Lucene-Solr-Tests-7.x/lucene/top-level-ivy-settings.xml

resolve:

jar-checksums:
    [mkdir] Created dir: /home/jenkins/jenkins-slave/workspace/Lucene-Solr-Tests-7.x/lucene/null2076356704
     [copy] Copying 36 files to /home/jenkins/jenkins-slave/workspace/Lucene-Solr-Tests-7.x/lucene/null2076356704
   [delete] Deleting directory /home/jenkins/jenkins-slave/workspace/Lucene-Solr-Tests-7.x/lucene/null2076356704

resolve-example:

ivy-availability-check:
[loadresource] Do not set property disallowed.ivy.jars.list as its length is 0.

-ivy-fail-disallowed-ivy-version:

ivy-fail:

ivy-configure:
[ivy:configure] :: loading settings :: file = /home/jenkins/jenkins-slave/workspace/Lucene-Solr-Tests-7.x/lucene/top-level-ivy-settings.xml

resolve:

resolve-server:

ivy-availability-check:
[loadresource] Do not set property disallowed.ivy.jars.list as its length is 0.

-ivy-fail-disallowed-ivy-version:

ivy-fail:

ivy-fail:

ivy-configure:
[ivy:configure] :: loading settings :: file = /home/jenkins/jenkins-slave/workspace/Lucene-Solr-Tests-7.x/lucene/top-level-ivy-settings.xml

resolve:

resolve:

ivy-availability-check:
[loadresource] Do not set property disallowed.ivy.jars.list as its length is 0.

-ivy-fail-disallowed-ivy-version:

ivy-fail:

ivy-fail:

ivy-configure:
[ivy:configure] :: loading settings :: file = /home/jenkins/jenkins-slave/workspace/Lucene-Solr-Tests-7.x/lucene/top-level-ivy-settings.xml

resolve:

ivy-availability-check:
[loadresource] Do not set property disallowed.ivy.jars.list as its length is 0.

-ivy-fail-disallowed-ivy-version:

ivy-fail:

ivy-fail:

ivy-configure:
[ivy:configure] :: loading settings :: file = /home/jenkins/jenkins-slave/workspace/Lucene-Solr-Tests-7.x/lucene/top-level-ivy-settings.xml

resolve:

ivy-availability-check:
[loadresource] Do not set property disallowed.ivy.jars.list as its length is 0.

-ivy-fail-disallowed-ivy-version:

ivy-fail:

ivy-configure:
[ivy:configure] :: loading settings :: file = /home/jenkins/jenkins-slave/workspace/Lucene-Solr-Tests-7.x/lucene/top-level-ivy-settings.xml

resolve:

ivy-availability-check:
[loadresource] Do not set property disallowed.ivy.jars.list as its length is 0.

-ivy-fail-disallowed-ivy-version:

ivy-fail:

ivy-fail:

ivy-configure:
[ivy:configure] :: loading settings :: file = /home/jenkins/jenkins-slave/workspace/Lucene-Solr-Tests-7.x/lucene/top-level-ivy-settings.xml

resolve:

ivy-availability-check:
[loadresource] Do not set property disallowed.ivy.jars.list as its length is 0.

-ivy-fail-disallowed-ivy-version:

ivy-fail:

ivy-configure:
[ivy:configure] :: loading settings :: file = /home/jenkins/jenkins-slave/workspace/Lucene-Solr-Tests-7.x/lucene/top-level-ivy-settings.xml

resolve:

ivy-availability-check:
[loadresource] Do not set property disallowed.ivy.jars.list as its length is 0.

-ivy-fail-disallowed-ivy-version:

ivy-fail:

ivy-fail:

ivy-configure:
[ivy:configure] :: loading settings :: file = /home/jenkins/jenkins-slave/workspace/Lucene-Solr-Tests-7.x/lucene/top-level-ivy-settings.xml

resolve:

ivy-availability-check:
[loadresource] Do not set property disallowed.ivy.jars.list as its length is 0.

-ivy-fail-disallowed-ivy-version:

ivy-fail:

ivy-fail:

ivy-configure:
[ivy:configure] :: loading settings :: file = /home/jenkins/jenkins-slave/workspace/Lucene-Solr-Tests-7.x/lucene/top-level-ivy-settings.xml

resolve:

ivy-availability-check:
[loadresource] Do not set property disallowed.ivy.jars.list as its length is 0.

-ivy-fail-disallowed-ivy-version:

ivy-fail:

ivy-fail:

ivy-configure:
[ivy:configure] :: loading settings :: file = /home/jenkins/jenkins-slave/workspace/Lucene-Solr-Tests-7.x/lucene/top-level-ivy-settings.xml

resolve:

ivy-availability-check:
[loadresource] Do not set property disallowed.ivy.jars.list as its length is 0.

-ivy-fail-disallowed-ivy-version:

ivy-fail:

ivy-fail:

ivy-configure:
[ivy:configure] :: loading settings :: file = /home/jenkins/jenkins-slave/workspace/Lucene-Solr-Tests-7.x/lucene/top-level-ivy-settings.xml

resolve:

ivy-availability-check:
[loadresource] Do not set property disallowed.ivy.jars.list as its length is 0.

-ivy-fail-disallowed-ivy-version:

ivy-fail:

ivy-fail:

ivy-configure:
[ivy:configure] :: loading settings :: file = /home/jenkins/jenkins-slave/workspace/Lucene-Solr-Tests-7.x/lucene/top-level-ivy-settings.xml

resolve:

ivy-availability-check:
[loadresource] Do not set property disallowed.ivy.jars.list as its length is 0.

-ivy-fail-disallowed-ivy-version:

ivy-fail:

ivy-fail:

ivy-configure:
[ivy:configure] :: loading settings :: file = /home/jenkins/jenkins-slave/workspace/Lucene-Solr-Tests-7.x/lucene/top-level-ivy-settings.xml

resolve:

ivy-availability-check:
[loadresource] Do not set property disallowed.ivy.jars.list as its length is 0.

-ivy-fail-disallowed-ivy-version:

ivy-fail:

ivy-fail:

ivy-configure:
[ivy:configure] :: loading settings :: file = /home/jenkins/jenkins-slave/workspace/Lucene-Solr-Tests-7.x/lucene/top-level-ivy-settings.xml

resolve:

ivy-availability-check:
[loadresource] Do not set property disallowed.ivy.jars.list as its length is 0.

-ivy-fail-disallowed-ivy-version:

ivy-fail:

ivy-fail:

ivy-configure:
[ivy:configure] :: loading settings :: file = /home/jenkins/jenkins-slave/workspace/Lucene-Solr-Tests-7.x/lucene/top-level-ivy-settings.xml

resolve:

ivy-availability-check:
[loadresource] Do not set property disallowed.ivy.jars.list as its length is 0.

-ivy-fail-disallowed-ivy-version:

ivy-fail:

ivy-fail:

ivy-configure:
[ivy:configure] :: loading settings :: file = /home/jenkins/jenkins-slave/workspace/Lucene-Solr-Tests-7.x/lucene/top-level-ivy-settings.xml

resolve:

ivy-availability-check:
[loadresource] Do not set property disallowed.ivy.jars.list as its length is 0.

-ivy-fail-disallowed-ivy-version:

ivy-fail:

ivy-fail:

ivy-configure:
[ivy:configure] :: loading settings :: file = /home/jenkins/jenkins-slave/workspace/Lucene-Solr-Tests-7.x/lucene/top-level-ivy-settings.xml

resolve:

jar-checksums:
    [mkdir] Created dir: /home/jenkins/jenkins-slave/workspace/Lucene-Solr-Tests-7.x/solr/null34686697
     [copy] Copying 242 files to /home/jenkins/jenkins-slave/workspace/Lucene-Solr-Tests-7.x/solr/null34686697
   [delete] Deleting directory /home/jenkins/jenkins-slave/workspace/Lucene-Solr-Tests-7.x/solr/null34686697

check-working-copy:
[ivy:cachepath] :: resolving dependencies :: org.eclipse.jgit#org.eclipse.jgit-caller;working
[ivy:cachepath] 	confs: [default]
[ivy:cachepath] 	found org.eclipse.jgit#org.eclipse.jgit;4.6.0.201612231935-r in public
[ivy:cachepath] 	found com.jcraft#jsch;0.1.53 in public
[ivy:cachepath] 	found com.googlecode.javaewah#JavaEWAH;1.1.6 in public
[ivy:cachepath] 	found org.apache.httpcomponents#httpclient;4.3.6 in public
[ivy:cachepath] 	found org.apache.httpcomponents#httpcore;4.3.3 in public
[ivy:cachepath] 	found commons-logging#commons-logging;1.1.3 in public
[ivy:cachepath] 	found commons-codec#commons-codec;1.6 in public
[ivy:cachepath] 	found org.slf4j#slf4j-api;1.7.2 in public
[ivy:cachepath] :: resolution report :: resolve 52ms :: artifacts dl 1ms
	---------------------------------------------------------------------
	|                  |            modules            ||   artifacts   |
	|       conf       | number| search|dwnlded|evicted|| number|dwnlded|
	---------------------------------------------------------------------
	|      default     |   8   |   0   |   0   |   0   ||   8   |   0   |
	---------------------------------------------------------------------
[wc-checker] Initializing working copy...
[wc-checker] SLF4J: Failed to load class "org.slf4j.impl.StaticLoggerBinder".
[wc-checker] SLF4J: Defaulting to no-operation (NOP) logger implementation
[wc-checker] SLF4J: See http://www.slf4j.org/codes.html#StaticLoggerBinder for further details.
[wc-checker] Checking working copy status...

-jenkins-base:

BUILD SUCCESSFUL
Total time: 203 minutes 22 seconds
Archiving artifacts
java.lang.InterruptedException: no matches found within 10000
	at hudson.FilePath$ValidateAntFileMask.hasMatch(FilePath.java:2847)
	at hudson.FilePath$ValidateAntFileMask.invoke(FilePath.java:2726)
	at hudson.FilePath$ValidateAntFileMask.invoke(FilePath.java:2707)
	at hudson.FilePath$FileCallableWrapper.call(FilePath.java:3086)
Also:   hudson.remoting.Channel$CallSiteStackTrace: Remote call to lucene2
		at hudson.remoting.Channel.attachCallSiteStackTrace(Channel.java:1741)
		at hudson.remoting.UserRequest$ExceptionResponse.retrieve(UserRequest.java:357)
		at hudson.remoting.Channel.call(Channel.java:955)
		at hudson.FilePath.act(FilePath.java:1072)
		at hudson.FilePath.act(FilePath.java:1061)
		at hudson.FilePath.validateAntFileMask(FilePath.java:2705)
		at hudson.tasks.ArtifactArchiver.perform(ArtifactArchiver.java:243)
		at hudson.tasks.BuildStepCompatibilityLayer.perform(BuildStepCompatibilityLayer.java:81)
		at hudson.tasks.BuildStepMonitor$1.perform(BuildStepMonitor.java:20)
		at hudson.model.AbstractBuild$AbstractBuildExecution.perform(AbstractBuild.java:744)
		at hudson.model.AbstractBuild$AbstractBuildExecution.performAllBuildSteps(AbstractBuild.java:690)
		at hudson.model.Build$BuildExecution.post2(Build.java:186)
		at hudson.model.AbstractBuild$AbstractBuildExecution.post(AbstractBuild.java:635)
		at hudson.model.Run.execute(Run.java:1835)
		at hudson.model.FreeStyleBuild.run(FreeStyleBuild.java:43)
		at hudson.model.ResourceController.execute(ResourceController.java:97)
		at hudson.model.Executor.run(Executor.java:429)
Caused: hudson.FilePath$TunneledInterruptedException
	at hudson.FilePath$FileCallableWrapper.call(FilePath.java:3088)
	at hudson.remoting.UserRequest.perform(UserRequest.java:212)
	at hudson.remoting.UserRequest.perform(UserRequest.java:54)
	at hudson.remoting.Request$2.run(Request.java:369)
	at hudson.remoting.InterceptingExecutorService$1.call(InterceptingExecutorService.java:72)
	at java.util.concurrent.FutureTask.run(FutureTask.java:266)
	at java.util.concurrent.ThreadPoolExecutor.runWorker(ThreadPoolExecutor.java:1142)
	at java.util.concurrent.ThreadPoolExecutor$Worker.run(ThreadPoolExecutor.java:617)
	at java.lang.Thread.run(Thread.java:748)
Caused: java.lang.InterruptedException: java.lang.InterruptedException: no matches found within
10000
	at hudson.FilePath.act(FilePath.java:1074)
	at hudson.FilePath.act(FilePath.java:1061)
	at hudson.FilePath.validateAntFileMask(FilePath.java:2705)
	at hudson.tasks.ArtifactArchiver.perform(ArtifactArchiver.java:243)
	at hudson.tasks.BuildStepCompatibilityLayer.perform(BuildStepCompatibilityLayer.java:81)
	at hudson.tasks.BuildStepMonitor$1.perform(BuildStepMonitor.java:20)
	at hudson.model.AbstractBuild$AbstractBuildExecution.perform(AbstractBuild.java:744)
	at hudson.model.AbstractBuild$AbstractBuildExecution.performAllBuildSteps(AbstractBuild.java:690)
	at hudson.model.Build$BuildExecution.post2(Build.java:186)
	at hudson.model.AbstractBuild$AbstractBuildExecution.post(AbstractBuild.java:635)
	at hudson.model.Run.execute(Run.java:1835)
	at hudson.model.FreeStyleBuild.run(FreeStyleBuild.java:43)
	at hudson.model.ResourceController.execute(ResourceController.java:97)
	at hudson.model.Executor.run(Executor.java:429)
No artifacts found that match the file pattern "**/*.events,heapdumps/**,**/hs_err_pid*".
Configuration error?
Recording test results
Build step 'Publish JUnit test result report' changed build result to UNSTABLE
Email was triggered for: Unstable (Test Failures)
Sending email for trigger: Unstable (Test Failures)

Mime
View raw message