lucene-dev mailing list archives

Site index · List index
Message view « Date » · « Thread »
Top « Date » · « Thread »
From Apache Jenkins Server <jenk...@builds.apache.org>
Subject [JENKINS] Lucene-Solr-NightlyTests-master - Build # 1754 - Failure
Date Sat, 19 Jan 2019 08:28:33 GMT
Build: https://builds.apache.org/job/Lucene-Solr-NightlyTests-master/1754/

2 tests failed.
FAILED:  org.apache.lucene.analysis.core.TestRandomChains.testRandomChainsWithLargeStrings

Error Message:
some thread(s) failed

Stack Trace:
java.lang.RuntimeException: some thread(s) failed
	at org.apache.lucene.analysis.BaseTokenStreamTestCase.checkRandomData(BaseTokenStreamTestCase.java:581)
	at org.apache.lucene.analysis.core.TestRandomChains.testRandomChainsWithLargeStrings(TestRandomChains.java:899)
	at sun.reflect.NativeMethodAccessorImpl.invoke0(Native Method)
	at sun.reflect.NativeMethodAccessorImpl.invoke(NativeMethodAccessorImpl.java:62)
	at sun.reflect.DelegatingMethodAccessorImpl.invoke(DelegatingMethodAccessorImpl.java:43)
	at java.lang.reflect.Method.invoke(Method.java:498)
	at com.carrotsearch.randomizedtesting.RandomizedRunner.invoke(RandomizedRunner.java:1750)
	at com.carrotsearch.randomizedtesting.RandomizedRunner$8.evaluate(RandomizedRunner.java:938)
	at com.carrotsearch.randomizedtesting.RandomizedRunner$9.evaluate(RandomizedRunner.java:974)
	at com.carrotsearch.randomizedtesting.RandomizedRunner$10.evaluate(RandomizedRunner.java:988)
	at org.apache.lucene.util.TestRuleSetupTeardownChained$1.evaluate(TestRuleSetupTeardownChained.java:49)
	at org.apache.lucene.util.AbstractBeforeAfterRule$1.evaluate(AbstractBeforeAfterRule.java:45)
	at org.apache.lucene.util.TestRuleThreadAndTestName$1.evaluate(TestRuleThreadAndTestName.java:48)
	at org.apache.lucene.util.TestRuleIgnoreAfterMaxFailures$1.evaluate(TestRuleIgnoreAfterMaxFailures.java:64)
	at org.apache.lucene.util.TestRuleMarkFailure$1.evaluate(TestRuleMarkFailure.java:47)
	at com.carrotsearch.randomizedtesting.rules.StatementAdapter.evaluate(StatementAdapter.java:36)
	at com.carrotsearch.randomizedtesting.ThreadLeakControl$StatementRunner.run(ThreadLeakControl.java:368)
	at com.carrotsearch.randomizedtesting.ThreadLeakControl.forkTimeoutingTask(ThreadLeakControl.java:817)
	at com.carrotsearch.randomizedtesting.ThreadLeakControl$3.evaluate(ThreadLeakControl.java:468)
	at com.carrotsearch.randomizedtesting.RandomizedRunner.runSingleTest(RandomizedRunner.java:947)
	at com.carrotsearch.randomizedtesting.RandomizedRunner$5.evaluate(RandomizedRunner.java:832)
	at com.carrotsearch.randomizedtesting.RandomizedRunner$6.evaluate(RandomizedRunner.java:883)
	at com.carrotsearch.randomizedtesting.RandomizedRunner$7.evaluate(RandomizedRunner.java:894)
	at org.apache.lucene.util.AbstractBeforeAfterRule$1.evaluate(AbstractBeforeAfterRule.java:45)
	at com.carrotsearch.randomizedtesting.rules.StatementAdapter.evaluate(StatementAdapter.java:36)
	at org.apache.lucene.util.TestRuleStoreClassName$1.evaluate(TestRuleStoreClassName.java:41)
	at com.carrotsearch.randomizedtesting.rules.NoShadowingOrOverridesOnMethodsRule$1.evaluate(NoShadowingOrOverridesOnMethodsRule.java:40)
	at com.carrotsearch.randomizedtesting.rules.NoShadowingOrOverridesOnMethodsRule$1.evaluate(NoShadowingOrOverridesOnMethodsRule.java:40)
	at com.carrotsearch.randomizedtesting.rules.StatementAdapter.evaluate(StatementAdapter.java:36)
	at com.carrotsearch.randomizedtesting.rules.StatementAdapter.evaluate(StatementAdapter.java:36)
	at com.carrotsearch.randomizedtesting.rules.StatementAdapter.evaluate(StatementAdapter.java:36)
	at org.apache.lucene.util.TestRuleAssertionsRequired$1.evaluate(TestRuleAssertionsRequired.java:53)
	at org.apache.lucene.util.TestRuleMarkFailure$1.evaluate(TestRuleMarkFailure.java:47)
	at org.apache.lucene.util.TestRuleIgnoreAfterMaxFailures$1.evaluate(TestRuleIgnoreAfterMaxFailures.java:64)
	at org.apache.lucene.util.TestRuleIgnoreTestSuites$1.evaluate(TestRuleIgnoreTestSuites.java:54)
	at com.carrotsearch.randomizedtesting.rules.StatementAdapter.evaluate(StatementAdapter.java:36)
	at com.carrotsearch.randomizedtesting.ThreadLeakControl$StatementRunner.run(ThreadLeakControl.java:368)
	at java.lang.Thread.run(Thread.java:748)


FAILED:  org.apache.solr.cloud.RollingRestartTest.test

Error Message:
Address already in use

Stack Trace:
java.net.BindException: Address already in use
	at __randomizedtesting.SeedInfo.seed([EAEE53A87ED43831:62BA6C72D02855C9]:0)
	at sun.nio.ch.Net.bind0(Native Method)
	at sun.nio.ch.Net.bind(Net.java:433)
	at sun.nio.ch.Net.bind(Net.java:425)
	at sun.nio.ch.ServerSocketChannelImpl.bind(ServerSocketChannelImpl.java:223)
	at sun.nio.ch.ServerSocketAdaptor.bind(ServerSocketAdaptor.java:74)
	at org.eclipse.jetty.server.ServerConnector.openAcceptChannel(ServerConnector.java:342)
	at org.eclipse.jetty.server.ServerConnector.open(ServerConnector.java:308)
	at org.eclipse.jetty.server.AbstractNetworkConnector.doStart(AbstractNetworkConnector.java:80)
	at org.eclipse.jetty.server.ServerConnector.doStart(ServerConnector.java:236)
	at org.eclipse.jetty.util.component.AbstractLifeCycle.start(AbstractLifeCycle.java:68)
	at org.eclipse.jetty.server.Server.doStart(Server.java:394)
	at org.eclipse.jetty.util.component.AbstractLifeCycle.start(AbstractLifeCycle.java:68)
	at org.apache.solr.client.solrj.embedded.JettySolrRunner.retryOnPortBindFailure(JettySolrRunner.java:544)
	at org.apache.solr.client.solrj.embedded.JettySolrRunner.start(JettySolrRunner.java:483)
	at org.apache.solr.client.solrj.embedded.JettySolrRunner.start(JettySolrRunner.java:451)
	at org.apache.solr.cloud.RollingRestartTest.restartWithRolesTest(RollingRestartTest.java:104)
	at org.apache.solr.cloud.RollingRestartTest.test(RollingRestartTest.java:53)
	at sun.reflect.NativeMethodAccessorImpl.invoke0(Native Method)
	at sun.reflect.NativeMethodAccessorImpl.invoke(NativeMethodAccessorImpl.java:62)
	at sun.reflect.DelegatingMethodAccessorImpl.invoke(DelegatingMethodAccessorImpl.java:43)
	at java.lang.reflect.Method.invoke(Method.java:498)
	at com.carrotsearch.randomizedtesting.RandomizedRunner.invoke(RandomizedRunner.java:1750)
	at com.carrotsearch.randomizedtesting.RandomizedRunner$8.evaluate(RandomizedRunner.java:938)
	at com.carrotsearch.randomizedtesting.RandomizedRunner$9.evaluate(RandomizedRunner.java:974)
	at com.carrotsearch.randomizedtesting.RandomizedRunner$10.evaluate(RandomizedRunner.java:988)
	at org.apache.solr.BaseDistributedSearchTestCase$ShardsRepeatRule$ShardsFixedStatement.callStatement(BaseDistributedSearchTestCase.java:1082)
	at org.apache.solr.BaseDistributedSearchTestCase$ShardsRepeatRule$ShardsStatement.evaluate(BaseDistributedSearchTestCase.java:1054)
	at com.carrotsearch.randomizedtesting.rules.SystemPropertiesRestoreRule$1.evaluate(SystemPropertiesRestoreRule.java:57)
	at org.apache.lucene.util.TestRuleSetupTeardownChained$1.evaluate(TestRuleSetupTeardownChained.java:49)
	at org.apache.lucene.util.AbstractBeforeAfterRule$1.evaluate(AbstractBeforeAfterRule.java:45)
	at org.apache.lucene.util.TestRuleThreadAndTestName$1.evaluate(TestRuleThreadAndTestName.java:48)
	at org.apache.lucene.util.TestRuleIgnoreAfterMaxFailures$1.evaluate(TestRuleIgnoreAfterMaxFailures.java:64)
	at org.apache.lucene.util.TestRuleMarkFailure$1.evaluate(TestRuleMarkFailure.java:47)
	at com.carrotsearch.randomizedtesting.rules.StatementAdapter.evaluate(StatementAdapter.java:36)
	at com.carrotsearch.randomizedtesting.ThreadLeakControl$StatementRunner.run(ThreadLeakControl.java:368)
	at com.carrotsearch.randomizedtesting.ThreadLeakControl.forkTimeoutingTask(ThreadLeakControl.java:817)
	at com.carrotsearch.randomizedtesting.ThreadLeakControl$3.evaluate(ThreadLeakControl.java:468)
	at com.carrotsearch.randomizedtesting.RandomizedRunner.runSingleTest(RandomizedRunner.java:947)
	at com.carrotsearch.randomizedtesting.RandomizedRunner$5.evaluate(RandomizedRunner.java:832)
	at com.carrotsearch.randomizedtesting.RandomizedRunner$6.evaluate(RandomizedRunner.java:883)
	at com.carrotsearch.randomizedtesting.RandomizedRunner$7.evaluate(RandomizedRunner.java:894)
	at com.carrotsearch.randomizedtesting.rules.StatementAdapter.evaluate(StatementAdapter.java:36)
	at com.carrotsearch.randomizedtesting.rules.SystemPropertiesRestoreRule$1.evaluate(SystemPropertiesRestoreRule.java:57)
	at org.apache.lucene.util.AbstractBeforeAfterRule$1.evaluate(AbstractBeforeAfterRule.java:45)
	at com.carrotsearch.randomizedtesting.rules.StatementAdapter.evaluate(StatementAdapter.java:36)
	at org.apache.lucene.util.TestRuleStoreClassName$1.evaluate(TestRuleStoreClassName.java:41)
	at com.carrotsearch.randomizedtesting.rules.NoShadowingOrOverridesOnMethodsRule$1.evaluate(NoShadowingOrOverridesOnMethodsRule.java:40)
	at com.carrotsearch.randomizedtesting.rules.NoShadowingOrOverridesOnMethodsRule$1.evaluate(NoShadowingOrOverridesOnMethodsRule.java:40)
	at com.carrotsearch.randomizedtesting.rules.StatementAdapter.evaluate(StatementAdapter.java:36)
	at com.carrotsearch.randomizedtesting.rules.StatementAdapter.evaluate(StatementAdapter.java:36)
	at com.carrotsearch.randomizedtesting.rules.StatementAdapter.evaluate(StatementAdapter.java:36)
	at org.apache.lucene.util.TestRuleAssertionsRequired$1.evaluate(TestRuleAssertionsRequired.java:53)
	at org.apache.lucene.util.TestRuleMarkFailure$1.evaluate(TestRuleMarkFailure.java:47)
	at org.apache.lucene.util.TestRuleIgnoreAfterMaxFailures$1.evaluate(TestRuleIgnoreAfterMaxFailures.java:64)
	at org.apache.lucene.util.TestRuleIgnoreTestSuites$1.evaluate(TestRuleIgnoreTestSuites.java:54)
	at com.carrotsearch.randomizedtesting.rules.StatementAdapter.evaluate(StatementAdapter.java:36)
	at com.carrotsearch.randomizedtesting.ThreadLeakControl$StatementRunner.run(ThreadLeakControl.java:368)
	at java.lang.Thread.run(Thread.java:748)




Build Log:
[...truncated 3912 lines...]
   [junit4] Suite: org.apache.lucene.analysis.core.TestRandomChains
   [junit4]   2> TEST FAIL: useCharFilter=true text='p?title=Cais_do_Sodr%c3%a9&oldid=199432292 ] | importance= | date=July 13, 2008 '
   [junit4]   2> كانون الثاني 19, 2019 1:16:54 م com.carrotsearch.randomizedtesting.RandomizedRunner$QueueUncaughtExceptionsHandler uncaughtException
   [junit4]   2> WARNING: Uncaught exception in thread: Thread[Thread-115,5,TGRP-TestRandomChains]
   [junit4]   2> java.lang.OutOfMemoryError: GC overhead limit exceeded
   [junit4]   2> 	at __randomizedtesting.SeedInfo.seed([3D7E18734A53713E]:0)
   [junit4]   2> 	at java.util.Arrays.copyOf(Arrays.java:3332)
   [junit4]   2> 	at java.lang.AbstractStringBuilder.ensureCapacityInternal(AbstractStringBuilder.java:124)
   [junit4]   2> 	at java.lang.AbstractStringBuilder.append(AbstractStringBuilder.java:448)
   [junit4]   2> 	at java.lang.StringBuilder.append(StringBuilder.java:136)
   [junit4]   2> 	at java.lang.StringBuilder.append(StringBuilder.java:131)
   [junit4]   2> 	at org.apache.lucene.analysis.BaseTokenStreamTestCase.assertTokenStreamContents(BaseTokenStreamTestCase.java:207)
   [junit4]   2> 	at org.apache.lucene.analysis.BaseTokenStreamTestCase.assertTokenStreamContents(BaseTokenStreamTestCase.java:320)
   [junit4]   2> 	at org.apache.lucene.analysis.BaseTokenStreamTestCase.assertTokenStreamContents(BaseTokenStreamTestCase.java:324)
   [junit4]   2> 	at org.apache.lucene.analysis.BaseTokenStreamTestCase.checkAnalysisConsistency(BaseTokenStreamTestCase.java:858)
   [junit4]   2> 	at org.apache.lucene.analysis.BaseTokenStreamTestCase.checkRandomData(BaseTokenStreamTestCase.java:657)
   [junit4]   2> 	at org.apache.lucene.analysis.BaseTokenStreamTestCase.access$000(BaseTokenStreamTestCase.java:67)
   [junit4]   2> 	at org.apache.lucene.analysis.BaseTokenStreamTestCase$AnalysisThread.run(BaseTokenStreamTestCase.java:531)
   [junit4]   2> 
   [junit4]   2> Exception from random analyzer: 
   [junit4]   2> charfilters=
   [junit4]   2> tokenizer=
   [junit4]   2>   org.apache.lucene.analysis.ngram.NGramTokenizer(org.apache.lucene.util.AttributeFactory$1@215685e1, 26, 36)
   [junit4]   2> filters=
   [junit4]   2>   org.apache.lucene.analysis.shingle.ShingleFilter(ValidatingTokenFilter@275c836c term=,bytes=[],startOffset=0,endOffset=0,positionIncrement=1,positionLength=1,type=word,termFrequency=1,flags=0,payload=null, 48)
   [junit4]   2>   org.apache.lucene.analysis.shingle.ShingleFilter(ValidatingTokenFilter@3dea2f49 term=,bytes=[],startOffset=0,endOffset=0,positionIncrement=1,positionLength=1,type=word,termFrequency=1,flags=0,payload=null)
   [junit4]   2> NOTE: download the large Jenkins line-docs file by running 'ant get-jenkins-line-docs' in the lucene directory.
   [junit4]   2> NOTE: reproduce with: ant test  -Dtestcase=TestRandomChains -Dtests.method=testRandomChainsWithLargeStrings -Dtests.seed=3D7E18734A53713E -Dtests.multiplier=2 -Dtests.nightly=true -Dtests.slow=true -Dtests.linedocsfile=/home/jenkins/jenkins-slave/workspace/Lucene-Solr-NightlyTests-master/test-data/enwiki.random.lines.txt -Dtests.locale=ar-SY -Dtests.timezone=Asia/Macau -Dtests.asserts=true -Dtests.file.encoding=UTF-8
   [junit4] ERROR    384s J2 | TestRandomChains.testRandomChainsWithLargeStrings <<<
   [junit4]    > Throwable #1: java.lang.RuntimeException: some thread(s) failed
   [junit4]    > 	at org.apache.lucene.analysis.BaseTokenStreamTestCase.checkRandomData(BaseTokenStreamTestCase.java:581)
   [junit4]    > 	at org.apache.lucene.analysis.core.TestRandomChains.testRandomChainsWithLargeStrings(TestRandomChains.java:899)
   [junit4]    > 	at java.lang.Thread.run(Thread.java:748)Throwable #2: com.carrotsearch.randomizedtesting.UncaughtExceptionError: Captured an uncaught exception in thread: Thread[id=207, name=Thread-115, state=RUNNABLE, group=TGRP-TestRandomChains]
   [junit4]    > Caused by: java.lang.OutOfMemoryError: GC overhead limit exceeded
   [junit4]    > 	at __randomizedtesting.SeedInfo.seed([3D7E18734A53713E]:0)
   [junit4]    > 	at java.util.Arrays.copyOf(Arrays.java:3332)
   [junit4]    > 	at java.lang.AbstractStringBuilder.ensureCapacityInternal(AbstractStringBuilder.java:124)
   [junit4]    > 	at java.lang.AbstractStringBuilder.append(AbstractStringBuilder.java:448)
   [junit4]    > 	at java.lang.StringBuilder.append(StringBuilder.java:136)
   [junit4]    > 	at java.lang.StringBuilder.append(StringBuilder.java:131)
   [junit4]    > 	at org.apache.lucene.analysis.BaseTokenStreamTestCase.assertTokenStreamContents(BaseTokenStreamTestCase.java:207)
   [junit4]    > 	at org.apache.lucene.analysis.BaseTokenStreamTestCase.assertTokenStreamContents(BaseTokenStreamTestCase.java:320)
   [junit4]    > 	at org.apache.lucene.analysis.BaseTokenStreamTestCase.assertTokenStreamContents(BaseTokenStreamTestCase.java:324)
   [junit4]    > 	at org.apache.lucene.analysis.BaseTokenStreamTestCase.checkAnalysisConsistency(BaseTokenStreamTestCase.java:858)
   [junit4]    > 	at org.apache.lucene.analysis.BaseTokenStreamTestCase.checkRandomData(BaseTokenStreamTestCase.java:657)
   [junit4]    > 	at org.apache.lucene.analysis.BaseTokenStreamTestCase.access$000(BaseTokenStreamTestCase.java:67)
   [junit4]    > 	at org.apache.lucene.analysis.BaseTokenStreamTestCase$AnalysisThread.run(BaseTokenStreamTestCase.java:531)
   [junit4]   2> NOTE: leaving temporary files on disk at: /x1/jenkins/jenkins-slave/workspace/Lucene-Solr-NightlyTests-master/checkout/lucene/build/analysis/common/test/J2/temp/lucene.analysis.core.TestRandomChains_3D7E18734A53713E-001
   [junit4]   2> NOTE: test params are: codec=Asserting(Lucene80): {dummy=Lucene50(blocksize=128)}, docValues:{}, maxPointsInLeafNode=2043, maxMBSortInHeap=7.7326421151110845, sim=Asserting(org.apache.lucene.search.similarities.AssertingSimilarity@f209530), locale=ar-SY, timezone=Asia/Macau
   [junit4]   2> NOTE: Linux 4.4.0-137-generic amd64/Oracle Corporation 1.8.0_191 (64-bit)/cpus=4,threads=1,free=166377416,total=534773760
   [junit4]   2> NOTE: All tests run in this JVM: [TestPortugueseMinimalStemFilter, TestStrangeOvergeneration, DelimitedTermFrequencyTokenFilterTest, TestMultiWordSynonyms, TestConcatenatingTokenStream, TestCJKBigramFilterFactory, TestDoubleEscape, TestPortugueseStemFilterFactory, TestMorphData, TestCzechStemmer, MinHashFilterTest, TestEnglishAnalyzer, TestCharTokenizers, TestCommonGramsFilterFactory, TestBengaliFilters, TestArabicNormalizationFilter, TestGermanStemFilter, TestOptionalCondition, TestStemmerOverrideFilter, TestTurkishLowerCaseFilterFactory, TestCodepointCountFilterFactory, TestDelimitedPayloadTokenFilterFactory, TestLatvianAnalyzer, TestIrishLowerCaseFilter, TestSpanishLightStemFilterFactory, TestComplexPrefix, TestFlattenGraphFilter, TestNorwegianMinimalStemFilter, TestHungarianLightStemFilter, TestPersianCharFilter, TestCustomAnalyzer, TestItalianLightStemFilterFactory, TestIndonesianAnalyzer, TestGalicianMinimalStemFilter, TestReverseStringFilterFactory, TestLimitTokenOffsetFilterFactory, TestBrazilianAnalyzer, TestKeepCase, TestFilesystemResourceLoader, TestFrenchAnalyzer, TestRandomChains]
   [junit4] Completed [283/291 (1!)] on J2 in 411.97s, 2 tests, 1 error <<< FAILURES!

[...truncated 25 lines...]
   [junit4] JVM J2: stdout was not empty, see: /x1/jenkins/jenkins-slave/workspace/Lucene-Solr-NightlyTests-master/checkout/lucene/build/analysis/common/test/temp/junit4-J2-20190119_051103_6753297945855853057295.sysout
   [junit4] >>> JVM J2 emitted unexpected output (verbatim) ----
   [junit4] java.lang.OutOfMemoryError: GC overhead limit exceeded
   [junit4] Dumping heap to /x1/jenkins/jenkins-slave/workspace/Lucene-Solr-NightlyTests-master/checkout/heapdumps/java_pid24935.hprof ...
   [junit4] Heap dump file created [434965279 bytes in 2.561 secs]
   [junit4] <<< JVM J2: EOF ----

[...truncated 10021 lines...]
   [junit4] Suite: org.apache.solr.cloud.RollingRestartTest
   [junit4]   2> Creating dataDir: /x1/jenkins/jenkins-slave/workspace/Lucene-Solr-NightlyTests-master/checkout/solr/build/solr-core/test/J2/temp/solr.cloud.RollingRestartTest_EAEE53A87ED43831-001/init-core-data-001
   [junit4]   2> 1229658 INFO  (SUITE-RollingRestartTest-seed#[EAEE53A87ED43831]-worker) [    ] o.a.s.BaseDistributedSearchTestCase Setting hostContext system property: /
   [junit4]   2> 1229662 INFO  (TEST-RollingRestartTest.test-seed#[EAEE53A87ED43831]) [    ] o.a.s.c.ZkTestServer STARTING ZK TEST SERVER
   [junit4]   2> 1229663 INFO  (ZkTestServer Run Thread) [    ] o.a.s.c.ZkTestServer client port:0.0.0.0/0.0.0.0:0
   [junit4]   2> 1229663 INFO  (ZkTestServer Run Thread) [    ] o.a.s.c.ZkTestServer Starting server
   [junit4]   2> 1229763 INFO  (TEST-RollingRestartTest.test-seed#[EAEE53A87ED43831]) [    ] o.a.s.c.ZkTestServer start zk server on port:46808
   [junit4]   2> 1229763 INFO  (TEST-RollingRestartTest.test-seed#[EAEE53A87ED43831]) [    ] o.a.s.c.ZkTestServer parse host and port list: 127.0.0.1:46808
   [junit4]   2> 1229763 INFO  (TEST-RollingRestartTest.test-seed#[EAEE53A87ED43831]) [    ] o.a.s.c.ZkTestServer connecting to 127.0.0.1 46808
   [junit4]   2> 1229769 INFO  (zkConnectionManagerCallback-4404-thread-1) [    ] o.a.s.c.c.ConnectionManager zkClient has connected
   [junit4]   2> 1229772 INFO  (zkConnectionManagerCallback-4406-thread-1) [    ] o.a.s.c.c.ConnectionManager zkClient has connected
   [junit4]   2> 1229773 INFO  (TEST-RollingRestartTest.test-seed#[EAEE53A87ED43831]) [    ] o.a.s.c.ZkTestServer put /x1/jenkins/jenkins-slave/workspace/Lucene-Solr-NightlyTests-master/checkout/solr/core/src/test-files/solr/collection1/conf/solrconfig-tlog.xml to /configs/conf1/solrconfig.xml
   [junit4]   2> 1229775 INFO  (TEST-RollingRestartTest.test-seed#[EAEE53A87ED43831]) [    ] o.a.s.c.ZkTestServer put /x1/jenkins/jenkins-slave/workspace/Lucene-Solr-NightlyTests-master/checkout/solr/core/src/test-files/solr/collection1/conf/schema.xml to /configs/conf1/schema.xml
   [junit4]   2> 1229776 INFO  (TEST-RollingRestartTest.test-seed#[EAEE53A87ED43831]) [    ] o.a.s.c.ZkTestServer put /x1/jenkins/jenkins-slave/workspace/Lucene-Solr-NightlyTests-master/checkout/solr/core/src/test-files/solr/collection1/conf/solrconfig.snippet.randomindexconfig.xml to /configs/conf1/solrconfig.snippet.randomindexconfig.xml
   [junit4]   2> 1229777 INFO  (TEST-RollingRestartTest.test-seed#[EAEE53A87ED43831]) [    ] o.a.s.c.ZkTestServer put /x1/jenkins/jenkins-slave/workspace/Lucene-Solr-NightlyTests-master/checkout/solr/core/src/test-files/solr/collection1/conf/stopwords.txt to /configs/conf1/stopwords.txt
   [junit4]   2> 1229779 INFO  (TEST-RollingRestartTest.test-seed#[EAEE53A87ED43831]) [    ] o.a.s.c.ZkTestServer put /x1/jenkins/jenkins-slave/workspace/Lucene-Solr-NightlyTests-master/checkout/solr/core/src/test-files/solr/collection1/conf/protwords.txt to /configs/conf1/protwords.txt
   [junit4]   2> 1229780 INFO  (TEST-RollingRestartTest.test-seed#[EAEE53A87ED43831]) [    ] o.a.s.c.ZkTestServer put /x1/jenkins/jenkins-slave/workspace/Lucene-Solr-NightlyTests-master/checkout/solr/core/src/test-files/solr/collection1/conf/currency.xml to /configs/conf1/currency.xml
   [junit4]   2> 1229781 INFO  (TEST-RollingRestartTest.test-seed#[EAEE53A87ED43831]) [    ] o.a.s.c.ZkTestServer put /x1/jenkins/jenkins-slave/workspace/Lucene-Solr-NightlyTests-master/checkout/solr/core/src/test-files/solr/collection1/conf/enumsConfig.xml to /configs/conf1/enumsConfig.xml
   [junit4]   2> 1229783 INFO  (TEST-RollingRestartTest.test-seed#[EAEE53A87ED43831]) [    ] o.a.s.c.ZkTestServer put /x1/jenkins/jenkins-slave/workspace/Lucene-Solr-NightlyTests-master/checkout/solr/core/src/test-files/solr/collection1/conf/open-exchange-rates.json to /configs/conf1/open-exchange-rates.json
   [junit4]   2> 1229784 INFO  (TEST-RollingRestartTest.test-seed#[EAEE53A87ED43831]) [    ] o.a.s.c.ZkTestServer put /x1/jenkins/jenkins-slave/workspace/Lucene-Solr-NightlyTests-master/checkout/solr/core/src/test-files/solr/collection1/conf/mapping-ISOLatin1Accent.txt to /configs/conf1/mapping-ISOLatin1Accent.txt
   [junit4]   2> 1229785 INFO  (TEST-RollingRestartTest.test-seed#[EAEE53A87ED43831]) [    ] o.a.s.c.ZkTestServer put /x1/jenkins/jenkins-slave/workspace/Lucene-Solr-NightlyTests-master/checkout/solr/core/src/test-files/solr/collection1/conf/old_synonyms.txt to /configs/conf1/old_synonyms.txt
   [junit4]   2> 1229787 INFO  (TEST-RollingRestartTest.test-seed#[EAEE53A87ED43831]) [    ] o.a.s.c.ZkTestServer put /x1/jenkins/jenkins-slave/workspace/Lucene-Solr-NightlyTests-master/checkout/solr/core/src/test-files/solr/collection1/conf/synonyms.txt to /configs/conf1/synonyms.txt
   [junit4]   2> 1229790 INFO  (zkConnectionManagerCallback-4410-thread-1) [    ] o.a.s.c.c.ConnectionManager zkClient has connected
   [junit4]   2> 1229793 INFO  (TEST-RollingRestartTest.test-seed#[EAEE53A87ED43831]) [    ] o.a.s.c.AbstractFullDistribZkTestBase Will use NRT replicas unless explicitly asked otherwise
   [junit4]   2> 1229976 WARN  (TEST-RollingRestartTest.test-seed#[EAEE53A87ED43831]) [    ] o.e.j.s.AbstractConnector Ignoring deprecated socket close linger time
   [junit4]   2> 1229976 INFO  (TEST-RollingRestartTest.test-seed#[EAEE53A87ED43831]) [    ] o.a.s.c.s.e.JettySolrRunner Start Jetty (original configured port=0)
   [junit4]   2> 1229976 INFO  (TEST-RollingRestartTest.test-seed#[EAEE53A87ED43831]) [    ] o.a.s.c.s.e.JettySolrRunner Trying to start Jetty on port 0 try number 1 ...
   [junit4]   2> 1229976 INFO  (TEST-RollingRestartTest.test-seed#[EAEE53A87ED43831]) [    ] o.e.j.s.Server jetty-9.4.14.v20181114; built: 2018-11-14T21:20:31.478Z; git: c4550056e785fb5665914545889f21dc136ad9e6; jvm 1.8.0_191-b12
   [junit4]   2> 1229977 INFO  (TEST-RollingRestartTest.test-seed#[EAEE53A87ED43831]) [    ] o.e.j.s.session DefaultSessionIdManager workerName=node0
   [junit4]   2> 1229977 INFO  (TEST-RollingRestartTest.test-seed#[EAEE53A87ED43831]) [    ] o.e.j.s.session No SessionScavenger set, using defaults
   [junit4]   2> 1229977 INFO  (TEST-RollingRestartTest.test-seed#[EAEE53A87ED43831]) [    ] o.e.j.s.session node0 Scavenging every 600000ms
   [junit4]   2> 1229978 INFO  (TEST-RollingRestartTest.test-seed#[EAEE53A87ED43831]) [    ] o.e.j.s.h.ContextHandler Started o.e.j.s.ServletContextHandler@7d911863{/,null,AVAILABLE}
   [junit4]   2> 1229985 WARN  (TEST-RollingRestartTest.test-seed#[EAEE53A87ED43831]) [    ] o.e.j.u.s.S.config No Client EndPointIdentificationAlgorithm configured for SslContextFactory@56398f23[provider=null,keyStore=null,trustStore=null]
   [junit4]   2> 1229986 INFO  (TEST-RollingRestartTest.test-seed#[EAEE53A87ED43831]) [    ] o.e.j.s.AbstractConnector Started ServerConnector@55c37c1b{SSL,[ssl, http/1.1]}{127.0.0.1:34365}
   [junit4]   2> 1229986 INFO  (TEST-RollingRestartTest.test-seed#[EAEE53A87ED43831]) [    ] o.e.j.s.Server Started @1230051ms
   [junit4]   2> 1229986 INFO  (TEST-RollingRestartTest.test-seed#[EAEE53A87ED43831]) [    ] o.a.s.c.s.e.JettySolrRunner Jetty properties: {solr.data.dir=/x1/jenkins/jenkins-slave/workspace/Lucene-Solr-NightlyTests-master/checkout/solr/build/solr-core/test/J2/temp/solr.cloud.RollingRestartTest_EAEE53A87ED43831-001/tempDir-001/control/data, replicaType=NRT, hostContext=/, hostPort=34365, coreRootDirectory=/x1/jenkins/jenkins-slave/workspace/Lucene-Solr-NightlyTests-master/checkout/solr/build/solr-core/test/J2/../../../../../../../../../../../x1/jenkins/jenkins-slave/workspace/Lucene-Solr-NightlyTests-master/checkout/solr/build/solr-core/test/J2/temp/solr.cloud.RollingRestartTest_EAEE53A87ED43831-001/control-001/cores}
   [junit4]   2> 1229987 ERROR (TEST-RollingRestartTest.test-seed#[EAEE53A87ED43831]) [    ] o.a.s.u.StartupLoggingUtils Missing Java Option solr.log.dir. Logging may be missing or incomplete.
   [junit4]   2> 1229987 INFO  (TEST-RollingRestartTest.test-seed#[EAEE53A87ED43831]) [    ] o.a.s.s.SolrDispatchFilter Using logger factory org.apache.logging.slf4j.Log4jLoggerFactory
   [junit4]   2> 1229987 INFO  (TEST-RollingRestartTest.test-seed#[EAEE53A87ED43831]) [    ] o.a.s.s.SolrDispatchFilter  ___      _       Welcome to Apache Solr? version 9.0.0
   [junit4]   2> 1229987 INFO  (TEST-RollingRestartTest.test-seed#[EAEE53A87ED43831]) [    ] o.a.s.s.SolrDispatchFilter / __| ___| |_ _   Starting in cloud mode on port null
   [junit4]   2> 1229987 INFO  (TEST-RollingRestartTest.test-seed#[EAEE53A87ED43831]) [    ] o.a.s.s.SolrDispatchFilter \__ \/ _ \ | '_|  Install dir: null
   [junit4]   2> 1229987 INFO  (TEST-RollingRestartTest.test-seed#[EAEE53A87ED43831]) [    ] o.a.s.s.SolrDispatchFilter |___/\___/_|_|    Start time: 2019-01-19T07:23:02.335Z
   [junit4]   2> 1229990 INFO  (zkConnectionManagerCallback-4412-thread-1) [    ] o.a.s.c.c.ConnectionManager zkClient has connected
   [junit4]   2> 1229997 INFO  (TEST-RollingRestartTest.test-seed#[EAEE53A87ED43831]) [    ] o.a.s.s.SolrDispatchFilter Loading solr.xml from SolrHome (not found in ZooKeeper)
   [junit4]   2> 1229997 INFO  (TEST-RollingRestartTest.test-seed#[EAEE53A87ED43831]) [    ] o.a.s.c.SolrXmlConfig Loading container configuration from /x1/jenkins/jenkins-slave/workspace/Lucene-Solr-NightlyTests-master/checkout/solr/build/solr-core/test/J2/temp/solr.cloud.RollingRestartTest_EAEE53A87ED43831-001/control-001/solr.xml
   [junit4]   2> 1230002 INFO  (TEST-RollingRestartTest.test-seed#[EAEE53A87ED43831]) [    ] o.a.s.c.SolrXmlConfig Configuration parameter autoReplicaFailoverWorkLoopDelay is ignored
   [junit4]   2> 1230002 INFO  (TEST-RollingRestartTest.test-seed#[EAEE53A87ED43831]) [    ] o.a.s.c.SolrXmlConfig Configuration parameter autoReplicaFailoverBadNodeExpiration is ignored
   [junit4]   2> 1230004 INFO  (TEST-RollingRestartTest.test-seed#[EAEE53A87ED43831]) [    ] o.a.s.c.SolrXmlConfig MBean server found: com.sun.jmx.mbeanserver.JmxMBeanServer@60b48556, but no JMX reporters were configured - adding default JMX reporter.
   [junit4]   2> 1230077 INFO  (TEST-RollingRestartTest.test-seed#[EAEE53A87ED43831]) [    ] o.a.s.h.c.HttpShardHandlerFactory Host whitelist initialized: WhitelistHostChecker [whitelistHosts=null, whitelistHostCheckingEnabled=false]
   [junit4]   2> 1230078 WARN  (TEST-RollingRestartTest.test-seed#[EAEE53A87ED43831]) [    ] o.a.s.c.s.i.Http2SolrClient Create Http2SolrClient with HTTP/1.1 transport since Java 8 or lower versions does not support SSL + HTTP/2
   [junit4]   2> 1230079 WARN  (TEST-RollingRestartTest.test-seed#[EAEE53A87ED43831]) [    ] o.e.j.u.s.S.config No Client EndPointIdentificationAlgorithm configured for SslContextFactory@3d1ae58c[provider=null,keyStore=null,trustStore=null]
   [junit4]   2> 1230085 WARN  (TEST-RollingRestartTest.test-seed#[EAEE53A87ED43831]) [    ] o.a.s.c.s.i.Http2SolrClient Create Http2SolrClient with HTTP/1.1 transport since Java 8 or lower versions does not support SSL + HTTP/2
   [junit4]   2> 1230086 WARN  (TEST-RollingRestartTest.test-seed#[EAEE53A87ED43831]) [    ] o.e.j.u.s.S.config No Client EndPointIdentificationAlgorithm configured for SslContextFactory@36985c61[provider=null,keyStore=null,trustStore=null]
   [junit4]   2> 1230087 INFO  (TEST-RollingRestartTest.test-seed#[EAEE53A87ED43831]) [    ] o.a.s.c.ZkContainer Zookeeper client=127.0.0.1:46808/solr
   [junit4]   2> 1230089 INFO  (zkConnectionManagerCallback-4418-thread-1) [    ] o.a.s.c.c.ConnectionManager zkClient has connected
   [junit4]   2> 1230091 INFO  (zkConnectionManagerCallback-4420-thread-1) [    ] o.a.s.c.c.ConnectionManager zkClient has connected
   [junit4]   2> 1230186 INFO  (TEST-RollingRestartTest.test-seed#[EAEE53A87ED43831]) [n:127.0.0.1:34365_    ] o.a.s.c.OverseerElectionContext I am going to be the leader 127.0.0.1:34365_
   [junit4]   2> 1230187 INFO  (TEST-RollingRestartTest.test-seed#[EAEE53A87ED43831]) [n:127.0.0.1:34365_    ] o.a.s.c.Overseer Overseer (id=72648555097751557-127.0.0.1:34365_-n_0000000000) starting
   [junit4]   2> 1230194 INFO  (zkConnectionManagerCallback-4427-thread-1) [    ] o.a.s.c.c.ConnectionManager zkClient has connected
   [junit4]   2> 1230197 INFO  (TEST-RollingRestartTest.test-seed#[EAEE53A87ED43831]) [n:127.0.0.1:34365_    ] o.a.s.c.s.i.ZkClientClusterStateProvider Cluster at 127.0.0.1:46808/solr ready
   [junit4]   2> 1230197 INFO  (OverseerStateUpdate-72648555097751557-127.0.0.1:34365_-n_0000000000) [n:127.0.0.1:34365_    ] o.a.s.c.Overseer Starting to work on the main queue : 127.0.0.1:34365_
   [junit4]   2> 1230198 INFO  (TEST-RollingRestartTest.test-seed#[EAEE53A87ED43831]) [n:127.0.0.1:34365_    ] o.a.s.c.ZkController Register node as live in ZooKeeper:/live_nodes/127.0.0.1:34365_
   [junit4]   2> 1230199 INFO  (OverseerStateUpdate-72648555097751557-127.0.0.1:34365_-n_0000000000) [n:127.0.0.1:34365_    ] o.a.s.c.c.ZkStateReader Updated live nodes from ZooKeeper... (0) -> (1)
   [junit4]   2> 1230200 INFO  (zkCallback-4426-thread-1) [    ] o.a.s.c.c.ZkStateReader Updated live nodes from ZooKeeper... (0) -> (1)
   [junit4]   2> 1230203 DEBUG (OverseerAutoScalingTriggerThread-72648555097751557-127.0.0.1:34365_-n_0000000000) [    ] o.a.s.c.a.NodeLostTrigger NodeLostTrigger .auto_add_replicas - Initial livenodes: [127.0.0.1:34365_]
   [junit4]   2> 1230205 DEBUG (ScheduledTrigger-3844-thread-1) [    ] o.a.s.c.a.NodeLostTrigger Running NodeLostTrigger: .auto_add_replicas with currently live nodes: 1 and last live nodes: 1
   [junit4]   2> 1230228 INFO  (TEST-RollingRestartTest.test-seed#[EAEE53A87ED43831]) [n:127.0.0.1:34365_    ] o.a.s.h.a.MetricsHistoryHandler No .system collection, keeping metrics history in memory.
   [junit4]   2> 1230263 INFO  (TEST-RollingRestartTest.test-seed#[EAEE53A87ED43831]) [n:127.0.0.1:34365_    ] o.a.s.m.r.SolrJmxReporter JMX monitoring for 'solr.node' (registry 'solr.node') enabled at server: com.sun.jmx.mbeanserver.JmxMBeanServer@60b48556
   [junit4]   2> 1230280 INFO  (TEST-RollingRestartTest.test-seed#[EAEE53A87ED43831]) [n:127.0.0.1:34365_    ] o.a.s.m.r.SolrJmxReporter JMX monitoring for 'solr.jvm' (registry 'solr.jvm') enabled at server: com.sun.jmx.mbeanserver.JmxMBeanServer@60b48556
   [junit4]   2> 1230280 INFO  (TEST-RollingRestartTest.test-seed#[EAEE53A87ED43831]) [n:127.0.0.1:34365_    ] o.a.s.m.r.SolrJmxReporter JMX monitoring for 'solr.jetty' (registry 'solr.jetty') enabled at server: com.sun.jmx.mbeanserver.JmxMBeanServer@60b48556
   [junit4]   2> 1230282 INFO  (TEST-RollingRestartTest.test-seed#[EAEE53A87ED43831]) [n:127.0.0.1:34365_    ] o.a.s.c.CorePropertiesLocator Found 0 core definitions underneath /x1/jenkins/jenkins-slave/workspace/Lucene-Solr-NightlyTests-master/checkout/solr/build/solr-core/test/J2/../../../../../../../../../../../x1/jenkins/jenkins-slave/workspace/Lucene-Solr-NightlyTests-master/checkout/solr/build/solr-core/test/J2/temp/solr.cloud.RollingRestartTest_EAEE53A87ED43831-001/control-001/cores
   [junit4]   2> 1230336 INFO  (zkConnectionManagerCallback-4433-thread-1) [    ] o.a.s.c.c.ConnectionManager zkClient has connected
   [junit4]   2> 1230337 INFO  (TEST-RollingRestartTest.test-seed#[EAEE53A87ED43831]) [    ] o.a.s.c.c.ZkStateReader Updated live nodes from ZooKeeper... (0) -> (1)
   [junit4]   2> 1230338 INFO  (TEST-RollingRestartTest.test-seed#[EAEE53A87ED43831]) [    ] o.a.s.c.s.i.ZkClientClusterStateProvider Cluster at 127.0.0.1:46808/solr ready
   [junit4]   2> 1230352 INFO  (qtp111216638-18537) [n:127.0.0.1:34365_    ] o.a.s.h.a.CollectionsHandler Invoked Collection Action :create with params collection.configName=conf1&name=control_collection&nrtReplicas=1&action=CREATE&numShards=1&createNodeSet=127.0.0.1:34365_&wt=javabin&version=2 and sendToOCPQueue=true
   [junit4]   2> 1230358 INFO  (OverseerThreadFactory-3846-thread-1-processing-n:127.0.0.1:34365_) [n:127.0.0.1:34365_    ] o.a.s.c.a.c.CreateCollectionCmd Create collection control_collection
   [junit4]   2> 1230475 INFO  (qtp111216638-18535) [n:127.0.0.1:34365_    ] o.a.s.s.HttpSolrCall [admin] webapp=null path=/admin/metrics params={prefix=CONTAINER.fs.usableSpace,CONTAINER.fs.totalSpace,CORE.coreName&wt=javabin&version=2&group=solr.node,solr.core} status=0 QTime=0
   [junit4]   2> 1230477 INFO  (qtp111216638-18536) [n:127.0.0.1:34365_    ] o.a.s.s.HttpSolrCall [admin] webapp=null path=/admin/metrics params={prefix=CONTAINER.fs.usableSpace,CONTAINER.fs.totalSpace,CORE.coreName&wt=javabin&version=2&group=solr.node,solr.core} status=0 QTime=0
   [junit4]   2> 1230478 INFO  (qtp111216638-18538) [n:127.0.0.1:34365_    ] o.a.s.s.HttpSolrCall [admin] webapp=null path=/admin/metrics params={prefix=CONTAINER.fs.usableSpace,CONTAINER.fs.totalSpace,CORE.coreName&wt=javabin&version=2&group=solr.node,solr.core} status=0 QTime=0
   [junit4]   2> 1230479 INFO  (qtp111216638-18534) [n:127.0.0.1:34365_    ] o.a.s.s.HttpSolrCall [admin] webapp=null path=/admin/metrics params={prefix=CONTAINER.fs.usableSpace,CONTAINER.fs.totalSpace,CORE.coreName&wt=javabin&version=2&group=solr.node,solr.core} status=0 QTime=0
   [junit4]   2> 1230479 INFO  (qtp111216638-18535) [n:127.0.0.1:34365_    ] o.a.s.s.HttpSolrCall [admin] webapp=null path=/admin/metrics params={prefix=CONTAINER.fs.usableSpace,CONTAINER.fs.totalSpace,CORE.coreName&wt=javabin&version=2&group=solr.node,solr.core} status=0 QTime=0
   [junit4]   2> 1230484 INFO  (qtp111216638-18536) [n:127.0.0.1:34365_    x:control_collection_shard1_replica_n1] o.a.s.h.a.CoreAdminOperation core create command qt=/admin/cores&collection.configName=conf1&newCollection=true&name=control_collection_shard1_replica_n1&action=CREATE&numShards=1&collection=control_collection&shard=shard1&wt=javabin&version=2&replicaType=NRT
   [junit4]   2> 1230484 INFO  (qtp111216638-18536) [n:127.0.0.1:34365_    x:control_collection_shard1_replica_n1] o.a.s.c.TransientSolrCoreCacheDefault Allocating transient cache for 4 transient cores
   [junit4]   2> 1231206 DEBUG (ScheduledTrigger-3844-thread-3) [    ] o.a.s.c.a.NodeLostTrigger Running NodeLostTrigger: .auto_add_replicas with currently live nodes: 1 and last live nodes: 1
   [junit4]   2> 1231506 INFO  (qtp111216638-18536) [n:127.0.0.1:34365_ c:control_collection s:shard1  x:control_collection_shard1_replica_n1] o.a.s.c.SolrConfig Using Lucene MatchVersion: 9.0.0
   [junit4]   2> 1231522 INFO  (qtp111216638-18536) [n:127.0.0.1:34365_ c:control_collection s:shard1  x:control_collection_shard1_replica_n1] o.a.s.s.IndexSchema [control_collection_shard1_replica_n1] Schema name=test
   [junit4]   2> 1231637 INFO  (qtp111216638-18536) [n:127.0.0.1:34365_ c:control_collection s:shard1  x:control_collection_shard1_replica_n1] o.a.s.s.IndexSchema Loaded schema test/1.0 with uniqueid field id
   [junit4]   2> 1231658 INFO  (qtp111216638-18536) [n:127.0.0.1:34365_ c:control_collection s:shard1  x:control_collection_shard1_replica_n1] o.a.s.c.CoreContainer Creating SolrCore 'control_collection_shard1_replica_n1' using configuration from collection control_collection, trusted=true
   [junit4]   2> 1231659 INFO  (qtp111216638-18536) [n:127.0.0.1:34365_ c:control_collection s:shard1  x:control_collection_shard1_replica_n1] o.a.s.m.r.SolrJmxReporter JMX monitoring for 'solr.core.control_collection.shard1.replica_n1' (registry 'solr.core.control_collection.shard1.replica_n1') enabled at server: com.sun.jmx.mbeanserver.JmxMBeanServer@60b48556
   [junit4]   2> 1231659 INFO  (qtp111216638-18536) [n:127.0.0.1:34365_ c:control_collection s:shard1  x:control_collection_shard1_replica_n1] o.a.s.c.SolrCore [[control_collection_shard1_replica_n1] ] Opening new SolrCore at [/x1/jenkins/jenkins-slave/workspace/Lucene-Solr-NightlyTests-master/checkout/solr/build/solr-core/test/J2/temp/solr.cloud.RollingRestartTest_EAEE53A87ED43831-001/control-001/cores/control_collection_shard1_replica_n1], dataDir=[/x1/jenkins/jenkins-slave/workspace/Lucene-Solr-NightlyTests-master/checkout/solr/build/solr-core/test/J2/../../../../../../../../../../../x1/jenkins/jenkins-slave/workspace/Lucene-Solr-NightlyTests-master/checkout/solr/build/solr-core/test/J2/temp/solr.cloud.RollingRestartTest_EAEE53A87ED43831-001/control-001/cores/control_collection_shard1_replica_n1/data/]
   [junit4]   2> 1231664 INFO  (qtp111216638-18536) [n:127.0.0.1:34365_ c:control_collection s:shard1  x:control_collection_shard1_replica_n1] o.a.s.u.RandomMergePolicy RandomMergePolicy wrapping class org.apache.lucene.index.TieredMergePolicy: [TieredMergePolicy: maxMergeAtOnce=17, maxMergeAtOnceExplicit=43, maxMergedSegmentMB=7.677734375, floorSegmentMB=2.0517578125, forceMergeDeletesPctAllowed=6.617901387947141, segmentsPerTier=16.0, maxCFSSegmentSizeMB=0.7763671875, noCFSRatio=0.0, deletesPctAllowed=34.361452560166505
   [junit4]   2> 1231692 WARN  (qtp111216638-18536) [n:127.0.0.1:34365_ c:control_collection s:shard1  x:control_collection_shard1_replica_n1] o.a.s.c.RequestHandlers INVALID paramSet a in requestHandler {type = requestHandler,name = /dump,class = DumpRequestHandler,attributes = {initParams=a, name=/dump, class=DumpRequestHandler},args = {defaults={a=A,b=B}}}
   [junit4]   2> 1231752 INFO  (qtp111216638-18536) [n:127.0.0.1:34365_ c:control_collection s:shard1  x:control_collection_shard1_replica_n1] o.a.s.u.UpdateHandler Using UpdateLog implementation: org.apache.solr.update.UpdateLog
   [junit4]   2> 1231752 INFO  (qtp111216638-18536) [n:127.0.0.1:34365_ c:control_collection s:shard1  x:control_collection_shard1_replica_n1] o.a.s.u.UpdateLog Initializing UpdateLog: dataDir= defaultSyncLevel=FLUSH numRecordsToKeep=100 maxNumLogsToKeep=10 numVersionBuckets=65536
   [junit4]   2> 1231755 INFO  (qtp111216638-18536) [n:127.0.0.1:34365_ c:control_collection s:shard1  x:control_collection_shard1_replica_n1] o.a.s.u.CommitTracker Hard AutoCommit: disabled
   [junit4]   2> 1231755 INFO  (qtp111216638-18536) [n:127.0.0.1:34365_ c:control_collection s:shard1  x:control_collection_shard1_replica_n1] o.a.s.u.CommitTracker Soft AutoCommit: disabled
   [junit4]   2> 1231756 INFO  (qtp111216638-18536) [n:127.0.0.1:34365_ c:control_collection s:shard1  x:control_collection_shard1_replica_n1] o.a.s.u.RandomMergePolicy RandomMergePolicy wrapping class org.apache.lucene.index.LogByteSizeMergePolicy: [LogByteSizeMergePolicy: minMergeSize=1677721, mergeFactor=20, maxMergeSize=2147483648, maxMergeSizeForForcedMerge=9223372036854775807, calibrateSizeByDeletes=true, maxMergeDocs=2147483647, maxCFSSegmentSizeMB=8.796093022207999E12, noCFSRatio=0.583057492616664]
   [junit4]   2> 1231757 INFO  (qtp111216638-18536) [n:127.0.0.1:34365_ c:control_collection s:shard1  x:control_collection_shard1_replica_n1] o.a.s.s.SolrIndexSearcher Opening [Searcher@4d487391[control_collection_shard1_replica_n1] main]
   [junit4]   2> 1231759 INFO  (qtp111216638-18536) [n:127.0.0.1:34365_ c:control_collection s:shard1  x:control_collection_shard1_replica_n1] o.a.s.r.ManagedResourceStorage Configured ZooKeeperStorageIO with znodeBase: /configs/conf1
   [junit4]   2> 1231759 INFO  (qtp111216638-18536) [n:127.0.0.1:34365_ c:control_collection s:shard1  x:control_collection_shard1_replica_n1] o.a.s.r.ManagedResourceStorage Loaded null at path _rest_managed.json using ZooKeeperStorageIO:path=/configs/conf1
   [junit4]   2> 1231760 INFO  (qtp111216638-18536) [n:127.0.0.1:34365_ c:control_collection s:shard1  x:control_collection_shard1_replica_n1] o.a.s.h.ReplicationHandler Commits will be reserved for 10000ms.
   [junit4]   2> 1231760 INFO  (qtp111216638-18536) [n:127.0.0.1:34365_ c:control_collection s:shard1  x:control_collection_shard1_replica_n1] o.a.s.u.UpdateLog Could not find max version in index or recent updates, using new clock 1623072528513630208
   [junit4]   2> 1231763 INFO  (searcherExecutor-3851-thread-1-processing-n:127.0.0.1:34365_ x:control_collection_shard1_replica_n1 c:control_collection s:shard1) [n:127.0.0.1:34365_ c:control_collection s:shard1  x:control_collection_shard1_replica_n1] o.a.s.c.SolrCore [control_collection_shard1_replica_n1] Registered new searcher Searcher@4d487391[control_collection_shard1_replica_n1] main{ExitableDirectoryReader(UninvertingDirectoryReader())}
   [junit4]   2> 1231766 INFO  (qtp111216638-18536) [n:127.0.0.1:34365_ c:control_collection s:shard1  x:control_collection_shard1_replica_n1] o.a.s.c.ZkShardTerms Successful update of terms at /collections/control_collection/terms/shard1 to Terms{values={core_node2=0}, version=0}
   [junit4]   2> 1231766 INFO  (qtp111216638-18536) [n:127.0.0.1:34365_ c:control_collection s:shard1  x:control_collection_shard1_replica_n1] o.a.s.c.ShardLeaderElectionContextBase make sure parent is created /collections/control_collection/leaders/shard1
   [junit4]   2> 1231770 INFO  (qtp111216638-18536) [n:127.0.0.1:34365_ c:control_collection s:shard1  x:control_collection_shard1_replica_n1] o.a.s.c.ShardLeaderElectionContext Enough replicas found to continue.
   [junit4]   2> 1231770 INFO  (qtp111216638-18536) [n:127.0.0.1:34365_ c:control_collection s:shard1  x:control_collection_shard1_replica_n1] o.a.s.c.ShardLeaderElectionContext I may be the new leader - try and sync
   [junit4]   2> 1231770 INFO  (qtp111216638-18536) [n:127.0.0.1:34365_ c:control_collection s:shard1  x:control_collection_shard1_replica_n1] o.a.s.c.SyncStrategy Sync replicas to https://127.0.0.1:34365/control_collection_shard1_replica_n1/
   [junit4]   2> 1231771 INFO  (qtp111216638-18536) [n:127.0.0.1:34365_ c:control_collection s:shard1  x:control_collection_shard1_replica_n1] o.a.s.c.SyncStrategy Sync Success - now sync replicas to me
   [junit4]   2> 1231771 INFO  (qtp111216638-18536) [n:127.0.0.1:34365_ c:control_collection s:shard1  x:control_collection_shard1_replica_n1] o.a.s.c.SyncStrategy https://127.0.0.1:34365/control_collection_shard1_replica_n1/ has no replicas
   [junit4]   2> 1231771 INFO  (qtp111216638-18536) [n:127.0.0.1:34365_ c:control_collection s:shard1  x:control_collection_shard1_replica_n1] o.a.s.c.ShardLeaderElectionContextBase Creating leader registration node /collections/control_collection/leaders/shard1/leader after winning as /collections/control_collection/leader_elect/shard1/election/72648555097751557-core_node2-n_0000000000
   [junit4]   2> 1231773 INFO  (qtp111216638-18536) [n:127.0.0.1:34365_ c:control_collection s:shard1  x:control_collection_shard1_replica_n1] o.a.s.c.ShardLeaderElectionContext I am the new leader: https://127.0.0.1:34365/control_collection_shard1_replica_n1/ shard1
   [junit4]   2> 1231875 INFO  (zkCallback-4419-thread-1) [    ] o.a.s.c.c.ZkStateReader A cluster state change: [WatchedEvent state:SyncConnected type:NodeDataChanged path:/collections/control_collection/state.json] for collection [control_collection] has occurred - updating... (live nodes size: [1])
   [junit4]   2> 1231875 INFO  (zkCallback-4419-thread-2) [    ] o.a.s.c.c.ZkStateReader A cluster state change: [WatchedEvent state:SyncConnected type:NodeDataChanged path:/collections/control_collection/state.json] for collection [control_collection] has occurred - updating... (live nodes size: [1])
   [junit4]   2> 1231877 INFO  (qtp111216638-18536) [n:127.0.0.1:34365_ c:control_collection s:shard1  x:control_collection_shard1_replica_n1] o.a.s.c.ZkController I am the leader, no recovery necessary
   [junit4]   2> 1231880 INFO  (qtp111216638-18536) [n:127.0.0.1:34365_ c:control_collection s:shard1  x:control_collection_shard1_replica_n1] o.a.s.s.HttpSolrCall [admin] webapp=null path=/admin/cores params={qt=/admin/cores&collection.configName=conf1&newCollection=true&name=control_collection_shard1_replica_n1&action=CREATE&numShards=1&collection=control_collection&shard=shard1&wt=javabin&version=2&replicaType=NRT} status=0 QTime=1396
   [junit4]   2> 1231884 INFO  (qtp111216638-18537) [n:127.0.0.1:34365_    ] o.a.s.h.a.CollectionsHandler Wait for new collection to be active for at most 45 seconds. Check all shard replicas
   [junit4]   2> 1231980 INFO  (zkCallback-4419-thread-1) [    ] o.a.s.c.c.ZkStateReader A cluster state change: [WatchedEvent state:SyncConnected type:NodeDataChanged path:/collections/control_collection/state.json] for collection [control_collection] has occurred - updating... (live nodes size: [1])
   [junit4]   2> 1231980 INFO  (zkCallback-4419-thread-3) [    ] o.a.s.c.c.ZkStateReader A cluster state change: [WatchedEvent state:SyncConnected type:NodeDataChanged path:/collections/control_collection/state.json] for collection [control_collection] has occurred - updating... (live nodes size: [1])
   [junit4]   2> 1231980 INFO  (zkCallback-4419-thread-2) [    ] o.a.s.c.c.ZkStateReader A cluster state change: [WatchedEvent state:SyncConnected type:NodeDataChanged path:/collections/control_collection/state.json] for collection [control_collection] has occurred - updating... (live nodes size: [1])
   [junit4]   2> 1231981 INFO  (qtp111216638-18537) [n:127.0.0.1:34365_    ] o.a.s.s.HttpSolrCall [admin] webapp=null path=/admin/collections params={collection.configName=conf1&name=control_collection&nrtReplicas=1&action=CREATE&numShards=1&createNodeSet=127.0.0.1:34365_&wt=javabin&version=2} status=0 QTime=1628
   [junit4]   2> 1231987 INFO  (zkConnectionManagerCallback-4439-thread-1) [    ] o.a.s.c.c.ConnectionManager zkClient has connected
   [junit4]   2> 1231988 INFO  (TEST-RollingRestartTest.test-seed#[EAEE53A87ED43831]) [    ] o.a.s.c.c.ZkStateReader Updated live nodes from ZooKeeper... (0) -> (1)
   [junit4]   2> 1231989 INFO  (TEST-RollingRestartTest.test-seed#[EAEE53A87ED43831]) [    ] o.a.s.c.s.i.ZkClientClusterStateProvider Cluster at 127.0.0.1:46808/solr ready
   [junit4]   2> 1231989 INFO  (TEST-RollingRestartTest.test-seed#[EAEE53A87ED43831]) [    ] o.a.s.c.ChaosMonkey monkey: init - expire sessions:false cause connection loss:false
   [junit4]   2> 1231992 INFO  (qtp111216638-18537) [n:127.0.0.1:34365_    ] o.a.s.h.a.CollectionsHandler Invoked Collection Action :create with params collection.configName=conf1&name=collection1&nrtReplicas=1&action=CREATE&numShards=2&createNodeSet=&stateFormat=2&wt=javabin&version=2 and sendToOCPQueue=true
   [junit4]   2> 1231995 INFO  (OverseerThreadFactory-3846-thread-2-processing-n:127.0.0.1:34365_) [n:127.0.0.1:34365_    ] o.a.s.c.a.c.CreateCollectionCmd Create collection collection1
   [junit4]   2> 1231995 INFO  (OverseerCollectionConfigSetProcessor-72648555097751557-127.0.0.1:34365_-n_0000000000) [n:127.0.0.1:34365_    ] o.a.s.c.OverseerTaskQueue Response ZK path: /overseer/collection-queue-work/qnr-0000000000 doesn't exist.  Requestor may have disconnected from ZooKeeper
   [junit4]   2> 1232200 WARN  (OverseerThreadFactory-3846-thread-2-processing-n:127.0.0.1:34365_) [n:127.0.0.1:34365_    ] o.a.s.c.a.c.CreateCollectionCmd It is unusual to create a collection (collection1) without cores.
   [junit4]   2> 1232203 INFO  (qtp111216638-18537) [n:127.0.0.1:34365_    ] o.a.s.h.a.CollectionsHandler Wait for new collection to be active for at most 45 seconds. Check all shard replicas
   [junit4]   2> 1232204 INFO  (qtp111216638-18537) [n:127.0.0.1:34365_    ] o.a.s.s.HttpSolrCall [admin] webapp=null path=/admin/collections params={collection.configName=conf1&name=collection1&nrtReplicas=1&action=CREATE&numShards=2&createNodeSet=&stateFormat=2&wt=javabin&version=2} status=0 QTime=211
   [junit4]   2> 1232205 INFO  (TEST-RollingRestartTest.test-seed#[EAEE53A87ED43831]) [    ] o.a.s.c.AbstractFullDistribZkTestBase Creating jetty instances pullReplicaCount=0 numOtherReplicas=16
   [junit4]   2> 1232207 DEBUG (ScheduledTrigger-3844-thread-4) [    ] o.a.s.c.a.NodeLostTrigger Running NodeLostTrigger: .auto_add_replicas with currently live nodes: 1 and last live nodes: 1
   [junit4]   2> 1232391 INFO  (TEST-RollingRestartTest.test-seed#[EAEE53A87ED43831]) [    ] o.a.s.c.AbstractFullDistribZkTestBase create jetty 1 in directory /x1/jenkins/jenkins-slave/workspace/Lucene-Solr-NightlyTests-master/checkout/solr/build/solr-core/test/J2/temp/solr.cloud.RollingRestartTest_EAEE53A87ED43831-001/shard-1-001 of type NRT
   [junit4]   2> 1232393 WARN  (closeThreadPool-4440-thread-1) [    ] o.e.j.s.AbstractConnector Ignoring deprecated socket close linger time
   [junit4]   2> 1232393 INFO  (closeThreadPool-4440-thread-1) [    ] o.a.s.c.s.e.JettySolrRunner Start Jetty (original configured port=0)
   [junit4]   2> 1232393 INFO  (closeThreadPool-4440-thread-1) [    ] o.a.s.c.s.e.JettySolrRunner Trying to start Jetty on port 0 try number 1 ...
   [junit4]   2> 1232393 INFO  (closeThreadPool-4440-thread-1) [    ] o.e.j.s.Server jetty-9.4.14.v20181114; built: 2018-11-14T21:20:31.478Z; git: c4550056e785fb5665914545889f21dc136ad9e6; jvm 1.8.0_191-b12
   [junit4]   2> 1232409 INFO  (closeThreadPool-4440-thread-1) [    ] o.e.j.s.session DefaultSessionIdManager workerName=node0
   [junit4]   2> 1232409 INFO  (closeThreadPool-4440-thread-1) [    ] o.e.j.s.session No SessionScavenger set, using defaults
   [junit4]   2> 1232409 INFO  (closeThreadPool-4440-thread-1) [    ] o.e.j.s.session node0 Scavenging every 600000ms
   [junit4]   2> 1232410 INFO  (closeThreadPool-4440-thread-1) [    ] o.e.j.s.h.ContextHandler Started o.e.j.s.ServletContextHandler@6d171447{/,null,AVAILABLE}
   [junit4]   2> 1232410 WARN  (closeThreadPool-4440-thread-1) [    ] o.e.j.u.s.S.config No Client EndPointIdentificationAlgorithm configured for SslContextFactory@2810aa9c[provider=null,keyStore=null,trustStore=null]
   [junit4]   2> 1232411 INFO  (closeThreadPool-4440-thread-1) [    ] o.e.j.s.AbstractConnector Started ServerConnector@7c0ced2b{SSL,[ssl, http/1.1]}{127.0.0.1:42747}
   [junit4]   2> 1232411 INFO  (closeThreadPool-4440-thread-1) [    ] o.e.j.s.Server Started @1232475ms
   [junit4]   2> 1232411 INFO  (closeThreadPool-4440-thread-1) [    ] o.a.s.c.s.e.JettySolrRunner Jetty properties: {solr.data.dir=/x1/jenkins/jenkins-slave/workspace/Lucene-Solr-NightlyTests-master/checkout/solr/build/solr-core/test/J2/temp/solr.cloud.RollingRestartTest_EAEE53A87ED43831-001/tempDir-001/jetty1, replicaType=NRT, solrconfig=solrconfig.xml, hostContext=/, hostPort=42747, coreRootDirectory=/x1/jenkins/jenkins-slave/workspace/Lucene-Solr-NightlyTests-master/checkout/solr/build/solr-core/test/J2/temp/solr.cloud.RollingRestartTest_EAEE53A87ED43831-001/shard-1-001/cores}
   [junit4]   2> 1232411 ERROR (closeThreadPool-4440-thread-1) [    ] o.a.s.u.StartupLoggingUtils Missing Java Option solr.log.dir. Logging may be missing or incomplete.
   [junit4]   2> 1232411 INFO  (closeThreadPool-4440-thread-1) [    ] o.a.s.s.SolrDispatchFilter Using logger factory org.apache.logging.slf4j.Log4jLoggerFactory
   [junit4]   2> 1232412 INFO  (closeThreadPool-4440-thread-1) [    ] o.a.s.s.SolrDispatchFilter  ___      _       Welcome to Apache Solr? version 9.0.0
   [junit4]   2> 1232412 INFO  (closeThreadPool-4440-thread-1) [    ] o.a.s.s.SolrDispatchFilter / __| ___| |_ _   Starting in cloud mode on port null
   [junit4]   2> 1232412 INFO  (closeThreadPool-4440-thread-1) [    ] o.a.s.s.SolrDispatchFilter \__ \/ _ \ | '_|  Install dir: null
   [junit4]   2> 1232412 INFO  (closeThreadPool-4440-thread-1) [    ] o.a.s.s.SolrDispatchFilter |___/\___/_|_|    Start time: 2019-01-19T07:23:04.760Z
   [junit4]   2> 1232414 INFO  (zkConnectionManagerCallback-4442-thread-1) [    ] o.a.s.c.c.ConnectionManager zkClient has connected
   [junit4]   2> 1232415 INFO  (closeThreadPool-4440-thread-1) [    ] o.a.s.s.SolrDispatchFilter Loading solr.xml from SolrHome (not found in ZooKeeper)
   [junit4]   2> 1232415 INFO  (closeThreadPool-4440-thread-1) [    ] o.a.s.c.SolrXmlConfig Loading container configuration from /x1/jenkins/jenkins-slave/workspace/Lucene-Solr-NightlyTests-master/checkout/solr/build/solr-core/test/J2/temp/solr.cloud.RollingRestartTest_EAEE53A87ED43831-001/shard-1-001/solr.xml
   [junit4]   2> 1232420 INFO  (closeThreadPool-4440-thread-1) [    ] o.a.s.c.SolrXmlConfig Configuration parameter autoReplicaFailoverWorkLoopDelay is ignored
   [junit4]   2> 1232420 INFO  (closeThreadPool-4440-thread-1) [    ] o.a.s.c.SolrXmlConfig Configuration parameter autoReplicaFailoverBadNodeExpiration is ignored
   [junit4]   2> 1232422 INFO  (closeThreadPool-4440-thread-1) [    ] o.a.s.c.SolrXmlConfig MBean server found: com.sun.jmx.mbeanserver.JmxMBeanServer@60b48556, but no JMX reporters were configured - adding default JMX reporter.
   [junit4]   2> 1232563 INFO  (TEST-RollingRestartTest.test-seed#[EAEE53A87ED43831]) [    ] o.a.s.c.AbstractFullDistribZkTestBase create jetty 2 in directory /x1/jenkins/jenkins-slave/workspace/Lucene-Solr-NightlyTests-master/checkout/solr/build/solr-core/test/J2/temp/solr.cloud.RollingRestartTest_EAEE53A87ED43831-001/shard-2-001 of type NRT
   [junit4]   2> 1232565 WARN  (closeThreadPool-4440-thread-2) [    ] o.e.j.s.AbstractConnector Ignoring deprecated socket close linger time
   [junit4]   2> 1232566 INFO  (closeThreadPool-4440-thread-2) [    ] o.a.s.c.s.e.JettySolrRunner Start Jetty (original configured port=0)
   [junit4]   2> 1232566 INFO  (closeThreadPool-4440-thread-2) [    ] o.a.s.c.s.e.JettySolrRunner Trying to start Jetty on port 0 try number 1 ...
   [junit4]   2> 1232566 INFO  (closeThreadPool-4440-thread-2) [    ] o.e.j.s.Server jetty-9.4.14.v20181114; built: 2018-11-14T21:20:31.478Z; git: c4550056e785fb5665914545889f21dc136ad9e6; jvm 1.8.0_191-b12
   [junit4]   2> 1232567 INFO  (closeThreadPool-4440-thread-2) [    ] o.e.j.s.session DefaultSessionIdManager workerName=node0
   [junit4]   2> 1232567 INFO  (closeThreadPool-4440-thread-2) [    ] o.e.j.s.session No SessionScavenger set, using defaults
   [junit4]   2> 1232568 INFO  (closeThreadPool-4440-thread-2) [    ] o.e.j.s.session node0 Scavenging every 660000ms
   [junit4]   2> 1232568 INFO  (closeThreadPool-4440-thread-2) [    ] o.e.j.s.h.ContextHandler Started o.e.j.s.ServletContextHandler@3396ec96{/,null,AVAILABLE}
   [junit4]   2> 1232569 WARN  (closeThreadPool-4440-thread-2) [    ] o.e.j.u.s.S.config No Client EndPointIdentificationAlgorithm configured for SslContextFactory@7a626c74[provider=null,keyStore=null,trustStore=null]
   [junit4]   2> 1232569 INFO  (closeThreadPool-4440-thread-2) [    ] o.e.j.s.AbstractConnector Started ServerConnector@169a3def{SSL,[ssl, http/1.1]}{127.0.0.1:44781}
   [junit4]   2> 1232569 INFO  (closeThreadPool-4440-thread-2) [    ] o.e.j.s.Server Started @1232633ms
   [junit4]   2> 1232569 INFO  (closeThreadPool-4440-thread-2) [    ] o.a.s.c.s.e.JettySolrRunner Jetty properties: {solr.data.dir=/x1/jenkins/jenkins-slave/workspace/Lucene-Solr-NightlyTests-master/checkout/solr/build/solr-core/test/J2/temp/solr.cloud.RollingRestartTest_EAEE53A87ED43831-001/tempDir-001/jetty2, replicaType=NRT, solrconfig=solrconfig.xml, hostContext=/, hostPort=44781, coreRootDirectory=/x1/jenkins/jenkins-slave/workspace/Lucene-Solr-NightlyTests-master/checkout/solr/build/solr-core/test/J2/temp/solr.cloud.RollingRestartTest_EAEE53A87ED43831-001/shard-2-001/cores}
   [junit4]   2> 1232569 ERROR (closeThreadPool-4440-thread-2) [    ] o.a.s.u.StartupLoggingUtils Missing Java Option solr.log.dir. Logging may be missing or incomplete.
   [junit4]   2> 1232570 INFO  (closeThreadPool-4440-thread-2) [    ] o.a.s.s.SolrDispatchFilter Using logger factory org.apache.logging.slf4j.Log4jLoggerFactory
   [junit4]   2> 1232570 INFO  (closeThreadPool-4440-thread-2) [    ] o.a.s.s.SolrDispatchFilter  ___      _       Welcome to Apache Solr? version 9.0.0
   [junit4]   2> 1232570 INFO  (closeThreadPool-4440-thread-2) [    ] o.a.s.s.SolrDispatchFilter / __| ___| |_ _   Starting in cloud mode on port null
   [junit4]   2> 1232570 INFO  (closeThreadPool-4440-thread-2) [    ] o.a.s.s.SolrDispatchFilter \__ \/ _ \ | '_|  Install dir: null
   [junit4]   2> 1232570 INFO  (closeThreadPool-4440-thread-2) [    ] o.a.s.s.SolrDispatchFilter |___/\___/_|_|    Start time: 2019-01-19T07:23:04.918Z
   [junit4]   2> 1232572 INFO  (zkConnectionManagerCallback-4444-thread-1) [    ] o.a.s.c.c.ConnectionManager zkClient has connected
   [junit4]   2> 1232573 INFO  (closeThreadPool-4440-thread-2) [    ] o.a.s.s.SolrDispatchFilter Loading solr.xml from SolrHome (not found in ZooKeeper)
   [junit4]   2> 1232573 INFO  (closeThreadPool-4440-thread-2) [    ] o.a.s.c.SolrXmlConfig Loading container configuration from /x1/jenkins/jenkins-slave/workspace/Lucene-Solr-NightlyTests-master/checkout/solr/build/solr-core/test/J2/temp/solr.cloud.RollingRestartTest_EAEE53A87ED43831-001/shard-2-001/solr.xml
   [junit4]   2> 1232594 INFO  (closeThreadPool-4440-thread-2) [    ] o.a.s.c.SolrXmlConfig Configuration parameter autoReplicaFailoverWorkLoopDelay is ignored
   [junit4]   2> 1232594 INFO  (closeThreadPool-4440-thread-2) [    ] o.a.s.c.SolrXmlConfig Configuration parameter autoReplicaFailoverBadNodeExpiration is ignored
   [junit4]   2> 1232596 INFO  (closeThreadPool-4440-thread-2) [    ] o.a.s.c.SolrXmlConfig MBean server found: com.sun.jmx.mbeanserver.JmxMBeanServer@60b48556, but no JMX reporters were configured - adding default JMX reporter.
   [junit4]   2> 1232600 INFO  (closeThreadPool-4440-thread-1) [    ] o.a.s.h.c.HttpShardHandlerFactory Host whitelist initialized: WhitelistHostChecker [whitelistHosts=null, whitelistHostCheckingEnabled=false]
   [junit4]   2> 1232601 WARN  (closeThreadPool-4440-thread-1) [    ] o.a.s.c.s.i.Http2SolrClient Create Http2SolrClient with HTTP/1.1 transport since Java 8 or lower versions does not support SSL + HTTP/2
   [junit4]   2> 1232602 WARN  (closeThreadPool-4440-thread-1) [    ] o.e.j.u.s.S.config No Client EndPointIdentificationAlgorithm configured for SslContextFactory@204f9ce1[provider=null,keyStore=null,trustStore=null]
   [junit4]   2> 1232605 WARN  (closeThreadPool-4440-thread-1) [    ] o.a.s.c.s.i.Http2SolrClient Create Http2SolrClient with HTTP/1.1 transport since Java 8 or lower versions does not support SSL + HTTP/2
   [junit4]   2> 1232617 WARN  (closeThreadPool-4440-thread-1) [    ] o.e.j.u.s.S.config No Client EndPointIdentificationAlgorithm configured for SslContextFactory@54c28a38[provider=null,keyStore=null,trustStore=null]
   [junit4]   2> 1232618 INFO  (closeThreadPool-4440-thread-1) [    ] o.a.s.c.ZkContainer Zookeeper client=127.0.0.1:46808/solr
   [junit4]   2> 1232620 INFO  (zkConnectionManagerCallback-4450-thread-1) [    ] o.a.s.c.c.ConnectionManager zkClient has connected
   [junit4]   2> 1232622 INFO  (zkConnectionManagerCallback-4452-thread-1) [    ] o.a.s.c.c.ConnectionManager zkClient has connected
   [junit4]   2> 1232628 INFO  (closeThreadPool-4440-thread-1) [n:127.0.0.1:42747_    ] o.a.s.c.c.ZkStateReader Updated live nodes from ZooKeeper... (0) -> (1)
   [junit4]   2> 1232632 INFO  (closeThreadPool-4440-thread-1) [n:127.0.0.1:42747_    ] o.a.s.c.ZkController Publish node=127.0.0.1:42747_ as DOWN
   [junit4]   2> 1232634 INFO  (closeThreadPool-4440-thread-1) [n:127.0.0.1:42747_    ] o.a.s.c.TransientSolrCoreCacheDefault Allocating transient cache for 4 transient cores
   [junit4]   2> 1232634 INFO  (closeThreadPool-4440-thread-1) [n:127.0.0.1:42747_    ] o.a.s.c.ZkController Register node as live in ZooKeeper:/live_nodes/127.0.0.1:42747_
   [junit4]   2> 1232635 INFO  (zkCallback-4419-thread-2) [    ] o.a.s.c.c.ZkStateReader Updated live nodes from ZooKeeper... (1) -> (2)
   [junit4]   2> 1232641 INFO  (zkCallback-4426-thread-1) [    ] o.a.s.c.c.ZkStateReader Updated live nodes from ZooKeeper... (1) -> (2)
   [junit4]   2> 1232641 INFO  (zkCallback-4451-thread-1) [    ] o.a.s.c.c.ZkStateReader Updated live nodes from ZooKeeper... (1) -> (2)
   [junit4]   2> 1232642 INFO  (zkCallback-4438-thread-1) [    ] o.a.s.c.c.ZkStateReader Updated live nodes from ZooKeeper... (1) -> (2)
   [junit4]   2> 1232665 INFO  (zkConnectionManagerCallback-4459-thread-1) [    ] o.a.s.c.c.ConnectionManager zkClient has connected
   [junit4]   2> 1232667 INFO  (closeThreadPool-4440-thread-1) [n:127.0.0.1:42747_    ] o.a.s.c.c.ZkStateReader Updated live nodes from ZooKeeper... (0) -> (2)
   [junit4]   2> 1232668 INFO  (closeThreadPool-4440-thread-1) [n:127.0.0.1:42747_    ] o.a.s.c.s.i.ZkClientClusterStateProvider Cluster at 127.0.0.1:46808/solr ready
   [junit4]   2> 1232669 INFO  (closeThreadPool-4440-thread-1) [n:127.0.0.1:42747_    ] o.a.s.h.a.MetricsHistoryHandler No .system collection, keeping metrics history in memory.
   [junit4]   2> 1232705 INFO  (closeThreadPool-4440-thread-1) [n:127.0.0.1:42747_    ] o.a.s.m.r.SolrJmxReporter JMX monitoring for 'solr.node' (registry 'solr.node') enabled at server: com.sun.jmx.mbeanserver.JmxMBeanServer@60b48556
   [junit4]   2> 1232724 INFO  (closeThreadPool-4440-thread-1) [n:127.0.0.1:42747_    ] o.a.s.m.r.SolrJmxReporter JMX monitoring for 'solr.jvm' (registry 'solr.jvm') enabled at server: com.sun.jmx.mbeanserver.JmxMBeanServer@60b48556
   [junit4]   2> 1232725 INFO  (closeThreadPool-4440-thread-1) [n:127.0.0.1:42747_    ] o.a.s.m.r.SolrJmxReporter JMX monitoring for 'solr.jetty' (registry 'solr.jetty') enabled at server: com.sun.jmx.mbeanserver.JmxMBeanServer@60b48556
   [junit4]   2> 1232727 INFO  (closeThreadPool-4440-thread-1) [n:127.0.0.1:42747_    ] o.a.s.c.CorePropertiesLocator Found 0 core definitions underneath /x1/jenkins/jenkins-slave/workspace/Lucene-Solr-NightlyTests-master/checkout/solr/build/solr-core/test/J2/temp/solr.cloud.RollingRestartTest_EAEE53A87ED43831-001/shard-1-001/cores
   [junit4]   2> 1232829 INFO  (TEST-RollingRestartTest.test-seed#[EAEE53A87ED43831]) [    ] o.a.s.c.AbstractFullDistribZkTestBase create jetty 3 in directory /x1/jenkins/jenkins-slave/workspace/Lucene-Solr-NightlyTests-master/checkout/solr/build/solr-core/test/J2/temp/solr.cloud.RollingRestartTest_EAEE53A87ED43831-001/shard-3-001 of type NRT
   [junit4]   2> 1232831 WARN  (closeThreadPool-4440-thread-1) [    ] o.e.j.s.AbstractConnector Ignoring deprecated socket close linger time
   [junit4]   2> 1232831 INFO  (closeThreadPool-4440-thread-1) [    ] o.a.s.c.s.e.JettySolrRunner Start Jetty (original configured port=0)
   [junit4]   2> 1232831 INFO  (closeThreadPool-4440-thread-1) [    ] o.a.s.c.s.e.JettySolrRunner Trying to start Jetty on port 0 try number 1 ...
   [junit4]   2> 1232831 INFO  (closeThreadPool-4440-thread-1) [    ] o.e.j.s.Server jetty-9.4.14.v20181114; built: 2018-11-14T21:20:31.478Z; git: c4550056e785fb5665914545889f21dc136ad9e6; jvm 1.8.0_191-b12
   [junit4]   2> 1232833 INFO  (closeThreadPool-4440-thread-1) [    ] o.e.j.s.session DefaultSessionIdManager workerName=node0
   [junit4]   2> 1232833 INFO  (closeThreadPool-4440-thread-1) [    ] o.e.j.s.session No SessionScavenger set, using defaults
   [junit4]   2> 1232833 INFO  (closeThreadPool-4440-thread-1) [    ] o.e.j.s.session node0 Scavenging every 600000ms
   [junit4]   2> 1232834 INFO  (closeThreadPool-4440-thread-1) [    ] o.e.j.s.h.ContextHandler Started o.e.j.s.ServletContextHandler@5b431e59{/,null,AVAILABLE}
   [junit4]   2> 1232834 WARN  (closeThreadPool-4440-thread-1) [    ] o.e.j.u.s.S.config No Client EndPointIdentificationAlgorithm configured for SslContextFactory@5ed660cd[provider=null,keyStore=null,trustStore=null]
   [junit4]   2> 1232835 INFO  (closeThreadPool-4440-thread-1) [    ] o.e.j.s.AbstractConnector Started ServerConnector@4c377d77{SSL,[ssl, http/1.1]}{127.0.0.1:37758}
   [junit4]   2> 1232835 INFO  (closeThreadPool-4440-thread-1) [    ] o.e.j.s.Server Started @1232899ms
   [junit4]   2> 1232835 INFO  (closeThreadPool-4440-thread-1) [    ] o.a.s.c.s.e.JettySolrRunner Jetty properties: {solr.data.dir=/x1/jenkins/jenkins-slave/workspace/Lucene-Solr-NightlyTests-master/checkout/solr/build/solr-core/test/J2/temp/solr.cloud.RollingRestartTest_EAEE53A87ED43831-001/tempDir-001/jetty3, solrconfig=solrconfig.xml, hostContext=/, hostPort=37758, coreRootDirectory=/x1/jenkins/jenkins-slave/workspace/Lucene-Solr-NightlyTests-master/checkout/solr/build/solr-core/test/J2/temp/solr.cloud.RollingRestartTest_EAEE53A87ED43831-001/shard-3-001/cores}
   [junit4]   2> 1232835 ERROR (closeThreadPool-4440-thread-1) [    ] o.a.s.u.StartupLoggingUtils Missing Java Option solr.log.dir. Logging may be missing or incomplete.
   [junit4]   2> 1232835 INFO  (closeThreadPool-4440-thread-1) [    ] o.a.s.s.SolrDispatchFilter Using logger factory org.apache.logging.slf4j.Log4jLoggerFactory
   [junit4]   2> 1232835 INFO  (closeThreadPool-4440-thread-1) [    ] o.a.s.s.SolrDispatchFilter  ___      _       Welcome to Apache Solr? version 9.0.0
   [junit4]   2> 1232835 INFO  (closeThreadPool-4440-thread-1) [    ] o.a.s.s.SolrDispatchFilter / __| ___| |_ _   Starting in cloud mode on port null
   [junit4]   2> 1232835 INFO  (closeThreadPool-4440-thread-1) [    ] o.a.s.s.SolrDispatchFilter \__ \/ _ \ | '_|  Install dir: null
   [junit4]   2> 1232835 INFO  (closeThreadPool-4440-thread-1) [    ] o.a.s.s.SolrDispatchFilter |___/\___/_|_|    Start time: 2019-01-19T07:23:05.183Z
   [junit4]   2> 1232859 INFO  (zkConnectionManagerCallback-4462-thread-1) [    ] o.a.s.c.c.ConnectionManager zkClient has connected
   [junit4]   2> 1232860 INFO  (closeThreadPool-4440-thread-1) [    ] o.a.s.s.SolrDispatchFilter Loading solr.xml from SolrHome (not found in ZooKeeper)
   [junit4]   2> 1232861 INFO  (closeThreadPool-4440-thread-1) [    ] o.a.s.c.SolrXmlConfig Loading container configuration from /x1/jenkins/jenkins-slave/workspace/Lucene-Solr-NightlyTests-master/checkout/solr/build/solr-core/test/J2/temp/solr.cloud.RollingRestartTest_EAEE53A87ED43831-001/shard-3-001/solr.xml
   [junit4]   2> 1232866 INFO  (closeThreadPool-4440-thread-1) [    ] o.a.s.c.SolrXmlConfig Configuration parameter autoReplicaFailoverWorkLoopDelay is ignored
   [junit4]   2> 1232866 INFO  (closeThreadPool-4440-thread-1) [    ] o.a.s.c.SolrXmlConfig Configuration parameter autoReplicaFailoverBadNodeExpiration is ignored
   [junit4]   2> 1232867 INFO  (closeThreadPool-4440-thread-1) [    ] o.a.s.c.SolrXmlConfig MBean server found: com.sun.jmx.mbeanserver.JmxMBeanServer@60b48556, but no JMX reporters were configured - adding default JMX reporter.
   [junit4]   2> 1233056 INFO  (closeThreadPool-4440-thread-2) [    ] o.a.s.h.c.HttpShardHandlerFactory Host whitelist initialized: WhitelistHostChecker [whitelistHosts=null, whitelistHostCheckingEnabled=false]
   [junit4]   2> 1233058 WARN  (closeThreadPool-4440-thread-2) [    ] o.a.s.c.s.i.Http2SolrClient Create Http2SolrClient with HTTP/1.1 transport since Java 8 or lower versions does not support SSL + HTTP/2
   [junit4]   2> 1233066 WARN  (closeThreadPool-4440-thread-2) [    ] o.e.j.u.s.S.config No Client EndPointIdentificationAlgorithm configured for SslContextFactory@c6c6372[provider=null,keyStore=null,trustStore=null]
   [junit4]   2> 1233070 WARN  (closeThreadPool-4440-thread-2) [    ] o.a.s.c.s.i.Http2SolrClient Create Http2SolrClient with HTTP/1.1 transport since Java 8 or lower versions does not support SSL + HTTP/2
   [junit4]   2> 1233089 INFO  (closeThreadPool-4440-thread-1) [    ] o.a.s.h.c.HttpShardHandlerFactory Host whitelist initialized: WhitelistHostChecker [whitelistHosts=null, whitelistHostCheckingEnabled=false]
   [junit4]   2> 1233090 WARN  (closeThreadPool-4440-thread-1) [    ] o.a.s.c.s.i.Http2SolrClient Create Http2SolrClient with HTTP/1.1 transport since Java 8 or lower versions does not support SSL + HTTP/2
   [junit4]   2> 1233090 WARN  (closeThreadPool-4440-thread-2) [    ] o.e.j.u.s.S.config No Client EndPointIdentificationAlgorithm configured for SslContextFactory@26a500e8[provider=null,keyStore=null,trustStore=null]
   [junit4]   2> 1233091 WARN  (closeThreadPool-4440-thread-1) [    ] o.e.j.u.s.S.config No Client EndPointIdentificationAlgorithm configured for SslContextFactory@5a9b958a[provider=null,keyStore=null,trustStore=null]
   [junit4]   2> 1233092 INFO  (closeThreadPool-4440-thread-2) [    ] o.a.s.c.ZkContainer Zookeeper client=127.0.0.1:46808/solr
   [junit4]   2> 1233100 WARN  (closeThreadPool-4440-thread-1) [    ] o.a.s.c.s.i.Http2SolrClient Create Http2SolrClient with HTTP/1.1 transport since Java 8 or lower versions does not support SSL + HTTP/2
   [junit4]   2> 1233101 INFO  (zkConnectionManagerCallback-4470-thread-1) [    ] o.a.s.c.c.ConnectionManager zkClient has connected
   [junit4]   2> 1233103 WARN  (closeThreadPool-4440-thread-1) [    ] o.e.j.u.s.S.config No Client EndPointIdentificationAlgorithm configured for SslContextFactory@7e8fd066[provider=null,keyStore=null,trustStore=null]
   [junit4]   2> 1233104 INFO  (closeThreadPool-4440-thread-1) [    ] o.a.s.c.ZkContainer Zookeeper client=127.0.0.1:46808/solr
   [junit4]   2> 1233110 INFO  (zkConnectionManagerCallback-4476-thread-1) [    ] o.a.s.c.c.ConnectionManager zkClient has connected
   [junit4]   2> 1233112 INFO  (zkConnectionManagerCallback-4473-thread-1) [    ] o.a.s.c.c.ConnectionManager zkClient has connected
   [junit4]   2> 1233115 INFO  (zkConnectionManagerCallback-4478-thread-1) [    ] o.a.s.c.c.ConnectionManager zkClient has connected
   [junit4]   2> 1233119 INFO  (closeThreadPool-4440-thread-2) [n:127.0.0.1:44781_    ] o.a.s.c.c.ZkStateReader Updated live nodes from ZooKeeper... (0) -> (2)
   [junit4]   2> 1233127 INFO  (closeThreadPool-4440-thread-2) [n:127.0.0.1:44781_    ] o.a.s.c.ZkController Publish node=127.0.0.1:44781_ as DOWN
   [junit4]   2> 1233128 INFO  (closeThreadPool-4440-thread-1) [    ] o.a.s.c.c.ZkStateReader Updated live nodes from ZooKeeper... (0) -> (2)
   [junit4]   2> 1233128 INFO  (closeThreadPool-4440-thread-2) [n:127.0.0.1:44781_    ] o.a.s.c.TransientSolrCoreCacheDefault Allocating transient cache for 4 transient cores
   [junit4]   2> 1233128 INFO  (closeThreadPool-4440-thread-2) [n:127.0.0.1:44781_    ] o.a.s.c.ZkController Register node as live in ZooKeeper:/live_nodes/127.0.0.1:44781_
   [junit4]   2> 1233131 INFO  (zkCallback-4419-thread-2) [    ] o.a.s.c.c.ZkStateReader Updated live nodes from ZooKeeper... (2) -> (3)
   [junit4]   2> 1233133 INFO  (zkCallback-4451-thread-1) [    ] o.a.s.c.c.ZkStateReader Updated live nodes from ZooKeeper... (2) -> (3)
   [junit4]   2> 1233133 INFO  (zkCallback-4426-thread-1) [    ] o.a.s.c.c.ZkStateReader Updated live nodes from ZooKeeper... (2) -> (3)
   [junit4]   2> 1233133 INFO  (zkCallback-4438-thread-1) [    ] o.a.s.c.c.ZkStateReader Updated live nodes from ZooKeeper... (2) -> (3)
   [junit4]   2> 1233134 INFO  (zkCallback-4472-thread-1) [    ] o.a.s.c.c.ZkStateReader Updated live nodes from ZooKeeper... (2) -> (3)
   [junit4]   2> 1233134 INFO  (zkCallback-4477-thread-1) [    ] o.a.s.c.c.ZkStateReader Updated live nodes from ZooKeeper... (2) -> (3)
   [junit4]   2> 1233139 INFO  (closeThreadPool-4440-thread-1) [    ] o.a.s.c.ZkController Publish node=127.0.0.1:37758_ as DOWN
   [junit4]   2> 1233140 INFO  (closeThreadPool-4440-thread-1) [    ] o.a.s.c.TransientSolrCoreCacheDefault Allocating transient cache for 4 transient cores
   [junit4]   2> 1233140 INFO  (closeThreadPool-4440-thread-1) [    ] o.a.s.c.ZkController Register node as live in ZooKeeper:/live_nodes/127.0.0.1:37758_
   [junit4]   2> 1233142 INFO  (zkCallback-4426-thread-1) [    ] o.a.s.c.c.ZkStateReader Updated live nodes from ZooKeeper... (3) -> (4)
   [junit4]   2> 1233142 INFO  (zkCallback-4419-thread-2) [    ] o.a.s.c.c.ZkStateReader Updated live nodes from ZooKeeper... (3) -> (4)
   [junit4]   2> 1233142 INFO  (zkCallback-4438-thread-1) [    ] o.a.s.c.c.ZkStateReader Updated live nodes from ZooKeeper... (3) -> (4)
   [junit4]   2> 1233142 INFO  (zkCallback-4451-thread-1) [    ] o.a.s.c.c.ZkStateReader Updated live nodes from ZooKeeper... (3) -> (4)
   [junit4]   2> 1233143 INFO  (zkCallback-4472-thread-1) [    ] o.a.s.c.c.ZkStateReader Updated live nodes from ZooKeeper... (3) -> (4)
   [junit4]   2> 1233143 INFO  (zkCallback-4477-thread-1) [    ] o.a.s.c.c.ZkStateReader Updated live nodes from ZooKeeper... (3) -> (4)
   [junit4]   2> 1233147 INFO  (TEST-RollingRestartTest.test-seed#[EAEE53A87ED43831]) [    ] o.a.s.c.AbstractFullDistribZkTestBase create jetty 4 in directory /x1/jenkins/jenkins-slave/workspace/Lucene-Solr-NightlyTests-master/checkout/solr/build/solr-core/test/J2/temp/solr.cloud.RollingRestartTest_EAEE53A87ED43831-001/shard-4-001 of type NRT
   [junit4]   2> 1233153 INFO  (zkCallback-4458-thread-1) [    ] o.a.s.c.c.ZkStateReader Updated live nodes from ZooKeeper... (2) -> (4)
   [junit4]   2> 1233155 WARN  (closeThreadPool-4440-thread-3) [    ] o.e.j.s.AbstractConnector Ignoring deprecated socket close linger time
   [junit4]   2> 1233157 INFO  (closeThreadPool-4440-thread-3) [    ] o.a.s.c.s.e.JettySolrRunner Start Jetty (original configured port=0)
   [junit4]   2> 1233157 INFO  (closeThreadPool-4440-thread-3) [    ] o.a.s.c.s.e.JettySolrRunner Trying to start Jetty on port 0 try number 1 ...
   [junit4]   2> 1233157 INFO  (closeThreadPool-4440-thread-3) [    ] o.e.j.s.Server jetty-9.4.14.v20181114; built: 2018-11-14T21:20:31.478Z; git: c4550056e785fb5665914545889f21dc136ad9e6; jvm 1.8.0_191-b12
   [junit4]   2> 1233158 INFO  (closeThreadPool-4440-thread-3) [    ] o.e.j.s.session DefaultSessionIdManager workerName=node0
   [junit4]   2> 1233158 INFO  (closeThreadPool-4440-thread-3) [    ] o.e.j.s.session No SessionScavenger set, using defaults
   [junit4]   2> 1233158 INFO  (closeThreadPool-4440-thread-3) [    ] o.e.j.s.session node0 Scavenging every 660000ms
   [junit4]   2> 1233159 INFO  (closeThreadPool-4440-thread-3) [    ] o.e.j.s.h.ContextHandler Started o.e.j.s.ServletContextHandler@3dfb04da{/,null,AVAILABLE}
   [junit4]   2> 1233159 WARN  (closeThreadPool-4440-thread-3) [    ] o.e.j.u.s.S.config No Client EndPointIdentificationAlgorithm configured for SslContextFactory@680a5d0f[provider=null,keyStore=null,trustStore=null]
   [junit4]   2> 1233160 INFO  (closeThreadPool-4440-thread-3) [    ] o.e.j.s.AbstractConnector Started ServerConnector@3e8588a6{SSL,[ssl, http/1.1]}{127.0.0.1:40425}
   [junit4]   2> 1233160 INFO  (closeThreadPool-4440-thread-3) [    ] o.e.j.s.Server Started @1233224ms
   [junit4]   2> 1233160 INFO  (closeThreadPool-4440-thread-3) [    ] o.a.s.c.s.e.JettySolrRunner Jetty properties: {solr.data.dir=/x1/jenkins/jenkins-slave/workspace/Lucene-Solr-NightlyTests-master/checkout/solr/build/solr-core/test/J2/temp/solr.cloud.RollingRestartTest_EAEE53A87ED43831-001/tempDir-001/jetty4, replicaType=NRT, solrconfig=solrconfig.xml, hostContext=/, hostPort=40425, coreRootDirectory=/x1/jenkins/jenkins-slave/workspace/Lucene-Solr-NightlyTests-master/checkout/solr/build/solr-core/test/J2/temp/solr.cloud.RollingRestartTest_EAEE53A87ED43831-001/shard-4-001/cores}
   [junit4]   2> 1233160 ERROR (closeThreadPool-4440-thread-3) [    ] o.a.s.u.StartupLoggingUtils Missing Java Option solr.log.dir. Logging may be missing or incomplete.
   [junit4]   2> 1233160 INFO  (closeThreadPool-4440-thread-3) [    ] o.a.s.s.SolrDispatchFilter Using logger factory org.apache.logging.slf4j.Log4jLoggerFactory
   [junit4]   2> 1233160 INFO  (closeThreadPool-4440-thread-3) [    ] o.a.s.s.SolrDispatchFilter  ___      _       Welcome to Apache Solr? version 9.0.0
   [junit4]   2> 1233160 INFO  (closeThreadPool-4440-thread-3) [    ] o.a.s.s.SolrDispatchFilter / __| ___| |_ _   Starting in cloud mode on port null
   [junit4]   2> 1233160 INFO  (closeThreadPool-4440-thread-3) [    ] o.a.s.s.SolrDispatchFilter \__ \/ _ \ | '_|  Install dir: null
   [junit4]   2> 1233160 INFO  (closeThreadPool-4440-thread-3) [    ] o.a.s.s.SolrDispatchFilter |___/\___/_|_|    Start time: 2019-01-19T07:23:05.508Z
   [junit4]   2> 1233163 INFO  (zkConnectionManagerCallback-4484-thread-1) [    ] o.a.s.c.c.ConnectionManager zkClient has connected
   [junit4]   2> 1233164 INFO  (closeThreadPool-4440-thread-3) [    ] o.a.s.s.SolrDispatchFilter Loading solr.xml from SolrHome (not found in ZooKeeper)
   [junit4]   2> 1233164 INFO  (closeThreadPool-4440-thread-3) [    ] o.a.s.c.SolrXmlConfig Loading container configuration from /x1/jenkins/jenkins-slave/workspace/Lucene-Solr-NightlyTests-master/checkout/solr/build/solr-core/test/J2/temp/solr.cloud.RollingRestartTest_EAEE53A87ED43831-001/shard-4-001/solr.xml
   [junit4]   2> 1233169 INFO  (closeThreadPool-4440-thread-3) [    ] o.a.s.c.SolrXmlConfig Configuration parameter autoReplicaFailoverWorkLoopDelay is ignored
   [junit4]   2> 1233169 INFO  (closeThreadPool-4440-thread-3) [    ] o.a.s.c.SolrXmlConfig Configuration parameter autoReplicaFailoverBadNodeExpiration is ignored
   [junit4]   2> 1233171 INFO  (closeThreadPool-4440-thread-3) [    ] o.a.s.c.SolrXmlConfig MBean server found: com.sun.jmx.mbeanserver.JmxMBeanServer@60b48556, but no JMX reporters were configured - adding default JMX reporter.
   [junit4]   2> 1233176 INFO  (zkConnectionManagerCallback-4489-thread-1) [    ] o.a.s.c.c.ConnectionManager zkClient has connected
   [junit4]   2> 1233177 INFO  (zkConnectionManagerCallback-4494-thread-1) [    ] o.a.s.c.c.ConnectionManager zkClient has connected
   [junit4]   2> 1233182 INFO  (closeThreadPool-4440-thread-2) [n:127.0.0.1:44781_    ] o.a.s.c.c.ZkStateReader Updated live nodes from ZooKeeper... (0) -> (4)
   [junit4]   2> 1233182 INFO  (closeThreadPool-4440-thread-1) [    ] o.a.s.c.c.ZkStateReader Updated live nodes from ZooKeeper... (0) -> (4)
   [junit4]   2> 1233184 INFO  (closeThreadPool-4440-thread-2) [n:127.0.0.1:44781_    ] o.a.s.c.s.i.ZkClientClusterStateProvider Cluster at 127.0.0.1:46808/solr ready
   [junit4]   2> 1233185 INFO  (closeThreadPool-4440-thread-2) [n:127.0.0.1:44781_    ] o.a.s.h.a.MetricsHistoryHandler No .system collection, keeping metrics history in memory.
   [junit4]   2> 1233185 INFO  (closeThreadPool-4440-thread-1) [    ] o.a.s.c.s.i.ZkClientClusterStateProvider Cluster at 127.0.0.1:46808/solr ready
   [junit4]   2> 1233189 INFO  (closeThreadPool-4440-thread-1) [    ] o.a.s.h.a.MetricsHistoryHandler No .system collection, keeping metrics history in memory.
   [junit4]   2> 1233209 DEBUG (ScheduledTrigger-3844-thread-2) [    ] o.a.s.c.a.NodeLostTrigger Running NodeLostTrigger: .auto_add_replicas with currently live nodes: 4 and last live nodes: 1
   [junit4]   2> 1233241 INFO  (closeThreadPool-4440-thread-2) [n:127.0.0.1:44781_    ] o.a.s.m.r.SolrJmxReporter JMX monitoring for 'solr.node' (registry 'solr.node') enabled at server: com.sun.jmx.mbeanserver.JmxMBeanServer@60b48556
   [junit4]   2> 1233247 INFO  (closeThreadPool-4440-thread-1) [    ] o.a.s.m.r.SolrJmxReporter JMX monitoring for 'solr.node' (registry 'solr.node') enabled at server: com.sun.jmx.mbeanserver.JmxMBeanServer@60b48556
   [junit4]   2> 1233267 INFO  (closeThreadPool-4440-thread-1) [    ] o.a.s.m.r.SolrJmxReporter JMX monitoring for 'solr.jvm' (registry 'solr.jvm') enabled at server: com.sun.jmx.mbeanserver.JmxMBeanServer@60b48556
   [junit4]   2> 1233267 INFO  (closeThreadPool-4440-thread-1) [    ] o.a.s.m.r.SolrJmxReporter JMX monitoring for 'solr.jetty' (registry 'solr.jetty') enabled at server: com.sun.jmx.mbeanserver.JmxMBeanServer@60b48556
   [junit4]   2> 1233275 INFO  (closeThreadPool-4440-thread-3) [    ] o.a.s.h.c.HttpShardHandlerFactory Host whitelist initialized: WhitelistHostChecker [whitelistHosts=null, whitelistHostCheckingEnabled=false]
   [junit4]   2> 1233276 INFO  (closeThreadPool-4440-thread-1) [    ] o.a.s.c.CorePropertiesLocator Found 0 core definitions underneath /x1/jenkins/jenkins-slave/workspace/Lucene-Solr-NightlyTests-master/checkout/solr/build/solr-core/test/J2/temp/solr.cloud.RollingRestartTest_EAEE53A87ED43831-001/shard-3-001/cores
   [junit4]   2> 1233276 WARN  (closeThreadPool-4440-thread-3) [    ] o.a.s.c.s.i.Http2SolrClient Create Http2SolrClient with HTTP/1.1 transport since Java 8 or lower versions does not support SSL + HTTP/2
   [junit4]   2> 1233277 WARN  (closeThreadPool-4440-thread-3) [    ] o.e.j.u.s.S.config No Client EndPointIdentificationAlgorithm configured for SslContextFactory@27179e2c[provider=null,keyStore=null,trustStore=null]
   [junit4]   2> 1233280 WARN  (closeThreadPool-4440-thread-3) [    ] o.a.s.c.s.i.Http2SolrClient Create Http2SolrClient with HTTP/1.1 transport since Java 8 or lower versions does not support SSL + HTTP/2
   [junit4]   2> 1233281 WARN  (closeThreadPool-4440-thread-3) [    ] o.e.j.u.s.S.config No Client EndPointIdentificationAlgorithm configured for SslContextFactory@56df7cf9[provider=null,keyStore=null,trustStore=null]
   [junit4]   2> 1233281 INFO  (closeThreadPool-4440-thread-2) [n:127.0.0.1:44781_    ] o.a.s.m.r.SolrJmxReporter JMX monitoring for 'solr.jvm' (registry 'solr.jvm') enabled at server: com.sun.jmx.mbeanserver.JmxMBeanServer@60b48556
   [junit4]   2> 1233282 INFO  (closeThreadPool-4440-thread-2) [n:127.0.0.1:44781_    ] o.a.s.m.r.SolrJmxReporter JMX monitoring for 'solr.jetty' (registry 'solr.jetty') enabled at server: com.sun.jmx.mbeanserver.JmxMBeanServer@60b48556
   [junit4]   2> 1233282 INFO  (closeThreadPool-4440-thread-3) [    ] o.a.s.c.ZkContainer Zookeeper client=127.0.0.1:46808/solr
   [junit4]   2> 1233284 INFO  (closeThreadPool-4440-thread-2) [n:127.0.0.1:44781_    ] o.a.s.c.CorePropertiesLocator Found 0 core definitions underneath /x1/jenkins/jenkins-slave/workspace/Lucene-Solr-NightlyTests-master/checkout/solr/build/solr-core/test/J2/temp/solr.cloud.RollingRestartTest_EAEE53A87ED43831-001/shard-2-001/cores
   [junit4]   2> 1233287 INFO  (zkConnectionManagerCallback-4502-thread-1) [    ] o.a.s.c.c.ConnectionManager zkClient has connected
   [junit4]   2> 1233291 INFO  (zkConnectionManagerCallback-4504-thread-1) [    ] o.a.s.c.c.ConnectionManager zkClient has connected
   [junit4]   2> 1233298 INFO  (closeThreadPool-4440-thread-3) [n:127.0.0.1:40425_    ] o.a.s.c.c.ZkStateReader Updated live nodes from ZooKeeper... (0) -> (4)
   [junit4]   2> 1233305 INFO  (closeThreadPool-4440-thread-3) [n:127.0.0.1:40425_    ] o.a.s.c.ZkController Publish node=127.0.0.1:40425_ as DOWN
   [junit4]   2> 1233307 INFO  (closeThreadPool-4440-thread-3) [n:127.0.0.1:40425_    ] o.a.s.c.TransientSolrCoreCacheDefault Allocating transient cache for 4 transient cores
   [junit4]   2> 1233307 INFO  (closeThreadPool-4440-thread-3) [n:127.0.0.1:40425_    ] o.a.s.c.ZkController Register node as live in ZooKeeper:/live_nodes/127.0.0.1:40425_
   [junit4]   2> 1233310 INFO  (zkCallback-4426-thread-1) [    ] o.a.s.c.c.ZkStateReader Updated live nodes from ZooKeeper... (4) -> (5)
   [junit4]   2> 1233310 INFO  (zkCallback-4438-thread-1) [    ] o.a.s.c.c.ZkStateReader Updated live nodes from ZooKeeper... (4) -> (5)
   [junit4]   2> 1233310 INFO  (zkCallback-4477-thread-1) [    ] o.a.s.c.c.ZkStateReader Updated live nodes from ZooKeeper... (4) -> (5)
   [junit4]   2> 1233310 INFO  (zkCallback-4503-thread-1) [    ] o.a.s.c.c.ZkStateReader Updated live nodes from ZooKeeper... (4) -> (5)
   [junit4]   2> 1233310 INFO  (zkCallback-4451-thread-1) [    ] o.a.s.c.c.ZkStateReader Updated live nodes from ZooKeeper... (4) -> (5)
   [junit4]   2> 1233310 INFO  (zkCallback-4472-thread-1) [    ] o.a.s.c.c.ZkStateReader Updated live nodes from ZooKeeper... (4) -> (5)
   [junit4]   2> 1233310 INFO  (zkCallback-4458-thread-1) [    ] o.a.s.c.c.ZkStateReader Updated live nodes from ZooKeeper... (4) -> (5)
   [junit4]   2> 1233310 INFO  (zkCallback-4419-thread-2) [    ] o.a.s.c.c.ZkStateReader Updated live nodes from ZooKeeper... (4) -> (5)
   [junit4]   2> 1233311 INFO  (zkCallback-4488-thread-1) [    ] o.a.s.c.c.ZkStateReader Updated live nodes from ZooKeeper... (4) -> (5)
   [junit4]   2> 1233311 INFO  (zkCallback-4493-thread-1) [    ] o.a.s.c.c.ZkStateReader Updated live nodes from ZooKeeper... (4) -> (5)
   [junit4]   2> 1233358 INFO  (zkConnectionManagerCallback-4511-thread-1) [    ] o.a.s.c.c.ConnectionManager zkClient has connected
   [junit4]   2> 1233360 INFO  (closeThreadPool-4440-thread-3) [n:127.0.0.1:40425_    ] o.a.s.c.c.ZkStateReader Updated live nodes from ZooKeeper... (0) -> (5)
   [junit4]   2> 1233363 INFO  (closeThreadPool-4440-thread-3) [n:127.0.0.1:40425_    ] o.a.s.c.s.i.ZkClientClusterStateProvider Cluster at 127.0.0.1:46808/solr ready
   [junit4]   2> 1233364 INFO  (closeThreadPool-4440-thread-3) [n:127.0.0.1:40425_    ] o.a.s.h.a.MetricsHistoryHandler No .system collection, keeping metrics history in memory.
   [junit4]   2> 1233413 INFO  (closeThreadPool-4440-thread-3) [n:127.0.0.1:40425_    ] o.a.s.m.r.SolrJmxReporter JMX monitoring for 'solr.node' (registry 'solr.node') enabled at server: com.sun.jmx.mbeanserver.JmxMBeanServer@60b48556
   [junit4]   2> 1233431 INFO  (closeThreadPool-4440-thread-3) [n:127.0.0.1:40425_    ] o.a.s.m.r.SolrJmxReporter JMX monitoring for 'solr.jvm' (registry 'solr.jvm') enabled at server: com.sun.jmx.mbeanserver.JmxMBeanServer@60b48556
   [junit4]   2> 1233431 INFO  (closeThreadPool-4440-thread-3) [n:127.0.0.1:40425_    ] o.a.s.m.r.SolrJmxReporter JMX monitoring for 'solr.jetty' (registry 'solr.jetty') enabled at server: com.sun.jmx.mbeanserver.JmxMBeanServer@60b48556
   [junit4]   2> 1233435 INFO  (closeThreadPool-4440-thread-3) [n:127.0.0.1:40425_    ] o.a.s.c.CorePropertiesLocator Found 0 core definitions underneath /x1/jenkins/jenkins-slave/workspace/Lucene-Solr-NightlyTests-master/checkout/solr/build/solr-core/test/J2/temp/solr.cloud.RollingRestartTest_EAEE53A87ED43831-001/shard-4-001/cores
   [junit4]   2> 1233488 INFO  (TEST-RollingRestartTest.test-seed#[EAEE53A87ED43831]) [    ] o.a.s.c.AbstractFullDistribZkTestBase create jetty 5 in directory /x1/jenkins/jenkins-slave/workspace/Lucene-Solr-NightlyTests-master/checkout/solr/build/solr-core/test/J2/temp/solr.cloud.RollingRestartTest_EAEE53A87ED43831-001/shard-5-001 of type NRT
   [junit4]   2> 1233490 WARN  (closeThreadPool-4440-thread-1) [    ] o.e.j.s.AbstractConnector Ignoring deprecated socket close linger time
   [junit4]   2> 1233490 INFO  (closeThreadPool-4440-thread-1) [    ] o.a.s.c.s.e.JettySolrRunner Start Jetty (original configured port=0)
   [junit4]   2> 1233490 INFO  (closeThreadPool-4440-thread-1) [    ] o.a.s.c.s.e.JettySolrRunner Trying to start Jetty on port 0 try number 1 ...
   [junit4]   2> 1233490 INFO  (closeThreadPool-4440-thread-1) [    ] o.e.j.s.Server jetty-9.4.14.v20181114; built: 2018-11-14T21:20:31.478Z; git: c4550056e785fb5665914545889f21dc136ad9e6; jvm 1.8.0_191-b12
   [junit4]   2> 1233492 INFO  (closeThreadPool-4440-thread-1) [    ] o.e.j.s.session DefaultSessionIdManager workerName=node0
   [junit4]   2> 1233492 INFO  (closeThreadPool-4440-thread-1) [    ] o.e.j.s.session No SessionScavenger set, using defaults
   [junit4]   2> 1233492 INFO  (closeThreadPool-4440-thread-1) [    ] o.e.j.s.session node0 Scavenging every 660000ms
   [junit4]   2> 1233492 INFO  (closeThreadPool-4440-thread-1) [    ] o.e.j.s.h.ContextHandler Started o.e.j.s.ServletContextHandler@454519f3{/,null,AVAILABLE}
   [junit4]   2> 1233493 WARN  (closeThreadPool-4440-thread-1) [    ] o.e.j.u.s.S.config No Client EndPointIdentificationAlgorithm configured for SslContextFactory@235d3b76[provider=null,keyStore=null,trustStore=null]
   [junit4]   2> 1233493 INFO  (closeThreadPool-4440-thread-1) [    ] o.e.j.s.AbstractConnector Started ServerConnector@6d07e6b7{SSL,[ssl, http/1.1]}{127.0.0.1:34576}
   [junit4]   2> 1233493 INFO  (closeThreadPool-4440-thread-1) [    ] o.e.j.s.Server Started @1233557ms
   [junit4]   2> 1233493 INFO  (closeThreadPool-4440-thread-1) [    ] o.a.s.c.s.e.JettySolrRunner Jetty properties: {solr.data.dir=/x1/jenkins/jenkins-slave/workspace/Lucene-Solr-NightlyTests-master/checkout/solr/build/solr-core/test/J2/temp/solr.cloud.RollingRestartTest_EAEE53A87ED43831-001/tempDir-001/jetty5, solrconfig=solrconfig.xml, hostContext=/, hostPort=34576, coreRootDirectory=/x1/jenkins/jenkins-slave/workspace/Lucene-Solr-NightlyTests-master/checkout/solr/build/solr-core/test/J2/../../../../../../../../../../../x1/jenkins/jenkins-slave/workspace/Lucene-Solr-NightlyTests-master/checkout/solr/build/solr-core/test/J2/temp/solr.cloud.RollingRestartTest_EAEE53A87ED43831-001/shard-5-001/cores}
   [junit4]   2> 1233493 ERROR (closeThreadPool-4440-thread-1) [    ] o.a.s.u.StartupLoggingUtils Missing Java Option solr.log.dir. Logging may be missing or incomplete.
   [junit4]   2> 1233494 INFO  (closeThreadPool-4440-thread-1) [    ] o.a.s.s.SolrDispatchFilter Using logger factory org.apache.logging.slf4j.Log4jLoggerFactory
   [junit4]   2> 1233494 INFO  (closeThreadPool-4440-thread-1) [    ] o.a.s.s.SolrDispatchFilter  ___      _       Welcome to Apache Solr? version 9.0.0
   [junit4]   2> 1233494 INFO  (closeThreadPool-4440-thread-1) [    ] o.a.s.s.SolrDispatchFilter / __| ___| |_ _   Starting in cloud mode on port null
   [junit4]   2> 1233494 INFO  (closeThreadPool-4440-thread-1) [    ] o.a.s.s.SolrD

[...truncated too long message...]

n1/leader_elect/shard2/election/72648555097751651-core_node25-n_0000000010
   [junit4]   2> 	2	/solr/overseer_elect/election/72648555097751596-127.0.0.1:44932_-n_0000000009
   [junit4]   2> 	2	/solr/collections/collection1/leader_elect/shard2/election/72648555097751579-core_node21-n_0000000004
   [junit4]   2> 	2	/solr/collections/collection1/leader_elect/shard1/election/72648555097751723-core_node26-n_0000000019
   [junit4]   2> 	2	/solr/overseer_elect/election/72648555097751619-127.0.0.1:42646_-n_0000000015
   [junit4]   2> 	2	/solr/overseer_elect/election/72648555097751731-127.0.0.1:41934_-n_0000000049
   [junit4]   2> 	2	/solr/overseer_elect/election/72648555097751715-127.0.0.1:44986_-n_0000000045
   [junit4]   2> 	2	/solr/collections/collection1/leader_elect/shard2/election/72648555097751715-core_node25-n_0000000019
   [junit4]   2> 	2	/solr/overseer_elect/election/72648555097751739-127.0.0.1:37758_-n_0000000055
   [junit4]   2> 	2	/solr/overseer_elect/election/72648555097751703-127.0.0.1:41355_-n_0000000042
   [junit4]   2> 	2	/solr/overseer_elect/election/72648555097751557-127.0.0.1:34365_-n_0000000017
   [junit4]   2> 	2	/solr/overseer_elect/election/72648555097751747-127.0.0.1:34576_-n_0000000057
   [junit4]   2> 	2	/solr/overseer_elect/election/72648555097751643-127.0.0.1:44932_-n_0000000023
   [junit4]   2> 	2	/solr/overseer_elect/election/72648555097751639-127.0.0.1:41355_-n_0000000022
   [junit4]   2> 	2	/solr/overseer_elect/election/72648555097751570-127.0.0.1:37758_-n_0000000003
   [junit4]   2> 	2	/solr/collections/collection1/leader_elect/shard1/election/72648555097751659-core_node26-n_0000000012
   [junit4]   2> 	2	/solr/collections/collection1/leader_elect/shard2/election/72648555097751643-core_node14-n_0000000008
   [junit4]   2> 	2	/solr/overseer_elect/election/72648555097751675-127.0.0.1:37758_-n_0000000031
   [junit4]   2> 	2	/solr/collections/collection1/leader_elect/shard2/election/72648555097751683-core_node21-n_0000000016
   [junit4]   2> 	2	/solr/collections/collection1/leader_elect/shard2/election/72648555097751707-core_node14-n_0000000017
   [junit4]   2> 	2	/solr/overseer_elect/election/72648555097751683-127.0.0.1:34576_-n_0000000037
   [junit4]   2> 	2	/solr/collections/collection1/leader_elect/shard1/election/72648555097751607-core_node26-n_0000000006
   [junit4]   2> 	2	/solr/overseer_elect/election/72648555097751619-127.0.0.1:42646_-n_0000000053
   [junit4]   2> 	2	/solr/collections/collection1/leader_elect/shard2/election/72648555097751611-core_node32-n_0000000007
   [junit4]   2> 	2	/solr/overseer_elect/election/72648555097751707-127.0.0.1:44932_-n_0000000043
   [junit4]   2> 
   [junit4]   2> Maximum concurrent children watches above limit:
   [junit4]   2> 
   [junit4]   2> 	112	/solr/collections
   [junit4]   2> 	61	/solr/live_nodes
   [junit4]   2> 	30	/solr/autoscaling/events/.scheduled_maintenance
   [junit4]   2> 	30	/solr/overseer/queue-work
   [junit4]   2> 	29	/solr/autoscaling/events/.auto_add_replicas
   [junit4]   2> 	20	/solr/overseer/queue
   [junit4]   2> 	20	/solr/overseer/collection-queue-work
   [junit4]   2> 
   [junit4]   2> 1534365 INFO  (TEST-RollingRestartTest.test-seed#[EAEE53A87ED43831]) [    ] o.a.s.c.ZkTestServer parse host and port list: 127.0.0.1:46808
   [junit4]   2> 1534365 INFO  (TEST-RollingRestartTest.test-seed#[EAEE53A87ED43831]) [    ] o.a.s.c.ZkTestServer connecting to 127.0.0.1 46808
   [junit4]   2> NOTE: download the large Jenkins line-docs file by running 'ant get-jenkins-line-docs' in the lucene directory.
   [junit4]   2> NOTE: reproduce with: ant test  -Dtestcase=RollingRestartTest -Dtests.method=test -Dtests.seed=EAEE53A87ED43831 -Dtests.multiplier=2 -Dtests.nightly=true -Dtests.slow=true -Dtests.linedocsfile=/home/jenkins/jenkins-slave/workspace/Lucene-Solr-NightlyTests-master/test-data/enwiki.random.lines.txt -Dtests.locale=ro-RO -Dtests.timezone=Africa/Bujumbura -Dtests.asserts=true -Dtests.file.encoding=US-ASCII
   [junit4] ERROR    305s J2 | RollingRestartTest.test <<<
   [junit4]    > Throwable #1: java.net.BindException: Address already in use
   [junit4]    > 	at __randomizedtesting.SeedInfo.seed([EAEE53A87ED43831:62BA6C72D02855C9]:0)
   [junit4]    > 	at sun.nio.ch.Net.bind0(Native Method)
   [junit4]    > 	at sun.nio.ch.Net.bind(Net.java:433)
   [junit4]    > 	at sun.nio.ch.Net.bind(Net.java:425)
   [junit4]    > 	at sun.nio.ch.ServerSocketChannelImpl.bind(ServerSocketChannelImpl.java:223)
   [junit4]    > 	at sun.nio.ch.ServerSocketAdaptor.bind(ServerSocketAdaptor.java:74)
   [junit4]    > 	at org.eclipse.jetty.server.ServerConnector.openAcceptChannel(ServerConnector.java:342)
   [junit4]    > 	at org.eclipse.jetty.server.ServerConnector.open(ServerConnector.java:308)
   [junit4]    > 	at org.eclipse.jetty.server.AbstractNetworkConnector.doStart(AbstractNetworkConnector.java:80)
   [junit4]    > 	at org.eclipse.jetty.server.ServerConnector.doStart(ServerConnector.java:236)
   [junit4]    > 	at org.eclipse.jetty.util.component.AbstractLifeCycle.start(AbstractLifeCycle.java:68)
   [junit4]    > 	at org.eclipse.jetty.server.Server.doStart(Server.java:394)
   [junit4]    > 	at org.eclipse.jetty.util.component.AbstractLifeCycle.start(AbstractLifeCycle.java:68)
   [junit4]    > 	at org.apache.solr.client.solrj.embedded.JettySolrRunner.retryOnPortBindFailure(JettySolrRunner.java:544)
   [junit4]    > 	at org.apache.solr.client.solrj.embedded.JettySolrRunner.start(JettySolrRunner.java:483)
   [junit4]    > 	at org.apache.solr.client.solrj.embedded.JettySolrRunner.start(JettySolrRunner.java:451)
   [junit4]    > 	at org.apache.solr.cloud.RollingRestartTest.restartWithRolesTest(RollingRestartTest.java:104)
   [junit4]    > 	at org.apache.solr.cloud.RollingRestartTest.test(RollingRestartTest.java:53)
   [junit4]    > 	at org.apache.solr.BaseDistributedSearchTestCase$ShardsRepeatRule$ShardsFixedStatement.callStatement(BaseDistributedSearchTestCase.java:1082)
   [junit4]    > 	at org.apache.solr.BaseDistributedSearchTestCase$ShardsRepeatRule$ShardsStatement.evaluate(BaseDistributedSearchTestCase.java:1054)
   [junit4]    > 	at java.lang.Thread.run(Thread.java:748)
   [junit4]   2> NOTE: leaving temporary files on disk at: /x1/jenkins/jenkins-slave/workspace/Lucene-Solr-NightlyTests-master/checkout/solr/build/solr-core/test/J2/temp/solr.cloud.RollingRestartTest_EAEE53A87ED43831-001
   [junit4]   2> Jan 19, 2019 7:28:06 AM com.carrotsearch.randomizedtesting.ThreadLeakControl checkThreadLeaks
   [junit4]   2> WARNING: Will linger awaiting termination of 1 leaked thread(s).
   [junit4]   2> NOTE: test params are: codec=Asserting(Lucene80): {}, docValues:{}, maxPointsInLeafNode=1210, maxMBSortInHeap=7.188848946450351, sim=Asserting(org.apache.lucene.search.similarities.AssertingSimilarity@5d66d856), locale=ro-RO, timezone=Africa/Bujumbura
   [junit4]   2> NOTE: Linux 4.4.0-137-generic amd64/Oracle Corporation 1.8.0_191 (64-bit)/cpus=4,threads=1,free=101422272,total=518520832
   [junit4]   2> NOTE: All tests run in this JVM: [TestPayloadScoreQParserPlugin, TestConfigReload, TestSafeXMLParsing, TestFieldSortValues, CdcrUpdateLogTest, DistributedIntervalFacetingTest, ZkCLITest, UpdateRequestProcessorFactoryTest, OverriddenZkACLAndCredentialsProvidersTest, HdfsDirectoryFactoryTest, CloudMLTQParserTest, TestQuerySenderNoQuery, AlternateDirectoryTest, TestDefaultStatsCache, SmileWriterTest, TestDeleteCollectionOnDownNodes, TestSimExtremeIndexing, ActionThrottleTest, TestUnifiedSolrHighlighter, SpellCheckCollatorWithCollapseTest, ShardRoutingCustomTest, PrimitiveFieldTypeTest, TestMergePolicyConfig, TestTolerantUpdateProcessorCloud, TestSimpleTrackingShardHandler, TestSortByMinMaxFunction, NumberUtilsTest, TestSurroundQueryParser, TestDistributedStatsComponentCardinality, TestMacroExpander, WrapperMergePolicyFactoryTest, DistributedSuggestComponentTest, TestDynamicFieldResource, LoggingHandlerTest, TestSuggestSpellingConverter, BadIndexSchemaTest, UUIDFieldTest, FileBasedSpellCheckerTest, TestSerializedLuceneMatchVersion, TestDynamicURP, SearchRateTriggerTest, TestAuthenticationFramework, ResourceLoaderTest, SolrShardReporterTest, MetricTriggerIntegrationTest, BinaryUpdateRequestHandlerTest, TestUpdate, TestTrie, TestRequestStatusCollectionAPI, SimplePostToolTest, SolrGangliaReporterTest, LeaderElectionContextKeyTest, SortSpecParsingTest, TestCloudInspectUtil, HDFSCollectionsAPITest, TestCloudSearcherWarming, TestTestInjection, HighlighterMaxOffsetTest, TestMinHashQParser, TestSolrConfigHandlerCloud, TriLevelCompositeIdRoutingTest, TestFieldCache, TestFieldCacheSortRandom, TriggerSetPropertiesIntegrationTest, TestCharFilters, TestStreamBody, TestRangeQuery, CoreSorterTest, ReplicaListTransformerTest, TestStressReorder, SuggesterTSTTest, CoreAdminRequestStatusTest, TestReversedWildcardFilterFactory, XmlInterpolationTest, BasicDistributedZkTest, OverseerRolesTest, AtomicUpdateProcessorFactoryTest, ImplicitSnitchTest, MetricsHandlerTest, TestFileDictionaryLookup, TestDocumentBuilder, HdfsChaosMonkeyNothingIsSafeTest, MoveReplicaHDFSTest, CreateRoutedAliasTest, TestLuceneIndexBackCompat, GraphQueryTest, TestSolrJ, TestSolrQueryResponse, ZookeeperStatusHandlerTest, JavabinLoaderTest, SliceStateTest, AssignBackwardCompatibilityTest, RollingRestartTest]
   [junit4] Completed [271/839 (1!)] on J2 in 305.08s, 1 test, 1 error <<< FAILURES!

[...truncated 10959 lines...]
BUILD FAILED
/x1/jenkins/jenkins-slave/workspace/Lucene-Solr-NightlyTests-master/checkout/build.xml:651: The following error occurred while executing this line:
/x1/jenkins/jenkins-slave/workspace/Lucene-Solr-NightlyTests-master/checkout/build.xml:585: Some of the tests produced a heap dump, but did not fail. Maybe a suppressed OutOfMemoryError? Dumps created:
* java_pid24935.hprof

Total time: 281 minutes 15 seconds
Build step 'Invoke Ant' marked build as failure
Archiving artifacts
Recording test results
Email was triggered for: Failure - Any
Sending email for trigger: Failure - Any

Mime
View raw message