lucene-dev mailing list archives

Site index · List index
Message view « Date » · « Thread »
Top « Date » · « Thread »
From Policeman Jenkins Server <jenk...@thetaphi.de>
Subject [JENKINS] Lucene-Solr-7.x-Windows (64bit/jdk-9.0.4) - Build # 953 - Still Unstable!
Date Fri, 11 Jan 2019 20:05:44 GMT
Build: https://jenkins.thetaphi.de/job/Lucene-Solr-7.x-Windows/953/
Java: 64bit/jdk-9.0.4 -XX:-UseCompressedOops -XX:+UseConcMarkSweepGC

3 tests failed.
FAILED:  junit.framework.TestSuite.org.apache.solr.handler.admin.AutoscalingHistoryHandlerTest

Error Message:
ObjectTracker found 2 object(s) that were not released!!! [ZkStateReader, SolrZkClient] org.apache.solr.common.util.ObjectReleaseTracker$ObjectTrackerException: org.apache.solr.common.cloud.ZkStateReader  at org.apache.solr.common.util.ObjectReleaseTracker.track(ObjectReleaseTracker.java:42)  at org.apache.solr.common.cloud.ZkStateReader.<init>(ZkStateReader.java:328)  at org.apache.solr.client.solrj.impl.ZkClientClusterStateProvider.connect(ZkClientClusterStateProvider.java:160)  at org.apache.solr.client.solrj.impl.CloudSolrClient.connect(CloudSolrClient.java:399)  at org.apache.solr.client.solrj.impl.CloudSolrClient.requestWithRetryOnStaleState(CloudSolrClient.java:827)  at org.apache.solr.client.solrj.impl.CloudSolrClient.requestWithRetryOnStaleState(CloudSolrClient.java:950)  at org.apache.solr.client.solrj.impl.CloudSolrClient.requestWithRetryOnStaleState(CloudSolrClient.java:997)  at org.apache.solr.client.solrj.impl.CloudSolrClient.request(CloudSolrClient.java:817)  at org.apache.solr.client.solrj.SolrRequest.process(SolrRequest.java:194)  at org.apache.solr.client.solrj.SolrRequest.process(SolrRequest.java:211)  at org.apache.solr.client.solrj.impl.SolrClientCloudManager.request(SolrClientCloudManager.java:115)  at org.apache.solr.cloud.autoscaling.SystemLogListener.onEvent(SystemLogListener.java:126)  at org.apache.solr.cloud.autoscaling.ScheduledTriggers$TriggerListeners.fireListeners(ScheduledTriggers.java:837)  at org.apache.solr.cloud.autoscaling.ScheduledTriggers.lambda$add$3(ScheduledTriggers.java:327)  at java.base/java.util.concurrent.Executors$RunnableAdapter.call(Executors.java:514)  at java.base/java.util.concurrent.FutureTask.run(FutureTask.java:264)  at org.apache.solr.common.util.ExecutorUtil$MDCAwareThreadPoolExecutor.lambda$execute$0(ExecutorUtil.java:209)  at java.base/java.util.concurrent.ThreadPoolExecutor.runWorker(ThreadPoolExecutor.java:1167)  at java.base/java.util.concurrent.ThreadPoolExecutor$Worker.run(ThreadPoolExecutor.java:641)  at java.base/java.lang.Thread.run(Thread.java:844)  org.apache.solr.common.util.ObjectReleaseTracker$ObjectTrackerException: org.apache.solr.common.cloud.SolrZkClient  at org.apache.solr.common.util.ObjectReleaseTracker.track(ObjectReleaseTracker.java:42)  at org.apache.solr.common.cloud.SolrZkClient.<init>(SolrZkClient.java:203)  at org.apache.solr.common.cloud.SolrZkClient.<init>(SolrZkClient.java:126)  at org.apache.solr.common.cloud.SolrZkClient.<init>(SolrZkClient.java:116)  at org.apache.solr.common.cloud.ZkStateReader.<init>(ZkStateReader.java:306)  at org.apache.solr.client.solrj.impl.ZkClientClusterStateProvider.connect(ZkClientClusterStateProvider.java:160)  at org.apache.solr.client.solrj.impl.CloudSolrClient.connect(CloudSolrClient.java:399)  at org.apache.solr.client.solrj.impl.CloudSolrClient.requestWithRetryOnStaleState(CloudSolrClient.java:827)  at org.apache.solr.client.solrj.impl.CloudSolrClient.requestWithRetryOnStaleState(CloudSolrClient.java:950)  at org.apache.solr.client.solrj.impl.CloudSolrClient.requestWithRetryOnStaleState(CloudSolrClient.java:997)  at org.apache.solr.client.solrj.impl.CloudSolrClient.request(CloudSolrClient.java:817)  at org.apache.solr.client.solrj.SolrRequest.process(SolrRequest.java:194)  at org.apache.solr.client.solrj.SolrRequest.process(SolrRequest.java:211)  at org.apache.solr.client.solrj.impl.SolrClientCloudManager.request(SolrClientCloudManager.java:115)  at org.apache.solr.cloud.autoscaling.SystemLogListener.onEvent(SystemLogListener.java:126)  at org.apache.solr.cloud.autoscaling.ScheduledTriggers$TriggerListeners.fireListeners(ScheduledTriggers.java:837)  at org.apache.solr.cloud.autoscaling.ScheduledTriggers.lambda$add$3(ScheduledTriggers.java:327)  at java.base/java.util.concurrent.Executors$RunnableAdapter.call(Executors.java:514)  at java.base/java.util.concurrent.FutureTask.run(FutureTask.java:264)  at org.apache.solr.common.util.ExecutorUtil$MDCAwareThreadPoolExecutor.lambda$execute$0(ExecutorUtil.java:209)  at java.base/java.util.concurrent.ThreadPoolExecutor.runWorker(ThreadPoolExecutor.java:1167)  at java.base/java.util.concurrent.ThreadPoolExecutor$Worker.run(ThreadPoolExecutor.java:641)  at java.base/java.lang.Thread.run(Thread.java:844)   expected null, but was:<ObjectTracker found 2 object(s) that were not released!!! [ZkStateReader, SolrZkClient] org.apache.solr.common.util.ObjectReleaseTracker$ObjectTrackerException: org.apache.solr.common.cloud.ZkStateReader  at org.apache.solr.common.util.ObjectReleaseTracker.track(ObjectReleaseTracker.java:42)  at org.apache.solr.common.cloud.ZkStateReader.<init>(ZkStateReader.java:328)  at org.apache.solr.client.solrj.impl.ZkClientClusterStateProvider.connect(ZkClientClusterStateProvider.java:160)  at org.apache.solr.client.solrj.impl.CloudSolrClient.connect(CloudSolrClient.java:399)  at org.apache.solr.client.solrj.impl.CloudSolrClient.requestWithRetryOnStaleState(CloudSolrClient.java:827)  at org.apache.solr.client.solrj.impl.CloudSolrClient.requestWithRetryOnStaleState(CloudSolrClient.java:950)  at org.apache.solr.client.solrj.impl.CloudSolrClient.requestWithRetryOnStaleState(CloudSolrClient.java:997)  at org.apache.solr.client.solrj.impl.CloudSolrClient.request(CloudSolrClient.java:817)  at org.apache.solr.client.solrj.SolrRequest.process(SolrRequest.java:194)  at org.apache.solr.client.solrj.SolrRequest.process(SolrRequest.java:211)  at org.apache.solr.client.solrj.impl.SolrClientCloudManager.request(SolrClientCloudManager.java:115)  at org.apache.solr.cloud.autoscaling.SystemLogListener.onEvent(SystemLogListener.java:126)  at org.apache.solr.cloud.autoscaling.ScheduledTriggers$TriggerListeners.fireListeners(ScheduledTriggers.java:837)  at org.apache.solr.cloud.autoscaling.ScheduledTriggers.lambda$add$3(ScheduledTriggers.java:327)  at java.base/java.util.concurrent.Executors$RunnableAdapter.call(Executors.java:514)  at java.base/java.util.concurrent.FutureTask.run(FutureTask.java:264)  at org.apache.solr.common.util.ExecutorUtil$MDCAwareThreadPoolExecutor.lambda$execute$0(ExecutorUtil.java:209)  at java.base/java.util.concurrent.ThreadPoolExecutor.runWorker(ThreadPoolExecutor.java:1167)  at java.base/java.util.concurrent.ThreadPoolExecutor$Worker.run(ThreadPoolExecutor.java:641)  at java.base/java.lang.Thread.run(Thread.java:844)  org.apache.solr.common.util.ObjectReleaseTracker$ObjectTrackerException: org.apache.solr.common.cloud.SolrZkClient  at org.apache.solr.common.util.ObjectReleaseTracker.track(ObjectReleaseTracker.java:42)  at org.apache.solr.common.cloud.SolrZkClient.<init>(SolrZkClient.java:203)  at org.apache.solr.common.cloud.SolrZkClient.<init>(SolrZkClient.java:126)  at org.apache.solr.common.cloud.SolrZkClient.<init>(SolrZkClient.java:116)  at org.apache.solr.common.cloud.ZkStateReader.<init>(ZkStateReader.java:306)  at org.apache.solr.client.solrj.impl.ZkClientClusterStateProvider.connect(ZkClientClusterStateProvider.java:160)  at org.apache.solr.client.solrj.impl.CloudSolrClient.connect(CloudSolrClient.java:399)  at org.apache.solr.client.solrj.impl.CloudSolrClient.requestWithRetryOnStaleState(CloudSolrClient.java:827)  at org.apache.solr.client.solrj.impl.CloudSolrClient.requestWithRetryOnStaleState(CloudSolrClient.java:950)  at org.apache.solr.client.solrj.impl.CloudSolrClient.requestWithRetryOnStaleState(CloudSolrClient.java:997)  at org.apache.solr.client.solrj.impl.CloudSolrClient.request(CloudSolrClient.java:817)  at org.apache.solr.client.solrj.SolrRequest.process(SolrRequest.java:194)  at org.apache.solr.client.solrj.SolrRequest.process(SolrRequest.java:211)  at org.apache.solr.client.solrj.impl.SolrClientCloudManager.request(SolrClientCloudManager.java:115)  at org.apache.solr.cloud.autoscaling.SystemLogListener.onEvent(SystemLogListener.java:126)  at org.apache.solr.cloud.autoscaling.ScheduledTriggers$TriggerListeners.fireListeners(ScheduledTriggers.java:837)  at org.apache.solr.cloud.autoscaling.ScheduledTriggers.lambda$add$3(ScheduledTriggers.java:327)  at java.base/java.util.concurrent.Executors$RunnableAdapter.call(Executors.java:514)  at java.base/java.util.concurrent.FutureTask.run(FutureTask.java:264)  at org.apache.solr.common.util.ExecutorUtil$MDCAwareThreadPoolExecutor.lambda$execute$0(ExecutorUtil.java:209)  at java.base/java.util.concurrent.ThreadPoolExecutor.runWorker(ThreadPoolExecutor.java:1167)  at java.base/java.util.concurrent.ThreadPoolExecutor$Worker.run(ThreadPoolExecutor.java:641)  at java.base/java.lang.Thread.run(Thread.java:844)  >

Stack Trace:
java.lang.AssertionError: ObjectTracker found 2 object(s) that were not released!!! [ZkStateReader, SolrZkClient]
org.apache.solr.common.util.ObjectReleaseTracker$ObjectTrackerException: org.apache.solr.common.cloud.ZkStateReader
	at org.apache.solr.common.util.ObjectReleaseTracker.track(ObjectReleaseTracker.java:42)
	at org.apache.solr.common.cloud.ZkStateReader.<init>(ZkStateReader.java:328)
	at org.apache.solr.client.solrj.impl.ZkClientClusterStateProvider.connect(ZkClientClusterStateProvider.java:160)
	at org.apache.solr.client.solrj.impl.CloudSolrClient.connect(CloudSolrClient.java:399)
	at org.apache.solr.client.solrj.impl.CloudSolrClient.requestWithRetryOnStaleState(CloudSolrClient.java:827)
	at org.apache.solr.client.solrj.impl.CloudSolrClient.requestWithRetryOnStaleState(CloudSolrClient.java:950)
	at org.apache.solr.client.solrj.impl.CloudSolrClient.requestWithRetryOnStaleState(CloudSolrClient.java:997)
	at org.apache.solr.client.solrj.impl.CloudSolrClient.request(CloudSolrClient.java:817)
	at org.apache.solr.client.solrj.SolrRequest.process(SolrRequest.java:194)
	at org.apache.solr.client.solrj.SolrRequest.process(SolrRequest.java:211)
	at org.apache.solr.client.solrj.impl.SolrClientCloudManager.request(SolrClientCloudManager.java:115)
	at org.apache.solr.cloud.autoscaling.SystemLogListener.onEvent(SystemLogListener.java:126)
	at org.apache.solr.cloud.autoscaling.ScheduledTriggers$TriggerListeners.fireListeners(ScheduledTriggers.java:837)
	at org.apache.solr.cloud.autoscaling.ScheduledTriggers.lambda$add$3(ScheduledTriggers.java:327)
	at java.base/java.util.concurrent.Executors$RunnableAdapter.call(Executors.java:514)
	at java.base/java.util.concurrent.FutureTask.run(FutureTask.java:264)
	at org.apache.solr.common.util.ExecutorUtil$MDCAwareThreadPoolExecutor.lambda$execute$0(ExecutorUtil.java:209)
	at java.base/java.util.concurrent.ThreadPoolExecutor.runWorker(ThreadPoolExecutor.java:1167)
	at java.base/java.util.concurrent.ThreadPoolExecutor$Worker.run(ThreadPoolExecutor.java:641)
	at java.base/java.lang.Thread.run(Thread.java:844)

org.apache.solr.common.util.ObjectReleaseTracker$ObjectTrackerException: org.apache.solr.common.cloud.SolrZkClient
	at org.apache.solr.common.util.ObjectReleaseTracker.track(ObjectReleaseTracker.java:42)
	at org.apache.solr.common.cloud.SolrZkClient.<init>(SolrZkClient.java:203)
	at org.apache.solr.common.cloud.SolrZkClient.<init>(SolrZkClient.java:126)
	at org.apache.solr.common.cloud.SolrZkClient.<init>(SolrZkClient.java:116)
	at org.apache.solr.common.cloud.ZkStateReader.<init>(ZkStateReader.java:306)
	at org.apache.solr.client.solrj.impl.ZkClientClusterStateProvider.connect(ZkClientClusterStateProvider.java:160)
	at org.apache.solr.client.solrj.impl.CloudSolrClient.connect(CloudSolrClient.java:399)
	at org.apache.solr.client.solrj.impl.CloudSolrClient.requestWithRetryOnStaleState(CloudSolrClient.java:827)
	at org.apache.solr.client.solrj.impl.CloudSolrClient.requestWithRetryOnStaleState(CloudSolrClient.java:950)
	at org.apache.solr.client.solrj.impl.CloudSolrClient.requestWithRetryOnStaleState(CloudSolrClient.java:997)
	at org.apache.solr.client.solrj.impl.CloudSolrClient.request(CloudSolrClient.java:817)
	at org.apache.solr.client.solrj.SolrRequest.process(SolrRequest.java:194)
	at org.apache.solr.client.solrj.SolrRequest.process(SolrRequest.java:211)
	at org.apache.solr.client.solrj.impl.SolrClientCloudManager.request(SolrClientCloudManager.java:115)
	at org.apache.solr.cloud.autoscaling.SystemLogListener.onEvent(SystemLogListener.java:126)
	at org.apache.solr.cloud.autoscaling.ScheduledTriggers$TriggerListeners.fireListeners(ScheduledTriggers.java:837)
	at org.apache.solr.cloud.autoscaling.ScheduledTriggers.lambda$add$3(ScheduledTriggers.java:327)
	at java.base/java.util.concurrent.Executors$RunnableAdapter.call(Executors.java:514)
	at java.base/java.util.concurrent.FutureTask.run(FutureTask.java:264)
	at org.apache.solr.common.util.ExecutorUtil$MDCAwareThreadPoolExecutor.lambda$execute$0(ExecutorUtil.java:209)
	at java.base/java.util.concurrent.ThreadPoolExecutor.runWorker(ThreadPoolExecutor.java:1167)
	at java.base/java.util.concurrent.ThreadPoolExecutor$Worker.run(ThreadPoolExecutor.java:641)
	at java.base/java.lang.Thread.run(Thread.java:844)

 expected null, but was:<ObjectTracker found 2 object(s) that were not released!!! [ZkStateReader, SolrZkClient]
org.apache.solr.common.util.ObjectReleaseTracker$ObjectTrackerException: org.apache.solr.common.cloud.ZkStateReader
	at org.apache.solr.common.util.ObjectReleaseTracker.track(ObjectReleaseTracker.java:42)
	at org.apache.solr.common.cloud.ZkStateReader.<init>(ZkStateReader.java:328)
	at org.apache.solr.client.solrj.impl.ZkClientClusterStateProvider.connect(ZkClientClusterStateProvider.java:160)
	at org.apache.solr.client.solrj.impl.CloudSolrClient.connect(CloudSolrClient.java:399)
	at org.apache.solr.client.solrj.impl.CloudSolrClient.requestWithRetryOnStaleState(CloudSolrClient.java:827)
	at org.apache.solr.client.solrj.impl.CloudSolrClient.requestWithRetryOnStaleState(CloudSolrClient.java:950)
	at org.apache.solr.client.solrj.impl.CloudSolrClient.requestWithRetryOnStaleState(CloudSolrClient.java:997)
	at org.apache.solr.client.solrj.impl.CloudSolrClient.request(CloudSolrClient.java:817)
	at org.apache.solr.client.solrj.SolrRequest.process(SolrRequest.java:194)
	at org.apache.solr.client.solrj.SolrRequest.process(SolrRequest.java:211)
	at org.apache.solr.client.solrj.impl.SolrClientCloudManager.request(SolrClientCloudManager.java:115)
	at org.apache.solr.cloud.autoscaling.SystemLogListener.onEvent(SystemLogListener.java:126)
	at org.apache.solr.cloud.autoscaling.ScheduledTriggers$TriggerListeners.fireListeners(ScheduledTriggers.java:837)
	at org.apache.solr.cloud.autoscaling.ScheduledTriggers.lambda$add$3(ScheduledTriggers.java:327)
	at java.base/java.util.concurrent.Executors$RunnableAdapter.call(Executors.java:514)
	at java.base/java.util.concurrent.FutureTask.run(FutureTask.java:264)
	at org.apache.solr.common.util.ExecutorUtil$MDCAwareThreadPoolExecutor.lambda$execute$0(ExecutorUtil.java:209)
	at java.base/java.util.concurrent.ThreadPoolExecutor.runWorker(ThreadPoolExecutor.java:1167)
	at java.base/java.util.concurrent.ThreadPoolExecutor$Worker.run(ThreadPoolExecutor.java:641)
	at java.base/java.lang.Thread.run(Thread.java:844)

org.apache.solr.common.util.ObjectReleaseTracker$ObjectTrackerException: org.apache.solr.common.cloud.SolrZkClient
	at org.apache.solr.common.util.ObjectReleaseTracker.track(ObjectReleaseTracker.java:42)
	at org.apache.solr.common.cloud.SolrZkClient.<init>(SolrZkClient.java:203)
	at org.apache.solr.common.cloud.SolrZkClient.<init>(SolrZkClient.java:126)
	at org.apache.solr.common.cloud.SolrZkClient.<init>(SolrZkClient.java:116)
	at org.apache.solr.common.cloud.ZkStateReader.<init>(ZkStateReader.java:306)
	at org.apache.solr.client.solrj.impl.ZkClientClusterStateProvider.connect(ZkClientClusterStateProvider.java:160)
	at org.apache.solr.client.solrj.impl.CloudSolrClient.connect(CloudSolrClient.java:399)
	at org.apache.solr.client.solrj.impl.CloudSolrClient.requestWithRetryOnStaleState(CloudSolrClient.java:827)
	at org.apache.solr.client.solrj.impl.CloudSolrClient.requestWithRetryOnStaleState(CloudSolrClient.java:950)
	at org.apache.solr.client.solrj.impl.CloudSolrClient.requestWithRetryOnStaleState(CloudSolrClient.java:997)
	at org.apache.solr.client.solrj.impl.CloudSolrClient.request(CloudSolrClient.java:817)
	at org.apache.solr.client.solrj.SolrRequest.process(SolrRequest.java:194)
	at org.apache.solr.client.solrj.SolrRequest.process(SolrRequest.java:211)
	at org.apache.solr.client.solrj.impl.SolrClientCloudManager.request(SolrClientCloudManager.java:115)
	at org.apache.solr.cloud.autoscaling.SystemLogListener.onEvent(SystemLogListener.java:126)
	at org.apache.solr.cloud.autoscaling.ScheduledTriggers$TriggerListeners.fireListeners(ScheduledTriggers.java:837)
	at org.apache.solr.cloud.autoscaling.ScheduledTriggers.lambda$add$3(ScheduledTriggers.java:327)
	at java.base/java.util.concurrent.Executors$RunnableAdapter.call(Executors.java:514)
	at java.base/java.util.concurrent.FutureTask.run(FutureTask.java:264)
	at org.apache.solr.common.util.ExecutorUtil$MDCAwareThreadPoolExecutor.lambda$execute$0(ExecutorUtil.java:209)
	at java.base/java.util.concurrent.ThreadPoolExecutor.runWorker(ThreadPoolExecutor.java:1167)
	at java.base/java.util.concurrent.ThreadPoolExecutor$Worker.run(ThreadPoolExecutor.java:641)
	at java.base/java.lang.Thread.run(Thread.java:844)

>
	at __randomizedtesting.SeedInfo.seed([E53BAE4AB460D0A4]:0)
	at org.junit.Assert.fail(Assert.java:88)
	at org.junit.Assert.failNotNull(Assert.java:755)
	at org.junit.Assert.assertNull(Assert.java:737)
	at org.apache.solr.SolrTestCaseJ4.teardownTestCases(SolrTestCaseJ4.java:317)
	at jdk.internal.reflect.GeneratedMethodAccessor58.invoke(Unknown Source)
	at java.base/jdk.internal.reflect.DelegatingMethodAccessorImpl.invoke(DelegatingMethodAccessorImpl.java:43)
	at java.base/java.lang.reflect.Method.invoke(Method.java:564)
	at com.carrotsearch.randomizedtesting.RandomizedRunner.invoke(RandomizedRunner.java:1750)
	at com.carrotsearch.randomizedtesting.RandomizedRunner$7.evaluate(RandomizedRunner.java:901)
	at com.carrotsearch.randomizedtesting.rules.StatementAdapter.evaluate(StatementAdapter.java:36)
	at com.carrotsearch.randomizedtesting.rules.SystemPropertiesRestoreRule$1.evaluate(SystemPropertiesRestoreRule.java:57)
	at org.apache.lucene.util.AbstractBeforeAfterRule$1.evaluate(AbstractBeforeAfterRule.java:45)
	at com.carrotsearch.randomizedtesting.rules.StatementAdapter.evaluate(StatementAdapter.java:36)
	at org.apache.lucene.util.TestRuleStoreClassName$1.evaluate(TestRuleStoreClassName.java:41)
	at com.carrotsearch.randomizedtesting.rules.NoShadowingOrOverridesOnMethodsRule$1.evaluate(NoShadowingOrOverridesOnMethodsRule.java:40)
	at com.carrotsearch.randomizedtesting.rules.NoShadowingOrOverridesOnMethodsRule$1.evaluate(NoShadowingOrOverridesOnMethodsRule.java:40)
	at com.carrotsearch.randomizedtesting.rules.StatementAdapter.evaluate(StatementAdapter.java:36)
	at com.carrotsearch.randomizedtesting.rules.StatementAdapter.evaluate(StatementAdapter.java:36)
	at org.apache.lucene.util.TestRuleAssertionsRequired$1.evaluate(TestRuleAssertionsRequired.java:53)
	at org.apache.lucene.util.TestRuleMarkFailure$1.evaluate(TestRuleMarkFailure.java:47)
	at org.apache.lucene.util.TestRuleIgnoreAfterMaxFailures$1.evaluate(TestRuleIgnoreAfterMaxFailures.java:64)
	at org.apache.lucene.util.TestRuleIgnoreTestSuites$1.evaluate(TestRuleIgnoreTestSuites.java:54)
	at com.carrotsearch.randomizedtesting.rules.StatementAdapter.evaluate(StatementAdapter.java:36)
	at com.carrotsearch.randomizedtesting.ThreadLeakControl$StatementRunner.run(ThreadLeakControl.java:368)
	at java.base/java.lang.Thread.run(Thread.java:844)


FAILED:  junit.framework.TestSuite.org.apache.solr.handler.admin.AutoscalingHistoryHandlerTest

Error Message:
3 threads leaked from SUITE scope at org.apache.solr.handler.admin.AutoscalingHistoryHandlerTest:     1) Thread[id=15563, name=AutoscalingActionExecutor-4332-thread-1-SendThread(127.0.0.1:63718), state=TIMED_WAITING, group=TGRP-AutoscalingHistoryHandlerTest]         at java.base@9.0.4/java.lang.Thread.sleep(Native Method)         at app//org.apache.zookeeper.client.StaticHostProvider.next(StaticHostProvider.java:152)         at app//org.apache.zookeeper.ClientCnxn$SendThread.run(ClientCnxn.java:1062)    2) Thread[id=15564, name=AutoscalingActionExecutor-4332-thread-1-EventThread, state=WAITING, group=TGRP-AutoscalingHistoryHandlerTest]         at java.base@9.0.4/jdk.internal.misc.Unsafe.park(Native Method)         at java.base@9.0.4/java.util.concurrent.locks.LockSupport.park(LockSupport.java:194)         at java.base@9.0.4/java.util.concurrent.locks.AbstractQueuedSynchronizer$ConditionObject.await(AbstractQueuedSynchronizer.java:2062)         at java.base@9.0.4/java.util.concurrent.LinkedBlockingQueue.take(LinkedBlockingQueue.java:435)         at app//org.apache.zookeeper.ClientCnxn$EventThread.run(ClientCnxn.java:504)    3) Thread[id=15565, name=zkConnectionManagerCallback-6974-thread-1, state=WAITING, group=TGRP-AutoscalingHistoryHandlerTest]         at java.base@9.0.4/jdk.internal.misc.Unsafe.park(Native Method)         at java.base@9.0.4/java.util.concurrent.locks.LockSupport.park(LockSupport.java:194)         at java.base@9.0.4/java.util.concurrent.locks.AbstractQueuedSynchronizer$ConditionObject.await(AbstractQueuedSynchronizer.java:2062)         at java.base@9.0.4/java.util.concurrent.LinkedBlockingQueue.take(LinkedBlockingQueue.java:435)         at java.base@9.0.4/java.util.concurrent.ThreadPoolExecutor.getTask(ThreadPoolExecutor.java:1092)         at java.base@9.0.4/java.util.concurrent.ThreadPoolExecutor.runWorker(ThreadPoolExecutor.java:1152)         at java.base@9.0.4/java.util.concurrent.ThreadPoolExecutor$Worker.run(ThreadPoolExecutor.java:641)         at java.base@9.0.4/java.lang.Thread.run(Thread.java:844)

Stack Trace:
com.carrotsearch.randomizedtesting.ThreadLeakError: 3 threads leaked from SUITE scope at org.apache.solr.handler.admin.AutoscalingHistoryHandlerTest: 
   1) Thread[id=15563, name=AutoscalingActionExecutor-4332-thread-1-SendThread(127.0.0.1:63718), state=TIMED_WAITING, group=TGRP-AutoscalingHistoryHandlerTest]
        at java.base@9.0.4/java.lang.Thread.sleep(Native Method)
        at app//org.apache.zookeeper.client.StaticHostProvider.next(StaticHostProvider.java:152)
        at app//org.apache.zookeeper.ClientCnxn$SendThread.run(ClientCnxn.java:1062)
   2) Thread[id=15564, name=AutoscalingActionExecutor-4332-thread-1-EventThread, state=WAITING, group=TGRP-AutoscalingHistoryHandlerTest]
        at java.base@9.0.4/jdk.internal.misc.Unsafe.park(Native Method)
        at java.base@9.0.4/java.util.concurrent.locks.LockSupport.park(LockSupport.java:194)
        at java.base@9.0.4/java.util.concurrent.locks.AbstractQueuedSynchronizer$ConditionObject.await(AbstractQueuedSynchronizer.java:2062)
        at java.base@9.0.4/java.util.concurrent.LinkedBlockingQueue.take(LinkedBlockingQueue.java:435)
        at app//org.apache.zookeeper.ClientCnxn$EventThread.run(ClientCnxn.java:504)
   3) Thread[id=15565, name=zkConnectionManagerCallback-6974-thread-1, state=WAITING, group=TGRP-AutoscalingHistoryHandlerTest]
        at java.base@9.0.4/jdk.internal.misc.Unsafe.park(Native Method)
        at java.base@9.0.4/java.util.concurrent.locks.LockSupport.park(LockSupport.java:194)
        at java.base@9.0.4/java.util.concurrent.locks.AbstractQueuedSynchronizer$ConditionObject.await(AbstractQueuedSynchronizer.java:2062)
        at java.base@9.0.4/java.util.concurrent.LinkedBlockingQueue.take(LinkedBlockingQueue.java:435)
        at java.base@9.0.4/java.util.concurrent.ThreadPoolExecutor.getTask(ThreadPoolExecutor.java:1092)
        at java.base@9.0.4/java.util.concurrent.ThreadPoolExecutor.runWorker(ThreadPoolExecutor.java:1152)
        at java.base@9.0.4/java.util.concurrent.ThreadPoolExecutor$Worker.run(ThreadPoolExecutor.java:641)
        at java.base@9.0.4/java.lang.Thread.run(Thread.java:844)
	at __randomizedtesting.SeedInfo.seed([E53BAE4AB460D0A4]:0)


FAILED:  junit.framework.TestSuite.org.apache.solr.handler.admin.AutoscalingHistoryHandlerTest

Error Message:
There are still zombie threads that couldn't be terminated:    1) Thread[id=15563, name=AutoscalingActionExecutor-4332-thread-1-SendThread(127.0.0.1:63718), state=TIMED_WAITING, group=TGRP-AutoscalingHistoryHandlerTest]         at java.base@9.0.4/java.lang.Thread.sleep(Native Method)         at app//org.apache.zookeeper.ClientCnxn$SendThread.run(ClientCnxn.java:1049)    2) Thread[id=15565, name=zkConnectionManagerCallback-6974-thread-1, state=WAITING, group=TGRP-AutoscalingHistoryHandlerTest]         at java.base@9.0.4/jdk.internal.misc.Unsafe.park(Native Method)         at java.base@9.0.4/java.util.concurrent.locks.LockSupport.park(LockSupport.java:194)         at java.base@9.0.4/java.util.concurrent.locks.AbstractQueuedSynchronizer$ConditionObject.await(AbstractQueuedSynchronizer.java:2062)         at java.base@9.0.4/java.util.concurrent.LinkedBlockingQueue.take(LinkedBlockingQueue.java:435)         at java.base@9.0.4/java.util.concurrent.ThreadPoolExecutor.getTask(ThreadPoolExecutor.java:1092)         at java.base@9.0.4/java.util.concurrent.ThreadPoolExecutor.runWorker(ThreadPoolExecutor.java:1152)         at java.base@9.0.4/java.util.concurrent.ThreadPoolExecutor$Worker.run(ThreadPoolExecutor.java:641)         at java.base@9.0.4/java.lang.Thread.run(Thread.java:844)

Stack Trace:
com.carrotsearch.randomizedtesting.ThreadLeakError: There are still zombie threads that couldn't be terminated:
   1) Thread[id=15563, name=AutoscalingActionExecutor-4332-thread-1-SendThread(127.0.0.1:63718), state=TIMED_WAITING, group=TGRP-AutoscalingHistoryHandlerTest]
        at java.base@9.0.4/java.lang.Thread.sleep(Native Method)
        at app//org.apache.zookeeper.ClientCnxn$SendThread.run(ClientCnxn.java:1049)
   2) Thread[id=15565, name=zkConnectionManagerCallback-6974-thread-1, state=WAITING, group=TGRP-AutoscalingHistoryHandlerTest]
        at java.base@9.0.4/jdk.internal.misc.Unsafe.park(Native Method)
        at java.base@9.0.4/java.util.concurrent.locks.LockSupport.park(LockSupport.java:194)
        at java.base@9.0.4/java.util.concurrent.locks.AbstractQueuedSynchronizer$ConditionObject.await(AbstractQueuedSynchronizer.java:2062)
        at java.base@9.0.4/java.util.concurrent.LinkedBlockingQueue.take(LinkedBlockingQueue.java:435)
        at java.base@9.0.4/java.util.concurrent.ThreadPoolExecutor.getTask(ThreadPoolExecutor.java:1092)
        at java.base@9.0.4/java.util.concurrent.ThreadPoolExecutor.runWorker(ThreadPoolExecutor.java:1152)
        at java.base@9.0.4/java.util.concurrent.ThreadPoolExecutor$Worker.run(ThreadPoolExecutor.java:641)
        at java.base@9.0.4/java.lang.Thread.run(Thread.java:844)
	at __randomizedtesting.SeedInfo.seed([E53BAE4AB460D0A4]:0)




Build Log:
[...truncated 1991 lines...]
   [junit4] JVM J0: stderr was not empty, see: C:\Users\jenkins\workspace\Lucene-Solr-7.x-Windows\lucene\build\core\test\temp\junit4-J0-20190111_185512_66112138817343298769540.syserr
   [junit4] >>> JVM J0 emitted unexpected output (verbatim) ----
   [junit4] OpenJDK 64-Bit Server VM warning: Option UseConcMarkSweepGC was deprecated in version 9.0 and will likely be removed in a future release.
   [junit4] <<< JVM J0: EOF ----

[...truncated 3 lines...]
   [junit4] JVM J1: stderr was not empty, see: C:\Users\jenkins\workspace\Lucene-Solr-7.x-Windows\lucene\build\core\test\temp\junit4-J1-20190111_185512_6595824523116488400242.syserr
   [junit4] >>> JVM J1 emitted unexpected output (verbatim) ----
   [junit4] OpenJDK 64-Bit Server VM warning: Option UseConcMarkSweepGC was deprecated in version 9.0 and will likely be removed in a future release.
   [junit4] <<< JVM J1: EOF ----

[...truncated 316 lines...]
   [junit4] JVM J0: stderr was not empty, see: C:\Users\jenkins\workspace\Lucene-Solr-7.x-Windows\lucene\build\test-framework\test\temp\junit4-J0-20190111_190225_174421085822707665098.syserr
   [junit4] >>> JVM J0 emitted unexpected output (verbatim) ----
   [junit4] OpenJDK 64-Bit Server VM warning: Option UseConcMarkSweepGC was deprecated in version 9.0 and will likely be removed in a future release.
   [junit4] <<< JVM J0: EOF ----

[...truncated 3 lines...]
   [junit4] JVM J1: stderr was not empty, see: C:\Users\jenkins\workspace\Lucene-Solr-7.x-Windows\lucene\build\test-framework\test\temp\junit4-J1-20190111_190225_17416491860367443940581.syserr
   [junit4] >>> JVM J1 emitted unexpected output (verbatim) ----
   [junit4] OpenJDK 64-Bit Server VM warning: Option UseConcMarkSweepGC was deprecated in version 9.0 and will likely be removed in a future release.
   [junit4] <<< JVM J1: EOF ----

[...truncated 1081 lines...]
   [junit4] JVM J0: stderr was not empty, see: C:\Users\jenkins\workspace\Lucene-Solr-7.x-Windows\lucene\build\analysis\common\test\temp\junit4-J0-20190111_190334_4956370507494207343092.syserr
   [junit4] >>> JVM J0 emitted unexpected output (verbatim) ----
   [junit4] OpenJDK 64-Bit Server VM warning: Option UseConcMarkSweepGC was deprecated in version 9.0 and will likely be removed in a future release.
   [junit4] <<< JVM J0: EOF ----

[...truncated 3 lines...]
   [junit4] JVM J1: stderr was not empty, see: C:\Users\jenkins\workspace\Lucene-Solr-7.x-Windows\lucene\build\analysis\common\test\temp\junit4-J1-20190111_190334_49510550892871921824269.syserr
   [junit4] >>> JVM J1 emitted unexpected output (verbatim) ----
   [junit4] OpenJDK 64-Bit Server VM warning: Option UseConcMarkSweepGC was deprecated in version 9.0 and will likely be removed in a future release.
   [junit4] <<< JVM J1: EOF ----

[...truncated 257 lines...]
   [junit4] JVM J1: stderr was not empty, see: C:\Users\jenkins\workspace\Lucene-Solr-7.x-Windows\lucene\build\analysis\icu\test\temp\junit4-J1-20190111_190609_54410597270090774714552.syserr
   [junit4] >>> JVM J1 emitted unexpected output (verbatim) ----
   [junit4] OpenJDK 64-Bit Server VM warning: Option UseConcMarkSweepGC was deprecated in version 9.0 and will likely be removed in a future release.
   [junit4] <<< JVM J1: EOF ----

[...truncated 3 lines...]
   [junit4] JVM J0: stderr was not empty, see: C:\Users\jenkins\workspace\Lucene-Solr-7.x-Windows\lucene\build\analysis\icu\test\temp\junit4-J0-20190111_190609_54412468817589499896346.syserr
   [junit4] >>> JVM J0 emitted unexpected output (verbatim) ----
   [junit4] OpenJDK 64-Bit Server VM warning: Option UseConcMarkSweepGC was deprecated in version 9.0 and will likely be removed in a future release.
   [junit4] <<< JVM J0: EOF ----

[...truncated 251 lines...]
   [junit4] JVM J1: stderr was not empty, see: C:\Users\jenkins\workspace\Lucene-Solr-7.x-Windows\lucene\build\analysis\kuromoji\test\temp\junit4-J1-20190111_190623_34312698850347078456457.syserr
   [junit4] >>> JVM J1 emitted unexpected output (verbatim) ----
   [junit4] OpenJDK 64-Bit Server VM warning: Option UseConcMarkSweepGC was deprecated in version 9.0 and will likely be removed in a future release.
   [junit4] <<< JVM J1: EOF ----

[...truncated 6 lines...]
   [junit4] JVM J0: stderr was not empty, see: C:\Users\jenkins\workspace\Lucene-Solr-7.x-Windows\lucene\build\analysis\kuromoji\test\temp\junit4-J0-20190111_190623_3436915850850405047584.syserr
   [junit4] >>> JVM J0 emitted unexpected output (verbatim) ----
   [junit4] OpenJDK 64-Bit Server VM warning: Option UseConcMarkSweepGC was deprecated in version 9.0 and will likely be removed in a future release.
   [junit4] <<< JVM J0: EOF ----

[...truncated 163 lines...]
   [junit4] JVM J0: stderr was not empty, see: C:\Users\jenkins\workspace\Lucene-Solr-7.x-Windows\lucene\build\analysis\morfologik\test\temp\junit4-J0-20190111_190649_69610871106097563715048.syserr
   [junit4] >>> JVM J0 emitted unexpected output (verbatim) ----
   [junit4] OpenJDK 64-Bit Server VM warning: Option UseConcMarkSweepGC was deprecated in version 9.0 and will likely be removed in a future release.
   [junit4] <<< JVM J0: EOF ----

[...truncated 3 lines...]
   [junit4] JVM J1: stderr was not empty, see: C:\Users\jenkins\workspace\Lucene-Solr-7.x-Windows\lucene\build\analysis\morfologik\test\temp\junit4-J1-20190111_190649_69612274529054618332232.syserr
   [junit4] >>> JVM J1 emitted unexpected output (verbatim) ----
   [junit4] OpenJDK 64-Bit Server VM warning: Option UseConcMarkSweepGC was deprecated in version 9.0 and will likely be removed in a future release.
   [junit4] <<< JVM J1: EOF ----

[...truncated 208 lines...]
   [junit4] JVM J1: stderr was not empty, see: C:\Users\jenkins\workspace\Lucene-Solr-7.x-Windows\lucene\build\analysis\nori\test\temp\junit4-J1-20190111_190656_7261919450894476353364.syserr
   [junit4] >>> JVM J1 emitted unexpected output (verbatim) ----
   [junit4] OpenJDK 64-Bit Server VM warning: Option UseConcMarkSweepGC was deprecated in version 9.0 and will likely be removed in a future release.
   [junit4] <<< JVM J1: EOF ----

[...truncated 3 lines...]
   [junit4] JVM J0: stderr was not empty, see: C:\Users\jenkins\workspace\Lucene-Solr-7.x-Windows\lucene\build\analysis\nori\test\temp\junit4-J0-20190111_190656_72613785263873316787452.syserr
   [junit4] >>> JVM J0 emitted unexpected output (verbatim) ----
   [junit4] OpenJDK 64-Bit Server VM warning: Option UseConcMarkSweepGC was deprecated in version 9.0 and will likely be removed in a future release.
   [junit4] <<< JVM J0: EOF ----

[...truncated 169 lines...]
   [junit4] JVM J0: stderr was not empty, see: C:\Users\jenkins\workspace\Lucene-Solr-7.x-Windows\lucene\build\analysis\opennlp\test\temp\junit4-J0-20190111_190708_2435001778242480004685.syserr
   [junit4] >>> JVM J0 emitted unexpected output (verbatim) ----
   [junit4] OpenJDK 64-Bit Server VM warning: Option UseConcMarkSweepGC was deprecated in version 9.0 and will likely be removed in a future release.
   [junit4] <<< JVM J0: EOF ----

[...truncated 3 lines...]
   [junit4] JVM J1: stderr was not empty, see: C:\Users\jenkins\workspace\Lucene-Solr-7.x-Windows\lucene\build\analysis\opennlp\test\temp\junit4-J1-20190111_190708_24312474419044008737129.syserr
   [junit4] >>> JVM J1 emitted unexpected output (verbatim) ----
   [junit4] OpenJDK 64-Bit Server VM warning: Option UseConcMarkSweepGC was deprecated in version 9.0 and will likely be removed in a future release.
   [junit4] <<< JVM J1: EOF ----

[...truncated 180 lines...]
   [junit4] JVM J0: stderr was not empty, see: C:\Users\jenkins\workspace\Lucene-Solr-7.x-Windows\lucene\build\analysis\phonetic\test\temp\junit4-J0-20190111_190714_0333831950733374869607.syserr
   [junit4] >>> JVM J0 emitted unexpected output (verbatim) ----
   [junit4] OpenJDK 64-Bit Server VM warning: Option UseConcMarkSweepGC was deprecated in version 9.0 and will likely be removed in a future release.
   [junit4] <<< JVM J0: EOF ----

   [junit4] JVM J1: stderr was not empty, see: C:\Users\jenkins\workspace\Lucene-Solr-7.x-Windows\lucene\build\analysis\phonetic\test\temp\junit4-J1-20190111_190714_03318274957745324950251.syserr
   [junit4] >>> JVM J1 emitted unexpected output (verbatim) ----
   [junit4] OpenJDK 64-Bit Server VM warning: Option UseConcMarkSweepGC was deprecated in version 9.0 and will likely be removed in a future release.
   [junit4] <<< JVM J1: EOF ----

[...truncated 160 lines...]
   [junit4] JVM J0: stderr was not empty, see: C:\Users\jenkins\workspace\Lucene-Solr-7.x-Windows\lucene\build\analysis\smartcn\test\temp\junit4-J0-20190111_190726_24914489056495791076189.syserr
   [junit4] >>> JVM J0 emitted unexpected output (verbatim) ----
   [junit4] OpenJDK 64-Bit Server VM warning: Option UseConcMarkSweepGC was deprecated in version 9.0 and will likely be removed in a future release.
   [junit4] <<< JVM J0: EOF ----

[...truncated 3 lines...]
   [junit4] JVM J1: stderr was not empty, see: C:\Users\jenkins\workspace\Lucene-Solr-7.x-Windows\lucene\build\analysis\smartcn\test\temp\junit4-J1-20190111_190726_2491940959432975051503.syserr
   [junit4] >>> JVM J1 emitted unexpected output (verbatim) ----
   [junit4] OpenJDK 64-Bit Server VM warning: Option UseConcMarkSweepGC was deprecated in version 9.0 and will likely be removed in a future release.
   [junit4] <<< JVM J1: EOF ----

[...truncated 168 lines...]
   [junit4] JVM J0: stderr was not empty, see: C:\Users\jenkins\workspace\Lucene-Solr-7.x-Windows\lucene\build\analysis\stempel\test\temp\junit4-J0-20190111_190734_1018588069805624443411.syserr
   [junit4] >>> JVM J0 emitted unexpected output (verbatim) ----
   [junit4] OpenJDK 64-Bit Server VM warning: Option UseConcMarkSweepGC was deprecated in version 9.0 and will likely be removed in a future release.
   [junit4] <<< JVM J0: EOF ----

   [junit4] JVM J1: stderr was not empty, see: C:\Users\jenkins\workspace\Lucene-Solr-7.x-Windows\lucene\build\analysis\stempel\test\temp\junit4-J1-20190111_190734_10111265675981309260647.syserr
   [junit4] >>> JVM J1 emitted unexpected output (verbatim) ----
   [junit4] OpenJDK 64-Bit Server VM warning: Option UseConcMarkSweepGC was deprecated in version 9.0 and will likely be removed in a future release.
   [junit4] <<< JVM J1: EOF ----

[...truncated 223 lines...]
   [junit4] JVM J1: stderr was not empty, see: C:\Users\jenkins\workspace\Lucene-Solr-7.x-Windows\lucene\build\backward-codecs\test\temp\junit4-J1-20190111_190740_22210646013139855189253.syserr
   [junit4] >>> JVM J1 emitted unexpected output (verbatim) ----
   [junit4] OpenJDK 64-Bit Server VM warning: Option UseConcMarkSweepGC was deprecated in version 9.0 and will likely be removed in a future release.
   [junit4] <<< JVM J1: EOF ----

[...truncated 9 lines...]
   [junit4] JVM J0: stderr was not empty, see: C:\Users\jenkins\workspace\Lucene-Solr-7.x-Windows\lucene\build\backward-codecs\test\temp\junit4-J0-20190111_190740_2224254777789369663945.syserr
   [junit4] >>> JVM J0 emitted unexpected output (verbatim) ----
   [junit4] OpenJDK 64-Bit Server VM warning: Option UseConcMarkSweepGC was deprecated in version 9.0 and will likely be removed in a future release.
   [junit4] <<< JVM J0: EOF ----

[...truncated 1567 lines...]
   [junit4] JVM J0: stderr was not empty, see: C:\Users\jenkins\workspace\Lucene-Solr-7.x-Windows\lucene\build\benchmark\test\temp\junit4-J0-20190111_190912_71218364740201078697005.syserr
   [junit4] >>> JVM J0 emitted unexpected output (verbatim) ----
   [junit4] OpenJDK 64-Bit Server VM warning: Option UseConcMarkSweepGC was deprecated in version 9.0 and will likely be removed in a future release.
   [junit4] <<< JVM J0: EOF ----

[...truncated 3 lines...]
   [junit4] JVM J1: stderr was not empty, see: C:\Users\jenkins\workspace\Lucene-Solr-7.x-Windows\lucene\build\benchmark\test\temp\junit4-J1-20190111_190912_713163069413663864989.syserr
   [junit4] >>> JVM J1 emitted unexpected output (verbatim) ----
   [junit4] OpenJDK 64-Bit Server VM warning: Option UseConcMarkSweepGC was deprecated in version 9.0 and will likely be removed in a future release.
   [junit4] <<< JVM J1: EOF ----

[...truncated 252 lines...]
   [junit4] JVM J0: stderr was not empty, see: C:\Users\jenkins\workspace\Lucene-Solr-7.x-Windows\lucene\build\classification\test\temp\junit4-J0-20190111_190929_5194326215275960931672.syserr
   [junit4] >>> JVM J0 emitted unexpected output (verbatim) ----
   [junit4] OpenJDK 64-Bit Server VM warning: Option UseConcMarkSweepGC was deprecated in version 9.0 and will likely be removed in a future release.
   [junit4] <<< JVM J0: EOF ----

[...truncated 3 lines...]
   [junit4] JVM J1: stderr was not empty, see: C:\Users\jenkins\workspace\Lucene-Solr-7.x-Windows\lucene\build\classification\test\temp\junit4-J1-20190111_190929_51816269119372808980058.syserr
   [junit4] >>> JVM J1 emitted unexpected output (verbatim) ----
   [junit4] OpenJDK 64-Bit Server VM warning: Option UseConcMarkSweepGC was deprecated in version 9.0 and will likely be removed in a future release.
   [junit4] <<< JVM J1: EOF ----

[...truncated 268 lines...]
   [junit4] JVM J0: stderr was not empty, see: C:\Users\jenkins\workspace\Lucene-Solr-7.x-Windows\lucene\build\codecs\test\temp\junit4-J0-20190111_190947_3133166201636463063223.syserr
   [junit4] >>> JVM J0 emitted unexpected output (verbatim) ----
   [junit4] OpenJDK 64-Bit Server VM warning: Option UseConcMarkSweepGC was deprecated in version 9.0 and will likely be removed in a future release.
   [junit4] <<< JVM J0: EOF ----

[...truncated 3 lines...]
   [junit4] JVM J1: stderr was not empty, see: C:\Users\jenkins\workspace\Lucene-Solr-7.x-Windows\lucene\build\codecs\test\temp\junit4-J1-20190111_190947_3136283636987158040103.syserr
   [junit4] >>> JVM J1 emitted unexpected output (verbatim) ----
   [junit4] OpenJDK 64-Bit Server VM warning: Option UseConcMarkSweepGC was deprecated in version 9.0 and will likely be removed in a future release.
   [junit4] <<< JVM J1: EOF ----

[...truncated 235 lines...]
   [junit4] JVM J0: stderr was not empty, see: C:\Users\jenkins\workspace\Lucene-Solr-7.x-Windows\lucene\build\demo\test\temp\junit4-J0-20190111_191139_0093482313243133900315.syserr
   [junit4] >>> JVM J0 emitted unexpected output (verbatim) ----
   [junit4] OpenJDK 64-Bit Server VM warning: Option UseConcMarkSweepGC was deprecated in version 9.0 and will likely be removed in a future release.
   [junit4] <<< JVM J0: EOF ----

   [junit4] JVM J1: stderr was not empty, see: C:\Users\jenkins\workspace\Lucene-Solr-7.x-Windows\lucene\build\demo\test\temp\junit4-J1-20190111_191139_00910109082958908174630.syserr
   [junit4] >>> JVM J1 emitted unexpected output (verbatim) ----
   [junit4] OpenJDK 64-Bit Server VM warning: Option UseConcMarkSweepGC was deprecated in version 9.0 and will likely be removed in a future release.
   [junit4] <<< JVM J1: EOF ----

[...truncated 174 lines...]
   [junit4] JVM J0: stderr was not empty, see: C:\Users\jenkins\workspace\Lucene-Solr-7.x-Windows\lucene\build\expressions\test\temp\junit4-J0-20190111_191144_92611860814873649725538.syserr
   [junit4] >>> JVM J0 emitted unexpected output (verbatim) ----
   [junit4] OpenJDK 64-Bit Server VM warning: Option UseConcMarkSweepGC was deprecated in version 9.0 and will likely be removed in a future release.
   [junit4] <<< JVM J0: EOF ----

[...truncated 3 lines...]
   [junit4] JVM J1: stderr was not empty, see: C:\Users\jenkins\workspace\Lucene-Solr-7.x-Windows\lucene\build\expressions\test\temp\junit4-J1-20190111_191144_92617481247056550646657.syserr
   [junit4] >>> JVM J1 emitted unexpected output (verbatim) ----
   [junit4] OpenJDK 64-Bit Server VM warning: Option UseConcMarkSweepGC was deprecated in version 9.0 and will likely be removed in a future release.
   [junit4] <<< JVM J1: EOF ----

[...truncated 235 lines...]
   [junit4] JVM J0: stderr was not empty, see: C:\Users\jenkins\workspace\Lucene-Solr-7.x-Windows\lucene\build\facet\test\temp\junit4-J0-20190111_191153_00813035634660291647962.syserr
   [junit4] >>> JVM J0 emitted unexpected output (verbatim) ----
   [junit4] OpenJDK 64-Bit Server VM warning: Option UseConcMarkSweepGC was deprecated in version 9.0 and will likely be removed in a future release.
   [junit4] <<< JVM J0: EOF ----

[...truncated 3 lines...]
   [junit4] JVM J1: stderr was not empty, see: C:\Users\jenkins\workspace\Lucene-Solr-7.x-Windows\lucene\build\facet\test\temp\junit4-J1-20190111_191153_0089143288736796005428.syserr
   [junit4] >>> JVM J1 emitted unexpected output (verbatim) ----
   [junit4] OpenJDK 64-Bit Server VM warning: Option UseConcMarkSweepGC was deprecated in version 9.0 and will likely be removed in a future release.
   [junit4] <<< JVM J1: EOF ----

[...truncated 186 lines...]
   [junit4] JVM J0: stderr was not empty, see: C:\Users\jenkins\workspace\Lucene-Solr-7.x-Windows\lucene\build\grouping\test\temp\junit4-J0-20190111_191229_6002742077375729580778.syserr
   [junit4] >>> JVM J0 emitted unexpected output (verbatim) ----
   [junit4] OpenJDK 64-Bit Server VM warning: Option UseConcMarkSweepGC was deprecated in version 9.0 and will likely be removed in a future release.
   [junit4] <<< JVM J0: EOF ----

   [junit4] JVM J1: stderr was not empty, see: C:\Users\jenkins\workspace\Lucene-Solr-7.x-Windows\lucene\build\grouping\test\temp\junit4-J1-20190111_191229_6007434979067924077251.syserr
   [junit4] >>> JVM J1 emitted unexpected output (verbatim) ----
   [junit4] OpenJDK 64-Bit Server VM warning: Option UseConcMarkSweepGC was deprecated in version 9.0 and will likely be removed in a future release.
   [junit4] <<< JVM J1: EOF ----

[...truncated 252 lines...]
   [junit4] JVM J1: stderr was not empty, see: C:\Users\jenkins\workspace\Lucene-Solr-7.x-Windows\lucene\build\highlighter\test\temp\junit4-J1-20190111_191239_4289612055644351670427.syserr
   [junit4] >>> JVM J1 emitted unexpected output (verbatim) ----
   [junit4] OpenJDK 64-Bit Server VM warning: Option UseConcMarkSweepGC was deprecated in version 9.0 and will likely be removed in a future release.
   [junit4] <<< JVM J1: EOF ----

   [junit4] JVM J0: stderr was not empty, see: C:\Users\jenkins\workspace\Lucene-Solr-7.x-Windows\lucene\build\highlighter\test\temp\junit4-J0-20190111_191239_4289976472258748097913.syserr
   [junit4] >>> JVM J0 emitted unexpected output (verbatim) ----
   [junit4] OpenJDK 64-Bit Server VM warning: Option UseConcMarkSweepGC was deprecated in version 9.0 and will likely be removed in a future release.
   [junit4] <<< JVM J0: EOF ----

[...truncated 167 lines...]
   [junit4] JVM J0: stderr was not empty, see: C:\Users\jenkins\workspace\Lucene-Solr-7.x-Windows\lucene\build\join\test\temp\junit4-J0-20190111_191303_29214765241505619530785.syserr
   [junit4] >>> JVM J0 emitted unexpected output (verbatim) ----
   [junit4] OpenJDK 64-Bit Server VM warning: Option UseConcMarkSweepGC was deprecated in version 9.0 and will likely be removed in a future release.
   [junit4] <<< JVM J0: EOF ----

[...truncated 3 lines...]
   [junit4] JVM J1: stderr was not empty, see: C:\Users\jenkins\workspace\Lucene-Solr-7.x-Windows\lucene\build\join\test\temp\junit4-J1-20190111_191303_29213716054551981052859.syserr
   [junit4] >>> JVM J1 emitted unexpected output (verbatim) ----
   [junit4] OpenJDK 64-Bit Server VM warning: Option UseConcMarkSweepGC was deprecated in version 9.0 and will likely be removed in a future release.
   [junit4] <<< JVM J1: EOF ----

[...truncated 156 lines...]
   [junit4] JVM J0: stderr was not empty, see: C:\Users\jenkins\workspace\Lucene-Solr-7.x-Windows\lucene\build\memory\test\temp\junit4-J0-20190111_191320_16520001047448217439.syserr
   [junit4] >>> JVM J0 emitted unexpected output (verbatim) ----
   [junit4] OpenJDK 64-Bit Server VM warning: Option UseConcMarkSweepGC was deprecated in version 9.0 and will likely be removed in a future release.
   [junit4] <<< JVM J0: EOF ----

[...truncated 3 lines...]
   [junit4] JVM J1: stderr was not empty, see: C:\Users\jenkins\workspace\Lucene-Solr-7.x-Windows\lucene\build\memory\test\temp\junit4-J1-20190111_191320_1651943322838470942356.syserr
   [junit4] >>> JVM J1 emitted unexpected output (verbatim) ----
   [junit4] OpenJDK 64-Bit Server VM warning: Option UseConcMarkSweepGC was deprecated in version 9.0 and will likely be removed in a future release.
   [junit4] <<< JVM J1: EOF ----

[...truncated 199 lines...]
   [junit4] JVM J1: stderr was not empty, see: C:\Users\jenkins\workspace\Lucene-Solr-7.x-Windows\lucene\build\misc\test\temp\junit4-J1-20190111_191327_6977513182852510096362.syserr
   [junit4] >>> JVM J1 emitted unexpected output (verbatim) ----
   [junit4] OpenJDK 64-Bit Server VM warning: Option UseConcMarkSweepGC was deprecated in version 9.0 and will likely be removed in a future release.
   [junit4] <<< JVM J1: EOF ----

   [junit4] JVM J0: stderr was not empty, see: C:\Users\jenkins\workspace\Lucene-Solr-7.x-Windows\lucene\build\misc\test\temp\junit4-J0-20190111_191327_6976461115319301192374.syserr
   [junit4] >>> JVM J0 emitted unexpected output (verbatim) ----
   [junit4] OpenJDK 64-Bit Server VM warning: Option UseConcMarkSweepGC was deprecated in version 9.0 and will likely be removed in a future release.
   [junit4] <<< JVM J0: EOF ----

[...truncated 339 lines...]
   [junit4] JVM J0: stderr was not empty, see: C:\Users\jenkins\workspace\Lucene-Solr-7.x-Windows\lucene\build\queries\test\temp\junit4-J0-20190111_191350_5851119406056399989255.syserr
   [junit4] >>> JVM J0 emitted unexpected output (verbatim) ----
   [junit4] OpenJDK 64-Bit Server VM warning: Option UseConcMarkSweepGC was deprecated in version 9.0 and will likely be removed in a future release.
   [junit4] <<< JVM J0: EOF ----

[...truncated 3 lines...]
   [junit4] JVM J1: stderr was not empty, see: C:\Users\jenkins\workspace\Lucene-Solr-7.x-Windows\lucene\build\queries\test\temp\junit4-J1-20190111_191350_5856337846101904289586.syserr
   [junit4] >>> JVM J1 emitted unexpected output (verbatim) ----
   [junit4] OpenJDK 64-Bit Server VM warning: Option UseConcMarkSweepGC was deprecated in version 9.0 and will likely be removed in a future release.
   [junit4] <<< JVM J1: EOF ----

[...truncated 235 lines...]
   [junit4] JVM J0: stderr was not empty, see: C:\Users\jenkins\workspace\Lucene-Solr-7.x-Windows\lucene\build\queryparser\test\temp\junit4-J0-20190111_191403_4382505238352068057299.syserr
   [junit4] >>> JVM J0 emitted unexpected output (verbatim) ----
   [junit4] OpenJDK 64-Bit Server VM warning: Option UseConcMarkSweepGC was deprecated in version 9.0 and will likely be removed in a future release.
   [junit4] <<< JVM J0: EOF ----

   [junit4] JVM J1: stderr was not empty, see: C:\Users\jenkins\workspace\Lucene-Solr-7.x-Windows\lucene\build\queryparser\test\temp\junit4-J1-20190111_191403_4389612140530045546749.syserr
   [junit4] >>> JVM J1 emitted unexpected output (verbatim) ----
   [junit4] OpenJDK 64-Bit Server VM warning: Option UseConcMarkSweepGC was deprecated in version 9.0 and will likely be removed in a future release.
   [junit4] <<< JVM J1: EOF ----

[...truncated 214 lines...]
   [junit4] JVM J1: stderr was not empty, see: C:\Users\jenkins\workspace\Lucene-Solr-7.x-Windows\lucene\build\replicator\test\temp\junit4-J1-20190111_191414_6785352700695148962606.syserr
   [junit4] >>> JVM J1 emitted unexpected output (verbatim) ----
   [junit4] OpenJDK 64-Bit Server VM warning: Option UseConcMarkSweepGC was deprecated in version 9.0 and will likely be removed in a future release.
   [junit4] <<< JVM J1: EOF ----

[...truncated 6 lines...]
   [junit4] JVM J0: stderr was not empty, see: C:\Users\jenkins\workspace\Lucene-Solr-7.x-Windows\lucene\build\replicator\test\temp\junit4-J0-20190111_191414_678852918937211300879.syserr
   [junit4] >>> JVM J0 emitted unexpected output (verbatim) ----
   [junit4] OpenJDK 64-Bit Server VM warning: Option UseConcMarkSweepGC was deprecated in version 9.0 and will likely be removed in a future release.
   [junit4] <<< JVM J0: EOF ----

[...truncated 220 lines...]
   [junit4] JVM J1: stderr was not empty, see: C:\Users\jenkins\workspace\Lucene-Solr-7.x-Windows\lucene\build\sandbox\test\temp\junit4-J1-20190111_191429_27517568916925268967546.syserr
   [junit4] >>> JVM J1 emitted unexpected output (verbatim) ----
   [junit4] OpenJDK 64-Bit Server VM warning: Option UseConcMarkSweepGC was deprecated in version 9.0 and will likely be removed in a future release.
   [junit4] <<< JVM J1: EOF ----

[...truncated 3 lines...]
   [junit4] JVM J0: stderr was not empty, see: C:\Users\jenkins\workspace\Lucene-Solr-7.x-Windows\lucene\build\sandbox\test\temp\junit4-J0-20190111_191429_27514900932452295598984.syserr
   [junit4] >>> JVM J0 emitted unexpected output (verbatim) ----
   [junit4] OpenJDK 64-Bit Server VM warning: Option UseConcMarkSweepGC was deprecated in version 9.0 and will likely be removed in a future release.
   [junit4] <<< JVM J0: EOF ----

[...truncated 282 lines...]
   [junit4] JVM J1: stderr was not empty, see: C:\Users\jenkins\workspace\Lucene-Solr-7.x-Windows\lucene\build\spatial-extras\test\temp\junit4-J1-20190111_191523_11612352460819115772161.syserr
   [junit4] >>> JVM J1 emitted unexpected output (verbatim) ----
   [junit4] OpenJDK 64-Bit Server VM warning: Option UseConcMarkSweepGC was deprecated in version 9.0 and will likely be removed in a future release.
   [junit4] <<< JVM J1: EOF ----

[...truncated 21 lines...]
   [junit4] JVM J0: stderr was not empty, see: C:\Users\jenkins\workspace\Lucene-Solr-7.x-Windows\lucene\build\spatial-extras\test\temp\junit4-J0-20190111_191523_11614857512611893001357.syserr
   [junit4] >>> JVM J0 emitted unexpected output (verbatim) ----
   [junit4] OpenJDK 64-Bit Server VM warning: Option UseConcMarkSweepGC was deprecated in version 9.0 and will likely be removed in a future release.
   [junit4] <<< JVM J0: EOF ----

[...truncated 181 lines...]
   [junit4] JVM J0: stderr was not empty, see: C:\Users\jenkins\workspace\Lucene-Solr-7.x-Windows\lucene\build\spatial3d\test\temp\junit4-J0-20190111_191609_9672905906881174151323.syserr
   [junit4] >>> JVM J0 emitted unexpected output (verbatim) ----
   [junit4] OpenJDK 64-Bit Server VM warning: Option UseConcMarkSweepGC was deprecated in version 9.0 and will likely be removed in a future release.
   [junit4] <<< JVM J0: EOF ----

[...truncated 17 lines...]
   [junit4] JVM J1: stderr was not empty, see: C:\Users\jenkins\workspace\Lucene-Solr-7.x-Windows\lucene\build\spatial3d\test\temp\junit4-J1-20190111_191609_9686584488731124405491.syserr
   [junit4] >>> JVM J1 emitted unexpected output (verbatim) ----
   [junit4] OpenJDK 64-Bit Server VM warning: Option UseConcMarkSweepGC was deprecated in version 9.0 and will likely be removed in a future release.
   [junit4] <<< JVM J1: EOF ----

[...truncated 152 lines...]
   [junit4] JVM J0: stderr was not empty, see: C:\Users\jenkins\workspace\Lucene-Solr-7.x-Windows\lucene\build\spatial\test\temp\junit4-J0-20190111_191626_8486712110674578254066.syserr
   [junit4] >>> JVM J0 emitted unexpected output (verbatim) ----
   [junit4] OpenJDK 64-Bit Server VM warning: Option UseConcMarkSweepGC was deprecated in version 9.0 and will likely be removed in a future release.
   [junit4] <<< JVM J0: EOF ----

[...truncated 256 lines...]
   [junit4] JVM J1: stderr was not empty, see: C:\Users\jenkins\workspace\Lucene-Solr-7.x-Windows\lucene\build\suggest\test\temp\junit4-J1-20190111_191631_2222879395181845144393.syserr
   [junit4] >>> JVM J1 emitted unexpected output (verbatim) ----
   [junit4] OpenJDK 64-Bit Server VM warning: Option UseConcMarkSweepGC was deprecated in version 9.0 and will likely be removed in a future release.
   [junit4] <<< JVM J1: EOF ----

[...truncated 3 lines...]
   [junit4] JVM J0: stderr was not empty, see: C:\Users\jenkins\workspace\Lucene-Solr-7.x-Windows\lucene\build\suggest\test\temp\junit4-J0-20190111_191631_22211144597744850258990.syserr
   [junit4] >>> JVM J0 emitted unexpected output (verbatim) ----
   [junit4] OpenJDK 64-Bit Server VM warning: Option UseConcMarkSweepGC was deprecated in version 9.0 and will likely be removed in a future release.
   [junit4] <<< JVM J0: EOF ----

[...truncated 2520 lines...]
   [junit4] Suite: org.apache.solr.handler.admin.AutoscalingHistoryHandlerTest
   [junit4]   2> 705993 INFO  (SUITE-AutoscalingHistoryHandlerTest-seed#[E53BAE4AB460D0A4]-worker) [    ] o.a.s.SolrTestCaseJ4 SecureRandom sanity checks: test.solr.allowed.securerandom=null & java.security.egd=file:/dev/./urandom
   [junit4]   2> Creating dataDir: C:\Users\jenkins\workspace\Lucene-Solr-7.x-Windows\solr\build\solr-core\test\J1\temp\solr.handler.admin.AutoscalingHistoryHandlerTest_E53BAE4AB460D0A4-001\init-core-data-001
   [junit4]   2> 705995 WARN  (SUITE-AutoscalingHistoryHandlerTest-seed#[E53BAE4AB460D0A4]-worker) [    ] o.a.s.SolrTestCaseJ4 startTrackingSearchers: numOpens=1 numCloses=1
   [junit4]   2> 705995 INFO  (SUITE-AutoscalingHistoryHandlerTest-seed#[E53BAE4AB460D0A4]-worker) [    ] o.a.s.SolrTestCaseJ4 Using PointFields (NUMERIC_POINTS_SYSPROP=true) w/NUMERIC_DOCVALUES_SYSPROP=false
   [junit4]   2> 705995 INFO  (SUITE-AutoscalingHistoryHandlerTest-seed#[E53BAE4AB460D0A4]-worker) [    ] o.a.s.SolrTestCaseJ4 Randomized ssl (false) and clientAuth (false) via: @org.apache.solr.util.RandomizeSSL(reason="", value=0.0/0.0, ssl=0.0/0.0, clientAuth=0.0/0.0)
   [junit4]   2> 705995 INFO  (SUITE-AutoscalingHistoryHandlerTest-seed#[E53BAE4AB460D0A4]-worker) [    ] o.a.s.c.MiniSolrCloudCluster Starting cluster of 2 servers in C:\Users\jenkins\workspace\Lucene-Solr-7.x-Windows\solr\build\solr-core\test\J1\temp\solr.handler.admin.AutoscalingHistoryHandlerTest_E53BAE4AB460D0A4-001\tempDir-001
   [junit4]   2> 705995 INFO  (SUITE-AutoscalingHistoryHandlerTest-seed#[E53BAE4AB460D0A4]-worker) [    ] o.a.s.c.ZkTestServer STARTING ZK TEST SERVER
   [junit4]   2> 705995 INFO  (ZkTestServer Run Thread) [    ] o.a.s.c.ZkTestServer client port:0.0.0.0/0.0.0.0:0
   [junit4]   2> 705998 INFO  (ZkTestServer Run Thread) [    ] o.a.s.c.ZkTestServer Starting server
   [junit4]   2> 706093 INFO  (SUITE-AutoscalingHistoryHandlerTest-seed#[E53BAE4AB460D0A4]-worker) [    ] o.a.s.c.ZkTestServer start zk server on port:63718
   [junit4]   2> 706093 INFO  (SUITE-AutoscalingHistoryHandlerTest-seed#[E53BAE4AB460D0A4]-worker) [    ] o.a.s.c.ZkTestServer parse host and port list: 127.0.0.1:63718
   [junit4]   2> 706093 INFO  (SUITE-AutoscalingHistoryHandlerTest-seed#[E53BAE4AB460D0A4]-worker) [    ] o.a.s.c.ZkTestServer connecting to 127.0.0.1 63718
   [junit4]   2> 706099 INFO  (zkConnectionManagerCallback-6856-thread-1) [    ] o.a.s.c.c.ConnectionManager zkClient has connected
   [junit4]   2> 706104 INFO  (zkConnectionManagerCallback-6858-thread-1) [    ] o.a.s.c.c.ConnectionManager zkClient has connected
   [junit4]   2> 706107 INFO  (zkConnectionManagerCallback-6860-thread-1) [    ] o.a.s.c.c.ConnectionManager zkClient has connected
   [junit4]   2> 706110 WARN  (jetty-launcher-6861-thread-2) [    ] o.e.j.s.AbstractConnector Ignoring deprecated socket close linger time
   [junit4]   2> 706110 WARN  (jetty-launcher-6861-thread-1) [    ] o.e.j.s.AbstractConnector Ignoring deprecated socket close linger time
   [junit4]   2> 706111 INFO  (jetty-launcher-6861-thread-2) [    ] o.a.s.c.s.e.JettySolrRunner Start Jetty (original configured port=0)
   [junit4]   2> 706111 INFO  (jetty-launcher-6861-thread-2) [    ] o.a.s.c.s.e.JettySolrRunner Trying to start Jetty on port 0 try number 1 ...
   [junit4]   2> 706111 INFO  (jetty-launcher-6861-thread-1) [    ] o.a.s.c.s.e.JettySolrRunner Start Jetty (original configured port=0)
   [junit4]   2> 706111 INFO  (jetty-launcher-6861-thread-1) [    ] o.a.s.c.s.e.JettySolrRunner Trying to start Jetty on port 0 try number 1 ...
   [junit4]   2> 706111 INFO  (jetty-launcher-6861-thread-2) [    ] o.e.j.s.Server jetty-9.4.14.v20181114; built: 2018-11-14T21:20:31.478Z; git: c4550056e785fb5665914545889f21dc136ad9e6; jvm 9.0.4+11
   [junit4]   2> 706111 INFO  (jetty-launcher-6861-thread-1) [    ] o.e.j.s.Server jetty-9.4.14.v20181114; built: 2018-11-14T21:20:31.478Z; git: c4550056e785fb5665914545889f21dc136ad9e6; jvm 9.0.4+11
   [junit4]   2> 706111 INFO  (jetty-launcher-6861-thread-2) [    ] o.e.j.s.session DefaultSessionIdManager workerName=node0
   [junit4]   2> 706111 INFO  (jetty-launcher-6861-thread-2) [    ] o.e.j.s.session No SessionScavenger set, using defaults
   [junit4]   2> 706111 INFO  (jetty-launcher-6861-thread-1) [    ] o.e.j.s.session DefaultSessionIdManager workerName=node0
   [junit4]   2> 706111 INFO  (jetty-launcher-6861-thread-1) [    ] o.e.j.s.session No SessionScavenger set, using defaults
   [junit4]   2> 706111 INFO  (jetty-launcher-6861-thread-2) [    ] o.e.j.s.session node0 Scavenging every 600000ms
   [junit4]   2> 706112 INFO  (jetty-launcher-6861-thread-1) [    ] o.e.j.s.session node0 Scavenging every 660000ms
   [junit4]   2> 706112 INFO  (jetty-launcher-6861-thread-2) [    ] o.e.j.s.h.ContextHandler Started o.e.j.s.ServletContextHandler@71e324bd{/solr,null,AVAILABLE}
   [junit4]   2> 706112 INFO  (jetty-launcher-6861-thread-1) [    ] o.e.j.s.h.ContextHandler Started o.e.j.s.ServletContextHandler@408d93d2{/solr,null,AVAILABLE}
   [junit4]   2> 706115 INFO  (jetty-launcher-6861-thread-1) [    ] o.e.j.s.AbstractConnector Started ServerConnector@63a4ebe7{HTTP/1.1,[http/1.1]}{127.0.0.1:63729}
   [junit4]   2> 706115 INFO  (jetty-launcher-6861-thread-2) [    ] o.e.j.s.AbstractConnector Started ServerConnector@7efc392b{HTTP/1.1,[http/1.1]}{127.0.0.1:63730}
   [junit4]   2> 706115 INFO  (jetty-launcher-6861-thread-2) [    ] o.e.j.s.Server Started @699387ms
   [junit4]   2> 706115 INFO  (jetty-launcher-6861-thread-1) [    ] o.e.j.s.Server Started @699387ms
   [junit4]   2> 706115 INFO  (jetty-launcher-6861-thread-2) [    ] o.a.s.c.s.e.JettySolrRunner Jetty properties: {hostContext=/solr, hostPort=63730}
   [junit4]   2> 706115 INFO  (jetty-launcher-6861-thread-1) [    ] o.a.s.c.s.e.JettySolrRunner Jetty properties: {hostContext=/solr, hostPort=63729}
   [junit4]   2> 706116 ERROR (jetty-launcher-6861-thread-1) [    ] o.a.s.u.StartupLoggingUtils Missing Java Option solr.log.dir. Logging may be missing or incomplete.
   [junit4]   2> 706116 INFO  (jetty-launcher-6861-thread-1) [    ] o.a.s.s.SolrDispatchFilter Using logger factory org.apache.logging.slf4j.Log4jLoggerFactory
   [junit4]   2> 706116 ERROR (jetty-launcher-6861-thread-2) [    ] o.a.s.u.StartupLoggingUtils Missing Java Option solr.log.dir. Logging may be missing or incomplete.
   [junit4]   2> 706116 INFO  (jetty-launcher-6861-thread-2) [    ] o.a.s.s.SolrDispatchFilter Using logger factory org.apache.logging.slf4j.Log4jLoggerFactory
   [junit4]   2> 706116 INFO  (jetty-launcher-6861-thread-1) [    ] o.a.s.s.SolrDispatchFilter  ___      _       Welcome to Apache Solr™ version 7.7.0
   [junit4]   2> 706116 INFO  (jetty-launcher-6861-thread-2) [    ] o.a.s.s.SolrDispatchFilter  ___      _       Welcome to Apache Solr™ version 7.7.0
   [junit4]   2> 706116 INFO  (jetty-launcher-6861-thread-1) [    ] o.a.s.s.SolrDispatchFilter / __| ___| |_ _   Starting in cloud mode on port null
   [junit4]   2> 706116 INFO  (jetty-launcher-6861-thread-1) [    ] o.a.s.s.SolrDispatchFilter \__ \/ _ \ | '_|  Install dir: null
   [junit4]   2> 706116 INFO  (jetty-launcher-6861-thread-1) [    ] o.a.s.s.SolrDispatchFilter |___/\___/_|_|    Start time: 2019-01-11T19:30:02.688734100Z
   [junit4]   2> 706116 INFO  (jetty-launcher-6861-thread-2) [    ] o.a.s.s.SolrDispatchFilter / __| ___| |_ _   Starting in cloud mode on port null
   [junit4]   2> 706116 INFO  (jetty-launcher-6861-thread-2) [    ] o.a.s.s.SolrDispatchFilter \__ \/ _ \ | '_|  Install dir: null
   [junit4]   2> 706116 INFO  (jetty-launcher-6861-thread-2) [    ] o.a.s.s.SolrDispatchFilter |___/\___/_|_|    Start time: 2019-01-11T19:30:02.688734100Z
   [junit4]   2> 706119 INFO  (zkConnectionManagerCallback-6863-thread-1) [    ] o.a.s.c.c.ConnectionManager zkClient has connected
   [junit4]   2> 706119 INFO  (zkConnectionManagerCallback-6865-thread-1) [    ] o.a.s.c.c.ConnectionManager zkClient has connected
   [junit4]   2> 706120 INFO  (jetty-launcher-6861-thread-1) [    ] o.a.s.s.SolrDispatchFilter solr.xml found in ZooKeeper. Loading...
   [junit4]   2> 706120 INFO  (jetty-launcher-6861-thread-2) [    ] o.a.s.s.SolrDispatchFilter solr.xml found in ZooKeeper. Loading...
   [junit4]   2> 706124 WARN  (NIOServerCxn.Factory:0.0.0.0/0.0.0.0:0) [    ] o.a.z.s.NIOServerCnxn Unable to read additional data from client sessionid 0x10009359f670003, likely client has closed socket
   [junit4]   2> 706261 INFO  (jetty-launcher-6861-thread-1) [    ] o.a.s.c.ZkContainer Zookeeper client=127.0.0.1:63718/solr
   [junit4]   2> 706265 INFO  (zkConnectionManagerCallback-6869-thread-1) [    ] o.a.s.c.c.ConnectionManager zkClient has connected
   [junit4]   2> 706266 WARN  (NIOServerCxn.Factory:0.0.0.0/0.0.0.0:0) [    ] o.a.z.s.NIOServerCnxn Unable to read additional data from client sessionid 0x10009359f670005, likely client has closed socket
   [junit4]   2> 706269 INFO  (zkConnectionManagerCallback-6871-thread-1) [    ] o.a.s.c.c.ConnectionManager zkClient has connected
   [junit4]   2> 706341 INFO  (jetty-launcher-6861-thread-2) [    ] o.a.s.c.ZkContainer Zookeeper client=127.0.0.1:63718/solr
   [junit4]   2> 706343 INFO  (zkConnectionManagerCallback-6877-thread-1) [    ] o.a.s.c.c.ConnectionManager zkClient has connected
   [junit4]   2> 706343 WARN  (NIOServerCxn.Factory:0.0.0.0/0.0.0.0:0) [    ] o.a.z.s.NIOServerCnxn Unable to read additional data from client sessionid 0x10009359f670007, likely client has closed socket
   [junit4]   2> 706351 INFO  (zkConnectionManagerCallback-6879-thread-1) [    ] o.a.s.c.c.ConnectionManager zkClient has connected
   [junit4]   2> 706357 INFO  (jetty-launcher-6861-thread-2) [n:127.0.0.1:63730_solr    ] o.a.s.c.OverseerElectionContext I am going to be the leader 127.0.0.1:63730_solr
   [junit4]   2> 706358 INFO  (jetty-launcher-6861-thread-2) [n:127.0.0.1:63730_solr    ] o.a.s.c.Overseer Overseer (id=72067719950172168-127.0.0.1:63730_solr-n_0000000000) starting
   [junit4]   2> 706359 INFO  (jetty-launcher-6861-thread-1) [n:127.0.0.1:63729_solr    ] o.a.s.c.ZkController Register node as live in ZooKeeper:/live_nodes/127.0.0.1:63729_solr
   [junit4]   2> 706360 INFO  (zkCallback-6870-thread-1) [    ] o.a.s.c.c.ZkStateReader Updated live nodes from ZooKeeper... (0) -> (1)
   [junit4]   2> 706360 INFO  (zkCallback-6878-thread-1) [    ] o.a.s.c.c.ZkStateReader Updated live nodes from ZooKeeper... (0) -> (1)
   [junit4]   2> 706364 INFO  (zkConnectionManagerCallback-6886-thread-1) [    ] o.a.s.c.c.ConnectionManager zkClient has connected
   [junit4]   2> 706365 INFO  (jetty-launcher-6861-thread-2) [n:127.0.0.1:63730_solr    ] o.a.s.c.c.ZkStateReader Updated live nodes from ZooKeeper... (0) -> (1)
   [junit4]   2> 706366 INFO  (jetty-launcher-6861-thread-2) [n:127.0.0.1:63730_solr    ] o.a.s.c.s.i.ZkClientClusterStateProvider Cluster at 127.0.0.1:63718/solr ready
   [junit4]   2> 706367 INFO  (jetty-launcher-6861-thread-2) [n:127.0.0.1:63730_solr    ] o.a.s.c.ZkController Publish node=127.0.0.1:63730_solr as DOWN
   [junit4]   2> 706367 INFO  (OverseerStateUpdate-72067719950172168-127.0.0.1:63730_solr-n_0000000000) [n:127.0.0.1:63730_solr    ] o.a.s.c.Overseer Starting to work on the main queue : 127.0.0.1:63730_solr
   [junit4]   2> 706368 DEBUG (OverseerAutoScalingTriggerThread-72067719950172168-127.0.0.1:63730_solr-n_0000000000) [    ] o.a.s.c.a.OverseerTriggerThread Adding .auto_add_replicas and .scheduled_maintenance triggers
   [junit4]   2> 706368 INFO  (jetty-launcher-6861-thread-2) [n:127.0.0.1:63730_solr    ] o.a.s.c.TransientSolrCoreCacheDefault Allocating transient cache for 2147483647 transient cores
   [junit4]   2> 706368 INFO  (jetty-launcher-6861-thread-2) [n:127.0.0.1:63730_solr    ] o.a.s.c.ZkController Register node as live in ZooKeeper:/live_nodes/127.0.0.1:63730_solr
   [junit4]   2> 706369 DEBUG (OverseerAutoScalingTriggerThread-72067719950172168-127.0.0.1:63730_solr-n_0000000000) [    ] o.a.s.c.a.OverseerTriggerThread Refreshing /autoscaling.json with znode version 1
   [junit4]   2> 706369 DEBUG (OverseerAutoScalingTriggerThread-72067719950172168-127.0.0.1:63730_solr-n_0000000000) [    ] o.a.s.c.a.OverseerTriggerThread Current znodeVersion 1, lastZnodeVersion 0
   [junit4]   2> 706369 DEBUG (OverseerAutoScalingTriggerThread-72067719950172168-127.0.0.1:63730_solr-n_0000000000) [    ] o.a.s.c.a.OverseerTriggerThread Processed trigger updates upto znodeVersion 1
   [junit4]   2> 706369 INFO  (zkCallback-6870-thread-1) [    ] o.a.s.c.c.ZkStateReader Updated live nodes from ZooKeeper... (1) -> (2)
   [junit4]   2> 706369 INFO  (zkCallback-6878-thread-1) [    ] o.a.s.c.c.ZkStateReader Updated live nodes from ZooKeeper... (1) -> (2)
   [junit4]   2> 706370 DEBUG (OverseerStateUpdate-72067719950172168-127.0.0.1:63730_solr-n_0000000000) [n:127.0.0.1:63730_solr    ] o.a.s.c.Overseer processMessage: queueSize: 1, message = {
   [junit4]   2>   "operation":"downnode",
   [junit4]   2>   "node_name":"127.0.0.1:63730_solr"} current state version: 0
   [junit4]   2> 706370 DEBUG (OverseerStateUpdate-72067719950172168-127.0.0.1:63730_solr-n_0000000000) [n:127.0.0.1:63730_solr    ] o.a.s.c.o.NodeMutator DownNode state invoked for node: 127.0.0.1:63730_solr
   [junit4]   2> 706372 DEBUG (OverseerAutoScalingTriggerThread-72067719950172168-127.0.0.1:63730_solr-n_0000000000) [    ] o.a.s.c.a.NodeLostTrigger NodeLostTrigger .auto_add_replicas - Initial livenodes: [127.0.0.1:63729_solr]
   [junit4]   2> 706372 DEBUG (OverseerAutoScalingTriggerThread-72067719950172168-127.0.0.1:63730_solr-n_0000000000) [    ] o.a.s.c.a.OverseerTriggerThread -- cleaning old nodeLost / nodeAdded markers
   [junit4]   2> 706372 DEBUG (OverseerAutoScalingTriggerThread-72067719950172168-127.0.0.1:63730_solr-n_0000000000) [    ] o.a.s.c.a.OverseerTriggerThread Current znodeVersion 1, lastZnodeVersion 1
   [junit4]   2> 706372 INFO  (zkCallback-6885-thread-1) [    ] o.a.s.c.c.ZkStateReader Updated live nodes from ZooKeeper... (1) -> (2)
   [junit4]   2> 706375 DEBUG (ScheduledTrigger-4331-thread-2) [    ] o.a.s.c.a.NodeLostTrigger Running NodeLostTrigger: .auto_add_replicas with currently live nodes: 2 and last live nodes: 1
   [junit4]   2> 706383 INFO  (zkConnectionManagerCallback-6891-thread-1) [    ] o.a.s.c.c.ConnectionManager zkClient has connected
   [junit4]   2> 706385 INFO  (jetty-launcher-6861-thread-1) [n:127.0.0.1:63729_solr    ] o.a.s.c.c.ZkStateReader Updated live nodes from ZooKeeper... (0) -> (2)
   [junit4]   2> 706385 INFO  (jetty-launcher-6861-thread-1) [n:127.0.0.1:63729_solr    ] o.a.s.c.s.i.ZkClientClusterStateProvider Cluster at 127.0.0.1:63718/solr ready
   [junit4]   2> 706386 INFO  (jetty-launcher-6861-thread-1) [n:127.0.0.1:63729_solr    ] o.a.s.h.a.MetricsHistoryHandler No .system collection, keeping metrics history in memory.
   [junit4]   2> 706389 INFO  (jetty-launcher-6861-thread-2) [n:127.0.0.1:63730_solr    ] o.a.s.h.a.MetricsHistoryHandler No .system collection, keeping metrics history in memory.
   [junit4]   2> 706409 INFO  (jetty-launcher-6861-thread-1) [n:127.0.0.1:63729_solr    ] o.a.s.m.r.SolrJmxReporter JMX monitoring for 'solr_63729.solr.node' (registry 'solr.node') enabled at server: com.sun.jmx.mbeanserver.JmxMBeanServer@346f2b71
   [junit4]   2> 706411 INFO  (jetty-launcher-6861-thread-2) [n:127.0.0.1:63730_solr    ] o.a.s.m.r.SolrJmxReporter JMX monitoring for 'solr_63730.solr.node' (registry 'solr.node') enabled at server: com.sun.jmx.mbeanserver.JmxMBeanServer@346f2b71
   [junit4]   2> 706416 INFO  (jetty-launcher-6861-thread-1) [n:127.0.0.1:63729_solr    ] o.a.s.m.r.SolrJmxReporter JMX monitoring for 'solr_63729.solr.jvm' (registry 'solr.jvm') enabled at server: com.sun.jmx.mbeanserver.JmxMBeanServer@346f2b71
   [junit4]   2> 706416 INFO  (jetty-launcher-6861-thread-1) [n:127.0.0.1:63729_solr    ] o.a.s.m.r.SolrJmxReporter JMX monitoring for 'solr_63729.solr.jetty' (registry 'solr.jetty') enabled at server: com.sun.jmx.mbeanserver.JmxMBeanServer@346f2b71
   [junit4]   2> 706417 INFO  (jetty-launcher-6861-thread-1) [n:127.0.0.1:63729_solr    ] o.a.s.c.CorePropertiesLocator Found 0 core definitions underneath C:\Users\jenkins\workspace\Lucene-Solr-7.x-Windows\solr\build\solr-core\test\J1\temp\solr.handler.admin.AutoscalingHistoryHandlerTest_E53BAE4AB460D0A4-001\tempDir-001\node1\.
   [junit4]   2> 706417 INFO  (jetty-launcher-6861-thread-2) [n:127.0.0.1:63730_solr    ] o.a.s.m.r.SolrJmxReporter JMX monitoring for 'solr_63730.solr.jvm' (registry 'solr.jvm') enabled at server: com.sun.jmx.mbeanserver.JmxMBeanServer@346f2b71
   [junit4]   2> 706418 INFO  (jetty-launcher-6861-thread-2) [n:127.0.0.1:63730_solr    ] o.a.s.m.r.SolrJmxReporter JMX monitoring for 'solr_63730.solr.jetty' (registry 'solr.jetty') enabled at server: com.sun.jmx.mbeanserver.JmxMBeanServer@346f2b71
   [junit4]   2> 706419 INFO  (jetty-launcher-6861-thread-2) [n:127.0.0.1:63730_solr    ] o.a.s.c.CorePropertiesLocator Found 0 core definitions underneath C:\Users\jenkins\workspace\Lucene-Solr-7.x-Windows\solr\build\solr-core\test\J1\temp\solr.handler.admin.AutoscalingHistoryHandlerTest_E53BAE4AB460D0A4-001\tempDir-001\node2\.
   [junit4]   2> 706462 INFO  (zkConnectionManagerCallback-6898-thread-1) [    ] o.a.s.c.c.ConnectionManager zkClient has connected
   [junit4]   2> 706464 INFO  (SUITE-AutoscalingHistoryHandlerTest-seed#[E53BAE4AB460D0A4]-worker) [    ] o.a.s.c.c.ZkStateReader Updated live nodes from ZooKeeper... (0) -> (2)
   [junit4]   2> 706465 INFO  (SUITE-AutoscalingHistoryHandlerTest-seed#[E53BAE4AB460D0A4]-worker) [    ] o.a.s.c.s.i.ZkClientClusterStateProvider Cluster at 127.0.0.1:63718/solr ready
   [junit4]   2> 706470 INFO  (qtp1837525691-15319) [n:127.0.0.1:63730_solr    ] o.a.s.h.a.CollectionsHandler Invoked Collection Action :create with params name=.system&nrtReplicas=1&action=CREATE&numShards=1&createNodeSet=127.0.0.1:63730_solr&wt=javabin&version=2 and sendToOCPQueue=true
   [junit4]   2> 706476 INFO  (OverseerThreadFactory-4333-thread-1-processing-n:127.0.0.1:63730_solr) [n:127.0.0.1:63730_solr    ] o.a.s.c.a.c.CreateCollectionCmd Create collection .system
   [junit4]   2> 706481 DEBUG (OverseerStateUpdate-72067719950172168-127.0.0.1:63730_solr-n_0000000000) [n:127.0.0.1:63730_solr    ] o.a.s.c.Overseer processMessage: queueSize: 1, message = {
   [junit4]   2>   "name":".system",
   [junit4]   2>   "fromApi":"true",
   [junit4]   2>   "numShards":1,
   [junit4]   2>   "createNodeSet":"127.0.0.1:63730_solr",
   [junit4]   2>   "nrtReplicas":"1",
   [junit4]   2>   "stateFormat":"2",
   [junit4]   2>   "replicationFactor":"1",
   [junit4]   2>   "operation":"create"} current state version: 0
   [junit4]   2> 706481 DEBUG (OverseerStateUpdate-72067719950172168-127.0.0.1:63730_solr-n_0000000000) [n:127.0.0.1:63730_solr    ] o.a.s.c.o.ClusterStateMutator building a new cName: .system
   [junit4]   2> 706482 DEBUG (OverseerStateUpdate-72067719950172168-127.0.0.1:63730_solr-n_0000000000) [n:127.0.0.1:63730_solr    ] o.a.s.c.o.ZkStateWriter going to create_collection /collections/.system/state.json
   [junit4]   2> 706580 DEBUG (OverseerThreadFactory-4333-thread-1-processing-n:127.0.0.1:63730_solr) [n:127.0.0.1:63730_solr    ] o.a.s.c.s.c.a.PolicyHelper Creating a new session
   [junit4]   2> 706582 INFO  (qtp1837525691-15320) [n:127.0.0.1:63730_solr    ] o.a.s.s.HttpSolrCall [admin] webapp=null path=/admin/metrics params={prefix=CONTAINER.fs.usableSpace,CONTAINER.fs.totalSpace,CORE.coreName&wt=javabin&version=2&group=solr.node,solr.core} status=0 QTime=2
   [junit4]   2> 706586 INFO  (qtp1837525691-15322) [n:127.0.0.1:63730_solr    ] o.a.s.s.HttpSolrCall [admin] webapp=null path=/admin/metrics params={prefix=CONTAINER.fs.usableSpace,CONTAINER.fs.totalSpace,CORE.coreName&wt=javabin&version=2&group=solr.node,solr.core} status=0 QTime=2
   [junit4]   2> 706590 INFO  (qtp1837525691-15326) [n:127.0.0.1:63730_solr    ] o.a.s.s.HttpSolrCall [admin] webapp=null path=/admin/metrics params={prefix=CONTAINER.fs.usableSpace,CONTAINER.fs.totalSpace,CORE.coreName&wt=javabin&version=2&group=solr.node,solr.core} status=0 QTime=2
   [junit4]   2> 706592 INFO  (qtp1837525691-15316) [n:127.0.0.1:63730_solr    ] o.a.s.s.HttpSolrCall [admin] webapp=null path=/admin/metrics params={prefix=CONTAINER.fs.usableSpace,CONTAINER.fs.totalSpace,CORE.coreName&wt=javabin&version=2&group=solr.node,solr.core} status=0 QTime=2
   [junit4]   2> 706595 INFO  (qtp1837525691-15318) [n:127.0.0.1:63730_solr    ] o.a.s.s.HttpSolrCall [admin] webapp=null path=/admin/metrics params={prefix=CONTAINER.fs.usableSpace,CONTAINER.fs.totalSpace,CORE.coreName&wt=javabin&version=2&group=solr.node,solr.core} status=0 QTime=2
   [junit4]   2> 706600 INFO  (qtp2100043817-15324) [n:127.0.0.1:63729_solr    ] o.a.s.s.HttpSolrCall [admin] webapp=null path=/admin/metrics params={prefix=CONTAINER.fs.usableSpace,CONTAINER.fs.totalSpace,CORE.coreName&wt=javabin&version=2&group=solr.node,solr.core} status=0 QTime=2
   [junit4]   2> 706603 INFO  (qtp2100043817-15325) [n:127.0.0.1:63729_solr    ] o.a.s.s.HttpSolrCall [admin] webapp=null path=/admin/metrics params={prefix=CONTAINER.fs.usableSpace,CONTAINER.fs.totalSpace,CORE.coreName&wt=javabin&version=2&group=solr.node,solr.core} status=0 QTime=2
   [junit4]   2> 706605 INFO  (qtp2100043817-15327) [n:127.0.0.1:63729_solr    ] o.a.s.s.HttpSolrCall [admin] webapp=null path=/admin/metrics params={prefix=CONTAINER.fs.usableSpace,CONTAINER.fs.totalSpace,CORE.coreName&wt=javabin&version=2&group=solr.node,solr.core} status=0 QTime=2
   [junit4]   2> 706609 INFO  (qtp2100043817-15328) [n:127.0.0.1:63729_solr    ] o.a.s.s.HttpSolrCall [admin] webapp=null path=/admin/metrics params={prefix=CONTAINER.fs.usableSpace,CONTAINER.fs.totalSpace,CORE.coreName&wt=javabin&version=2&group=solr.node,solr.core} status=0 QTime=2
   [junit4]   2> 706612 INFO  (qtp2100043817-15329) [n:127.0.0.1:63729_solr    ] o.a.s.s.HttpSolrCall [admin] webapp=null path=/admin/metrics params={prefix=CONTAINER.fs.usableSpace,CONTAINER.fs.totalSpace,CORE.coreName&wt=javabin&version=2&group=solr.node,solr.core} status=0 QTime=3
   [junit4]   2> 706613 DEBUG (OverseerThreadFactory-4333-thread-1-processing-n:127.0.0.1:63730_solr) [n:127.0.0.1:63730_solr    ] o.a.s.c.s.c.a.PolicyHelper New session created 
   [junit4]   2> 706615 DEBUG (OverseerThreadFactory-4333-thread-1-processing-n:127.0.0.1:63730_solr) [n:127.0.0.1:63730_solr    ] o.a.s.c.s.c.a.PolicyHelper returnSession, curr-time 154509767 sessionWrapper.createTime 154509766741800, this.sessionWrapper.createTime 154509766741800 
   [junit4]   2> 706617 DEBUG (OverseerStateUpdate-72067719950172168-127.0.0.1:63730_solr-n_0000000000) [n:127.0.0.1:63730_solr    ] o.a.s.c.Overseer processMessage: queueSize: 1, message = {
   [junit4]   2>   "operation":"ADDREPLICA",
   [junit4]   2>   "collection":".system",
   [junit4]   2>   "shard":"shard1",
   [junit4]   2>   "core":".system_shard1_replica_n1",
   [junit4]   2>   "state":"down",
   [junit4]   2>   "base_url":"http://127.0.0.1:63730/solr",
   [junit4]   2>   "type":"NRT",
   [junit4]   2>   "waitForFinalState":"false"} current state version: 0
   [junit4]   2> 706617 INFO  (OverseerStateUpdate-72067719950172168-127.0.0.1:63730_solr-n_0000000000) [n:127.0.0.1:63730_solr    ] o.a.s.c.o.SliceMutator createReplica() {
   [junit4]   2>   "operation":"ADDREPLICA",
   [junit4]   2>   "collection":".system",
   [junit4]   2>   "shard":"shard1",
   [junit4]   2>   "core":".system_shard1_replica_n1",
   [junit4]   2>   "state":"down",
   [junit4]   2>   "base_url":"http://127.0.0.1:63730/solr",
   [junit4]   2>   "type":"NRT",
   [junit4]   2>   "waitForFinalState":"false"} 
   [junit4]   2> 706617 DEBUG (OverseerStateUpdate-72067719950172168-127.0.0.1:63730_solr-n_0000000000) [n:127.0.0.1:63730_solr    ] o.a.s.c.o.SliceMutator Old Slice: shard1:{
   [junit4]   2>   "range":"80000000-7fffffff",
   [junit4]   2>   "state":"active",
   [junit4]   2>   "replicas":{}}
   [junit4]   2> 706617 DEBUG (OverseerStateUpdate-72067719950172168-127.0.0.1:63730_solr-n_0000000000) [n:127.0.0.1:63730_solr    ] o.a.s.c.o.SliceMutator New Slice: shard1:{
   [junit4]   2>   "range":"80000000-7fffffff",
   [junit4]   2>   "state":"active",
   [junit4]   2>   "replicas":{"core_node2":{
   [junit4]   2>       "core":".system_shard1_replica_n1",
   [junit4]   2>       "base_url":"http://127.0.0.1:63730/solr",
   [junit4]   2>       "state":"down",
   [junit4]   2>       "node_name":null,
   [junit4]   2>       "type":"NRT"}}}
   [junit4]   2> 706717 DEBUG (OverseerStateUpdate-72067719950172168-127.0.0.1:63730_solr-n_0000000000) [n:127.0.0.1:63730_solr    ] o.a.s.c.o.ZkStateWriter going to update_collection /collections/.system/state.json version: 0
   [junit4]   2> 706814 INFO  (qtp1837525691-15320) [n:127.0.0.1:63730_solr    x:.system_shard1_replica_n1] o.a.s.h.a.CoreAdminOperation core create command qt=/admin/cores&coreNodeName=core_node2&collection.configName=.system&newCollection=true&name=.system_shard1_replica_n1&action=CREATE&numShards=1&collection=.system&shard=shard1&wt=javabin&version=2&replicaType=NRT
   [junit4]   2> 706819 DEBUG (OverseerStateUpdate-72067719950172168-127.0.0.1:63730_solr-n_0000000000) [n:127.0.0.1:63730_solr    ] o.a.s.c.Overseer processMessage: queueSize: 1, message = {
   [junit4]   2>   "core":".system_shard1_replica_n1",
   [junit4]   2>   "core_node_name":"core_node2",
   [junit4]   2>   "roles":null,
   [junit4]   2>   "base_url":"http://127.0.0.1:63730/solr",
   [junit4]   2>   "node_name":"127.0.0.1:63730_solr",
   [junit4]   2>   "numShards":"1",
   [junit4]   2>   "state":"down",
   [junit4]   2>   "shard":"shard1",
   [junit4]   2>   "collection":".system",
   [junit4]   2>   "type":"NRT",
   [junit4]   2>   "force_set_state":"false",
   [junit4]   2>   "operation":"state"} current state version: 0
   [junit4]   2> 706819 DEBUG (OverseerStateUpdate-72067719950172168-127.0.0.1:63730_solr-n_0000000000) [n:127.0.0.1:63730_solr    ] o.a.s.c.o.ReplicaMutator Update state numShards=1 message={
   [junit4]   2>   "core":".system_shard1_replica_n1",
   [junit4]   2>   "core_node_name":"core_node2",
   [junit4]   2>   "roles":null,
   [junit4]   2>   "base_url":"http://127.0.0.1:63730/solr",
   [junit4]   2>   "node_name":"127.0.0.1:63730_solr",
   [junit4]   2>   "numShards":"1",
   [junit4]   2>   "state":"down",
   [junit4]   2>   "shard":"shard1",
   [junit4]   2>   "collection":".system",
   [junit4]   2>   "type":"NRT",
   [junit4]   2>   "force_set_state":"false",
   [junit4]   2>   "operation":"state"}
   [junit4]   2> 706819 DEBUG (OverseerStateUpdate-72067719950172168-127.0.0.1:63730_solr-n_0000000000) [n:127.0.0.1:63730_solr    ] o.a.s.c.o.ReplicaMutator Will update state for replica: core_node2:{"core":".system_shard1_replica_n1","base_url":"http://127.0.0.1:63730/solr","node_name":"127.0.0.1:63730_solr","state":"down","type":"NRT","force_set_state":"false"}
   [junit4]   2> 706819 DEBUG (OverseerStateUpdate-72067719950172168-127.0.0.1:63730_solr-n_0000000000) [n:127.0.0.1:63730_solr    ] o.a.s.c.o.ReplicaMutator Collection is now: DocCollection(.system//collections/.system/state.json/1)={
   [junit4]   2>   "pullReplicas":"0",
   [junit4]   2>   "replicationFactor":"1",
   [junit4]   2>   "router":{"name":"compositeId"},
   [junit4]   2>   "maxShardsPerNode":"1",
   [junit4]   2>   "autoAddReplicas":"false",
   [junit4]   2>   "nrtReplicas":"1",
   [junit4]   2>   "tlogReplicas":"0",
   [junit4]   2>   "shards":{"shard1":{
   [junit4]   2>       "range":"80000000-7fffffff",
   [junit4]   2>       "state":"active",
   [junit4]   2>       "replicas":{"core_node2":{
   [junit4]   2>           "core":".system_shard1_replica_n1",
   [junit4]   2>           "base_url":"http://127.0.0.1:63730/solr",
   [junit4]   2>           "node_name":"127.0.0.1:63730_solr",
   [junit4]   2>           "state":"down",
   [junit4]   2>           "type":"NRT",
   [junit4]   2>           "force_set_state":"false"}}}}}
   [junit4]   2> 706920 DEBUG (OverseerStateUpdate-72067719950172168-127.0.0.1:63730_solr-n_0000000000) [n:127.0.0.1:63730_solr    ] o.a.s.c.o.ZkStateWriter going to update_collection /collections/.system/state.json version: 1
   [junit4]   2> 707357 DEBUG (ScheduledTrigger-4331-thread-2) [    ] o.a.s.c.a.NodeLostTrigger Running NodeLostTrigger: .auto_add_replicas with currently live nodes: 2 and last live nodes: 2
   [junit4]   2> 707808 INFO  (qtp1837525691-15320) [n:127.0.0.1:63730_solr c:.system s:shard1 r:core_node2 x:.system_shard1_replica_n1] o.a.s.c.SolrConfig Using Lucene MatchVersion: 7.7.0
   [junit4]   2> 707817 INFO  (qtp1837525691-15320) [n:127.0.0.1:63730_solr c:.system s:shard1 r:core_node2 x:.system_shard1_replica_n1] o.a.s.s.ManagedIndexSchemaFactory The schema is configured as managed, but managed schema resource managed-schema not found - loading non-managed schema schema.xml instead
   [junit4]   2> 707819 INFO  (qtp1837525691-15320) [n:127.0.0.1:63730_solr c:.system s:shard1 r:core_node2 x:.system_shard1_replica_n1] o.a.s.s.IndexSchema [.system_shard1_replica_n1] Schema name=_system collection or core
   [junit4]   2> 707822 INFO  (qtp1837525691-15320) [n:127.0.0.1:63730_solr c:.system s:shard1 r:core_node2 x:.system_shard1_replica_n1] o.a.s.s.IndexSchema Loaded schema _system collection or core/1.1 with uniqueid field id
   [junit4]   2> 707823 INFO  (qtp1837525691-15320) [n:127.0.0.1:63730_solr c:.system s:shard1 r:core_node2 x:.system_shard1_replica_n1] o.a.s.s.ManagedIndexSchema Created and persisted managed schema znode at /configs/.system/managed-schema
   [junit4]   2> 707825 INFO  (qtp1837525691-15320) [n:127.0.0.1:63730_solr c:.system s:shard1 r:core_node2 x:.system_shard1_replica_n1] o.a.s.s.ManagedIndexSchemaFactory After upgrading to managed schema in ZooKeeper, renamed the non-managed schema /configs/.system/schema.xml to /configs/.system/schema.xml.bak
   [junit4]   2> 707825 INFO  (qtp1837525691-15320) [n:127.0.0.1:63730_solr c:.system s:shard1 r:core_node2 x:.system_shard1_replica_n1] o.a.s.c.CoreContainer Creating SolrCore '.system_shard1_replica_n1' using configuration from collection .system, trusted=true
   [junit4]   2> 707826 INFO  (qtp1837525691-15320) [n:127.0.0.1:63730_solr c:.system s:shard1 r:core_node2 x:.system_shard1_replica_n1] o.a.s.m.r.SolrJmxReporter JMX monitoring for 'solr_63730.solr.core..system.shard1.replica_n1' (registry 'solr.core..system.shard1.replica_n1') enabled at server: com.sun.jmx.mbeanserver.JmxMBeanServer@346f2b71
   [junit4]   2> 707826 INFO  (qtp1837525691-15320) [n:127.0.0.1:63730_solr c:.system s:shard1 r:core_node2 x:.system_shard1_replica_n1] o.a.s.c.SolrCore [[.system_shard1_replica_n1] ] Opening new SolrCore at [C:\Users\jenkins\workspace\Lucene-Solr-7.x-Windows\solr\build\solr-core\test\J1\temp\solr.handler.admin.AutoscalingHistoryHandlerTest_E53BAE4AB460D0A4-001\tempDir-001\node2\.system_shard1_replica_n1], dataDir=[C:\Users\jenkins\workspace\Lucene-Solr-7.x-Windows\solr\build\solr-core\test\J1\temp\solr.handler.admin.AutoscalingHistoryHandlerTest_E53BAE4AB460D0A4-001\tempDir-001\node2\.\.system_shard1_replica_n1\data\]
   [junit4]   2> 707885 INFO  (qtp1837525691-15320) [n:127.0.0.1:63730_solr c:.system s:shard1 r:core_node2 x:.system_shard1_replica_n1] o.a.s.u.UpdateHandler Using UpdateLog implementation: org.apache.solr.update.UpdateLog
   [junit4]   2> 707885 INFO  (qtp1837525691-15320) [n:127.0.0.1:63730_solr c:.system s:shard1 r:core_node2 x:.system_shard1_replica_n1] o.a.s.u.UpdateLog Initializing UpdateLog: dataDir= defaultSyncLevel=FLUSH numRecordsToKeep=100 maxNumLogsToKeep=10 numVersionBuckets=65536
   [junit4]   2> 707887 INFO  (qtp1837525691-15320) [n:127.0.0.1:63730_solr c:.system s:shard1 r:core_node2 x:.system_shard1_replica_n1] o.a.s.u.CommitTracker Hard AutoCommit: if 1 uncommitted docs; 
   [junit4]   2> 707887 INFO  (qtp1837525691-15320) [n:127.0.0.1:63730_solr c:.system s:shard1 r:core_node2 x:.system_shard1_replica_n1] o.a.s.u.CommitTracker Soft AutoCommit: disabled
   [junit4]   2> 707889 INFO  (qtp1837525691-15320) [n:127.0.0.1:63730_solr c:.system s:shard1 r:core_node2 x:.system_shard1_replica_n1] o.a.s.s.SolrIndexSearcher Opening [Searcher@323fbe2b[.system_shard1_replica_n1] main]
   [junit4]   2> 707890 INFO  (qtp1837525691-15320) [n:127.0.0.1:63730_solr c:.system s:shard1 r:core_node2 x:.system_shard1_replica_n1] o.a.s.r.ManagedResourceStorage Configured ZooKeeperStorageIO with znodeBase: /configs/.system
   [junit4]   2> 707890 INFO  (qtp1837525691-15320) [n:127.0.0.1:63730_solr c:.system s:shard1 r:core_node2 x:.system_shard1_replica_n1] o.a.s.r.ManagedResourceStorage Loaded null at path _rest_managed.json using ZooKeeperStorageIO:path=/configs/.system
   [junit4]   2> 707890 INFO  (qtp1837525691-15320) [n:127.0.0.1:63730_solr c:.system s:shard1 r:core_node2 x:.system_shard1_replica_n1] o.a.s.s.ZkIndexSchemaReader Creating ZooKeeper watch for the managed schema at /configs/.system/managed-schema
   [junit4]   2> 707891 INFO  (qtp1837525691-15320) [n:127.0.0.1:63730_solr c:.system s:shard1 r:core_node2 x:.system_shard1_replica_n1] o.a.s.s.ZkIndexSchemaReader Current schema version 0 is already the latest
   [junit4]   2> 707891 INFO  (qtp1837525691-15320) [n:127.0.0.1:63730_solr c:.system s:shard1 r:core_node2 x:.system_shard1_replica_n1] o.a.s.h.ReplicationHandler Commits will be reserved for 10000ms.
   [junit4]   2> 707891 INFO  (qtp1837525691-15320) [n:127.0.0.1:63730_solr c:.system s:shard1 r:core_node2 x:.system_shard1_replica_n1] o.a.s.u.UpdateLog Could not find max version in index or recent updates, using new clock 1622393492039794688
   [junit4]   2> 707893 INFO  (searcherExecutor-4342-thread-1-processing-n:127.0.0.1:63730_solr x:.system_shard1_replica_n1 c:.system s:shard1 r:core_node2) [n:127.0.0.1:63730_solr c:.system s:shard1 r:core_node2 x:.system_shard1_replica_n1] o.a.s.c.SolrCore [.system_shard1_replica_n1] Registered new searcher Searcher@323fbe2b[.system_shard1_replica_n1] main{ExitableDirectoryReader(UninvertingDirectoryReader())}
   [junit4]   2> 707896 INFO  (qtp1837525691-15320) [n:127.0.0.1:63730_solr c:.system s:shard1 r:core_node2 x:.system_shard1_replica_n1] o.a.s.c.ZkShardTerms Successful update of terms at /collections/.system/terms/shard1 to Terms{values={core_node2=0}, version=0}
   [junit4]   2> 707896 INFO  (qtp1837525691-15320) [n

[...truncated too long message...]

ers\jenkins\workspace\Lucene-Solr-7.x-Windows\solr\build\contrib\solr-analytics\test\temp\junit4-J1-20190111_195145_32317136244345824651823.syserr
   [junit4] >>> JVM J1 emitted unexpected output (verbatim) ----
   [junit4] OpenJDK 64-Bit Server VM warning: Option UseConcMarkSweepGC was deprecated in version 9.0 and will likely be removed in a future release.
   [junit4] <<< JVM J1: EOF ----

[...truncated 3 lines...]
   [junit4] JVM J0: stderr was not empty, see: C:\Users\jenkins\workspace\Lucene-Solr-7.x-Windows\solr\build\contrib\solr-analytics\test\temp\junit4-J0-20190111_195145_323333391201259196189.syserr
   [junit4] >>> JVM J0 emitted unexpected output (verbatim) ----
   [junit4] OpenJDK 64-Bit Server VM warning: Option UseConcMarkSweepGC was deprecated in version 9.0 and will likely be removed in a future release.
   [junit4] <<< JVM J0: EOF ----

[...truncated 572 lines...]
   [junit4] JVM J0: stderr was not empty, see: C:\Users\jenkins\workspace\Lucene-Solr-7.x-Windows\solr\build\contrib\solr-clustering\test\temp\junit4-J0-20190111_195400_44817784576289373116254.syserr
   [junit4] >>> JVM J0 emitted unexpected output (verbatim) ----
   [junit4] OpenJDK 64-Bit Server VM warning: Option UseConcMarkSweepGC was deprecated in version 9.0 and will likely be removed in a future release.
   [junit4] <<< JVM J0: EOF ----

[...truncated 3 lines...]
   [junit4] JVM J1: stderr was not empty, see: C:\Users\jenkins\workspace\Lucene-Solr-7.x-Windows\solr\build\contrib\solr-clustering\test\temp\junit4-J1-20190111_195400_44812120203195431743269.syserr
   [junit4] >>> JVM J1 emitted unexpected output (verbatim) ----
   [junit4] OpenJDK 64-Bit Server VM warning: Option UseConcMarkSweepGC was deprecated in version 9.0 and will likely be removed in a future release.
   [junit4] <<< JVM J1: EOF ----

[...truncated 1301 lines...]
   [junit4] JVM J0: stderr was not empty, see: C:\Users\jenkins\workspace\Lucene-Solr-7.x-Windows\solr\build\contrib\solr-dataimporthandler-extras\test\temp\junit4-J0-20190111_195437_9959998339536877486021.syserr
   [junit4] >>> JVM J0 emitted unexpected output (verbatim) ----
   [junit4] OpenJDK 64-Bit Server VM warning: Option UseConcMarkSweepGC was deprecated in version 9.0 and will likely be removed in a future release.
   [junit4] <<< JVM J0: EOF ----

[...truncated 3 lines...]
   [junit4] JVM J1: stderr was not empty, see: C:\Users\jenkins\workspace\Lucene-Solr-7.x-Windows\solr\build\contrib\solr-dataimporthandler-extras\test\temp\junit4-J1-20190111_195437_9959416092702229959873.syserr
   [junit4] >>> JVM J1 emitted unexpected output (verbatim) ----
   [junit4] OpenJDK 64-Bit Server VM warning: Option UseConcMarkSweepGC was deprecated in version 9.0 and will likely be removed in a future release.
   [junit4] <<< JVM J1: EOF ----

[...truncated 667 lines...]
   [junit4] JVM J1: stderr was not empty, see: C:\Users\jenkins\workspace\Lucene-Solr-7.x-Windows\solr\build\contrib\solr-dataimporthandler\test\temp\junit4-J1-20190111_195500_22110048304446887204517.syserr
   [junit4] >>> JVM J1 emitted unexpected output (verbatim) ----
   [junit4] OpenJDK 64-Bit Server VM warning: Option UseConcMarkSweepGC was deprecated in version 9.0 and will likely be removed in a future release.
   [junit4] <<< JVM J1: EOF ----

[...truncated 3 lines...]
   [junit4] JVM J0: stderr was not empty, see: C:\Users\jenkins\workspace\Lucene-Solr-7.x-Windows\solr\build\contrib\solr-dataimporthandler\test\temp\junit4-J0-20190111_195500_2214382882329582335068.syserr
   [junit4] >>> JVM J0 emitted unexpected output (verbatim) ----
   [junit4] OpenJDK 64-Bit Server VM warning: Option UseConcMarkSweepGC was deprecated in version 9.0 and will likely be removed in a future release.
   [junit4] <<< JVM J0: EOF ----

[...truncated 579 lines...]
   [junit4] JVM J1: stderr was not empty, see: C:\Users\jenkins\workspace\Lucene-Solr-7.x-Windows\solr\build\contrib\solr-cell\test\temp\junit4-J1-20190111_195550_32814869688800012446627.syserr
   [junit4] >>> JVM J1 emitted unexpected output (verbatim) ----
   [junit4] OpenJDK 64-Bit Server VM warning: Option UseConcMarkSweepGC was deprecated in version 9.0 and will likely be removed in a future release.
   [junit4] <<< JVM J1: EOF ----

[...truncated 3 lines...]
   [junit4] JVM J0: stderr was not empty, see: C:\Users\jenkins\workspace\Lucene-Solr-7.x-Windows\solr\build\contrib\solr-cell\test\temp\junit4-J0-20190111_195550_32817646320101848930224.syserr
   [junit4] >>> JVM J0 emitted unexpected output (verbatim) ----
   [junit4] OpenJDK 64-Bit Server VM warning: Option UseConcMarkSweepGC was deprecated in version 9.0 and will likely be removed in a future release.
   [junit4] <<< JVM J0: EOF ----

[...truncated 580 lines...]
   [junit4] JVM J0: stderr was not empty, see: C:\Users\jenkins\workspace\Lucene-Solr-7.x-Windows\solr\build\contrib\solr-langid\test\temp\junit4-J0-20190111_195616_15412054928131434381175.syserr
   [junit4] >>> JVM J0 emitted unexpected output (verbatim) ----
   [junit4] OpenJDK 64-Bit Server VM warning: Option UseConcMarkSweepGC was deprecated in version 9.0 and will likely be removed in a future release.
   [junit4] <<< JVM J0: EOF ----

[...truncated 3 lines...]
   [junit4] JVM J1: stderr was not empty, see: C:\Users\jenkins\workspace\Lucene-Solr-7.x-Windows\solr\build\contrib\solr-langid\test\temp\junit4-J1-20190111_195616_1544655204996981263390.syserr
   [junit4] >>> JVM J1 emitted unexpected output (verbatim) ----
   [junit4] OpenJDK 64-Bit Server VM warning: Option UseConcMarkSweepGC was deprecated in version 9.0 and will likely be removed in a future release.
   [junit4] <<< JVM J1: EOF ----

[...truncated 680 lines...]
   [junit4] JVM J0: stderr was not empty, see: C:\Users\jenkins\workspace\Lucene-Solr-7.x-Windows\solr\build\contrib\solr-ltr\test\temp\junit4-J0-20190111_195640_81712533781359932983423.syserr
   [junit4] >>> JVM J0 emitted unexpected output (verbatim) ----
   [junit4] OpenJDK 64-Bit Server VM warning: Option UseConcMarkSweepGC was deprecated in version 9.0 and will likely be removed in a future release.
   [junit4] <<< JVM J0: EOF ----

[...truncated 3 lines...]
   [junit4] JVM J1: stderr was not empty, see: C:\Users\jenkins\workspace\Lucene-Solr-7.x-Windows\solr\build\contrib\solr-ltr\test\temp\junit4-J1-20190111_195640_8174011748434170791216.syserr
   [junit4] >>> JVM J1 emitted unexpected output (verbatim) ----
   [junit4] OpenJDK 64-Bit Server VM warning: Option UseConcMarkSweepGC was deprecated in version 9.0 and will likely be removed in a future release.
   [junit4] <<< JVM J1: EOF ----

[...truncated 578 lines...]
   [junit4] JVM J1: stderr was not empty, see: C:\Users\jenkins\workspace\Lucene-Solr-7.x-Windows\solr\build\contrib\solr-prometheus-exporter\test\temp\junit4-J1-20190111_195738_4433639720495860980354.syserr
   [junit4] >>> JVM J1 emitted unexpected output (verbatim) ----
   [junit4] OpenJDK 64-Bit Server VM warning: Option UseConcMarkSweepGC was deprecated in version 9.0 and will likely be removed in a future release.
   [junit4] <<< JVM J1: EOF ----

   [junit4] JVM J0: stderr was not empty, see: C:\Users\jenkins\workspace\Lucene-Solr-7.x-Windows\solr\build\contrib\solr-prometheus-exporter\test\temp\junit4-J0-20190111_195738_4435842094474004270777.syserr
   [junit4] >>> JVM J0 emitted unexpected output (verbatim) ----
   [junit4] OpenJDK 64-Bit Server VM warning: Option UseConcMarkSweepGC was deprecated in version 9.0 and will likely be removed in a future release.
   [junit4] <<< JVM J0: EOF ----

[...truncated 567 lines...]
   [junit4] JVM J0: stderr was not empty, see: C:\Users\jenkins\workspace\Lucene-Solr-7.x-Windows\solr\build\contrib\solr-velocity\test\temp\junit4-J0-20190111_195812_9276282023228133600121.syserr
   [junit4] >>> JVM J0 emitted unexpected output (verbatim) ----
   [junit4] OpenJDK 64-Bit Server VM warning: Option UseConcMarkSweepGC was deprecated in version 9.0 and will likely be removed in a future release.
   [junit4] <<< JVM J0: EOF ----

[...truncated 33467 lines...]
[repro] Jenkins log URL: https://jenkins.thetaphi.de/job/Lucene-Solr-7.x-Windows/953/consoleText

[repro] Revision: 734f20b298c0846cc319cbb011c3f44398b54005

[repro] Ant options: "-Dargs=-XX:-UseCompressedOops -XX:+UseConcMarkSweepGC"

[repro] ant clean

[...truncated 6 lines...]
[repro] Test suites by module:
[repro]    solr\core
[repro]       AutoscalingHistoryHandlerTest
[repro] ant compile-test

[...truncated 3632 lines...]
[repro] ant test-nocompile -Dtests.dups=5 -Dtests.maxfailures=5 -Dtests.class="*.AutoscalingHistoryHandlerTest" -Dtests.showOutput=onerror "-Dargs=-XX:-UseCompressedOops -XX:+UseConcMarkSweepGC" -Dtests.seed=E53BAE4AB460D0A4 -Dtests.slow=true -Dtests.locale=es-US -Dtests.timezone=Europe/Berlin -Dtests.asserts=true -Dtests.file.encoding=Cp1252

[...truncated 48 lines...]
   [junit4] JVM J0: stderr was not empty, see: C:\Users\jenkins\workspace\Lucene-Solr-7.x-Windows\solr\build\solr-core\test\temp\junit4-J0-20190111_200246_8178127200349033470248.syserr
   [junit4] >>> JVM J0 emitted unexpected output (verbatim) ----
   [junit4] OpenJDK 64-Bit Server VM warning: Option UseConcMarkSweepGC was deprecated in version 9.0 and will likely be removed in a future release.
   [junit4] <<< JVM J0: EOF ----

[...truncated 4 lines...]
   [junit4] JVM J1: stderr was not empty, see: C:\Users\jenkins\workspace\Lucene-Solr-7.x-Windows\solr\build\solr-core\test\temp\junit4-J1-20190111_200246_81015198081806834448889.syserr
   [junit4] >>> JVM J1 emitted unexpected output (verbatim) ----
   [junit4] OpenJDK 64-Bit Server VM warning: Option UseConcMarkSweepGC was deprecated in version 9.0 and will likely be removed in a future release.
   [junit4] <<< JVM J1: EOF ----

[...truncated 21 lines...]
[repro] Failures:
[repro]   0/5 failed: org.apache.solr.handler.admin.AutoscalingHistoryHandlerTest
[repro] Exiting with code 0

[...truncated 75 lines...]

Mime
View raw message